##TITLE=31Pdec_LY-TMF-3.70.R
 D2O, 24 sc
 27.2.2020
##JCAMPDX= 6.0         $$ Bruker NMR JCAMP-DX V2.0
##DATA TYPE= NMR SPECTRUM
##DATA CLASS= NTUPLES
##ORIGIN= UXNMR, Bruker Analytische Messtechnik GmbH
##OWNER= root
$$ XWIN-NMR		Version 3.5
$$ Thu Feb 27 16:18:05 2020 Russian Standard Time (UT+4h)  she@DPX200
##.OBSERVE FREQUENCY= 81.013821
##.OBSERVE NUCLEUS= ^31P
##.ACQUISITION MODE= SIMULTANEOUS
##.ACQUISITION SCHEME= undefined
##.AVERAGES= 24
##.DIGITISER RES= 17
##SPECTROMETER/DATA SYSTEM= spect
##.PULSE SEQUENCE= zgpg30
##.SOLVENT NAME= CDCl3
##.SHIFT REFERENCE= (INTERNAL, CDCl3, 0, 182.463)
##AUDIT TRAIL= $$ (NUMBER, WHEN, WHO, WHERE, WHAT)
$$ ##TITLE= Audit trail, XWIN-NMR		Version 3.5
$$ ##JCAMPDX= 5.01
$$ ##ORIGIN= Bruker BioSpin GmbH
$$ ##OWNER= she
$$ F:/spectra/data/she/nmr/P31/1/pdata/1/auditp.txt
$$ ##AUDIT TRAIL=  $$ (NUMBER, WHEN, WHO, WHERE, WHAT)
(   1,<2020-02-27 16:16:29.10 +0400>,<she>,<DPX200>,
      <created by zg, POWCHK disabled, PULCHK disabled
       configuration hash MD5:
       00 E9 B6 7A A2 85 ED C7 34 08 36 98 17 FE 4E 26
       data hash MD5: 32K
       AB 37 C4 F4 3B 9F 79 39 16 90 20 D4 6E 12 22 B3>)
(   2,<2020-02-27 16:16:31.98 +0400>,<she>,<DPX200>,
      <Start of raw data processing
       efp BC_mod = 2 LB = 1 FT_mod = 6 PKNL = 1 PHC0 = -1532.408 PHC1 = 509.6013 SI = 64K 
       data hash MD5: 64K
       A9 F9 0C 55 95 60 FE 8C 7B C4 28 D2 5E 6C B9 8C>)
(   3,<2020-02-27 16:17:07.67 +0400>,<she>,<DPX200>,
      <pk PHC0 = -71.43913 PHC1 = 153.4 
       data hash MD5: 64K
       29 AC 9B F9 49 CB B1 C7 5E 15 5E DC 0B 42 2F 48>)
(   4,<2020-02-27 16:17:11.01 +0400>,<she>,<DPX200>,
      <abs ABSG = 5 
       data hash MD5: 64K
       6D 0B DF 75 2A 33 37 75 3F 8A 3E 20 46 B5 1A 8F>)
(   5,<2020-02-27 16:17:28.25 +0400>,<she>,<DPX200>,
      <pk PHC0 = -4.197779 PHC1 = 0 
       data hash MD5: 64K
       57 D1 09 D4 1F F1 69 38 90 5C 3C 8D 7A ED 33 67>)
$$ ##END=
$$ 
$$ hash MD5
$$ ED 6D 24 1D 62 C6 75 57 19 A8 3D 59 65 5C B2 8D
##$RELAX= 
##$RELAX= 
##$RELAX= 
##$RELAX= 
##$RELAX= 
##$RELAX= 
##$RELAX= 
##$RELAX= 
$$ Bruker specific parameters
$$ --------------------------
##$DU= <F:/spectra>
##$EXPNO= 1
##$NAME= <P31>
##$PROCNO= 1
##$TYPE= <nmr>
##$USER= <she>
##$AMP= (0..31)
100 100 100 100 100 100 100 100 100 100 100 100 100 100 100 100 100 100 
100 100 100 100 100 100 100 100 100 100 100 100 100 100 
##$AQSEQ= 0
##$AQ_mod= 1
##$AUNM= <au_zg>
##$AUTOPOS= <>
##$BF1= 81.014009
##$BF2= 200.13
##$BF3= 200.13
##$BF4= 200.13
##$BF5= 200.13
##$BF6= 200.13
##$BF7= 200.13
##$BF8= 200.13
##$BYTORDA= 1
##$CFDGTYP= 0
##$CFRGTYP= 5
##$CHEMSTR= <none>
##$CNST= (0..31)
1 1 145 1 1 1 1 1 1 1 1 1 1 1 1 1 1 1 1 1 1 1 1 1 1 1 1 1 1 1 1 1 
##$CPDPRG= <waltz16>
##$CPDPRG1= <>
##$CPDPRG2= <waltz16>
##$CPDPRG3= <>
##$CPDPRG4= <mlev>
##$CPDPRG5= <mlev>
##$CPDPRG6= <mlev>
##$CPDPRG7= <mlev>
##$CPDPRG8= <mlev>
##$CPDPRGB= <>
##$CPDPRGT= <>
##$D= (0..31)
0 1 0 0 0 0 0 0 0 0 0 0.03 2e-05 3e-06 0 0 0 0 0 0 0 0 0 0 0 0 0 0 0 0 
$$ [...]
##$SUBNAM3= <"">
##$SUBNAM4= <"">
##$SUBNAM5= <"">
##$SUBNAM6= <"">
##$SUBNAM7= <"">
##$SUBNAM8= <"">
##$SUBNAM9= <"">
##$SW= 369.568048894756
##$SWIBOX= (0..15)
0 1 3 0 0 0 0 0 0 0 0 0 0 0 0 0 
##$SW_h= 29940.119760479
##$TD= 32768
##$TD0= 1
##$TE= 0
##$TE2= 300
##$TE3= 300
##$TEG= 300
##$TL= (0..7)
0 120 53 12 22 120 120 120 
##$TP= (0..7)
150 150 150 150 150 150 150 150 
##$TP07= 0
##$TPNAME0= <>
##$TPNAME1= <>
##$TPNAME2= <>
##$TPNAME3= <>
##$TPNAME4= <>
##$TPNAME5= <>
##$TPNAME6= <>
##$TPNAME7= <>
##$TPOAL= (0..7)
0.5 0.5 0.5 0.5 0.5 0.5 0.5 0.5 
##$TPOFFS= (0..7)
0 0 0 0 0 0 0 0 
##$TUNHIN= 0
##$TUNHOUT= 0
##$TUNXOUT= 0
##$USERA1= <user>
##$USERA2= <user>
##$USERA3= <user>
##$USERA4= <user>
##$USERA5= <user>
##$V9= 5
##$VALIST= <valist>
##$VCLIST= <CCCCCCCCCCCCCCC>
##$VD= 0
##$VDLIST= <DDDDDDDDDDDDDDD>
##$VPLIST= <PPPPPPPPPPPPPPP>
##$VTLIST= <TTTTTTTTTTTTTTT>
##$WBST= 1024
##$WBSW= 4
##$XGAIN= (0..3)
0 0 0 0 
##$XL= 0
##$YL= 0
##$YMAX_a= 35006
##$YMIN_a= -38433
##$ZGOPTNS= <>
##$ZL1= 120
##$ZL2= 120
##$ZL3= 120
##$ZL4= 120
##$ABSF1= 182.463
##$ABSF2= -187.1042
##$ABSG= 5
##$ABSL= 3
##$ALPHA= 0
##$AQORDER= 0
##$ASSFAC= 0
##$ASSFACI= 0
##$ASSFACX= 0
##$ASSWID= 0
##$AUNMP= <proc_1d>
##$AZFE= 0.1
##$AZFW= 0.5
##$BCFW= 0
##$BC_mod= 2
##$BYTORDP= 0
##$COROFFS= 0
##$CY= -3
##$DATMOD= 1
##$DC= 0
##$DFILT= <>
##$DTYPP= 0
##$F1P= 0
##$F2P= 0
##$FCOR= 1
##$FTSIZE= 65536
##$FT_mod= 6
##$GAMMA= 0
##$GB= 0
##$INTBC= 1
##$INTSCL= 5.30512e-09
##$ISEN= 30
##$LB= 1
##$LEV0= 0
##$LPBIN= 0
##$MAXI= 10000
##$MC2= 0
##$MEAN= 0
##$ME_mod= 0
##$MI= 50
##$NCOEF= 0
##$NC_proc= -2
##$NLEV= 6
##$NOISF1= 182.463
##$NOISF2= 159.3651
##$NSP= 0
##$NTH_PI= 0
##$NZP= 0
##$OFFSET= 182.463
##$PC= 4
##$PHC0= -1608.045
##$PHC1= 663.0013
##$PH_mod= 1
##$PKNL= yes
##$PPARMOD= 0
##$PSCAL= 0
##$PSIGN= 0
##$REVERSE= no
##$SF= 81.0140089999434
##$SI= 65536
##$SIGF1= 159.3651
##$SIGF2= -187.1042
##$SINO= 113.3802
##$SIOLD= 16384
##$SREGLST= <1H.CDCl3>
##$SSB= 0
##$STSI= 65536
##$STSR= 0
##$SW_p= 29940.119760479
##$SYMM= 0
##$S_DEV= 0
##$TDeff= 32768
##$TDoff= 0
##$TI= <>
##$TILT= no
##$TM1= 0
##$TM2= 0
##$TOPLEV= 0
##$USERP1= <user>
##$USERP2= <user>
##$USERP3= <user>
##$USERP4= <user>
##$USERP5= <user>
##$WDW= 1
##$XDIM= 65536
##$YMAX_p= 280379140
##$YMIN_p= -1025628
$$ End of Bruker specific parameters
$$ ---------------------------------
##NTUPLES= NMR SPECTRUM
##VAR_NAME=  FREQUENCY,     SPECTRUM/REAL,   SPECTRUM/IMAG
##SYMBOL=    X,             R,               I
##VAR_TYPE=  INDEPENDENT,   DEPENDENT,       DEPENDENT
##VAR_FORM=  AFFN,          ASDF,            ASDF
##VAR_DIM=   65536,         65536,           65536
##UNITS=     HZ,            ARBITRARY UNITS, ARBITRARY UNITS
##FACTOR=    0.456856943014862, 1,           1
##FIRST=     14782.0589164792, 0,            0
##LAST=      -15158.0608439998, 0,           0
##MIN=       -15158.0608439998, -1025628,    0
##MAX=       14782.0589164792, 280379140,    0
$$ Real data points
##PAGE= N=1
##DATA TABLE= (X++(R..R)), XYDATA
$$ [...]
##PAGE= N=2
##DATA TABLE= (X++(I..I)), XYDATA
37015D56692q029r4090j38999p1652O0056J16872N6939L675M8871R9412L8209
$$ 456692 448663 354573 215574 143922 203978 320850 377789 381464 430335 529747 567956
37004E67956o6967p1639M984K1799m7900r7587q0493m8745j2439O3128J18526
$$ 567956 500989 429350 434334 456133 408233 310646 230153 181408 168969 232097 350623
36993C50623M4411j09776j56561m8294M6920J7125k6905L6679J26458R9842j0970
$$ 350623 395034 285258 128697 80403 127323 144448 117543 154222 280680 380522 369552
36982C69552o3673l0392l524j8977j9485J2789J5182l9845q3322m4297N1254J12661
$$ 369552 305879 275487 271963 252986 233501 246290 261472 221627 138305 94008 145262 257923
36970B57923Q7800J1052m1582l5033p661j2066l7417k8263K1719N0548K3826n770
$$ 257923 345723 356775 315193 280160 272499 260433 223016 194753 216472 267020 290846 285076
36958B85076K2692Q0779Q4069M612r3315j23496n7637N3716J20451Q9411j272
$$ 285076 307768 388547 472616 477228 383913 260417 202780 256496 376947 466358 465086
36947D65086o2853n9972m0371m7986n7609l2383L702Q704K028L0382P4110O6567
$$ 465086 402233 342261 301890 253904 196295 163912 167614 176318 178346 208728 282838 349405
36935C49405P537k4479M438K7315j0293m9850n729R1055J20502L4695q6688j48023
$$ 349405 356942 332463 336901 364216 353923 304073 298344 389399 509901 544596 457908 309885
36923C09885j33092p3286M264O0708M6137k8775p2897k5211N7478Q4623N9742
$$ 309885 176793 103507 107771 168479 214616 185841 112944 87733 145211 229834 289576
36912B89576M8004N3905K7865k1082k5699J5646J7944n5495j27887j22710o2712
$$ 289576 337580 391485 419350 398268 372569 388215 406159 350664 222777 100067 37355
36901C7355n840M0236P7436O2392k6068j12169j01537j0942N5965N0332K4828
$$ 37355 31515 71751 149187 211579 185511 73342 -28195 -39137 16828 67160 91988
36890I1988L8164P6675Q9404N7985P765k8438l8585l0409j5387j271K512r026
$$ 91988 130152 206827 296231 354216 361981 333543 294958 264549 249162 247891 250403 241377
36878B41377j6107J1797N9902O4159L899m5514j6840L4799J2219o0610o9859K145
$$ 241377 225270 237067 296969 361128 365027 319513 302673 337472 349691 289081 219222 221367
36866B21367M8113Q173n4212p7170p4998n2430J9505R3494O0711n4646p3875O4683
$$ 221367 269480 277653 223441 146271 71273 18843 38348 131842 192553 137907 64032 128715
36854A28715J74433R5074n5383p5518L793O493p7212r6255j8336K0291m2863r8428
$$ 128715 303148 398222 342839 267321 271114 277607 200395 104140 85804 106095 63232 -35196
36842c5196m9969N7425J35205J52615J09709K2446m3959l0968J4848J240n8825
$$ -35196 -85165 -27740 107465 260080 369789 392235 348276 317308 332156 333396 274571
36831B74571p0947k3338M713m255J2462N1756K8392o5334j23575q8889k0447L2698
$$ 274571 203624 180286 184999 180744 193206 244962 273354 208020 84445 -4444 -24891 7807
36819G807Q9324J29313P8884l8178q1829o507M8924k2627j21007r8534J1351O1087
$$ 7807 97131 226444 305328 267150 185321 178814 227738 205111 84104 -14430 -3079 58008
36807E8008J5184k4707J1786Q4873J26861J17289P2882K0819j3918k5949k8576
$$ 58008 73192 48485 60271 145144 272005 389294 462176 482995 469077 443128 414552
36796D14552k4828n088J9621K0938j298j7727j8483j9993k6245l1938n0056p7185
$$ 414552 389724 384636 404257 425195 423897 406170 387687 367694 341449 309511 259455 182270
36784A82270n8889K8655R3658L5706q0796r1708K5835J18955Q8475P366l2522
$$ 182270 123381 152036 245694 281400 200604 108896 134731 253686 342161 349527 317005
36773C17005m6723o8003o5167k7832j1427k4798M871Q0891Q6348k0588r7648k8268
$$ 317005 270282 202279 137112 109280 97853 73055 77926 158817 245165 224577 126929 98661
36761I8661Q1739O4813m6142p8239J6196J12874J11966M4841j5923m3981m3814
$$ 98661 180400 245213 199071 120832 137028 249902 361868 406709 390786 346805 302991
36750C02991k4693k722J2436K4982K8354J1237J576L8376Q1575M1961o5955j11066
$$ 302991 278298 275576 288012 312994 341348 352585 354161 392537 474112 516073 450118 339052
36738C39052l9810L4636J0943n3566o7107n3244o3467n4656J4850O8055K9381
$$ 339052 299242 333878 344821 291255 224148 170904 107437 52781 67631 135686 165067
36727A65067k8140l355M8968J4075p3394q4973j2223M1844M6406N5060O6541L4858
$$ 165067 136927 133572 182540 196615 123221 38248 26025 67869 114275 169335 235876 270734
36715B70734p160P292L8450P818k5384N7630J95453J90012J0220j47750j49748
$$ 270734 263574 270866 309316 317134 291750 349380 544833 734845 745065 597315 447567
36704D47567q3505o2788n2406J4417R2623J07614P1928L0843j3082n0385l9096
$$ 447567 364062 301274 248868 263285 355908 463522 535450 566293 553211 502826 463730
36693D63730N124l283p5769j04021l3397L4184N749m5502p608P6183P8252n706
$$ 463730 468854 465571 389802 285781 252384 286568 292317 246815 239207 315390 393642 387936
36681C87936n8383k6425K1003J8887j5072m2756n8263n6036j8948L4062M7748
$$ 387936 329553 303128 324131 343018 327946 285190 226927 170891 151943 186005 233753
36670B33753J0321j4604K4666Q3934P6277n570p5277p1557l6777l9905o5818m6013
$$ 233753 244074 229470 254136 338070 414347 408777 333500 261943 225166 185261 119443 73430
36658G3430K3477P5345Q0388P4352O1651k303r2632r6761P993P3150j1378j26982
$$ 73430 96907 172252 252640 326992 388643 386340 293708 196947 204940 278090 266712 139730
36646A39730r1847N8914J30833O6457k039O281J6282k8641n9886k2778J9358K851
$$ 139730 47883 106797 237630 304087 302048 308329 324611 295970 236084 213306 232664 235515
36634B35515k9452j9673O248R579J8899N9519Q0202K9208n8061j13273j19500
$$ 235515 206063 186390 192638 202217 221116 280635 360837 390045 331984 218711 99211
36623I9211q9597k7111L9024N2099J4866P005O0198R5117M6835k8250m5971j8013
$$ 99211 9614 -17497 21527 73626 88492 95497 155695 250812 297647 269397 223426 205413
36611B05413P22J5409M9966O7798L3878P78K7920O1597Q191j04587j55415j04674
$$ 205413 206135 221544 271510 339308 373186 373964 401884 463481 471672 367085 211670 106996
36599A06996l2629n063n203o634j3352q915M1176J09842J16342M5203k2431l1476
$$ 106996 74367 69304 64101 57467 44115 35200 76376 186218 302560 347763 325332 293856
36587B93856k6127n3303p2366l0611L3607M6154J5308Q234L2905L5133Q512J0400
$$ 293856 267729 214426 142060 111449 145056 191210 206518 214752 247657 282790 291302 301702
36575C01702M9051N1616r680n0363n568M9483J2228o9926o0756M8483J19884P7484
$$ 301702 350753 402369 392689 342326 336758 386241 398469 328543 267787 316270 436154 513638
36563E13638n24l6163o2151j09301j12316k8746N4567M9135Q485K0116M0463j4107
$$ 513638 513114 476951 414800 305499 193183 164437 219004 268139 276624 296740 337203 323096
36551C23096q2551m0382P2535R2094n105o3879p125N0174O822o6557o5481j6207
$$ 323096 240545 200163 272698 364792 359687 295808 288683 338857 345679 279122 213641 197434
36539A97434o38j6487j1855J2687K1222P483j5769l6005j4284Q1202J81332J58963
$$ 197434 196796 180309 168454 181141 202363 209846 194077 158072 143788 224990 406322 565285
36527E65285J5799q7961n9538o652m9533j23395j01498j4024J7223l795K8726
$$ 565285 581084 493123 433585 426933 377400 254005 152507 138483 155706 151911 180637
36516A80637J08015J04469r996r2086m2665M2489K8233n2493o1964K1812P3401
$$ 180637 288652 393121 383125 291039 248374 290863 319096 266603 204639 226451 299852
36505B99852J7510n3188k2382O2924N8265m5514q7498J7225J22771N7278j07298
$$ 299852 317362 264174 241792 304716 362981 317467 229969 247194 369965 427243 319945
36494C19945j49105k3063Q3834M0154o0668p9089k2125L3434P7774J16773R2392
$$ 319945 170840 147777 231611 271765 211097 132008 109883 143317 221091 337864 430256
36483D30256k0649j17561q7018K3059P5635L4688j9613k4810J4220P0596R6319
$$ 430256 409607 292046 205028 228087 303722 338410 318797 293987 308207 378803 475122
36472D75122K4943j23470j90302n7176J54960K03779L8356j41659j58365n6461
$$ 475122 500065 376595 186293 129117 284077 487856 526212 384553 226188 169727
36462A69727J3987J80m2498o2675n1761r897N4433J01505Q9019K8792j6140k373
$$ 169727 183714 183894 141396 78721 26960 17063 71496 173001 262020 290812 274672 272299
36450B72299M1278M7736l288n4839m2822K3077P8362Q6224N8353Q712n2250q0032
$$ 272299 313577 361313 358025 303186 260364 283441 361803 448027 506380 515092 462842 382810
36438C82810k6434P5451J25965Q3343Q503l6816o2605q9927r5038n8913p945L2333
$$ 382810 356376 431827 557792 641135 649638 612822 550217 460290 365252 306339 298394 330727
36426C30727O0199N1858k0653r6995o1306Q1946J75124J15348j5209r7831j31138
$$ 330727 390926 442784 422131 325136 263830 345776 520900 636248 621039 523208 392070
36415C92070j43893q9590L9558J11996K9627q9689o9113O1260J29971R5037N8848
$$ 392070 248177 158587 198145 310141 339768 250079 180966 242226 372197 467234 526082
36404E26082M8738j2581j13079j25964k1949O2065K9200m2447m0925J8998N1561
$$ 526082 574820 562239 449160 323196 301247 363312 392512 350065 309140 328138 379699
36393C79699L0223q162l2979m1967m7141n9414o1727j4117P2491J07749L6336
$$ 379699 409922 401760 368781 326814 279673 220259 158532 144415 216906 324655 360991
36382C60991o3118q2093l9877k8615m3854n870P1205Q1957R893l9566j3861J3106
$$ 360991 297873 215780 175903 147288 103434 97564 168769 250726 260619 221053 207192 220298
36370B20298j7745n9330n7602l2800j0529K8729P9637Q3852K6899j6905J0523
$$ 220298 202553 143223 85621 52821 42292 71021 150658 234510 261409 244504 255027
36359B55027O8611Q6158N1833j60m0523n2430l6131k0157k3397j3739L7962Q3510
$$ 255027 323638 409796 461629 461469 420946 368516 332385 312228 288831 275092 313054 396564
36347C96564N4417k5459p0903o0080l5437o005M1663O0510j532q0489p0287n717
$$ 396564 450981 425522 354619 294539 259102 253097 294760 355270 353738 273249 202962 197245
36335A97245j5474r4396r9761K658P6787N0129J9783M9756N2175k2239n5678L4408
$$ 197245 181771 87375 -12386 -9728 67059 117188 136971 186727 238902 216663 160985 195393
36323A95393J21063O1902n6508n1163O5174J13076K8962n8380l8295M0124P0890
$$ 195393 316456 378358 321850 270687 335861 448937 477899 419519 381224 421348 492238
36312D92238L3396j2074j4039J8865L6608R504l0463l2888p455j0025m9079p1803
$$ 492238 525634 513560 499521 518386 554994 564498 534035 501147 493692 483667 434588 362785
36300C62785n5148l7197l7427k3380J5461L6366J5535j9360m8018p1361n9184
$$ 362785 307637 270440 233013 209633 225094 261460 276995 257635 209617 138256 79072
36289G9072J7317R1908O2518l6007n7071K3717N7341l0080j02536l2926R2464
$$ 79072 96389 188297 250815 214808 157737 181454 238795 208715 106179 73253 165717
36278A65717J20587O0434K1432K0460k296m5436o1023n3196m5534q466O9825J06147
$$ 165717 286304 346738 368170 388630 386334 340898 279875 226679 181145 172679 242504 348651
36266C48651L5678n8384n2833K9128O2819R926n8048q5728o8732j045R7776J38749
$$ 348651 384329 325945 273112 302240 365059 374985 316937 231209 162477 161432 259208 397957
36254C97957O2082n1343p8647l1300j4695m2285k3098O9499J41569J11232L716
$$ 397957 460039 408696 330049 298749 284054 241769 218671 288170 429739 540971 544687
36243E44687j02062j47137j08407j0635P3735R0546O2359M1311L6225L1755L1712
$$ 544687 442625 295488 187081 176446 250181 340727 403086 444397 480622 512377 544089
36232E44089K8514j3036p9301q4715k389N8197K165r3003q6378J6470Q6002O0533
$$ 544089 572603 559567 480266 395551 393162 451359 453524 360521 274143 290613 376615 437148
36220D37148o349n9170q3150n8486J2674N3572k865r6362j11488m3940J4753L3758
$$ 437148 430799 371629 288479 229993 242667 296239 293374 197012 85524 41584 56337 90095
36208I0095O4016J14429J27029Q2308K7768n456k9351m5798m3885l5956k6205
$$ 90095 154111 268540 395569 477877 505645 500189 470838 425040 381155 345199 318994
36197C18994K1544J06486J34219L9167q5784r8179n916N8907L0791m2248j06550
$$ 318994 340538 447024 581243 620410 534626 436447 430531 489438 520229 477981 371431
36186C71431j37425j02689j2609L5740j4325o5364j5116N5949J7535o3961k4105
$$ 371431 234006 131317 118708 154448 140123 74759 59643 115592 133127 69166 45061
36175D5061J02294J22090R543n8631j2800K0393j2747M804J03125J24767M958
$$ 45061 147355 269445 278988 220357 207557 227950 215203 220007 323132 447899 452857
36164D52857q5929l1184K6114n0114j23904j8026J54247J50297j0553q6083j919
$$ 452857 366928 335744 361858 311744 187840 169814 324061 474358 463805 377722 375803
36153C75803N6526l3246j42867j06506M2831J48019J32271L9993n6351j08820
$$ 375803 432329 399083 256216 149710 192541 340560 472831 512824 456473 347653
36143C47653r1822j7544N3353O0788R908l6910l5544n468J1134J0379J4472J6434
$$ 347653 255831 238287 291640 352428 362336 325426 289882 284414 295548 305927 320399 336833
36131C36833o108k2099K9343J18653J21293l490j20877j01264p686J9361j3126
$$ 336833 330725 308626 337969 456622 577915 574425 453548 352284 344598 363959 350833
36120C50833J380M9789J7949q0916r3901K0272J10693O8688k1386m6119k9499
$$ 350833 352213 402002 419951 339035 245134 265406 376099 444787 423401 377282 347783
36109C47783l8978n1604j9748K6855M0217L4513L0669L645m5574n3674n30L8294
$$ 347783 308805 257201 237453 264308 304525 339038 369707 373352 327778 274104 273574 311868
36097C11868J3591j6491N58J7401j0365k4857L1836R8725Q2599K92n8919n9076
$$ 311868 325459 308968 309526 326927 316562 291705 323541 422266 504865 505157 446238 387162
36085C87162k7250O792J3409l1035q1723m7999N9693J02475J2101q6921n7826
$$ 387162 359912 366704 380113 349078 267355 219356 279049 381524 393625 306704 248878
36074B48878M4009P2982J8636j2953J0515K2188n53o49M6212Q8636Q0351K6920
$$ 248878 292887 365869 384505 371552 382067 404255 403702 403053 449265 537901 618252 645172
36062F45172m9085j23281j54836j16558l7553K5398M6753L5323Q505j0060l933
$$ 645172 596087 472806 317970 201412 163859 189257 236010 271333 279838 269778 265845
36051B65845P037k942n845L4440O1855r921j21958j06202N3609J62301R9829l994
$$ 265845 272882 269940 264095 298535 360390 350469 228511 122309 175918 338219 438048 434054
36039D34054m121K3982m4237j27124p0137P0154J07181K7145j8637J1607J5498
$$ 434054 429933 453915 409678 282554 212417 282571 389752 416897 398260 409867 425365
36028D25365k0477J1494J09139J19923k621j02487o6888J0833J6024k932L7807
$$ 425365 404888 416382 525521 645444 642823 540336 473448 484281 500305 497373 535180
36017E35180Q0721K6854p8545j11067o5189m3750p0280n1244N1350J27203O4419
$$ 535180 615901 642755 564210 453143 387954 344204 273924 222680 274030 401233 465652
36006D65652p9935j39926n2876O8090R3113L5625l384K912n781m6344n8673k3581
$$ 465652 385717 245791 192915 261005 354118 389743 386359 389271 383490 337146 278473 254892
35994B54892q359m7402p3550l0914L2015N2601N1404O0592M5059r973k2485N8348
$$ 254892 246533 199131 125581 94667 126682 179283 230687 291279 336338 326365 303880 362228
35982C62228J28263O8181n6292q5553r657L9444J3076o143J7513J5631l3150n0062
$$ 362228 490491 558672 502380 416827 407170 446614 459690 453547 471060 486691 453541 403479
35970D03479n100J8503k7648o6064k6243L2847J8433n2119q6217m6926K1532O8997
$$ 403479 398379 416882 389234 323170 296927 329774 348207 296088 209871 162945 184477 253474
35958B53474Q3462P3010M0185k1610j03312j47429q0964P6240J82815J32005K966
$$ 253474 336936 409946 450131 428521 325209 177780 96816 173056 355871 487876 490842
35947D90842l8960K7846O5226p567j03329j09978l4880M9113J08203J29617P7260
$$ 490842 451882 479728 544954 537387 434058 324080 289200 338313 446516 576133 653393
35936F53393m8465j51346j24893J1328J19161R0201m5264j57670j45811k5478
$$ 653393 604928 453582 328689 340017 459178 549379 504115 346445 200634 175156
35926A75156R6315J29957Q2020K6264J4387L0616K3712k9095q5148p1208K0891
$$ 175156 271471 401428 483448 509712 524099 554715 578427 549332 464184 392976 413867
35915D13867R3023N1079n4486q1307M446Q3494P0488K6647K2398J2170n3469j04612
$$ 413867 506890 557969 503483 422176 426622 510116 580604 607251 629649 641819 588350 483738
35903D83738p0850k8069p5549j41330q1157P3207J44462P7506L773K2694P8390
$$ 483738 412888 384819 309270 167940 86783 159990 304452 381958 385731 408425 486815
35892D86815R0134O4408K7929l0889r9419j18048p0833k0597j5027k6862j6096
$$ 486815 576949 641357 669286 638397 538978 420930 350097 329500 314473 287611 271515
35881B71515J1484L0335K9483J4263J3000N8953J19600R5104m1859j65976j52074
$$ 271515 282999 313334 342817 357080 370080 429033 548633 643737 601878 435902 283828
35870B83828m5700K4743L4338L1217j274q6708j23654n166J65152J79180L2293
$$ 283828 238128 262871 297209 328426 327152 240444 116790 111624 276776 455956 488249
35859D88249p9711o8297l9096n4846m0317K7454N2900J2203M808M8155L0741n6526
$$ 488249 408538 340241 301145 246299 205982 233436 286336 298539 303347 351502 382243 325717
35847C25717o6031L5095P2961k7579q2503L7049J53224O1907j16678j17918N7627
$$ 325717 259686 294781 367742 340163 257660 294709 447933 509840 393162 275244 332871
35836C32871J67375R6097k8867p2138m2720k543K3154K2496q514l7720l3803j5012
$$ 332871 500246 596343 567476 495338 452618 450075 473229 495725 487211 449491 415688 400676
35824D00676p624l84Q837j2445n5179m9496J8111O3731M7032M0818Q3210R0366
$$ 400676 393052 392668 401505 389060 333881 284385 302496 366227 413259 454077 537287 627653
35812F27653J6400l7509k8K2114p1830j70965j15333L5351R3103L0418k2740k1018
$$ 627653 644053 606544 606516 628630 556800 385835 270502 305853 398956 429374 406634 385616
35800C85616l8793q3907p2968n03L9542J7606P06O891k3315q7980r7573k1243
$$ 385616 346823 262916 189948 189445 228987 246593 247299 254190 230875 142895 45322 24079
35788B4079O2890R4187R4597Q1823K9654m8896p8560k5012N4112R1287P7191L1244
$$ 24079 86969 181156 275753 357576 387230 338334 259774 234762 288874 380161 457352 488596
35776D88596k9167p5383q2323o4844n0560k7345K5415P2874O1667P926k1194o208
$$ 488596 459429 384046 301723 236879 186319 158974 184389 257263 318930 326856 305662 299454
35764B99454Q121j1914n2158p9314o4213N73P0694P8818L0060Q342M4608O0822
$$ 299454 307575 295661 243503 164189 99976 100549 171243 250061 280121 288463 333071 393893
35752C93893O895m4235k6419l241m5290q1972k0197P0424N8423j9766j0908R9972
$$ 393893 400788 356553 330134 326893 281603 199631 179434 249858 308281 288515 277607 377579
35740C77579J65570J10276K1843j2349j2675k1296l7832o7127j14585j19450j4771
$$ 377579 543149 653425 675268 662919 650244 628948 591116 523989 409404 289954 275183
35729B75183J31730J64919N5142n8920o7942j2088K6996L3540J6783k5207n7324
$$ 275183 406913 571832 626974 568054 500112 488024 515020 548560 565343 540136 482812
35718D82812k4751M3743N0804j6774n6830j3197M1118L2466p528k5149l5243n8852
$$ 482812 458061 501804 552608 535834 479004 465807 506925 539391 531863 506714 471471 412619
35706D12619n7220n399L8883J8127k7603k0558L7918P8952O8011L5338J7592J6002
$$ 412619 355399 350000 388883 407010 379407 358849 396767 475719 543730 579068 596660 612662
35694F12662J1850m069k1305k2161m510J5542K8120L5742K7123j6897p2098p7112
$$ 612662 624512 620443 599138 576977 572467 588009 616129 651871 678994 662097 589999 512887
35682E12887k5260Q541j8572m2938k256M8265K0608n5201p0983n382N1342L0326
$$ 512887 487627 496168 477596 434658 432402 480667 501275 446074 375091 369709 421051 451377
35670D51377l8416p7822l8358N9336J20341O5265m2906n1385N5371J08682J6635
$$ 451377 412961 335139 296781 356117 476458 541723 498817 447432 502803 611485 628120
35659F28120q4846p1727m9540j37846k02022o3685J42899J36216n3801j25973
$$ 628120 543274 471547 422007 284161 82139 18454 161353 297569 243768 117795
35649A17795J683Q7900M360p0858q238N1951o52k1434J02483J94154O5045j44798
$$ 117795 119478 207378 211738 140880 132642 184593 183941 162507 264990 459144 524189 379391
35637C79391j69683k1763P0128L2387K520N5746J07191Q9611M3830J3918n215
$$ 379391 209708 187945 258073 290460 292980 348726 455917 545528 589358 603276 598061
35626E98061m628L2923N8066m541j29297j94702j29688J0645J17739J26975N3585
$$ 598061 593433 626356 684422 679881 550584 355882 226194 236839 354578 481553 535138
35615E35138k3401l0226J5413J9738n5972j30335j10771j6745N6834N9517K1232
$$ 535138 511737 481511 496924 516662 460690 330355 219584 202839 259673 319190 340422
35604C40422k562J1139K9795j128o9854p6884K6870J26717Q9764j1476J0012J41753
$$ 340422 337860 348999 378794 377666 307812 230928 257798 384515 474279 462803 472815 614568
35592F14568J54382m1349k25917j77032K7757J57227J34011M2666n2106j31093
$$ 614568 768950 727601 501684 324652 352409 509636 643647 686313 634207 503114
35582E03114j47962q4692k0443k0361k5508K8345P1762K2644l9651J1731J23550
$$ 503114 355152 270460 250017 229656 204148 232493 304255 326899 287248 298979 422529
35571D22529J28252J1316o2732j143R3516Q5594k4866j35782j63087r7463J820
$$ 422529 550781 562097 499365 498222 591738 677332 652466 516684 353597 256134 257954
35560B57954N6917N1727M6099P7013R3657M5451k1759l3190k607j312m5408r0405
$$ 257954 314871 366598 412697 489710 583367 628818 607059 573869 571262 569950 524542 434137
35548D34137j07445r5996n0878K2758R2406J39445J70709J58444N0227j13343
$$ 434137 326692 230696 179818 202576 294982 434427 605136 763580 813807 700464
35538G00464j90505j20811j7368O185n837L2513Q4199P0938K6597K7598M6601
$$ 700464 509959 389148 371780 377965 372128 404641 488840 559778 586375 613973 660574
35527F60574J7627k3536j0780P081n1048j27173r9270J2645P6278N1300R097j8244
$$ 660574 678201 654665 643885 650966 599918 472745 373475 386120 462398 513698 522795 504551
35515E04551m9263m5247M0281J26364Q9892k9927q4538n3985m3555n8067K580
$$ 504551 455288 410041 450322 576686 666578 636651 552113 498128 454573 396506 399086
35504C99086J07783R0629o3479j48606n0990P9467Q5918L4152M0213M9680k9305
$$ 399086 506869 597498 534019 385413 334423 413890 499808 533960 574173 623853 594548
35493E94548j15072p7405K3264K7622n1059n5006L9846Q2320J0136l9006L9979
$$ 594548 479476 402071 425335 452957 401898 346892 386738 469058 479194 440188 480167
35482D80167J35846R1924m6666j01542k6993M0707O744m5059J15J02212J24687
$$ 480167 616013 707937 661271 559729 532736 573443 580187 535128 535243 637455 762142
35471G62142L0340p9815j09408o0215J6932P7507P7664J278q2511p6172O42J9305
$$ 762142 792482 712667 603259 543044 559976 637483 715147 716425 633914 557742 558384 577689
35459E77689n7917r8258j382J24864J15307k095n5482N257M8708j8067j10567
$$ 577689 519772 421514 420132 544996 660303 658208 602726 607983 656691 638624 528057
35448E28057j04164q363P0230P7457M8562K1303j7674q3768j33843r9877J2110
$$ 528057 423893 415530 485760 563217 611779 633082 615408 531640 397797 297920 310030
35437C10030R8691P3150k1462o5568j5494N9995Q9636P2662L5659o237k8695j1183
$$ 310030 408721 481871 460409 394841 379347 439342 528978 601640 637299 631062 602367 591184
35425E91184J5862P996j1561L640J0975o3538j56859j17046N0507J56841J07150
$$ 591184 607046 615042 603481 607121 618096 554558 397699 280653 331160 488001 595151
35414E95151K6824K9008M4503p68k5204L8598Q0585m339j15554j14637o2696q9713
$$ 595151 621975 650983 695486 694718 669514 708112 788697 784358 668804 554167 491471 401758
35402D01758j43024q3130N6751J22982Q8951M8652K4978j6989k7396N2438J26260
$$ 401758 258734 175604 232355 355337 444288 492940 517918 500929 473533 525971 652231
35391F52231O3282o5259p9261K3484Q5966N8056K5714P140n5281j20603r0654
$$ 652231 715513 650254 570993 594477 680443 738499 764213 771353 716072 595469 504815
35380E04815j0454q350n8918l4195L8311K2832m2109R318J40284J33526k1456
$$ 504815 494361 486011 427093 392898 431209 454041 411932 421250 561534 695060 673604
35369F73604q1559L3871J00673j5055j29025p4300J6595k6842j08560n7787O1106
$$ 673604 592045 625916 726589 711534 582509 508209 524804 497962 389402 331615 392721
35358C92721P3872j177r566O5585R7181L6182l5890n6093m4598k9653j1003M349
$$ 392721 466593 465416 455850 521435 618616 654798 618908 562815 518217 488564 477561 481910
35346D81910k900l4068o3023m6896L5991J22583R6027m0740j04857J7167J48278
$$ 481910 479010 444942 381919 335023 371014 493597 589624 548884 444027 461194 609472
35335F09472N0702j85324k38596l3172J61941J53529O2060M4904N2340K580l0956
$$ 609472 660174 474850 236254 203082 365023 518552 580612 625516 677856 680436 649480
35324F49480K6436R1147O7985L961k8619n1809q0617o3017j3655l0595r3371m8755
$$ 649480 675916 767063 835048 839009 810390 758581 677964 614947 601292 570697 477326 428571
35312D28571J07301J65495M1649o7976k1412L6356l3106r1718J0110J27268N8515
$$ 428571 535872 701367 743016 675040 653628 689984 656878 565160 575270 702538 761053
35301G61053r3425r6273J9948M6455l1957m8420K1699L3847m6285q9454l8382
$$ 761053 667628 571355 591303 637758 605801 557381 579080 612927 566642 477188 438806
35290D38806J5669J0720m586J4599M6993O0567L4861l9214j04792o1784P0640
$$ 438806 454475 465195 460609 475208 522201 582768 617629 578415 473623 411839 482479
35279D82479J25143K4659q2284n2988K9260K5182j9236O250M6570j1151j04282
$$ 482479 607622 632281 549997 497009 526269 551451 532215 538465 585035 573884 469602
35268D69602q8625J2123N7550K3844o341j8314m5957n2109m848J4562m3614n5537
$$ 469602 380977 393100 450650 474494 468153 449839 403882 351773 346925 361487 317873 262336
35256B62336P5204J96263J18604n8952r3440K0967Q2860K8984k2166k6437m4945
$$ 262336 337540 533803 652407 593455 500015 520982 603842 632826 610660 584223 539278
35245E39278n2118K2846R2275J6887j10384p3603Q3972R4166r2151k07159q9406
$$ 539278 487160 510006 602281 619168 508784 435181 519153 613319 521168 314009 224603
35234B24603Q2483R5057o270o3248m7262k0659j672J9977L5746M8378N8755J9522
$$ 224603 307086 402143 395873 332625 285363 264704 263032 283009 318755 367133 425888 445410
35222D45410p9441j11325L2963K17660J96428k5302j80335j17574K7545Q5901
$$ 445410 365969 254644 287607 505267 701695 676393 496058 378484 406029 491930
35212D91930O5437M1062K3769J5331L6130M5953j4487q2427m2942N2639L9237
$$ 491930 557367 598429 622198 637529 673659 719612 705125 622698 579756 632395 671632
35201F71632p4127r6366K1988R5755J3374r2664q7755l3520k1488j703Q3575J54317
$$ 671632 597505 501139 523127 618882 632256 539592 451837 418317 396829 395126 478701 633018
35189F33018J17417J3254o8283j01992q1615N829Q9751M8083r6166j64368q3287
$$ 633018 750435 763689 695406 593414 511799 517628 607379 655462 559296 394928 311641
35178C11641R523N359j1431M8873J05940O4083o904J342M9439M0983j609K045
$$ 311641 321164 326523 315092 363965 469905 533988 527084 528426 577865 618848 617239 619284
35166F19284L5596K9518n009r286R679R769J0039N2006R9281P1884l1258j15071
$$ 619284 654880 684398 679389 670103 679782 689551 699590 751596 850877 922761 891503 776432
35154G76432r6956N33O7477K0343r1182j28141m7152K6571j5787r2099o0684M8282
$$ 776432 679476 680009 747486 767829 676647 548506 501354 527925 512138 420039 359355 407637
35142D07637R1260M9168K6037L8479O05q2005r6023j8128M8164N2788M5148L0372
$$ 407637 498897 548065 574102 612581 613186 531181 435158 417030 465194 517982 563130 593502
35130E93502l7578j06133n8141Q2738J65675J43038R5197L2674r8583k13115j48815
$$ 593502 555924 449791 391650 474388 640063 783101 878298 910972 812389 599274 450459
35119D50459L5167R5136j2638o8922J8345O9235j3063n8135L9981J05749k35j11943
$$ 450459 485626 580762 568124 499202 517547 586782 573719 515584 555565 661314 661079 549136
35107E49136l7066J16511J30518J1973q3444j06453q9319j5656R3372J08542j1927
$$ 549136 512070 628581 759099 771072 687628 581175 491856 476200 569572 678114 666187
35096F66187j04274m5827M4013K4255k5719J5283O5892K849q7368n4950M3299
$$ 666187 561913 516086 560099 584354 558635 573918 639810 642659 555291 500341 543640
35085E43640N4525p24R80M3471K3088l8570m3227j812J7547L9506R5226R2442
$$ 543640 598165 597441 598421 641892 664980 626410 583183 581371 598918 638424 733650 826092
35073H26092k8564j20836l5006J04901P2927r3391j56796n7256L7731M2043N1908
$$ 826092 797528 676692 641686 746587 819514 726123 569327 512071 549802 591845 643753
35062F43753J14390J29133M2779m4240l8080J7029K8704k0690q3168j07772p5543
$$ 643753 758143 887276 930055 885815 847735 864764 893468 872778 789610 681838 606295
35051F06295j8035R746M710J7973N5915O0638K3901J1160K4910k0455j20410j33439
$$ 606295 588260 598006 602716 620689 676604 737242 761143 772303 797213 776758 656348 522909
35039E22909r026R8227O3043k0226j9887J6521j3229o7332n5411j0069j661J105
$$ 522909 513883 612110 675153 654927 635040 651561 638332 571000 515589 505520 503859 504964
35027E04964L5649L6488l1637o7893q486M5692K3024K6558J16881J45266P601
$$ 504964 540613 577101 545464 477571 469085 514777 537801 564359 681240 826506 834107
35016H34107j29686q9643J7992J3893k4670N4902J44915N1440j26170j31403K1657
$$ 834107 704421 614778 632770 646663 621993 676895 821810 873250 747080 615677 637334
35005F37334R0503J3343m8206l4321l8976n8042J1417J24012J20026Q720m1995
$$ 637334 727837 741180 692974 658653 619677 561635 573052 697064 817090 825810 783815
34994G83815O764L6665J6114K4252M9295O818o2655n0568K106j9648p0260l6031
$$ 783815 790579 827244 843358 867610 916905 923723 861068 810500 812606 792958 722698 686667
34982F86667J4020m8530j19103j1702J64504J36911n7952j13618L0517J04188
$$ 686667 700687 652157 533054 521352 685856 822767 764815 651197 681714 785902
34972G85902j2020j05938l3738N7284L6556R94L4218L9253m2463r4935m3846J5611
$$ 785902 773882 667944 634206 691490 728046 729040 763258 802511 760048 665113 621267 636878
34960F36878J7133L0799P8164O0678l6478q2243k2530L7837L4072J5138j3663
$$ 636878 654011 684810 762974 823652 787174 704931 682401 720238 754310 769448 755785
34949G55785r1889j30734l387J69291J23021j13459k07056k6115J67642J47054
$$ 755785 663896 533162 529775 699066 822087 708628 501572 475457 643099 790153
34939G90153K3309k0426m428k389J9817O1227K2629q3726j02924k0772q751q5043
$$ 790153 813462 793036 788608 786219 806036 867263 889892 806166 703242 682470 673719 588676
34927E88676m1857J56011K33521M8611j49652j22951M17J2285k1802L2672P9986
$$ 588676 546819 702830 936351 984962 835310 712359 712776 725061 703259 735931 815917
34916H15917n251r3715j5623J17175R2681m2860q4794j1776L0516k647l1146k0998
$$ 815917 810666 716951 701328 818503 911184 868324 783530 771754 802270 799623 768477 747479
34904G47479O712N7704J04846N5024q5038j44919l6844Q5504O7109j3900k0206
$$ 747479 754191 811895 916741 971765 886727 741808 704964 790468 857577 843677 823471
34893H23471O198k9763o8413j5841O2884O4067L1376M0245L0459o1797j39088
$$ 823471 829669 799906 731493 715652 778536 842603 873979 914224 944683 882886 743798
34882G43798r8346k2696l1855o9960l1011L2310K0486j2177L4140J03993Q5983
$$ 743798 645452 622756 590901 520941 489930 522240 542726 530549 564689 668682 754665
34871G54665J4363p888J0421J2727L2328R9356J22156L1681o5988n0116J2762
$$ 754665 769028 761140 771561 784288 816616 915972 1038128 1069809 1003821 953705 966467
34860I66467m559p3617r1062o8375p1991p3068j5612N8926R0572R9145R2166J5809
$$ 966467 961908 888291 797229 728854 656863 583795 568183 627109 717681 816826 908992 924801
34848I24801q9569o4034J03254J77911K2245j68106j64717m3882k675k8738j158
$$ 924801 835232 771198 874452 1052363 1074608 906502 741785 697903 695228 666490 665332
34837F65332M5805J7682k2515J9431N8024j2416q1283L241J46747J50541K9810
$$ 665332 711137 728819 706304 725735 783759 771343 690060 693301 840048 990589 1020399
34826A020399n5311p5704r8769r2671r634M6909k0158r3376k8626Q0638P7591
$$ 1020399 965088 889384 790615 697944 688310 735219 715061 621685 593059 673697 751288
34815G51288L4650R3640J57616N3416j18148j21909J3484O2738n521k9898J3184
$$ 751288 785938 879578 1037194 1090610 972462 850553 864037 926775 921254 891356 904540
34804I04540M212m1311p804M8998j5796j21707o0678J14901J42549j0572r9157
$$ 904540 908752 867441 859637 908635 892839 771132 710454 825355 967904 957332 858175
34793H58175k0387M9361j801n1630l833N3370L9672M086j6868n5416q1655j8431
$$ 858175 837788 887149 885348 833718 829885 883255 922927 927013 910145 854729 773074 754643
34781G54643Q5757R9153L1408R527L6215k956r6670j09793l2610P773r790J5771
$$ 754643 840400 939553 970961 980488 1016703 1013747 917077 807284 774674 782447 772657 788428
34769G88428P6712N3859m2074o8500n523K5358O051L9101J07966P5223n3375j11761
$$ 788428 865140 918999 876925 808425 802902 828260 834311 873412 981378 1056601 1003226 891465
34757H91465n1700K565L032L6489J06508J03765K7952j004J9230l0407j33266
$$ 891465 839765 842330 845362 881851 988359 1092124 1120076 1119072 1138302 1107895 974629
34746I74629j35100l1933O692n2377m3841Q3674J58897P6677m7407r7009j02770
$$ 974629 839529 807596 814288 761911 718070 801744 960641 1037318 989911 892902 790132
34735G90132r1604j2321J04395J21618J4514p5363o6155l1570k6697q223L3752
$$ 790132 698528 686207 790602 912220 926734 851371 785216 753646 726949 718726 752478
34724G52478N0206N9886J15033J47798N9355o1155m5784N0191K6304r8971j03861
$$ 752478 802684 862570 977603 1125401 1184756 1123601 1077817 1128008 1154312 1055341 951480
34713I51480M4773J30123N9855p775K2590M1216j7336o0513m7570n0931n8022
$$ 951480 996253 1126376 1186231 1178456 1201046 1242262 1224926 1164413 1116843 1065912 1007890
34702A007890J6118Q8252j5872k09423k04940J8314J61857R9213M4852J20638
$$ 1007890 1024008 1112260 1096388 886965 682025 700339 862196 961409 1006261 1126899
34692A126899J40390q202j31036p6769P018k7647p3354j3960N2768L7641L9421
$$ 1126899 1267289 1259087 1128051 1051282 1058300 1030653 957299 943339 996107 1033748 1073169
34681A073169J14007J26876J7259n4509m02K6634o2927j05636K213Q3914q589
$$ 1073169 1187176 1314052 1331311 1276802 1276400 1303034 1240107 1134471 1136684 1220598 1212009
34670A212009j30673j13120m2254n0202o9725j9424O490m6899l3717J12981J85032
$$ 1212009 1081336 968216 925962 875760 806035 786611 793101 746202 712485 825466 1010498
34659A010498K7801j64660j39455L4364J25401R3566M3127n483o7862p4846l71
$$ 1010498 1038299 873639 734184 768548 893949 987515 1030642 1025159 957297 882451 882080
34648H82080M1759p584l7279J4769M0424k601J5950J19220J20851k3873p6988
$$ 882080 923839 916255 878976 893745 934169 931568 947518 1066738 1187589 1163716 1086728
34637A086728O2327J30076m9902k19429j08517J02667J02731l5776m1725P2755
$$ 1086728 1149055 1279131 1229229 1009800 901283 1003950 1106681 1070905 1029180 1101935
34627A101935J01590M2010L2669M0189m3570j22518m6455Q3034P0271l5855o1188
$$ 1101935 1203525 1245535 1278204 1318393 1274823 1152305 1105850 1188884 1259155 1223300 1162112
34616A162112k6831m7577n6344N1515J40811L7510j20617p9330R3768J18781k7372
$$ 1162112 1135281 1087704 1031360 1082875 1223686 1261196 1140579 1061249 1155017 1273798 1246426
34605A246426j01665j3024P6333N5054j3150o1493q3036n2391J7016R702j09299
$$ 1246426 1144761 1131737 1208070 1263124 1249974 1188481 1105445 1053054 1070070 1079772 970473
34594I70473j65124k9594J40295J47744P1814P8699R7677j0874j29846o7394O8541
$$ 970473 805349 775755 916050 1063794 1135608 1214307 1311984 1301110 1171264 1103870 1172411
34583A172411L2014j25292j38294J9213J16757O5436O004J4533J8685J400K3890
$$ 1172411 1204425 1079133 940839 960052 1076809 1142245 1148249 1162782 1181467 1182867 1206757
34572A206757N7140K0896m3562m5624k0337l4465k8420M1930N4770n5341j04789
$$ 1206757 1263897 1284793 1241231 1195607 1175270 1140805 1112385 1154315 1209085 1153744 1048955
34561A048955L8932J61691K8334j87747j68581K3044Q5892J1327L7532J61214
$$ 1048955 1087887 1249578 1277912 1090165 921584 944628 1030520 1041847 1079379 1240593
34551A240593J42146l1227j02503J2016J17110R1530J2912o8338j61885j70129
$$ 1240593 1382739 1351512 1249009 1261025 1378135 1469665 1482577 1414239 1252354 1082225
34541A082225p725J55498R9563o0042m3726J07439J11584m1538q3769L4814P3478
$$ 1082225 1074500 1229998 1329561 1269519 1225793 1333232 1444816 1403278 1319509 1354323 1427801
34530A427801m1709j02933k4840K7113j3527p399O8043M8834p3121q5286O3634
$$ 1427801 1386092 1283159 1258319 1285432 1271905 1264506 1332549 1381383 1308262 1222976 1286610
34519A286610J43232K0210j34746j36443k7678O8206J14351J03776K9237m9023
$$ 1286610 1429842 1450052 1315306 1178863 1151185 1219391 1333742 1437518 1466755 1417732
34509A417732o8519p5444j09749p8015N7237J13496k4146j31052J5126K11719
$$ 1417732 1349213 1273769 1164020 1086005 1143242 1256738 1232592 1101540 1116666 1328385
34499A328385J44789n7139m7376J12149P4093j40391j75144L700N8670q2162j08056
$$ 1328385 1473174 1416035 1368659 1480808 1554901 1414510 1239366 1243066 1301736 1219574 1111518
34488A111518P5451J78123O9798k4092M791j6582j07816m3833J58650J73404n2071
$$ 1111518 1186969 1365092 1434890 1410798 1415589 1399007 1291191 1247358 1406008 1579412 1527341
34477A527341j53818K1350J53587L2301r7791k6347N8193k6314j17162n7493R060
$$ 1527341 1373523 1394873 1548460 1580761 1482970 1456623 1514816 1488502 1371340 1313847 1322907
34466A322907l4914l5479R4473J61207O0935l290Q5370J23255j1630j05105j2619
$$ 1322907 1287993 1252514 1346987 1508194 1569129 1565839 1651209 1774464 1762834 1657729 1645110
34455A645110N8047n7952j69837r4549J5679j1317o0093o679K7237l6596k8255
$$ 1645110 1703157 1645205 1475368 1380819 1396498 1385181 1325088 1318409 1345646 1309050 1280795
34444A280795J20599J69324j1272j59473n7078R9049O6778l4247q327M2290l3030
$$ 1280795 1401394 1570718 1559446 1399973 1342895 1441944 1508722 1474475 1466148 1508438 1475408
34433A475408j01712o624J05296M1256q9207q9826j2861L258J905N0992N3476
$$ 1475408 1373696 1367072 1472368 1513624 1424417 1334591 1321730 1324988 1326893 1377885 1431361
34422A431361l7729o1439O1721J43541N8253k6137K5139O1035l8488j09005k2673
$$ 1431361 1393632 1332193 1393914 1537455 1595708 1569571 1594710 1655745 1617257 1508252 1485579
34411A485579N3285j8607q2071r826M3083k3988k1249J44165K14476L0995j34914
$$ 1485579 1538864 1520257 1438186 1428360 1471443 1447455 1426206 1570371 1784847 1815842 1680928
34400A680928m3968Q8790N899j22190m3439R9364O3302l6407O573O0469o6075
$$ 1680928 1636960 1725750 1731649 1609459 1566020 1665384 1728686 1692279 1698852 1759321 1693246
34389A693246j92536o6104J51828J46540j9846p0472l488k282m5401l385N5496
$$ 1693246 1500710 1434606 1586434 1732974 1713128 1642656 1639168 1636886 1591485 1588100 1643596
34378A643596K1471P127J10827J48757k5647j90720j12098M2027K4797l9067N7179
$$ 1643596 1665067 1672194 1783021 1931778 1906131 1715411 1603313 1645340 1670137 1631070 1688249
34367A688249J54516K4626j55192r5539Q4024J00109K7139Q7799J62396J8474
$$ 1688249 1842765 1867391 1712199 1616660 1700684 1800793 1827932 1915731 2078127 2096601
34357B096601j86475j52253J1490J842r9925q305J80551J43056o4358j08088J6179
$$ 2096601 1910126 1757873 1769363 1771205 1671280 1662975 1843526 1986582 1922224 1814136 1830315
34346A830315K7014p5872l4653J26233J15114q1163j57909r309J51077J82023
$$ 1830315 1857329 1781457 1746804 1873037 1988151 1906988 1749079 1739770 1890847 2072870
34336B072870J33156J3763j74333k44142m7866J95095J74520k2447q7297q482
$$ 2072870 2206026 2219789 2045456 1801314 1753448 1948543 2123063 2100616 2013319 2004837
34326B004837M477l6475K2734R5683M797j21144n0318R6038N1139r1904o3276
$$ 2004837 2009314 1972839 1995573 2091256 2096053 1974909 1924591 2020629 2071768 1979864 1916588
34315A916588N9916K0246r4416k7139J04982J0782j75124r2082J60576J62035
$$ 1916588 1976504 1996750 1902334 1875195 1980177 1990959 1815835 1723753 1884329 2046364
34305B046364p8471j44836L9708J22385q566p8071K244K567j10420q4426J03254
$$ 2046364 1967893 1823057 1862765 1985150 1976584 1898513 1900757 1903324 1792904 1708478 1811732
34294A811732J59910J57j20156o7725J2715M8833J18242J64079N5373q7999m9589
$$ 1811732 1971642 1971799 1851643 1783918 1796633 1845466 1963708 2127787 2183160 2095161 2045572
34283B045572O8645K1911r6819l4009R9204J7234j54921p4934J51897J31575q1675
$$ 2045572 2114217 2136128 2039309 2005300 2104504 2121738 1966817 1891883 2043780 2175355 2093680
34272B093680p5318J41808J44434j17541k26658n3680O4819j0028k1341J16268
$$ 2093680 2018362 2160170 2304604 2187063 1960405 1906725 1971544 1961516 1940175 2056443
34262B056443J60927N6009K4839Q1882J1564j31080p5771J00202O6511j16296
$$ 2056443 2217370 2273379 2298218 2380100 2391664 2260584 2184813 2285015 2351526 2235230
34252B235230q3901J24377J23286p3564q3509Q3636N2430j30972m8452K24938
$$ 2235230 2151329 2275706 2398992 2325428 2241919 2325555 2377985 2247013 2198561 2423499
34242B423499J66964k01299k69573P5960K39953l771j49420N0363J53139o7028
$$ 2423499 2590463 2389164 2119591 2195551 2435504 2431733 2282313 2332676 2485815 2418787
34232B418787j72743P0644K24286J2439j64555j1498J25071k7725j41793L9852
$$ 2418787 2246044 2316688 2540974 2553413 2388858 2377360 2502431 2474706 2332913 2372765
34222B372765J90034M1906j03024J4537J19680j5525j10231M9339J65273N281
$$ 2372765 2562799 2604705 2501681 2516218 2635898 2620373 2510142 2559481 2724754 2730035
34212B730035j49241n6678M7907l2888p6202N5146J03506l6948o6034J04197J21531
$$ 2730035 2580794 2524116 2572023 2539135 2462933 2518079 2621585 2584637 2518603 2622800 2744331
34201B744331r6714j25953J51808K42804o4122k69738o2672J38368J5501o7775
$$ 2744331 2647617 2521664 2673472 2916276 2852154 2582416 2519744 2658112 2673613 2605838
34191B605838J55004K77262K424k43124q3606J30980K6243j18559J446J04423
$$ 2605838 2760842 3038104 3040528 2797404 2713798 2844778 2871021 2752462 2753908 2858331
34181B858331n3427j33058R7038K27524j8593k01413J3795J99526R73j47744J25268
$$ 2858331 2804904 2671846 2768884 2996408 2977815 2776402 2790197 2989723 2990696 2842952 2968220
34170B968220L39964L1596l37246j91141J32100O4097j46659k12K50956J18004
$$ 2968220 3308184 3339780 3002534 2811393 2943493 3007590 2860931 2860719 3111675 3229679
34160C229679j48984n1765J84553O5159k09039j47935Q6423M2675j27263j6406
$$ 3229679 3080695 3028930 3213483 3278642 3069603 2921668 3008091 3050766 2923503 2907097
34150B907097J96201J10728q1336J2664J87538N8417j39849l020K19080R0718
$$ 2907097 3103298 3214026 3132690 3145354 3332892 3391309 3251460 3248440 3467520 3558238
34140C558238j47746m0109J91091P9083j73810r2884J58394J31468l9035K5123
$$ 3558238 3410492 3370383 3561474 3640557 3466747 3373863 3532257 3663725 3624690 3649813
34130C649813J44195k8856k34622p7416J65663O0385j25697M3262K72374Q8666
$$ 3649813 3794008 3765152 3530530 3453114 3618777 3679162 3553465 3596727 3869101 3957767
34120C957767k06088q9533J71287M8725k03854n8864K27208J13630j46144m977
$$ 3957767 3751679 3662146 3833433 3882158 3678304 3619440 3846648 3960278 3814134 3809157
34110C809157K71791J11850k15188r9988K02927N5209l06305k04979J73752J51492
$$ 3809157 4080948 4192798 3977610 3877622 4080549 4135758 3829453 3624474 3798226 3949718
34100C949718j34920m5458K77647J99664j36819r3676K00762J30359j59634o2650
$$ 3949718 3814798 3769340 4046987 4246651 4109832 4016156 4216918 4347277 4187643 4124993
34090D124993K35115R7176k57893j20921L15457K83423j03542j01620K06146J20006
$$ 4124993 4360108 4457284 4199391 4078470 4393927 4677350 4573808 4472188 4678334 4798340
34080D798340k35667j32730K89152K41237j80903j65074K47785K58114j32914
$$ 4798340 4562673 4429943 4719095 4960332 4779429 4614355 4862140 5120254 4987340
34071D987340j64883J63655J32971k09007j23608L03787K66910j79864j96735
$$ 4987340 4822457 4986112 5119083 4910076 4786468 5090255 5357165 5177301 4980566
34062D980566K14384K32240j56862j57988K16631J65848k58443j94381L15130
$$ 4980566 5194950 5427190 5270328 5112340 5328971 5494819 5236376 5041995 5357125
34053E357125L46188j18742j54603K87005K90054j94700k32968K42442K90015
$$ 5357125 5703313 5584571 5429968 5716973 6007027 5812327 5579359 5821801 6111816
34044F111816j69094j91899K90155L08668j94911j97096L79964M46892j45694
$$ 6111816 5942722 5750823 6040978 6349646 6154735 5957639 6337603 6784495 6638801
34035F638801k89606K40963L71619j50304k79304K33338L46584j78263k84427
$$ 6638801 6349195 6590158 6961777 6811473 6532169 6765507 7112091 6933828 6649401
34026F649401K64160L90848j31073j87129M32883N18458j97124m18292K60379
$$ 6649401 6913561 7304409 7173336 6986207 7419090 7937548 7740424 7322132 7582511
34017G582511N67529j1565l15247J62670L41501j80146k69124M18451O19542q0246
$$ 7582511 8150040 8138475 7823228 7985898 8327399 8147253 7878129 8296580 8916122 8835876
34007H835876l60476K89964N78730k8892k54512M15792O50492r0020m20986K68823
$$ 8835876 8475400 8765364 9344094 9315202 9060690 9476482 10126974 10036954 9615968 9884791
33997I884791O09265l4609l21090L33071N45299j94964l53042O02243R51069l726
$$ 9884791 10494056 10459447 10138357 10471428 11016727 10821763 10468721 11070964 12022033 12018307
33987A2018307m91020L36591P59757p8222m17775O05065J104775R6507m82572
$$ 12018307 11527287 11863878 12623635 12545413 12127638 12732703 13837478 13933985 13451413
33978A3451413M75283J049983J01129m15583O51271J237796J26053n11720O37161
$$ 13451413 13926696 14976679 15077808 14662225 15313496 16551292 16677345 16165625 16802786
33969A6802786J313715J37780n00658Q61428J648510K42940n92680R84408K070845
$$ 16802786 18116501 18254281 17753623 18615051 20263561 20506501 19913821 20898229 22969074
33960B2969074N70937n33558J061779K296826P20344m34364J457753K906525J043013
$$ 22969074 23540011 23006453 24068232 26365058 27085402 26651038 28108791 31015316 32058329
33951C2058329l21467K023612L914151J720909L0571L019425N626763K999637
$$ 32058329 31736862 33760474 37674625 39395534 39426105 42445530 48072293 51071930
33943E1071930P65393M632639Q279199M922321J816997P078975J1922425O608921
$$ 51071930 51837323 56469962 64749161 69671482 71488479 78567454 90489879 97098800
33935I7098800L920811J8213514K7039430q545768p8419109j16861250q2279075
$$ 97098800 101019611 119233125 146272555 137726787 59307678 -57553572 -139832647
33928a39832647j2555759K5960749J9699832N855616P890548J2647622P314232
$$ -139832647 -152388406 -126427657 -106727825 -100872209 -92981661 -80334039 -73019807
33921g3019807J516711M501339Q202415M681444M45777K413975N286435L029039
$$ -73019807 -71503096 -67001757 -58799342 -54117898 -53672121 -51258146 -45971711 -42942672
33913d2942672P7032J695591L974456K156306k84525J035764L045365J689316
$$ -42942672 -42865640 -41170049 -37195593 -35039287 -35323812 -34288048 -31242683 -29553367
33905b9553367l16059P60582K465354J341554l57172N95291K078530J011393o03575
$$ -29553367 -29869426 -29108844 -26643490 -25301936 -25659108 -25063817 -22985287 -21973894 -22577469
33896b2577469K71199J841495J123575l81399J24534J361614P76864m49715L9989
$$ -22577469 -22306270 -20464775 -19341200 -19722599 -19598065 -18236451 -17459587 -17909302 -17869313
33887a7869313J122371O02453m10503J62457J196341O46324l98425P5316J032032
$$ -17869313 -16746942 -16144489 -16554992 -16392535 -15196194 -14549870 -14948295 -14872979 -13840947
33878a3840947M99715n21754o4597R40250N31862m50797p0157R36173O65223k79546
$$ -13840947 -13341232 -13862986 -13927583 -12987333 -12455471 -12906268 -12976425 -12040252 -11375029 -11654575
33868a1654575j12861O25474K88491n26514j66316P85338O24180k08387r2092
$$ -11654575 -11767436 -11141962 -10853471 -11379985 -11546301 -10760963 -10136783 -10345170 -10437262
33859a0437262O09200L92718l62379j88643N49572M05978l01671j80397M77253
$$ -10437262 -9828062 -9435344 -9797723 -9986366 -9436794 -9030816 -9332487 -9512884 -9035631
33850i035631L33000l21514j74597M94371L91529k36194j36817M55278L26548
$$ -9035631 -8702631 -9024145 -9198742 -8704371 -8312842 -8549036 -8685853 -8230575 -7904027
33841g904027k82995j70850M35490L48702k18644j00577M90073L85709k18006
$$ -7904027 -8187022 -8357872 -7922382 -7573680 -7792324 -7892901 -7402828 -7017119 -7235125
33832g235125j53614M07064K98217l33357l07038K99828L40184j69359j64456
$$ -7235125 -7388739 -6981675 -6683458 -7016815 -7323853 -7024025 -6683841 -6853200 -7017656
33823g017656L25675K80363k34863j84791L66083L56419j86921j92106L70797
$$ -7017656 -6691981 -6411618 -6646481 -6831272 -6465189 -6108770 -6295691 -6487797 -6117000
33814f117000M36831j07509k62462J44006K27560j56968k02742J69501J71636
$$ -6117000 -5680169 -5787678 -6050140 -5906134 -5678574 -5835542 -6038284 -5868783 -5697147
33805e697147k16247j75907K96240L39199r1807j46895K45447K71244j29203j54376
$$ -5697147 -5913394 -6089301 -5793061 -5453862 -5545669 -5692564 -5447117 -5175873 -5305076 -5459452
33795e459452K39718K45373j76153k06012J96732K04318k16191k01495K90507
$$ -5459452 -5219734 -4974361 -5150514 -5356526 -5159794 -4955476 -5171667 -5373162 -5082655
33786e082655L32256j91117l21857J66885L61253m7947k28627J60988L61651J1872
$$ -5082655 -4750399 -4941516 -5263373 -5096488 -4735235 -4783182 -5011809 -4850821 -4489170 -4477298
33776d477298k18299J0688J14999j50402j89703J83812L07487l6589j67318J76106
$$ -4477298 -4695597 -4684909 -4569910 -4720312 -4910015 -4726203 -4418716 -4455305 -4622623 -4446517
33766d446517L23313k6487k30584N6343K60606L0229j46146K9086J14910r7343
$$ -4446517 -4123204 -4149691 -4380275 -4323932 -4063326 -4033097 -4179243 -4150157 -4035247 -4132590
33756d132590j42907J26911J83477j15546j82247J53705K56664j06188k80547
$$ -4132590 -4275497 -4148586 -3965109 -4080655 -4262902 -4109197 -3852533 -3958721 -4239268
33747d239268O3178L30026J28536p0574O4351J13778j52780k42505Q9142L10164
$$ -4239268 -4176090 -3846064 -3717528 -3788102 -3723751 -3609973 -3762753 -4005258 -3916116 -3605952
33737c605952J08959m1248J43228J88710j61621l65952p9073J90819L4546j35019
$$ -3605952 -3496993 -3538241 -3395013 -3206303 -3367924 -3733876 -3812949 -3622130 -3587584 -3722603
33727c722603O5257K65060J01231r6557K985J10892l1317j13800P8091J86729
$$ -3722603 -3657346 -3392286 -3291055 -3387612 -3384627 -3273735 -3305052 -3418852 -3340761 -3154032
33717c154032j1729j48316M148Q1866j12045j73004J01316K59755M1233j24586
$$ -3154032 -3165761 -3314077 -3309929 -3228063 -3340108 -3513112 -3411796 -3152041 -3110808 -3235394
33707c235394M4672J56484l7656j27375J14811K20337p1402k41589N5971L05676
$$ -3235394 -3190722 -3034238 -3071894 -3199269 -3084458 -2864121 -2935523 -3177112 -3121141 -2815465
33697b815465N8958k52416j33859J06906L6398r0243O8160K08267J703j99851
$$ -2815465 -2756507 -3008923 -3142782 -3035876 -2999478 -3089721 -3021561 -2813294 -2811591 -3011442
33687c011442j9879J98980L9908j96808q4343J23037J4534j86380r1505J01822
$$ -3011442 -3031321 -2832341 -2792433 -2989241 -3073584 -2950547 -2936013 -3122393 -3213898 -3112076
33677c112076M7490n4761R7141K54067R9601q9080M5392K34519Q2598j83248j52358
$$ -3112076 -3064586 -3119347 -3022206 -2768139 -2668538 -2757618 -2712226 -2477707 -2395109 -2578357 -2730715
33666b730715J9244j7425j09507L4342K00773P4019j15321j4118J70685P7489
$$ -2730715 -2711471 -2728896 -2838403 -2804061 -2603288 -2529269 -2644590 -2658708 -2488023 -2410534
33656b410534j07228j8941J80268J27782n8921o6831k743j00594j73736J8404
$$ -2410534 -2517762 -2536703 -2356435 -2228653 -2287574 -2354405 -2357148 -2457742 -2631478 -2613074
33646b613074K19665J10684p9261q507J23590n899j78295n1846J51168O2368j16254
$$ -2613074 -2393409 -2282725 -2361986 -2370493 -2246903 -2252802 -2431097 -2482943 -2331775 -2269407 -2385661
33635b385661j9836J41785m222k13643m2538K79959K10035j42949k22417Q192
$$ -2385661 -2405497 -2263712 -2267934 -2481577 -2524115 -2244156 -2034121 -2177070 -2399487 -2391295
33625b391295J04491j1059j7373J02714O5417r0309o5649R0562P4699o9549n5563
$$ -2391295 -2286804 -2297863 -2315236 -2212522 -2147105 -2237414 -2303063 -2212501 -2137802 -2207351 -2262914
33614b262914O0079L270j41189q6792O7015J8715j17600j0020K22160J85093o5811
$$ -2262914 -2202835 -2199565 -2340754 -2427546 -2360531 -2341816 -2459416 -2469436 -2247276 -2062183 -2127994
33603b127994j24326M4821J13371K7820K3364Q7766J4762r8737l068J61690P1471
$$ -2127994 -2252320 -2207499 -2094128 -2066308 -2042944 -1955178 -1940416 -2039153 -2042221 -1880531 -1809060
33592a809060j50758j24962Q2700Q5125j00140j08564O2351O5421j14943j43284
$$ -1809060 -1959818 -2084780 -2002080 -1916955 -2017095 -2125659 -2063308 -1997887 -2112830 -2256114
33582b256114K2270Q9862K1658N2288J44353L7047j83307j72932L0674P1508n3018
$$ -2256114 -2233844 -2143982 -2122324 -2070036 -1925683 -1888636 -2071943 -2244875 -2214201 -2142693 -2195711
33571b195711j4513J75017J71093k0024l4999J37006J15652j31198j88795M8237
$$ -2195711 -2210224 -2035207 -1864114 -1884138 -1919137 -1782131 -1666479 -1797677 -1986472 -1938235
33561a938235J80622K0879j19570l9077M6363m281r445R2455P2432j18154j90332
$$ -1938235 -1757613 -1736734 -1856304 -1895381 -1849018 -1853299 -1862744 -1770289 -1697857 -1816011 -2006343
33550b006343k2201J29016Q8708R687R633j7595r9209r5484j5785k6791q5008
$$ -2006343 -2028544 -1899528 -1810820 -1801133 -1791500 -1809095 -1908304 -2003788 -2019573 -2046364 -2131372
33539b131372J9726K17097K07694n58q7531M527J479j35083j09989J24382K23184
$$ -2131372 -2111646 -1894549 -1686855 -1687413 -1774944 -1770417 -1768938 -1904021 -2014010 -1889628 -1666444
33528a666444M1266j29236q4641l987m1930o8446Q815O5638N4263R2977J54921
$$ -1666444 -1625178 -1754414 -1839055 -1843042 -1884972 -1953418 -1944603 -1878965 -1824702 -1731725 -1576804
33517a576804O1999j26483j35603L8372R7293k9234p9040L4230P7779l2023q3331
$$ -1576804 -1514805 -1641288 -1776891 -1738519 -1641226 -1670460 -1749500 -1715270 -1637491 -1669514 -1752845
33506a752845k159K3938m0665k112J29882J03624q0976j23293L1681R2379k8941
$$ -1752845 -1755004 -1731066 -1771731 -1773843 -1643961 -1540337 -1621313 -1744606 -1712925 -1620546 -1649487
33495a649487p6409K2743K0518j25967j27425P9106J77254M7934l1782N9451P9347
$$ -1649487 -1725896 -1703153 -1682635 -1808602 -1936027 -1856921 -1679667 -1631733 -1663515 -1604064 -1524717
33484a524717m8025n3000J19213J36423r4507k00435p790J35246K641j09192L4088
$$ -1524717 -1572742 -1625742 -1506529 -1370106 -1464613 -1665048 -1672838 -1537592 -1534951 -1644143 -1610055
33473a610055J65215L9936j04524j5066J14934M8293n7620m703N5691l8267j16355
$$ -1610055 -1444840 -1404904 -1509428 -1524494 -1409560 -1361267 -1418887 -1423590 -1367899 -1406166 -1522521
33462a522521l1724K4015r2535j64252l2591P0039l7908j17605M0880J97227R0401
$$ -1522521 -1554245 -1530230 -1622765 -1787017 -1819608 -1749569 -1787477 -1905082 -1864202 -1666975 -1576574
33451a576574q3164l5294J11590R9919N40L90K0720o7627j25516n635J36626J22990
$$ -1576574 -1659738 -1695032 -1583442 -1483523 -1482983 -1482593 -1461873 -1529500 -1655016 -1660651 -1524025 -1401035
33439a401035O2906Q0308M4593j16515j73594Q046J69927Q8913m6585k0481K5601
$$ -1401035 -1338129 -1257821 -1213228 -1329743 -1503337 -1495291 -1325364 -1236451 -1283036 -1303517 -1277916
33428a277916n8497r0528N4975J18373p1325k00794k890K19778J01343j38226
$$ -1277916 -1336413 -1426941 -1371966 -1253593 -1324918 -1525712 -1528602 -1308824 -1207481 -1345707
33418a345707r6238J01921P7903r7236p5742J06566J27588k0385p1877l697r426
$$ -1345707 -1441945 -1340024 -1262121 -1359357 -1435099 -1328533 -1200945 -1221330 -1293207 -1296904 -1306330
33407a306330p8588o2506k6899j00117j30308O1276K62280J70583o1294o8234
$$ -1306330 -1384918 -1447424 -1474323 -1574440 -1704748 -1643472 -1381192 -1210609 -1271903 -1340137
33397a340137J04202J22921k4596o2120L5414M0753n4133m5520N5644N5797j9202
$$ -1340137 -1235935 -1113014 -1137610 -1199730 -1164316 -1123563 -1177696 -1223216 -1167572 -1111775 -1130977
33386a130977J2824R2776J6921j39786j28615J3815M0023m6228l4772N3839J6721
$$ -1130977 -1118153 -1025377 -1008456 -1148242 -1276857 -1263042 -1223019 -1269247 -1304019 -1250180 -1233459
33375a233459j03179p6819O6733Q4643l1305o8429r905k2925q1669j9504R7150
$$ -1233459 -1336638 -1413457 -1346724 -1262081 -1293386 -1361815 -1371720 -1394645 -1476314 -1495818 -1398668
33364a398668O7660l4414J6003J38417P3930r7004n9163J50890J76404l7644j67327
$$ -1398668 -1331008 -1365422 -1349419 -1211002 -1137072 -1234076 -1293239 -1142349 -965945 -1003589 -1170916
33353a170916q9876l2509p6724j9517J64078K02764J5075j25578o1364K0352k4398
$$ -1170916 -1260792 -1293301 -1370025 -1389542 -1225464 -1022700 -1007625 -1133203 -1194567 -1174215 -1198613
33342a198613o2447P438O3443K6927K399L0080J756q1800p4121K0537K5666o9279
$$ -1198613 -1261060 -1253622 -1190179 -1163252 -1160853 -1130773 -1129017 -1210817 -1284938 -1264401 -1238735 -1308014
33330a308014p1933N2629J17136O6747N6760J13154O8030q8587j43373l5756L8834
$$ -1308014 -1379947 -1327318 -1210182 -1143435 -1086675 -973521 -905491 -994078 -1137451 -1173207 -1134373
33319a134373j0627l9746J8264M0661k301J6433Q6841L9461j11897j47754l1986
$$ -1134373 -1145000 -1184746 -1166482 -1125821 -1128122 -1111689 -1024848 -985387 -1097284 -1245038 -1277024
33308a277024K7821k7159k3759O6665O0118m9613m1448R1756P9191j22862k01681
$$ -1277024 -1249203 -1276362 -1300121 -1233456 -1173338 -1222951 -1264399 -1172643 -1093452 -1216314 -1417995
33297a417995k8412J11583K8900o2029J9093R2603N839m8817Q6681J93819M8877
$$ -1417995 -1446407 -1334824 -1305924 -1367953 -1348860 -1256257 -1250418 -1299235 -1212554 -1018735 -969858
33286i69858j69392j80265m4340K2143L6402J18827J76374N2858j47764j90000
$$ -969858 -1139250 -1319515 -1363855 -1341712 -1305310 -1186483 -1010109 -957251 -1105015 -1295015
33276a295015n6512P4820J03585N4955l2906r3325k5695J40180K12004J03149
$$ -1295015 -1351527 -1276707 -1173122 -1118167 -1151073 -1244398 -1270093 -1129913 -917909 -814760
33266h14760k9411m5655k8879q1812j19527m4876N3251O1267L5105N7972O3230
$$ -814760 -844171 -889826 -918705 -1000517 -1120044 -1164920 -1111669 -1050402 -1015297 -957325 -894095
33255h94095k7482j34081j46220q9294l1220L3652R3824P4167j2001l4706L2711
$$ -894095 -921577 -1055658 -1201878 -1291172 -1322392 -1288740 -1194916 -1120749 -1132750 -1167456 -1134745
33244a134745N5024j4894m6682J0315K6226l8360k8019R8602J35932j5348j40967
$$ -1134745 -1079721 -1094615 -1141297 -1130982 -1104756 -1143116 -1171135 -1072533 -936601 -951949 -1092916
33233a092916o6572N1815K5835l6820L0039J20785O1205n4349l5783N0838J1720
$$ -1092916 -1159488 -1107673 -1081838 -1118658 -1088619 -967834 -906629 -960978 -996761 -945923 -934203
33222i34203j14885j27948j1665O3050L2469r977j7351k5087j8231M2743R5953
$$ -934203 -1049088 -1177036 -1188701 -1125651 -1093182 -1103159 -1120510 -1145597 -1163828 -1121085 -1025132
33211a025132N0709m6687p2375j3025M1783N3496N5099N5687L2939q259m1643
$$ -1025132 -974423 -1021110 -1093485 -1106510 -1064727 -1011231 -956132 -900445 -867506 -875765 -917408
33200i17408m6197K041R1307J23142J8149j26783j40320l4101L1327L2864R1641
$$ -917408 -963605 -961564 -870257 -747115 -728966 -855749 -996069 -1030170 -998843 -965979 -874338
33189h74338J73705Q3393j63092k70466j08072P8954P1315n787K9694R1795L5671
$$ -874338 -700633 -617240 -780332 -1050798 -1158870 -1079916 -1008601 -1014388 -984694 -892899 -857228
33178h57228n0104k1537N0728L8257k45L2074N4181k4408r1505k5216O5762L0493
$$ -857228 -907332 -928869 -878141 -839884 -840129 -808055 -753874 -778282 -869787 -895003 -829241 -798748
33166g98748n4814m1223K3549J7174j4246K6202O4649r680j15283j09609k9487
$$ -798748 -853562 -894785 -871236 -854062 -868308 -842106 -777457 -787137 -902420 -1012029 -1041516
33155a041516P561J1945L3332J2681p2989q1081O3736J77524R2123n0052l1167
$$ -1041516 -1033955 -1022010 -988678 -975997 -1048986 -1130067 -1066331 -888807 -796684 -846736 -877903
33144h77903P6853N9533o8178j21029o3332j415M3869J05365J11446K538r6125
$$ -877903 -801050 -741517 -809695 -930724 -994056 -995471 -951602 -846237 -734791 -732253 -828378
33133h28378n0037M7113L6181l4942l2752P885n620n781Q4295J32391N963j44214
$$ -828378 -878415 -831302 -795121 -830063 -862815 -854930 -860550 -866331 -782036 -649645 -643682 -787896
33121g87896j00445N4838Q8446Q538l105N8314N2127j5678l3911l2437r6094j32588
$$ -787896 -888341 -833503 -745057 -736519 -739624 -681310 -629183 -644861 -678772 -711209 -807303 -939891
33109i39891k4393R4953K9894j16983j01437M4139Q9057J3324j1556K4307r201
$$ -939891 -964284 -869331 -839437 -956420 -1057857 -1013718 -924661 -911337 -922893 -898586 -907787
33098i07787p0738j6136P7329J9379j09968o1928J30600J89577O4907j5643K6569
$$ -907787 -978525 -994661 -917332 -897953 -1007921 -1069849 -939249 -749672 -684765 -700408 -673839
33087f73839L0726m3913m9250K0875P91r8703p5577P6211J25066Q524p5150m6491
$$ -673839 -643113 -687026 -736276 -715401 -714610 -813313 -888890 -812679 -687613 -679089 -754239 -800730
33075h00730n2449j16991n6024J47888K40158R7153q3661j20630p3417k4744N5140
$$ -800730 -853179 -970170 -1026194 -878306 -638148 -540995 -624656 -745286 -818703 -843447 -788307
33064g88307J17964K3931j65008j86342R442J52318P8600m8863p2413o9422j01511
$$ -788307 -670343 -646412 -811420 -997762 -988320 -836002 -757402 -806265 -878678 -948100 -1049611
33053a049611n3135J02433J69832N0313p3145m4417L1092K9214K4069Q5592J09755
$$ -1049611 -1102746 -1000313 -830481 -780168 -853313 -897730 -866638 -837424 -813355 -727763 -618008
33042f18008L0859l0151K984J5090n7211p9384J7350P3102j9449j08712m7165
$$ -618008 -587149 -617300 -614316 -599226 -656437 -735821 -718471 -645369 -664818 -773530 -820695
33031h20695O3625P7548L8662L0469L991o4453n7579N8534J05992k2656j58504
$$ -820695 -757070 -679522 -640860 -610391 -606400 -670853 -728432 -669898 -563906 -586562 -745066
33020g45066j19688J5537Q0119O9300M7177j850o0461j8571J12379J38219p289
$$ -745066 -864754 -849217 -769098 -699798 -652621 -654471 -714932 -733503 -621124 -482905 -490194
33009d90194j24133q1021k6279p7022q4778N4215J42453J8727j13720j8832J47365
$$ -490194 -614327 -695348 -721627 -798649 -883427 -829212 -686759 -668032 -781752 -800584 -653219
32998f53219R8443q7513j11960L9342J10818J7982p4911p8072o4956n8350l354
$$ -653219 -554776 -642289 -754249 -714907 -604089 -586107 -661018 -739090 -804046 -862396 -865750
32987h65750O0580M1511j6480l594M4698K1236l2971p386M7567N737q1359o2312
$$ -865750 -805170 -763659 -780139 -783733 -739035 -717799 -750770 -758156 -710589 -704852 -786211 -848523
32975h48523L3887M5923k8673m1311L1347O6187L8097M2713P4734K5080q3753
$$ -848523 -814636 -768713 -797386 -838697 -807350 -741163 -703066 -660353 -585619 -560539 -644292
32964f44292r4858J4777Q3026K7843m0269k9061J075j6113l6888j4738J3253J5528
$$ -644292 -739150 -724373 -641347 -613504 -653773 -682834 -681759 -697872 -734760 -749498 -736245 -720717
32952g20717K4928N2053M5637r772m9964k9581J4006K8631J1575j5103l3055k2525
$$ -720717 -695789 -643736 -598099 -607871 -657835 -687416 -673410 -644779 -633204 -648307 -681362 -703887
32940g03887J6164L8300M761n3853p2080l2430K7545O5095N6621J0032k4686j0584
$$ -703887 -687723 -649423 -644662 -698515 -770595 -803025 -775480 -710385 -653764 -643732 -668418 -679002
32928f79002L728m6657r9622k8794J22257J44763j7052j38866l9006J43656J66922
$$ -679002 -675274 -721931 -821553 -850347 -728090 -583327 -600379 -739245 -778251 -634595 -467673
32917d67673L7638n1881l3960l763j2578j9611j5081k2847j0727N2985R2642K1595
$$ -467673 -430035 -481916 -515876 -519639 -532217 -551828 -566909 -589756 -600483 -547498 -454856 -433261
32905d33261r3647j11458k4418M7240M0052m944m6315p1003n3232K772K3053k7444
$$ -433261 -526908 -638366 -662784 -615544 -575492 -580436 -626751 -697754 -750986 -748214 -725161 -752605
32893g52605n9650K957Q1374O8412J6734M0484R8319N5739p4235j35694o9140
$$ -752605 -812255 -809298 -727924 -659512 -642778 -602294 -503975 -448236 -522471 -658165 -727305
32882g27305J9507M2778L8525O1450Q4845N5004k6487j03598j16240n4756J9427
$$ -727305 -707798 -665020 -626495 -565045 -480200 -425196 -451683 -555281 -671521 -726277 -706850
32871g06850M0683K7944M0559N7155J2388m9006j3518Q5037Q2478l3143p5412
$$ -706850 -666167 -638223 -597664 -540509 -528121 -577127 -590645 -505608 -423130 -456273 -531685
32860e31685J8253N9297o4287j76914j09981K2131M7638K1931N6428P0790k6720
$$ -531685 -513432 -454135 -518422 -695336 -805317 -783186 -735548 -713617 -657189 -586399 -613119
32849f13119j02405j8177Q5504K1458r3132l6273J09997R3224p1034j40951n8355
$$ -613119 -715524 -733701 -648197 -626739 -719871 -756144 -646147 -552923 -623957 -764908 -823263
32838h23263J7360L0807O1259P9280m832r1479j3735J31375J03874o3505j14447
$$ -823263 -805903 -775096 -713837 -634557 -639389 -730868 -744603 -613228 -509354 -572859 -687306
32827f87306o425N9703L2540N5452J12907K7077j53725j65859J484N5945q1415
$$ -687306 -693731 -634028 -601488 -546036 -433129 -406052 -559777 -725636 -724152 -668207 -749622
32816g49622j27264M9241J76702N2886j13013p7255N0950O5939K0331M5797O8912
$$ -749622 -876886 -827645 -650943 -598057 -711070 -788325 -737375 -671436 -651105 -605308 -536396
32805e36396j3150q5074j6203P2861J4397r7530p0504M7661O0393m3597r7326
$$ -536396 -549546 -634620 -650823 -577962 -563565 -661095 -731599 -683938 -623545 -667142 -764468
32794g64468l5275M8960P9086N2255k9825j29409j33964J755J39590J26795J2416
$$ -764468 -799743 -750783 -671697 -619442 -649267 -778676 -912640 -910885 -771295 -644500 -632084
32783f32084m7088k6075j9625n2820o0310k7866j0200j7576q511N498l9170j30417
$$ -632084 -679172 -705247 -724872 -777692 -838002 -865868 -876068 -893644 -902155 -896657 -935827 -1066244
32771a066244j39984L7063L25275M91821L64310L5518k04720j86705m2347L654
$$ -1066244 -1206228 -1169165 -843890 -352069 12241 47759 -156961 -343666 -386013 -382359
32761c82359o6959j07309o7132l1348l3278k1505l945l4022n5301L8024J76850
$$ -382359 -449318 -556627 -623759 -655107 -688385 -709890 -713835 -747857 -803158 -765134 -588284
32750e88284J70123R674j00754o5042j3085l7276m9017Q454L2523l5863q6406
$$ -588284 -418161 -408487 -509241 -574283 -587368 -624644 -673661 -665207 -632684 -668547 -754953
32739g54953l7638K7684L8208N4588J00474P1232n7493j22907k3970R7793P7242
$$ -754953 -792591 -764907 -726699 -672111 -571637 -500405 -557898 -680805 -704775 -606982 -529740
32728e29740l2202q0814m2189K2542Q1174R5255J3806r7389q3729M8100R9470
$$ -529740 -561942 -642756 -684945 -662403 -581229 -485974 -472168 -569557 -653286 -605186 -505716
32717e05716r09p1181J128N6474l9583j35628n2322J06534J42545Q4517P2093
$$ -505716 -506625 -577806 -576678 -520204 -559787 -695415 -747737 -641203 -498658 -414141 -342048
32706c42048P3487j9703j39035j38160n1786j8971l2981N731O7967N2623l838
$$ -342048 -268561 -288264 -427299 -565459 -617245 -636216 -669197 -663466 -595499 -542876 -546714
32695e46714Q185N8189L5377l4188l4475K3445K7927k6698m4040n934J7020N178
$$ -546714 -538529 -480340 -444963 -479151 -513626 -490181 -462254 -488952 -532992 -538926 -521906 -516728
32683e16728n368j7316m0883k5830N0209R9194N1736k0982l6503l9042p4688o4921
$$ -516728 -522096 -539412 -580295 -606125 -555916 -456722 -404986 -425968 -462471 -501513 -576201 -641122
32671f41122L4613R2167M430r6072m7224O2480N1454l8437l6126M6755O3882K0160
$$ -641122 -606509 -514342 -509912 -605984 -653208 -590728 -539274 -577711 -613837 -567082 -503200 -483040
32659d83040L9892R9016N7574o4954j02946k6595K6399o17k4717j0512m894O047
$$ -483040 -443148 -344132 -286558 -351512 -454458 -481053 -454654 -455271 -479988 -490500 -495394 -489347
32647d89347O7627J01748l381j63796j81169m6107O0857O5896O9470J09505R2298
$$ -489347 -421720 -319972 -323353 -487149 -668318 -714425 -653568 -587672 -518202 -408697 -316399
32636c16399m625p4960p2403o7140q2992o3018j9816l3110p7090l9900O3501R1348
$$ -316399 -321024 -395984 -468387 -535527 -618519 -681537 -701353 -734463 -811553 -851453 -787952 -696604
32624f96604J5688k9230K3739Q0248O2337J3142j4841k4461m905N5911Q8378K1308
$$ -696604 -680916 -710146 -686407 -606159 -543822 -530680 -545521 -569982 -574887 -518976 -430598 -409290
32612d09290p2619p3010j4765r888k3635M2910J01327j3071j99444j75349O6918
$$ -409290 -481909 -554919 -569684 -579572 -603207 -560297 -458970 -472041 -671485 -846834 -779916
32601g79916K10794R9749m7985l0585L9372n15p2677m2752K6314J6918k0802R052
$$ -779916 -569122 -469373 -517358 -547943 -508571 -509086 -581763 -624515 -598201 -581283 -602085 -593033
32589e93033N1945J9430k8794k577L6620o794o5764j6614R4903J14248J8702o5414
$$ -593033 -541088 -521658 -550452 -553029 -516409 -523203 -588967 -605581 -510678 -396430 -377728 -443142
32577d43142o3227k8181k1158k6318m680L8895O0327K3946m8468q2371m2423Q25
$$ -443142 -506369 -534550 -555708 -582026 -586706 -547811 -487484 -463538 -512006 -594377 -636800 -635975
32565f35975l2656r2731o1090N6419J27334R5287M8436N1320M6892j4915p5230
$$ -635975 -668631 -761362 -822452 -766033 -638699 -543412 -494976 -443656 -396764 -411679 -486909
32554d86909o6272j4517K2671L8683M0684J1896l8730o0366l2881P783L5515N6404
$$ -486909 -553181 -567698 -545027 -506344 -465660 -453764 -492494 -552860 -585741 -577958 -542443 -486039
32542d86039N9827K4453k6702n2881o1384o8752l8626M0991P7157R82q2472l4268
$$ -486039 -426212 -401759 -428461 -481342 -542726 -611478 -650104 -609113 -531956 -530974 -613446 -647714
32530f47714Q0402Q0752l7997j04988n3357O192l717l9250o3948p6997k5578J10749
$$ -647714 -567312 -486560 -524557 -629545 -682902 -676710 -680427 -719677 -783625 -860622 -886200 -775451
32518g75451J81112M5410j39853r9045J16058J80797J7585r8003k4313L1985o8171
$$ -775451 -594339 -548929 -688782 -787827 -671769 -490972 -473387 -571390 -595703 -563718 -631889
32507f31889j32768o89J54828J30399K7928K9956P4813J8520p6344p1209r210
$$ -631889 -764657 -765346 -610518 -480119 -452191 -422235 -347422 -328902 -405246 -476455 -485665
32496d85665r022m7292n2236n9978q6649k1094J53415K22892N7760j23087o1076
$$ -485665 -494687 -541979 -594215 -654193 -740842 -761936 -608521 -385629 -327869 -450956 -512032
32485e12032J34805J65782n926j62604j82416j17182n292J34689J91433Q2332
$$ -512032 -377227 -211445 -217371 -379975 -562391 -679573 -684865 -550176 -358743 -276411
32475b76411o8704q6030m249K3799j1432j6046L550p672n42O1076N1309j07316
$$ -276411 -345115 -431145 -435394 -411595 -423027 -439073 -435523 -443195 -443737 -382661 -331352 -438668
32463d38668k16475o8925J74210J93508J1109p0135J9034L8070j04387j88699
$$ -438668 -655143 -724068 -549858 -356350 -345241 -415376 -396342 -358272 -462659 -651358
32453f51358p6984N7790L5469o1162o9915N369P4006J15730J35278R7982J3864
$$ -651358 -728342 -670552 -635083 -696245 -766160 -760791 -686785 -571055 -435777 -337795 -323931
32442c23931k9782K470L7368J7787k1138l7522l8107k4137J2423K9767j7737q0801
$$ -323931 -353713 -351243 -313875 -296088 -317226 -354748 -392855 -416992 -404569 -374802 -392539 -473340
32430d73340p8809l9272m1616n7293m960O8958N0790j9188P731J18469J31635
$$ -473340 -552149 -591421 -633037 -690330 -695290 -626332 -575542 -594730 -586999 -468530 -336895
32419c36895m470j20794r4499q692K7235K9996L1168j0458q8396r7678n493O7996
$$ -336895 -341365 -462159 -556658 -565350 -538115 -508119 -476951 -487409 -575805 -673483 -678976 -610980
32407f10980L6759j7578l18L7424R709m4127l4934J9438L1500j0823l6862m511
$$ -610980 -574221 -591799 -592117 -554693 -544984 -589111 -624045 -604607 -573107 -583930 -620792 -625303
32395f25303N4407Q6345P1377L8215L3646N3859K6377q7178j98460j82805m5101
$$ -625303 -570896 -484551 -413174 -374959 -341313 -287454 -261077 -348255 -546715 -729520 -774621
32384g74621R1330J44383J26696O1451l7433j05282p1087K2969N9343J6265j3260
$$ -774621 -683291 -538908 -412212 -350761 -388194 -493476 -564563 -541594 -482251 -465986 -479246
32373d79246J1575J9362l0420o4141j3272P4172J02914N0850k3267n0499j0744
$$ -479246 -467671 -448309 -478729 -542870 -556142 -481970 -379056 -328206 -351473 -401972 -412716
32362d12716M4057L2415n4380j24242j05107l9574M233M1727J00720J23146N8843
$$ -412716 -368659 -336244 -390624 -514866 -619973 -659547 -655314 -613587 -512867 -389721 -330878
32351c30878j6685j5542L672n3556j19058o0784O9413R3315o505o4263j617P8966
$$ -330878 -347563 -363105 -359433 -412989 -532047 -592831 -523418 -430103 -436608 -500871 -502488 -423522
32339d23522R2819P4482M8713j8374r9816j07440m8050k2001m2104j9839M7396
$$ -423522 -330703 -256221 -207508 -225882 -325698 -433138 -481188 -503189 -545293 -565132 -517736
32328e17736N4322j6457n5980k1076J3136K3602P1389J25852O1662j07109j88727
$$ -517736 -463414 -479871 -535851 -556927 -543791 -520189 -448800 -322948 -261286 -368395 -557122
32317e57122q6585P0491J40279J27851O8757n2125j79674j75761k5600J09595
$$ -557122 -643707 -573216 -432937 -305086 -236329 -288454 -468128 -643889 -669489 -559894
32307e59894J25592Q8830N3698l0442j45844j54387k8536O9070M8437K5760P6866
$$ -559894 -434302 -345472 -291774 -322216 -468060 -622447 -650983 -581913 -533476 -507716 -430850
32296d30850Q4626j8981q5804p454P3392J0210q4487m6729M4386K3371n8498m4332
$$ -430850 -346224 -365205 -451009 -458463 -385071 -374861 -459348 -506077 -461691 -438320 -496818 -541150
32284e41150K8828N986q7431q3725K8061Q3245J7124n2802l5922J9482M7793N1345
$$ -541150 -512322 -506336 -593767 -677492 -649431 -566186 -549062 -601864 -637786 -618304 -570511 -519166
32272e19166L8717j072l9133j6033P0042J47975J51337P6205j9307n8456l1433
$$ -519166 -480449 -481521 -520654 -536687 -466645 -318670 -167333 -91128 -110435 -168891 -200324
32261b00324k6791r7599j33678j6060J31354O9700j54652k14502k79J82021Q4076
$$ -200324 -227115 -324714 -458392 -474452 -343098 -273398 -428050 -642552 -642831 -460810 -376734
32250c76734j00168p1256J00975J44424M1022j6191J246l8663j15538p3020O9826
$$ -376734 -476902 -548158 -447183 -302759 -261737 -277928 -276682 -315345 -430883 -503903 -434077
32239d34077J18838K7716m2052p704K7434j2018o3585o9967n2956k1198L6173
$$ -434077 -315239 -287523 -329575 -337279 -309845 -321863 -385448 -455415 -508371 -529569 -493396
32228d93396O4418Q684n7165l0379L3951J7935l2406J0082R2776N0998q6623j21227
$$ -493396 -428978 -420294 -477459 -507838 -473887 -455952 -488358 -478276 -385500 -334502 -421125 -542352
32216e42352j5837O0184M0615M2150Q8829M3379r9396j32337K1970J48283P6901
$$ -542352 -558189 -498005 -457390 -415240 -326411 -283032 -382428 -514765 -492795 -344512 -267611
32205b67611n1043m3579K6234j4030j16941j04795J8917Q1938K7088k1386K1999
$$ -267611 -318654 -362233 -335999 -350029 -466970 -571765 -552848 -470910 -443822 -465208 -443209
32194d43209Q2673N7534m4819j31261j25667k7867Q4484J14086L8219o4518j02329
$$ -443209 -360536 -303002 -347821 -479082 -604749 -632616 -548132 -434046 -395827 -460345 -562674
32183e62674o0573J2435O9553Q6546N7453L956l1845k8490n471N960l228j5710
$$ -562674 -623247 -610812 -541259 -454713 -397260 -393304 -425149 -453639 -459110 -453150 -456378 -472088
32171d72088o025K6074L7468o632n7346k6422O9150R9021J0793p5276m9960J5582
$$ -472088 -478113 -452039 -414571 -421203 -478549 -504971 -435821 -336800 -326007 -401283 -451243 -435661
32159d35661N746l8762j4158L8402O686o6287l5835Q5429J30950N0888k2844j0418
$$ -435661 -429915 -468677 -482835 -444433 -437747 -504034 -539869 -454440 -323490 -272602 -295446 -305864
32147c05864J4092M8O332M4623K0389q4922j39547o3985M1518O7708N1438N7533
$$ -305864 -291772 -291724 -285392 -240769 -220380 -305302 -444849 -508834 -467316 -399608 -348170 -290637
32135b90637M3900l4300j01254o9485J3677M3763J2967j3929j2006N793M0904
$$ -290637 -246737 -281037 -382291 -451776 -438099 -394336 -381369 -395298 -407304 -401511 -360607
32124c60607P7293N9975j7212o4963j6056O9659R0809L9152j9361m3927l5909
$$ -360607 -283314 -223339 -240551 -305514 -321570 -251911 -161102 -121950 -141311 -185238 -221147
32113b21147q920K401m0997j09116j11431k7206M8637M6039K1690M7877Q3975
$$ -221147 -230067 -227666 -268663 -377779 -489210 -516416 -467779 -421740 -400050 -352173 -268198
32102b68198N5047o937r827M7171P3268K4831m6238q5250r7686j01213p6556m239
$$ -268198 -213151 -220088 -229915 -182744 -109476 -84645 -130883 -216133 -313819 -415032 -491588 -495827
32090d95827P8138R6908K8922n7748p8103l3998N88l761J965M3762P5199P3081
$$ -495827 -417689 -320781 -291859 -349607 -427710 -461708 -461120 -464881 -462916 -419154 -343955 -270874
32078b70874Q3942J07689N0501j01500j86187r4504K2306k6931j46723j00989
$$ -270874 -186932 -79243 -28742 -130242 -316429 -410933 -388627 -415558 -562281 -663270
32068f63270P4149J03015p2748j81503n2408J29128J37288K6696l4390l6647m2424
$$ -663270 -589121 -486106 -558854 -740357 -792765 -663637 -526349 -499653 -534043 -570690 -613114
32057f13114o505J08158J78257R2232l7675l6424N6546P2548m058m9144m0307
$$ -613114 -619619 -511461 -333204 -240972 -278647 -315071 -258525 -185977 -190035 -239179 -279486
32046b79486o8055j21289p2963Q8394J93029J22022k6576q0684j7460L3575k6040
$$ -279486 -347541 -468830 -541793 -453399 -260370 -138348 -164924 -245608 -263068 -229493 -255533
32035b55533j36757j49939j1872J52028J75573N2769o9805r1301n0817j7086k097
$$ -255533 -392290 -542229 -554101 -402073 -226500 -173731 -243536 -334837 -385654 -402740 -404837
32024d04837j4535p2087j13035l2639J26676J70776L3033r5581m3221Q3553Q2698
$$ -404837 -419372 -491459 -604494 -637133 -510457 -339681 -306648 -402229 -445450 -361897 -279199
32013b79199k7156p5426m0207n4648j36396j31144L0537J94674J83988K7628q9888
$$ -279199 -306355 -381781 -421988 -476636 -613032 -744176 -713639 -518965 -334977 -307349 -397237
32002c97237n2645P5985J48681J02367J3193j9229k286p982l5376k2324J2293
$$ -397237 -449882 -373897 -225216 -122849 -109656 -128885 -131171 -139153 -174529 -196853 -184560
31991a84560k4095j18654j31076j4455Q8181N6400l5584o0657k2655J0779L4479
$$ -184560 -208655 -327309 -458385 -472840 -384659 -328259 -363843 -424500 -447155 -436376 -401897
31980d01897N2903K5331k7526j384R4261Q5110p7747j65556p633J98948J63381
$$ -401897 -348994 -323663 -351189 -352573 -258312 -173202 -250949 -416505 -424138 -225190 -61809
31969f1809n8013j71654r4336l69J3114J3185J2866m7274j03022k6342J11466
$$ -61809 -119822 -291476 -385812 -386181 -373067 -359882 -347016 -394290 -497312 -523654 -412188
31958d12188J08148k3832o4750K6373L9192r6269j55376K969J80596J48748r698
$$ -412188 -304040 -327872 -392622 -366249 -327057 -423326 -578702 -575733 -395137 -246389 -256087
31947b56087o9353l226M7477K2368k2690m5438l6537J6719P3367L4660r9270j73384
$$ -256087 -325440 -328666 -281189 -258821 -281511 -326949 -363486 -346767 -273400 -238740 -338010 -511394
31935e11394r0770K8612L0561l9329l6389L5915N3270j478j3062O1980J16571
$$ -511394 -602164 -573552 -542991 -582320 -618709 -582794 -529524 -531002 -544064 -482084 -365513
31924c65513N7185o0001j08538m4706O2790J23198J08162N0404j7054q9616j49386
$$ -365513 -308328 -368329 -476867 -521573 -458783 -335585 -227423 -177019 -194073 -283689 -433075
31913d33075j41126m2682P1543J06499O5918K2754k667l9480o3820k0466N3985
$$ -433075 -574201 -616883 -545340 -438841 -372923 -350169 -352836 -392316 -456136 -476602 -422617
31902d22617O0016L412k467O6117R0462Q868p8687q3835o4346q3813p4228K8112
$$ -422617 -362601 -359189 -361656 -295539 -205077 -196209 -274896 -358731 -423077 -506890 -581118 -553006
31890e53006J23692Q3471l6978p8568k4070J939m1185m9585L7632J32777J33434
$$ -553006 -429314 -345843 -382821 -461389 -485459 -483520 -524705 -574290 -536658 -403881 -270447
31879b70447N4780k8866q6025j06206n3160P0181J54035Q3886q7071j65332n8238
$$ -270447 -215667 -244533 -330558 -436764 -489924 -419743 -265708 -181822 -268893 -434225 -492463
31868d92463R5124J10060P978l6240K8470N9036l5511j32626q5996M3568Q9275
$$ -492463 -397339 -287279 -279301 -315541 -287071 -228035 -263546 -396172 -482168 -438600 -349325
31857c49325L2015l583L5194P5385O8158M3538J0266n7954j20121q9259J4914
$$ -349325 -317310 -320893 -285699 -210314 -142156 -98618 -88352 -146306 -266427 -355686 -340772
31846c40772O4342J1156m4817k1081L1991L4307r078n1979p6549p0223j5530N6907
$$ -340772 -276430 -265274 -310091 -331172 -299181 -264874 -273952 -325931 -402480 -472703 -488233 -431326
31834d31326Q2340N5834L2439K1989j9568q3156j01118o4690l2337r161N1607
$$ -431326 -348986 -293152 -260713 -238724 -258292 -341448 -442566 -507256 -539593 -548754 -497147
31823d97147J13174P4870l9035p3258K0110R8804N6374k9312n7179n3667o3682
$$ -497147 -383973 -309103 -348138 -421396 -401286 -302482 -246108 -275420 -332599 -386266 -449948
31812d49948m4252K0988M4387j1706m1593K2605P6974K5633m4583j8348M8842
$$ -449948 -494200 -473212 -428825 -440531 -482124 -459519 -382545 -356912 -401495 -419843 -371001
31801c71001M6864Q431K0377M4827O959l5267M637N3798o211j07326q5328M2119
$$ -371001 -324137 -315706 -295329 -250502 -243543 -278810 -274173 -220375 -226586 -333912 -419240 -377121
31789c77121R8168L0766k8890j368L3702j670p0004j03371q2274r765Q6950J28729
$$ -377121 -278953 -248187 -277077 -278445 -244743 -246413 -316417 -419788 -502062 -511827 -424877 -296148
31777b96148O4361l2833n4401j6717j4316m7800l5277K7825O2025M2382R500l4057
$$ -296148 -231787 -264620 -319021 -335738 -350054 -397854 -433131 -405306 -343281 -300899 -291399 -325456
31765c25456r6788j02992Q931J22212O8662q8412j10406N4592J85646J24085j8139
$$ -325456 -422244 -525236 -516305 -394093 -325431 -413843 -524249 -469657 -284011 -159926 -178065
31754a78065p5887n9153m5998k2206L2051L8686m7651j17864n9280O3011J06672
$$ -178065 -253952 -313105 -359103 -381309 -349258 -310572 -358223 -476087 -535367 -472356 -365684
31743c65684N2228j9713o8679q5699k6335J07691J89299J17605o341j2445P3444
$$ -365684 -313456 -333169 -401848 -487547 -513882 -406191 -216892 -99287 -105628 -118073 -44629
31732d4629P4010m6483j28073q4715l5226q1098j24461m1711Q7110R0258k1340
$$ -44629 29381 -17102 -145175 -229890 -265116 -346214 -470675 -512386 -425276 -335018 -356358
31721c56358o8253J8834J02555O1894l3601n4763o308K0141J2479L2168P4937
$$ -356358 -424611 -405777 -303222 -241328 -274929 -329692 -336000 -315859 -303380 -271212 -196275
31710a96275O2991j9058q8874r0212n9672m0489j7432K1413L7870J1100j3209
$$ -196275 -133284 -152342 -241216 -331428 -391100 -431589 -449021 -427608 -389738 -378638 -391847
31699c91847O252M0101L9602M516l8052o7756n3324K7898J15274R6789k8473j11786
$$ -391847 -385595 -345494 -305892 -301376 -339428 -407184 -460508 -432610 -317336 -220547 -249020 -360806
31687c60806n4561M5692M7986j9671k7796L6164O3172J3458l0620j4224R709j6077
$$ -360806 -415367 -369675 -321689 -341360 -369156 -332992 -269820 -256362 -286982 -301206 -291497 -307574
31675c07574o2917p1978l7313L421K3012K5700L2932N3156O2527L7080K690M501
$$ -307574 -370491 -442469 -479782 -476361 -453349 -427649 -394717 -341561 -279034 -241954 -239264 -234763
31663b34763K5541J0928j8922J3672Q4888O5598o0587j29052m7690M0718l036
$$ -234763 -209222 -198294 -217216 -203544 -118656 -53058 -113645 -242697 -290387 -249669 -252705
31652b52705p1129l501J08037O1381r4864j22675O526O0002p0514j96201j34394
$$ -252705 -323834 -327335 -219298 -157917 -252781 -375456 -368930 -308928 -379442 -575643 -710037
31641g10037L7171J42380J44005J01211L4286n1033j07548j05655o9951j4467
$$ -710037 -672866 -530486 -386481 -285270 -250984 -302017 -409565 -515220 -585171 -599638
31631e99638O1432R6500K1520q8399p5432N0511J03010J8459l7364L9418R9423
$$ -599638 -538206 -441706 -420186 -508585 -584017 -533506 -430496 -412037 -449401 -409983 -310560
31620c10560n183j50106j19567O0630J72326J20400J5138k7577p741K8256M7366
$$ -310560 -315743 -465849 -585416 -524786 -352460 -232060 -216922 -244499 -252240 -223984 -176618
31609a76618J8378n7809j08935o6536K7897O7669K3615k6417j0259N0083P2221
$$ -176618 -158240 -216049 -324984 -391520 -363623 -295954 -272339 -298756 -309015 -258932 -186711
31598a86711J2576p2831p9938R984Q7008O0878J276K6325R7599P7875k6216o5027
$$ -186711 -174135 -246966 -326904 -316920 -229912 -169034 -167758 -141433 -43834 34041 7825 -57202
31586e7202p828N39r4244j42280m5256P0209O7334Q110m72K881l6216l4401O0444
$$ -57202 -65030 -64491 -158735 -301015 -346271 -276062 -208728 -200618 -201090 -198209 -234425 -268826 -208382
31573b08382J04191j8165j43494o1554J18576J20494n0945j25075j8273M9027
$$ -208382 -104191 -122356 -265850 -327404 -208828 -88334 -139279 -264354 -282627 -233600
31563b33600n1605j43723n9254Q2554Q5331j3160l3017N1524R3993J6366q2481
$$ -233600 -285205 -428928 -488182 -405628 -320297 -333457 -366474 -314950 -220957 -204591 -287072
31552b87072p4561L0360R9762L4515j07407j61706m9777J14709J60709O6994l8616
$$ -287072 -361633 -331273 -231511 -196996 -304403 -466109 -515886 -401177 -240468 -173474 -212090
31541b12090o0218k1460J9757M4493M5142J0689l5503m9270l0951j6961p478K6287
$$ -212090 -272308 -293768 -274011 -229518 -184376 -173687 -209190 -258460 -289411 -306372 -313850 -287563
31529b87563O5591N7386J0143p762J9761K7886k2719q5175r9567o5047j5896J9789
$$ -287563 -221972 -164586 -154443 -162205 -142444 -114558 -137277 -222452 -322019 -387066 -402962 -383173
31517c83173K2255o625k3176J3759P6512R8592O4313J1331m0648r2085j09177
$$ -383173 -360918 -367543 -390719 -376960 -300448 -201856 -137543 -126212 -166860 -258945 -368122
31506c68122n4600K6542M0256k2623o7421l0127M2991P3809M6964K683j5012J0818
$$ -368122 -422722 -396180 -355924 -378547 -445968 -476095 -433104 -359295 -312331 -309648 -324660 -313842
31494c13842N1791N1715j77m1173k7685o170k0883j5625O4774J34716P3487o3710
$$ -313842 -262051 -210336 -210513 -251686 -279371 -285541 -306424 -322049 -257275 -122559 -49072 -112782
31482a12782j02734j1464O5187M5226P342Q641j4644r0916j24886o2128N359K545
$$ -112782 -215516 -226980 -161793 -116567 -109225 -100584 -115228 -206144 -331030 -393158 -387799 -385254
31470c85254M52O4080J06914M1782l7826N527J15071J13705k4658j43708j35774
$$ -385254 -384802 -320722 -213808 -172026 -209852 -204325 -89254 24451 -207 -143915 -279689
31459b79689n8253p616k363j8264m0430m7723j7387L0494M6146J6913k2626l9657
$$ -279689 -337942 -345558 -347921 -366185 -406615 -454338 -471725 -441231 -395085 -378172 -400798 -440455
31447d40455j9107M4606J16408J13040p32j33211j63907j00513m7300l2494J7901
$$ -440455 -459562 -414956 -298548 -185508 -186240 -319451 -483358 -583871 -631171 -663665 -645764
31436f45764J18209J58306O5481o1633p1689L6529J19956Q2151k2988q6521p5116
$$ -645764 -527555 -369249 -303768 -365401 -437090 -400561 -280605 -198454 -221442 -307963 -383079
31425c83079l4385o934N485J2059Q785o275k0943k6017k5373j6731J5514O8862
$$ -383079 -417464 -424398 -418913 -406854 -398069 -404344 -425287 -451304 -476677 -493408 -477894 -409032
31413d09032J05408R2965M7227N785k0199l4571k1487K5751N7066J3574p2530
$$ -409032 -303624 -210659 -163432 -157647 -177846 -212417 -233904 -208153 -151087 -137513 -210043
31402b10043r3668n721J05908J31506O3663j5823m2024k5724k2428n9895q9994
$$ -210043 -303711 -309432 -203524 -72018 -8355 -24178 -66202 -91926 -114354 -174249 -264243
31391b64243l2284J01477J66454N1687j33904j64971r290J06535J3556j53524
$$ -264243 -296527 -195050 -28596 23091 -110813 -275784 -285074 -178539 -164983 -318507
31381c18507j57140l059Q8442J8306p1671m3305M0864M9972n842j4520N1212J01115
$$ -318507 -475647 -478706 -390264 -371958 -443629 -486934 -446070 -396098 -401940 -416460 -365248 -264133
31369b64133O9445j636l6899k3584m026r677l0612l5638o808L8228N5659K1734
$$ -264133 -194688 -196324 -233223 -256807 -260833 -270510 -301122 -336760 -343568 -305340 -249681 -227947
31357b27947l0877m6902k1934p061k4551k5064K7930P3666K9671o4927p7600K5344
$$ -227947 -258824 -305726 -327660 -334721 -359272 -384336 -356406 -282740 -253069 -317996 -395596 -370252
31345c70252J11063O1305n9248r7342j8012P5039R3327M6094j5044m7815k2796
$$ -370252 -259189 -197884 -257132 -354474 -372486 -297447 -204120 -158026 -173070 -220885 -243681
31334b43681M4821P3483M453r6227j10515l3075L5138N1049O6995R1323M8866
$$ -243681 -198860 -125377 -120924 -217151 -327666 -360741 -325603 -274554 -207559 -116236 -67370
31323f7370o7780j35705p0850M3853Q5892N6568K5434J664k9031j7317O9376J33266
$$ -67370 -135150 -270855 -341705 -297852 -211960 -155392 -129958 -128294 -157325 -174642 -105266 28000
31311B8000N5805j02210j53912m6701O7915N9419j5376l9049j9505m4414j08468
$$ 28000 83805 -18405 -172317 -219018 -151103 -91684 -107060 -146109 -165614 -210028 -318496
31300c18496j05382M399J13363R9454j5027r5409o5133J7168N8313M7689L6520
$$ -318496 -423878 -419479 -306116 -206662 -221689 -317098 -382231 -365063 -306750 -259061 -222541
31289b22541M5669N1116L9225J9603n912l4015l2348J9118O9582M7961l2330q9683
$$ -222541 -176872 -125756 -86531 -66928 -72840 -106855 -139203 -120085 -50503 -2542 -34872 -124555
31277a24555r0424o8869l7347K3600P6723M5159m9338q0044K650R2387Q8755K8095
$$ -124555 -214979 -283848 -321195 -297595 -220872 -175713 -225051 -305095 -302445 -210058 -121303 -93208
31265i3208j4948m0235n2964k680R9844J20001j2437j51338j21400K2442Q5044
$$ -93208 -108156 -148391 -201355 -204035 -104191 15810 3373 -147965 -269365 -246923 -161879
31254a61879J7931n6828o7201n4093l0227M2335J22943J08076J775p7578p8950
$$ -161879 -143948 -200776 -267977 -322070 -352297 -309962 -187019 -78943 -77168 -154746 -233696
31243b33696n8155k6332O5935J62938J16577o3891j61250n2837J05489J22564
$$ -233696 -291851 -318183 -252248 -89310 27267 -36624 -197874 -250711 -145222 -22658
31233b2658M0961R353K3060k1008j02915j10489m5575j6100m1307l6810Q526J0967
$$ -22658 18303 27656 50716 29708 -73207 -183696 -229271 -245371 -286678 -323488 -314962 -303995
31221c03995l2266j2678R3338J51346O9798n7634j05482r5332j03198q8382K9181
$$ -303995 -336261 -348939 -255601 -104255 -34457 -92091 -197573 -292905 -396103 -484485 -455304
31210d55304J74572J77289L2017o7275j0478O2896j1030j49590j38854L5322J53560
$$ -455304 -280732 -103443 -71426 -138701 -149179 -86283 -97313 -246903 -385757 -350435 -196875
31199a96875Q0052n2531n3461O0778J28811Q6438R654m3934r4039j33555r8382
$$ -196875 -116823 -169354 -222815 -162037 -33226 53212 62866 18932 -75107 -208662 -307044
31188c07044J2512R0971O0724r721r511N2660P2054O680p2016r0298o0602l2930
$$ -307044 -294532 -203561 -142837 -152558 -162069 -109409 -37355 -30675 -102691 -192989 -253591 -286521
31176b86521j5602R292K5759j195n4064o3217p00P1782Q4660N1628K8977J7975
$$ -286521 -302123 -292831 -267072 -268267 -322331 -385548 -386248 -314466 -229806 -178178 -149201 -131226
31164a31226k0263p0578p3923l6249k9015n5260k2784R4726J78601J32667L1383
$$ -131226 -151489 -222067 -295990 -332239 -361254 -416514 -439298 -344572 -165971 -33304 -1921
31153a921r059j7431q3113j54624j00615M9331J12214K7245n1120j77Q7404O6208
$$ -1921 -10980 -28411 -111524 -266148 -366763 -317432 -205218 -177973 -229093 -229270 -141866 -75658
31141g5658l8006q7359l7424L2516N4154L7962K2800K6549L8605K4774l7434j07417
$$ -75658 -113664 -201023 -238447 -205931 -151777 -113815 -91015 -64466 -25861 -1087 -38521 -145938
31129a45938j09498l4979L9444N9053M8791L5667j847o0429p6719k9173Q495j3133
$$ -145938 -255436 -290415 -250971 -191918 -143127 -107460 -109307 -169736 -246455 -275628 -267133 -280266
31117b80266l2105R313N1128K1392k7347r796L5194J8589k5631J850P0281N1605
$$ -280266 -312371 -303058 -251930 -230538 -257885 -267681 -232487 -213898 -239529 -237679 -167398 -115793
31105a15793n6607j11889n2672J9372K3331Q105J8355L799n4922o6937K1678J17129
$$ -115793 -172400 -284289 -336961 -317589 -294258 -286153 -267798 -263999 -318921 -385858 -364180 -247051
31093b47051J18389O4139L3212L641o4221j01067l3809N5584L6298n5066o9741
$$ -247051 -128662 -64523 -31311 -27670 -91891 -192958 -226767 -171183 -134885 -189951 -259692
31082b59692R329N0853J470m3034k0181P043j1004k7560j6160l1315q0212o8069
$$ -259692 -250363 -199510 -198040 -241074 -261255 -254212 -265216 -292776 -308936 -340251 -420463 -488532
31070d88532L9309J22882Q3650l232j9711J5160K1552J6605N1654P4340J1958
$$ -488532 -449223 -326341 -242691 -245923 -265634 -250474 -228922 -212317 -160663 -86323 -74365
31059g4365p0955o3399l875r255n2444j3472O9689L3821j03841j21878M2723J52648
$$ -74365 -145320 -208719 -212594 -221849 -274293 -287765 -218076 -184255 -288096 -409974 -367251 -214603
31047b14603L3410j38483j09218N7238R7471l5360j26317m7896P6857R9225M4953
$$ -214603 -181193 -319676 -428894 -371656 -274185 -309545 -435862 -483758 -406901 -307676 -262723
31036b62723J3927J6813L846k6489l2327l324K8584L9733M3392O6119J00781R4276
$$ -262723 -248796 -231983 -228137 -254626 -286953 -290277 -261693 -221960 -178568 -112449 -11668 82608
31024H2608J1526r1933j19091o7516l8462p4397q3035N342J00121P8048k2975
$$ 82608 94134 2201 -116890 -184406 -222868 -297265 -380300 -374958 -274837 -196789 -219764
31013b19764o3235q756M7659M6897K1785M905j1191k5119l0095m9410q3308o2809
$$ -219764 -282999 -291755 -244096 -197199 -175414 -170509 -181700 -206819 -236914 -286324 -369632 -432441
31001d32441M0351J14372N1528o2211o3380K6142M3346k9705m3225L7771O0208
$$ -432441 -392090 -277718 -226190 -288401 -351781 -325639 -282293 -311998 -355223 -317452 -257244
30990b57244m0589j14051n1557L0632L604n2928k603J12680J58569J23820Q6330
$$ -257244 -297833 -411884 -463441 -432809 -429205 -482133 -484736 -372056 -213487 -89667 -3337
30979c337M7395l7377j20296j10150k7662J8949n697l5650j6359M1318R5924R7755
$$ -3337 44058 6681 -113615 -223765 -251427 -232478 -238175 -273825 -290184 -248866 -152942 -55187
30967e5187J8603q3878r7499j2718L8705k1449q9152m8806L4192K8525m3727n8241
$$ -55187 -36584 -120462 -217961 -230679 -191974 -213423 -302575 -351381 -317189 -288664 -332391 -390632
30955c90632M257N9382Q1159J05542J06873L2089n8764m4929O0233J12025M2962
$$ -390632 -386375 -326993 -245834 -140292 -33419 -1330 -60094 -105023 -44790 67235 110197
30944A10197o3037j16432j17199q8533l1115L4948P3727Q2981O4939j4107j36055
$$ 110197 47160 -69272 -186471 -275004 -306119 -271171 -197444 -114463 -49524 -63631 -199686
30933a99686j66537k3157J47020J37119r950o9378L054K0914q4627j28703P356
$$ -199686 -366223 -389380 -242360 -105241 -115191 -184569 -181515 -160601 -245228 -373931 -366575
30922c66575J56470J26806o245n2633n837P275l0454l2781K648m04l4042j4900
$$ -366575 -210105 -83299 -89544 -142177 -148014 -140739 -171193 -203974 -201326 -201730 -235772 -250672
30910b50672N5108Q5274N6277M8827R3518J10549L4800q7709j63464j48525o2291
$$ -250672 -195564 -110290 -54013 -5186 88332 198881 233681 145972 -17492 -166017 -228308
30899b28308L8841Q6915N2338j7433m5524j3007L3596M9719K8845j3773n2146
$$ -228308 -189467 -102552 -50214 -67647 -113171 -126178 -92582 -42863 -14018 -27791 -79937
30888g9937n9165m1092l7405n0940k4469N6167R1735k977j38533j39715O255J20751
$$ -79937 -139102 -180194 -217599 -268539 -293008 -236841 -145106 -148083 -286616 -426331 -420076 -299325
30876b99325Q8853J4112L8748J20186J12851R174n1089p179L3972j5908p8616
$$ -299325 -210472 -196360 -157612 -37426 75425 84599 33510 26331 60303 44395 -34221
30865c4221m3944L9235L7056m7658p5827j166N2037k182o3801j4800P5488N8482
$$ -34221 -78165 -38930 -1874 -49532 -125359 -126525 -74488 -76670 -140471 -155271 -79783 -21301
30853b1301m7602q6637j8282K9068j8824p1856m9289j3369l4418m8653K5929J22865
$$ -21301 -68903 -155540 -173822 -144754 -163578 -235434 -284723 -298092 -332510 -381163 -355234 -232369
30841b32369J13182N532p0706n6991k0359k4051n1130o3395m6084J1057R4068
$$ -232369 -119187 -113655 -184361 -241352 -261711 -285762 -336892 -400287 -446371 -435314 -341246
$$ [...]
##END NTUPLES=NMR SPECTRUM
##END=
