##TITLE=31Pdec_LY-TMF-3.70.3
 D2O, 24 sc
 27.2.2020
##JCAMPDX= 6.0         $$ Bruker NMR JCAMP-DX V2.0
##DATA TYPE= NMR SPECTRUM
##DATA CLASS= NTUPLES
##ORIGIN= UXNMR, Bruker Analytische Messtechnik GmbH
##OWNER= root
$$ XWIN-NMR		Version 3.5
$$ Thu Feb 27 15:55:35 2020 Russian Standard Time (UT+4h)  she@DPX200
##.OBSERVE FREQUENCY= 81.013821
##.OBSERVE NUCLEUS= ^31P
##.ACQUISITION MODE= SIMULTANEOUS
##.ACQUISITION SCHEME= undefined
##.AVERAGES= 24
##.DIGITISER RES= 17
##SPECTROMETER/DATA SYSTEM= spect
##.PULSE SEQUENCE= zgpg30
##.SOLVENT NAME= CDCl3
##.SHIFT REFERENCE= (INTERNAL, CDCl3, 0, 182.463)
##AUDIT TRAIL= $$ (NUMBER, WHEN, WHO, WHERE, WHAT)
$$ ##TITLE= Audit trail, XWIN-NMR		Version 3.5
$$ ##JCAMPDX= 5.01
$$ ##ORIGIN= Bruker BioSpin GmbH
$$ ##OWNER= she
$$ F:/spectra/data/she/nmr/P31/1/pdata/1/auditp.txt
$$ ##AUDIT TRAIL=  $$ (NUMBER, WHEN, WHO, WHERE, WHAT)
(   1,<2020-02-27 15:54:14.96 +0400>,<she>,<DPX200>,
      <created by zg, POWCHK disabled, PULCHK disabled
       configuration hash MD5:
       00 E9 B6 7A A2 85 ED C7 34 08 36 98 17 FE 4E 26
       data hash MD5: 32K
       8E D4 11 80 FE CD 28 4A 77 4D C7 47 7D 1A C4 DA>)
(   2,<2020-02-27 15:54:17.42 +0400>,<she>,<DPX200>,
      <Start of raw data processing
       efp BC_mod = 2 LB = 1 FT_mod = 6 PKNL = 1 PHC0 = -1667.392 PHC1 = 779.8014 SI = 64K 
       data hash MD5: 64K
       E1 97 18 93 F6 90 89 32 C5 9E 09 27 86 57 2C 82>)
(   3,<2020-02-27 15:54:44.60 +0400>,<she>,<DPX200>,
      <pk PHC0 = 131.7846 PHC1 = -266.8001 
       data hash MD5: 64K
       B0 62 DD 7F 3B A3 99 BF 91 91 93 84 F4 EF 1E D3>)
(   4,<2020-02-27 15:54:47.70 +0400>,<she>,<DPX200>,
      <abs ABSG = 5 
       data hash MD5: 64K
       A5 14 87 8D 67 34 F7 8E A3 A9 21 04 8B 01 B8 37>)
(   5,<2020-02-27 15:55:02.31 +0400>,<she>,<DPX200>,
      <pk PHC0 = -5.000691 PHC1 = 0 
       data hash MD5: 64K
       24 69 3F 70 D9 99 2F C5 D4 24 96 CA 0E B0 59 2C>)
$$ ##END=
$$ 
$$ hash MD5
$$ 2B 5F 5C 45 9D 72 B7 26 08 25 9B F9 A3 80 C9 4B
##$RELAX= 
##$RELAX= 
##$RELAX= 
##$RELAX= 
##$RELAX= 
##$RELAX= 
##$RELAX= 
##$RELAX= 
$$ Bruker specific parameters
$$ --------------------------
##$DU= <F:/spectra>
##$EXPNO= 1
##$NAME= <P31>
##$PROCNO= 1
##$TYPE= <nmr>
##$USER= <she>
##$AMP= (0..31)
100 100 100 100 100 100 100 100 100 100 100 100 100 100 100 100 100 100 
100 100 100 100 100 100 100 100 100 100 100 100 100 100 
##$AQSEQ= 0
##$AQ_mod= 1
##$AUNM= <au_zg>
##$AUTOPOS= <>
##$BF1= 81.014009
##$BF2= 200.13
##$BF3= 200.13
##$BF4= 200.13
##$BF5= 200.13
##$BF6= 200.13
##$BF7= 200.13
##$BF8= 200.13
##$BYTORDA= 1
##$CFDGTYP= 0
##$CFRGTYP= 5
##$CHEMSTR= <none>
##$CNST= (0..31)
1 1 145 1 1 1 1 1 1 1 1 1 1 1 1 1 1 1 1 1 1 1 1 1 1 1 1 1 1 1 1 1 
##$CPDPRG= <waltz16>
##$CPDPRG1= <>
##$CPDPRG2= <waltz16>
##$CPDPRG3= <>
##$CPDPRG4= <mlev>
##$CPDPRG5= <mlev>
##$CPDPRG6= <mlev>
##$CPDPRG7= <mlev>
##$CPDPRG8= <mlev>
##$CPDPRGB= <>
##$CPDPRGT= <>
##$D= (0..31)
$$ [...]
##$SUBNAM3= <"">
##$SUBNAM4= <"">
##$SUBNAM5= <"">
##$SUBNAM6= <"">
##$SUBNAM7= <"">
##$SUBNAM8= <"">
##$SUBNAM9= <"">
##$SW= 369.568048894756
##$SWIBOX= (0..15)
0 1 3 0 0 0 0 0 0 0 0 0 0 0 0 0 
##$SW_h= 29940.119760479
##$TD= 32768
##$TD0= 1
##$TE= 0
##$TE2= 300
##$TE3= 300
##$TEG= 300
##$TL= (0..7)
0 120 53 12 22 120 120 120 
##$TP= (0..7)
150 150 150 150 150 150 150 150 
##$TP07= 0
##$TPNAME0= <>
##$TPNAME1= <>
##$TPNAME2= <>
##$TPNAME3= <>
##$TPNAME4= <>
##$TPNAME5= <>
##$TPNAME6= <>
##$TPNAME7= <>
##$TPOAL= (0..7)
0.5 0.5 0.5 0.5 0.5 0.5 0.5 0.5 
##$TPOFFS= (0..7)
0 0 0 0 0 0 0 0 
##$TUNHIN= 0
##$TUNHOUT= 0
##$TUNXOUT= 0
##$USERA1= <user>
##$USERA2= <user>
##$USERA3= <user>
##$USERA4= <user>
##$USERA5= <user>
##$V9= 5
##$VALIST= <valist>
##$VCLIST= <CCCCCCCCCCCCCCC>
##$VD= 0
##$VDLIST= <DDDDDDDDDDDDDDD>
##$VPLIST= <PPPPPPPPPPPPPPP>
##$VTLIST= <TTTTTTTTTTTTTTT>
##$WBST= 1024
##$WBSW= 4
##$XGAIN= (0..3)
0 0 0 0 
##$XL= 0
##$YL= 0
##$YMAX_a= 24677
##$YMIN_a= -25585
##$ZGOPTNS= <>
##$ZL1= 120
##$ZL2= 120
##$ZL3= 120
##$ZL4= 120
##$ABSF1= 182.463
##$ABSF2= -187.1042
##$ABSG= 5
##$ABSL= 3
##$ALPHA= 0
##$AQORDER= 0
##$ASSFAC= 0
##$ASSFACI= 0
##$ASSFACX= 0
##$ASSWID= 0
##$AUNMP= <proc_1d>
##$AZFE= 0.1
##$AZFW= 0.5
##$BCFW= 0
##$BC_mod= 2
##$BYTORDP= 0
##$COROFFS= 0
##$CY= -3
##$DATMOD= 1
##$DC= 0
##$DFILT= <>
##$DTYPP= 0
##$F1P= 0
##$F2P= 0
##$FCOR= 1
##$FTSIZE= 65536
##$FT_mod= 6
##$GAMMA= 0
##$GB= 0
##$INTBC= 1
##$INTSCL= 5.30512e-09
##$ISEN= 30
##$LB= 1
##$LEV0= 0
##$LPBIN= 0
##$MAXI= 10000
##$MC2= 0
##$MEAN= 0
##$ME_mod= 0
##$MI= 50
##$NCOEF= 0
##$NC_proc= -3
##$NLEV= 6
##$NOISF1= 182.463
##$NOISF2= 159.3651
##$NSP= 0
##$NTH_PI= 0
##$NZP= 0
##$OFFSET= 182.463
##$PC= 4
##$PHC0= -1540.608
##$PHC1= 513.0013
##$PH_mod= 1
##$PKNL= yes
##$PPARMOD= 0
##$PSCAL= 0
##$PSIGN= 0
##$REVERSE= no
##$SF= 81.0140089999434
##$SI= 65536
##$SIGF1= 159.3651
##$SIGF2= -187.1042
##$SINO= 113.3802
##$SIOLD= 16384
##$SREGLST= <1H.CDCl3>
##$SSB= 0
##$STSI= 65536
##$STSR= 0
##$SW_p= 29940.119760479
##$SYMM= 0
##$S_DEV= 0
##$TDeff= 32768
##$TDoff= 0
##$TI= <>
##$TILT= no
##$TM1= 0
##$TM2= 0
##$TOPLEV= 0
##$USERP1= <user>
##$USERP2= <user>
##$USERP3= <user>
##$USERP4= <user>
##$USERP5= <user>
##$WDW= 1
##$XDIM= 65536
##$YMAX_p= 368144039
##$YMIN_p= -2305584
$$ End of Bruker specific parameters
$$ ---------------------------------
##NTUPLES= NMR SPECTRUM
##VAR_NAME=  FREQUENCY,     SPECTRUM/REAL,   SPECTRUM/IMAG
##SYMBOL=    X,             R,               I
##VAR_TYPE=  INDEPENDENT,   DEPENDENT,       DEPENDENT
##VAR_FORM=  AFFN,          ASDF,            ASDF
##VAR_DIM=   65536,         65536,           65536
##UNITS=     HZ,            ARBITRARY UNITS, ARBITRARY UNITS
##FACTOR=    0.456856943014862, 1,           1
##FIRST=     14782.0589164792, 0,            0
##LAST=      -15158.0608439998, 0,           0
##MIN=       -15158.0608439998, -2305584,    0
##MAX=       14782.0589164792, 368144039,    0
$$ Real data points
##PAGE= N=1
##DATA TABLE= (X++(R..R)), XYDATA
$$ [...]
##PAGE= N=2
##DATA TABLE= (X++(I..I)), XYDATA
$$ plain form
36894 700134 444259 235627 258240 379243 412491 355150 305946 305647 341538 397400 413873
36883 413873 290906 35745 -142216 -6081 415430 789976 804884 511973 281408 384969
36873 384969 689479 835543 673023 400929 276014 320575 377490 339222 231930 149042
36863 149042 181344 348800 542002 611221 563408 553020 611191 551769 281748 31932 64134
36852 64134 277081 360590 258074 184178 215769 192974 76981 81894 313496 548380 553187
36841 553187 407914 323471 330710 362221 472682 721829 944097 900103 624009 394385
36831 394385 369709 455345 530640 599780 675541 692182 606260 465566 337009 270099 332392
36820 332392 534647 706562 627812 346257 187138 337136 579496 592864 386077 247491
$$ packed form
36894G00134k55875k08632K2613J21003L3248n7341m9204k99L5891N5862J6473
36883D13873j22967k55161j77961J36135M21511L74546J4908k92911k30565J03561
36873C84969L04510J46064j62520k72094j24915M4561N6915l8268j07292q2888
36863A49042L2302J67456J93202O9219m7813j0388N8171n9422k70021k49816L2202
36852F4134K12947Q3509j02516p3896L1591k2795j15993M913K31602K34884M807
36841E53187j45273q4443P239L1511J10461K49147K22268m3994k76094k29624
36831C94385k4676Q5636P5295O9140P5761J6641q5922j40694j28557o6910O2293
36820C32392K02255J71915p8750k81555j59119J49998K42360J3368k06787j38586
$$ plain form
36810 247491 331608 495026 536620 424822 254401 125420 118865 267235 476531 572994
36800 572994 500411 391940 381675 437277 465310 480903 535799 552322 414180 211618 194909
36789 194909 417756 598762 455302 53128 -303249 -424890 -336276 -111178 187584 421396
36779 421396 428649 219422 -19918 -161469 -245285 -312727 -285780 -106689 128209 290922
36769 290922 386375 481089 547866 506672 365271 202188 56737 -52696 -57107 81877 257591
36758 257591 326553 303556 298077 282495 118504 -160551 -304321 -179584 23858 56024 -59441
36747 -59441 -111284 -21477 99323 171361 242499 355664 462687 505234 481221 410904 329676
36736 329676 319170 429199 547583 482638 234425 51168 118503 312900 400183 375725
$$ packed form
36810B47491Q4117J63418M1594j11798j70421j28981o555J48370K09296R6463
36800E72994p2583j08471j0265N5602K8033J5593N4896J6523j38142k02562j6709
36789A94909K22847J81006j43460m02174l56377j21641Q8614K25098K98762K33812
36779D21396P253k09227k39340j41551q3816o7442K6947J79091K34898J62713
36769B90922R5453R4714O6777m1194j41401j63083j45451j09433m411J38984J75714
36758B57591O8962k2997n479j5582j63991k79055j43770J24737K03442L2166j15465
36747e9441n1843Q9807J20800P2038P1138J13165J07023M2547k4013p0317q1228
36736C29676j0506J10029J18384o4945k48213j83257O7335J94397Q7283k4458
$$ plain form
36726 375725 413084 521040 491119 241920 -2914 -16822 112662 147193 63400 38453 121474
36715 121474 160656 88205 51454 162470 304885 330220 300454 366252 503581 553321 469900
36704 469900 358237 290063 248878 248326 339219 483245 574121 608615 682032 781357 757358
36693 757358 577660 442262 525917 725748 797002 662449 469292 389880 458992 568063
36683 568063 559946 385974 207801 248859 498836 695298 671163 563351 560105 612237 574689
36672 574689 485638 473570 490268 392338 228313 175682 213201 137955 -60912 -123568 96726
36661 96726 402748 510600 348931 24957 -301736 -424135 -189623 273138 615524 669316
36651 669316 591421 518929 354494 69243 -69917 143255 488922 623345 571596 581995
$$ packed form
36726C75725L7359J07956k9921k49199k44834j3908J29484L4531q3793k4947Q3021
36715A21474L9182p2451l6751J11016J42415K5335k9766O5798J37329M9740q3421
36704D69900j11663o8174m1185n52R0893J44026R0876L4494P3417R9325k3999
36693G57358j79698j35398Q3655J99831P1254j34553j93157p9412O9112J09071
36683E68063q117j73972j78173M1058K49977J96462k4135j07812l246N2132l7548
36672E74689q9051j2068J6698r7930j64025n2631L7519p5246j98867o2656K20294
36661I6726L06022J07852j61669l23974l26693j22399K34512M62761L42386N3792
36651F69316p7895p2492j64435k85251j39160K13172L45667J34423n1749J0399
$$ plain form
36641 581995 640254 531220 313589 294881 496837 565134 337887 129716 254172 576273
36631 576273 781835 842038 929430 1040238 997749 768431 526720 407229 372401 337275
36621 337275 288778 257533 256464 262307 225924 131687 59658 103927 202065 178441 29126 2921
36609 2921 251039 535252 506774 215086 90684 381233 815365 941156 663549 302096
36599 302096 172072 255046 316573 244125 156605 184019 259864 229613 106201 77637 244715
36588 244715 473834 561799 452541 238943 40469 -61846 -49617 17863 81392 189167
36578 189167 407408 610099 553055 246157 38771 167963 414802 436857 276639 244648
36568 244648 400836 497350 428021 388453 509645 643348 652476 646497 737024 773691 557159
$$ packed form
36641E81995N8259j09034k17631j8708K01956O8297k27247k08171J24456L22101
36631E76273K05562O0203Q7392J10808m2489k29318k41711j19491l4828l5126
36621C37275m8497l1245j069N843l6383r4237p2029M4269R8138k3624j49315k6205
36609B921K48118K84213k8478k91688j24402K90549M34132J25791k77607l61453
36599C02096j30024Q2974O1527p2448q7520K7414P5845l0251j23412k8564J67078
36588B44715K29119Q7965j09258k13598j98474j02315J2229O7480O3529J07775
36578A89167K18241K02691n7044l06898k07386J29192K46839K2055j60218l1991
36568B44648J56188R6514o9329l9568J21192J33703R128n979R0527L6667k16532
$$ plain form
36557 557159 187035 -27350 52632 277227 432631 440403 362589 325956 412406 533898 475521
36546 475521 171619 -126801 -101507 247483 599420 675582 471806 148304 -144433 -290850
36536 -290850 -218598 14543 223748 280361 252255 297043 453784 607848 641175 550789 416217
36525 416217 304723 232369 186656 154939 135791 144460 208298 334645 473459 538291 495317
36514 495317 419616 423553 523168 609274 565654 392616 203838 125298 204823 387834 558010
36503 558010 618846 557415 431701 306483 218232 183741 203766 262316 354184 494414 655835
36492 655835 732120 648436 494351 439832 510892 570754 551856 554428 633656 648131 473963
36481 473963 253479 233270 411168 551322 538347 500786 543939 574392 489974 364306 307652
$$ packed form
36557E57159l70124k14385P9982K24595J55404P772p7814l6633Q6450J21492n8377
36546D75521l03902k98420K5294L48990L51937P6162k03776l23502k92737j46417
36536b90850P2252K33141K09205N6613k8106M4788J56741J54064L3327r0386j34572
36525D16217j11494p2354m5713l1717j9148Q669O3838J26347J38814O4832m2974
36514D95317p5701L937R9615Q6106m3620j73038j88778p8540P9525J83011J70176
36503E58010O0836o1431j25714j25218q8251l4491K0025N8550R1868J40230J61421
36492F55835P6285q3684j54085n4519P1060N9862j8898K572P9228J4475j74168
36481D73963k20484k0209J77898J40154j2975l7561M3153L0453q4418j25668n6654
$$ plain form
36470 307652 288297 244647 250058 381215 513733 466316 311233 310900 524208 702327 654907
36459 654907 513960 503290 616455 693902 693885 691857 689032 625304 545201 546063 567579 447214
36447 447214 217883 125913 260217 373612 228370 -43759 -121275 67814 285937 318484
36437 318484 184439 31159 -15586 106424 351237 542873 532588 398076 359509 487458
36427 487458 644766 747554 905157 1203618 1492173 1522718 1234651 801036 445320 286930
36417 286930 302006 351657 297265 154864 82760 167123 304311 361021 344967 319857 269219
36406 269219 191879 228065 485729 791398 845128 638946 494906 621234 848461 922869
36396 922869 853806 783359 679709 421028 107572 602 122866 190497 51855 -50552
$$ packed form
36470C07652j9355m3650N411J31157J32518m7417j55083l33K13308J78119m7420
36459F54907j40947j0670J13165P7447j7k028k825o3728q0103Q62K1516j20365
36447D47214k29331r1970J34304J13395j45242k72129p7516J89089K18123L2547
36437C18484j34045j53280m6745J22010K44813J91636j0285j34512l8567J27949
36427D87458J57308J02788J57603K98461K88555L0545k88067m33615l55716j58390
36417B86930J5076M9651n4392j42401p2104Q4363J37188N6710j6054k5110n0638
36406B69219p7340L6186K57664L05669N3730k06182j44040J26328K27227P4408
36396I22869o9063p0447j03650k58681l13456j06970J22264O7631j38642j02407
$$ plain form
36386 -50552 142390 448367 452523 120964 -102980 101354 491769 602607 356178 101954
36376 101954 109503 261733 294775 156965 24174 60811 267159 514817 659637 648943
36366 648943 566770 545951 605121 618247 484260 273688 148040 175309 295942 442316
36356 442316 601188 747875 805274 727218 584685 502456 503401 468267 289828 39726 -82256
36345 -82256 19489 212332 287220 195161 78115 93338 270127 519289 705181 709504 512645
36334 512645 247610 111518 180263 344623 452294 470814 478125 524712 552684 470449 305347
36323 305347 240722 422572 723482 825252 618073 385063 433201 656769 711316 569328
36313 569328 584678 927837 1267316 1212716 848541 573916 552120 590674 511763 384168
$$ packed form
36386e0552J92942L05977M156l31559k23944K04334L90415J10838k46429k54224
36376A01954P549J52230L3042j37810j32791L6637K06348K47658J44820j0694
36366F48943q2173k0819N9170J3126j33987k10572j25648K7269J20633J46374
36356D42316J58872J46687N7399p8056j42533q2229R45l5134j78439k50102j21982
36345h2256J01745J92843P4888r2059j17046J5223J76789K49162J85892M323j96859
36334E12645k65035j36092O8745J64360J07671J8520P311M6587K7972q2235j65102
36323C05347o4625J81850L00910J01770k07179k33010M8138K23568N4547j41988
36313E69328J5350L43159L39479n4600l64175k74625k1796L8554p8911j27595
$$ plain form
36303 384168 360342 468506 613652 671403 573057 392693 318081 424172 530736 429209
36293 429209 188338 39182 -4529 -158413 -464720 -647459 -505818 -231435 -131620 -186797
36283 -186797 -124090 137004 370135 406052 383592 508342 710354 732844 521636 328592
36273 328592 359880 480873 429896 244206 251205 593531 971912 1012652 757668 584069
36263 584069 683919 843935 785838 534953 330051 285675 298351 254834 191010 202280 287818
36252 287818 367481 425237 538882 727427 850166 765696 572374 555430 833878 1161061
36242 1161061 1178971 823924 383299 170242 233001 391886 482380 510180 579876 713569
36232 713569 801285 766963 712579 782891 921786 929054 777196 674708 732051 769848 614433
$$ packed form
36303C84168k3826J08164J45146N7751r8346j80364p4612J06091J06564j01527
36293D29209k40871j49156m3711j53884l06307j82739J41641K74383R9815n5177
36283a86797O2707K61094K33131L5917k2460J24750K02012K2490k11208j93044
36273C28592L1288J20993n0977j85690O999L42326L78381M0740k54984j73599
36263E84069R9850J60016n8097k50885k04902m4376J2676m3517o3824J1270Q5538
36252B87818P9663N7756J13645J88545J22739q4470j93322j6944K78448L27183
36242A161061J7910l55047m40625k13057O2759J58885R0494K7800O9696J33693
36232G13569Q7716l4322n4384P0312J38895P268j51858j02488N7343L7797j55415
$$ plain form
36221 614433 405285 394362 566161 699349 730913 803631 968605 1081859 1030289 869963
36211 869963 708613 612208 633333 759473 833222 713835 523995 527084 736726 874698
36201 874698 767427 549651 393382 278370 162427 150786 310604 488105 502729 395348
36191 395348 307385 238156 120306 36730 134514 356186 469132 385696 282753 348225 537852
36180 537852 661437 629276 520593 430175 341728 210900 123874 248189 577739 843252
36170 843252 793797 491786 195943 29823 -52453 -35126 170035 481297 645764 569681
36160 569681 439860 417155 416470 320745 217993 254394 393347 483269 457047 334904 148628
36149 148628 -10628 2012 193981 369773 386774 346724 399545 508058 570974 626640 732563
$$ packed form
36221F14433k09148j0923J71799J33188L1564P2718J64974J13254n1570j60326
36211H69963j61350r6405K1125J26140P3749j19387j89840L089K09642J37972
36201H74698j07271k17776j56269j15012j15943j1641J59818J77501J4624j07381
36191C95348q7963o9229j17850q3576R7784K21672J12946q3436j02943O5472J89627
36180E37852J23585l2161j08683r0418q8447j30828q7026J24315L29550K65513
36170H43252m9455l02011k95843j66120q2276J7327K05161L11262J64467p6083
36160E69681j29821k2705o85r5725j02752L6401J38953Q9922k6222j22143j86276
36149A48628j59256J2640J91969J75792J7001m0050N2821J08513O2916N5666J05923
$$ plain form
36138 732563 770513 598336 312236 144234 159849 246366 326417 385936 368209 259565 221339
36127 221339 409283 701135 830980 764540 699937 702861 603545 314810 24467 -34693 142569
36116 142569 372906 486228 441169 333354 310487 403330 469493 398322 300001 346453 500034
36105 500034 590676 602146 653023 724643 667711 494871 397732 411136 328665 67819 -127976
36094 -127976 -23838 258319 416027 359009 239106 178174 157080 148880 197259 324783 458552
36083 458552 507153 492082 556154 796923 1099600 1222469 1089308 885534 773018 644877
36073 644877 339577 -7333 -75818 191822 500262 593138 518618 447728 434832 446396 459949
36062 459949 453007 431657 503974 747827 975369 862024 398513 -19097 -83449 58243
$$ packed form
36138G32563L7950j72177k86100j68002J5615Q6517Q0051N9519j7727j08644l8226
36127B21339J87944K91852J29845o6440o4603K924r9316k88735k90343n9160J77262
36116A42569K30337J13322m5059j07815k2867R2843O6163p1171r8321M6452J53581
36105E00034R0642J1470N0877P1620n6932j72840r7139J3404q2471k60846j95795
36094a27976J04138K82157J57708n7018j19903o0932k1094q200M8379J27524J33769
36083D58552M8601j5071O4072K40769L02677J22869j33161k03774j12516j28141
36073F44877l05300l46910o8485K67640L08440R2876p4520p0890j2896J1564J3553
36062D59949o942k1350P2317K43853K27542j13345m63511m17610o4352J41692
$$ plain form
36052 58243 97122 12288 6172 145201 315039 455263 606442 747139 779488 691030 589888
36041 589888 561098 582929 584744 516119 378944 251510 244252 374665 528353 585014 520072
36030 520072 353280 106434 -126228 -192568 -75511 30390 -43157 -206438 -243635 -106045
36020 -106045 63688 154924 197221 254612 328441 384567 406625 405800 405884 410113 383685 316908
36008 316908 294670 409229 596920 682706 615598 522563 484884 426243 306111 250537 358947
35997 358947 529583 627104 689823 803434 893245 840382 717709 704794 817532 911139 916287
35986 916287 891486 865847 805101 719322 639397 506238 261388 38319 64496 338825 589926
35975 589926 617817 516184 476031 518113 540533 530991 585783 733178 845788 772772 528288
$$ packed form
36052E8243L8879q4834o116J39029J69838J40224J51179J40697L2349q8458j01142
36041E89888k8790K1831J815o8625j37175j27434p258J30413J53688N6661o4942
36030E20072j66792k46846k32662o6340J17057J05901p3547j63281l7197J37590
36020a06045J69733R1236M2297N7391P3829N6126K2058q25Q4M229k6428o6777
36008C16908k2238J14559J87691Q5786o7108r3035l7679n8641j20132n5574J08410
35997C58947J70636R7521O2719J13611Q9811n2863j22673j2915J12738R3607N148
35986I16287k4801k5639o0746q5779p9925j33159k44850k23069K6177K74329K51101
35975E89926K7891j01633m0153M2082K2420r542N4792J47395J12610p3016k44484
$$ plain form
35964 528288 306287 289108 466292 685738 853566 985716 1063943 992775 776979 601565
35954 601565 602854 662634 581580 377589 238474 227558 228250 179646 179263 299305 448466 497198
35942 497198 450481 426662 513582 685365 830063 846944 741652 615328 540640 490165 417407
35931 417407 341248 295483 268247 262529 339663 516353 690455 756256 720390 632465 516576
35920 516576 462882 620251 930498 1035429 695502 189493 14741 250257 519116 563220
35910 563220 518916 562142 615897 567450 508052 554587 622999 579925 481130 466342 513781
35899 513781 481980 344378 228470 239109 352716 479519 559903 606151 676832 783228
35889 783228 831250 732420 563556 500995 581805 658266 616694 500751 380366 263724 207053
$$ packed form
35964E28288k22001j7179J77184K19446J67828J32150P8227p1168k15796j75414
35954F01565J289N9780q1054k03991j39115j0916O92m8604l83J20042J49161M8732
35942D97198m6717k3819Q6920J71783J44698J6881j05292j26324p4688n0475p2758
35931D17407p6159m5765k7236n718P7134J76690J74102O5801l5866q7925j15889
35920E16576n3694J57369L10247J04931l39927n06009j74752K35516K68859M4104
35910E63220m4304M3226N3755m8447n9398M6535O8412m3074r8795j4788M7439
35899E13781l1801j37602j15908J0639J13607J26803Q0384M6248P0681J06396
35889G83228M8022r8830j68864o2561Q0810P6461m1572j15943j20385j16642n6671
$$ plain form
35878 207053 330612 606955 795222 739330 601575 632028 813257 921839 867639 767603
35868 767603 709586 645141 544464 485931 523315 583652 572488 503252 456371 464190 498787
35857 498787 540433 592420 629646 595548 494938 456507 618369 925923 1132135 1079412 913924
35846 913924 902389 1076512 1207058 1127880 920787 736597 597567 469057 391669 418235
35836 418235 500286 541036 504301 405327 275639 199800 275741 448233 499450 325108 110305
35825 110305 86439 212282 270284 206223 173440 265715 401958 490103 534172 547757 510052
35814 510052 442414 399220 364429 292998 259014 390072 628658 759708 741125 787217 1000573
35803 1000573 1144228 984443 683775 591309 748047 886063 875368 866418 953316 993858
$$ packed form
35878B07053J23559K76343J88267n5892j37755L0453J81229J08582n4200j00036
35868G67603n8017o4445j00677n8533L7384O0337j1164o9236m6881P819L4597
35857D98787M1646N1987L7226l4098j00610l8431J61862L07554K06212n2723j65488
35846I13924j1535J74123J30546p9178k07093j84190j39030j28510p7388K6566
35836D18235Q2051M0750l6735r8974j29688p5839P5941J72492N1217j74342k14803
35825A10305k3866J25843N8002o4061l2783R2275J36243Q8145M4069J3585l7705
35814E10052o7638m3194l4791p1431l3984J31058K38586J31050j8583M6092K13356
35803A000573J43655j59785l00668r2466J56738J38016j0695q950Q6898M0542
$$ plain form
35793 993858 883194 757271 759115 802018 752977 688043 750840 874815 870920 718400 555919
35782 555919 443404 350751 330802 455037 595952 543013 359942 346656 576366 760596
35772 760596 703400 602687 694139 842407 761811 481994 301013 351498 476538 508454
35762 508454 443191 339380 235867 179665 184930 173309 89865 40731 162952 396220 550310
35751 550310 571126 571326 621903 691517 780004 926562 1072860 1089013 965384 843303 843412
35740 843412 974558 1176899 1323332 1247036 945335 686453 701192 840325 799809 625404
35730 625404 656683 957074 1171401 1063178 849525 816029 890608 836018 649052 523533
35720 523533 556809 692939 840087 884272 716721 403334 197784 239259 373639 415510
$$ packed form
35793I93858j10664j25923J844M2903m9041o4934O2797J23975l895j52520j62481
35782E55919j12515r2653j9949J24235J40915n2939j83071j3286K29710J84230
35772G60596n7196j00713R1452J48268q0596k79817j80981N0485J25040L1916
35762E08454o5263j03811j03513n6202N265j1621q3444m9134J22221K33268J54090
35751E50310K0816K00N0577O9614Q8487J46558J46298J6153j23629j22081J09
35740H43412J31146K02341J46433p6296l01701k58882J4739J39133m0516j74405
35730F25404L1279L00391K14327j08223k13653l3496P4579n4590j86966j25519
35720E23533L3276J36130J47148M4185j67551l13387k05550M1475J34380M1871
$$ plain form
35710 415510 422114 530006 681813 732584 703944 710355 731644 680787 612741 632294 656685
35699 656685 517919 278278 193818 337508 489636 473763 402417 475630 681314 836345
35689 836345 851556 821583 857929 935750 953577 893391 843780 856480 860108 774981 650209
35678 650209 594619 608990 588360 467438 265445 22866 -188103 -234337 -56773 189271
35668 189271 290782 253529 249656 323038 362868 355543 412638 529619 578843 579859 692309
35657 692309 874274 853823 554994 259294 208727 331127 487841 673354 805637 670965
35647 670965 310927 126253 312987 511529 335196 -53631 -255895 -241123 -223137 -165300
35637 -165300 120429 519834 716000 669433 597442 550019 409339 251165 286824 456286
$$ packed form
35710D15510O604J07892J51807N0771k8640O411K1289n0857o8046J9553K4391
35699F56685j38766k39641q4460J43690J52128j5873p1346P3213K05684J55031
35689H36345J5211k9973L6346P7821J7827o0186m9611J2700L628q5127j24772
35678F50209n5590J4371k0630j20922k01993k42579k10969m6234J77564K46044
35668A89271J01511l7253l873P3382L9830p325N7095J16981M9224J016J12450
35657F92309J81965k0451k98829k95700n0567J22400J56714J85513J32283j34672
35647F70965l60038j84674J86734J98542j76333l88827k02264J4772J7986N7837
35637a65300K85729L99405J96166m6567p1991m7423j40680j58174L5659J69462
$$ plain form
35627 456286 478013 322262 259680 402244 551590 562320 533457 573219 656605 762036 888685
35616 888685 929830 800788 674362 782413 1000707 975004 670830 434223 457895 554223
35606 554223 543653 504833 508041 439921 270414 211526 415680 723415 873384 802073 622395
35595 622395 453585 352431 286564 152476 -54231 -139674 34542 280581 305327 117447
35585 117447 -55359 -146919 -220654 -171841 127510 456747 476672 305452 375304 702725
35575 702725 834693 598043 348558 331525 352806 290772 377171 689209 886617 781465
35565 781465 680976 812352 891533 671768 458126 596118 844915 779786 496925 386155
35555 386155 459690 442679 339912 387982 568820 653703 640346 704665 802491 747829 621019
$$ packed form
35627D56286K1727j55751o2582J42564J49346J0730k8863L9762Q3386J05431J26649
35616H88685M1145j29042j26426J08051K18294k5703l04174k36607K3672R6328
35606E54223j0570l8820L208o8120j69507n8888K04154L07735J49969p1311j79678
35595F22395j68810j01154o5867j34088k06707q5443J74216K46039K4746j87880
35585A17447j72806r1560p3735M8813K99351L29237J9925j71220O9852L27421
35575G02725J31968k36650k49485j7033K1281o2034Q6399L12038J97408j05152
35565G81465j00489J31376P9181k19765k13642J37992K48797o5129k82861j10770
35555C86155P3535j7011j02767M8070J80838Q4883j3357O4319R7826n4662j26810
$$ plain form
35544 621019 682682 919370 1059477 1012917 938175 904494 832695 742226 724413 700162 528001
35533 528001 318370 313492 483103 567874 504567 473293 522143 486132 327101 248090 389999
35522 389999 653282 877507 995425 986095 870713 766055 769032 805463 751320 642912 596404
35511 596404 609460 629601 702343 841563 894349 779544 704189 856538 1048112 1004035 859173
35500 859173 956077 1240785 1305824 1027313 732372 681916 771715 822139 813990 747785 583594
35489 583594 407580 378006 446382 408650 270837 269561 486151 736020 884755 978564 1027711
35478 1027711 974463 913915 1014756 1169948 1072213 704147 395102 306922 244621 100751
35468 100751 88881 338788 616629 682901 628192 621693 604396 477997 355912 376059 462929
$$ packed form
35544F21019O1663K36688J40107m6560p4742l3681p1799r0469j7813k4251j72161
35533E28001k09631m878J69611Q4771o3307l1274M8850l6011j59031p9011J41909
35522C89999K63283K24225J17918r330j15382j04658K977L6431n4143j08408m6508
35511E96404J3056K0141P2742J39220N2786j14805p5355J52349J91574m4077j44862
35500H59173R6904K84708O5039k78511k94941n0456Q9799N0424q149o6205j64191
35489E83594j76014k9574O8376l7732j37813j276K16590K49869J48735R3809M9147
35478A027711n3248o0548J00841J55192r7735l68066l09045q8180o2301j43870
35468A00751j1870K49907K77841O6272n4709o499j7297j26399j22085K0147Q6870
$$ plain form
35457 462929 502360 566871 746135 920702 922013 782463 637278 505998 346420 208170
35447 208170 168618 206159 256426 299493 313509 270233 244282 371088 622763 792485 779084
35436 779084 717724 755948 875447 997736 1074874 1018071 750689 403094 240677 330590
35426 330590 489082 586628 645094 615722 399894 158609 222364 561409 731554 526891
35416 526891 293257 356774 531909 503248 342333 290240 327990 336792 420496 676432 874218
35405 874218 771392 559249 577013 741006 699910 451990 347567 499974 630183 553888
35395 553888 449728 532809 740050 850575 730243 401822 28932 -157914 -59813 186493
35385 186493 413057 627092 862713 977701 832650 559231 397973 363051 323436 312336
$$ packed form
35457D62929L9431O4511J79264J74567J311j39550j45185j31280j59578j38250
35447B08170l9552L7541N0267M3067J4016m3276k5951J26806K51675J69722j3401
35436G79084o1360L8224J19499J22289P7138n6803k67382l47595j62417Q9913
35426C30590J58492R7546N8466k9372k15828k41285O3755L39045J70145k04663
35416E26891k33634O3517J75135k8661j60915n2093L7750Q802Q3704K55936J97786
35405H74218j02826k12143J7764J63993m1096k47920j04423J52407J30209p6295
35395E53888j04160Q3081K07241J10525j20332l28421l72890j86846R8101K46306
35385A86493K26564K14035K35621J14988j45051k73419j61258l4922l9615j1100
$$ plain form
35375 312336 453965 649392 659693 495221 425555 582378 815619 961567 1001387 935340
35365 935340 753676 573463 574276 747074 897944 925249 908653 917105 915975 868934 765299
35354 765299 578056 365455 333362 574809 838604 831279 670406 714629 991529 1163554
35344 1163554 1073554 939427 932527 935406 842237 752334 708321 565371 303513 169574 302602
35333 302602 493644 540442 579062 804344 1086859 1160311 1030889 919119 909702 920656 932786
35322 932786 1002419 1104848 1181828 1284273 1458968 1560194 1404926 1075629 831558 731043
35312 731043 588295 335281 173779 262796 458746 516690 413131 310779 291837 296433
35302 296433 298854 383577 604041 869223 1027976 1009566 849718 648608 547367 657458
$$ packed form
35375C12336J41629J95427J0301j64472o9666J56823K33241J45948L9820o6047
35365I35340j81664j80213Q13J72798J50870K7305j6596Q452j130m7041j03635
35354G65299j87243k12601l2093K41447K63795p325j60873M4223K76900J72025
35344A163554r0000j34127o900K879r3169q9903m4013j42950k61858j33939J33028
35333C02602J91042M6798L8620K25282K82515P3452j29422j11770r417J0954J2130
35322I32786O9633J02429P6980J02445J74695J01226j55268l29297k44071j00515
35312G31043j42748k53014j61502Q9017J95950N7944j03559j02352j8942M596
35302B96433K421Q4723K20464K65182J58753j8410j59848k01110j01241J10091
$$ plain form
35292 657458 917328 1079563 961263 674964 481162 442377 399206 289539 258842 368937
35282 368937 439707 357231 330462 587100 957380 1064263 869944 719646 822285 991407
35272 991407 997870 908032 898672 931566 827377 572373 357930 323146 390646 390478 282433
35261 282433 212102 337860 613349 796063 717192 492622 392528 538932 806339 971332
35251 971332 873125 499602 49378 -148062 61054 451784 680820 713295 794475 1016855
35241 1016855 1167732 1070475 841080 682768 616427 560459 522903 551176 601665 615706 642431
35230 642431 737530 806035 703218 468525 320359 404483 642023 841942 894405 837106
35220 837106 781688 799643 868049 921666 946367 989403 1073780 1140337 1094837 901642 637660
$$ packed form
35292F57458K59870J62235j18300k86299j93802l8785m3171j09667l0697J10095
35282C68937P0770q2476k6769K56638L70280J06883j94319j50298J02639J69122
35272I91407O463q9838r360L2894j04189k55004k14443l4784O7500j68j08045
35261B82433p0331J25758K75489J82714p8871k24570j00094J46404K67407J64993
35251I71332r8207l73523m50224j97440K09116L90730K29036L2475Q1180K22380
35241A016855J50877r7257k29395j58312o6341n5968l7556K8273N0489J4041K6725
35230F42431R5099O8505j02817k34693j48166Q4124K37540J99919N2463n7299
35220H37106n5418J7955O8406N3617K4701M3036Q4377O6557m5500j93195k63982
$$ plain form
35209 637660 463853 502427 700183 854845 834132 726383 707287 809863 916353 929356
35199 929356 844405 696393 552849 515573 588678 587767 355283 46827 -2676 275526 584292
35188 584292 675402 653793 744236 941030 1071761 1088521 1091062 1103978 1019246 786233 524217
35177 524217 387790 396736 457837 512679 593915 729404 858135 906338 916935 1002487 1151229
35166 1151229 1192717 1021608 753843 568579 489007 435078 405720 461148 580450 685868
35156 685868 770401 861700 905720 842234 756681 785149 890296 909427 818991 768721 836604
35145 836604 925206 937942 902915 875882 849329 801089 738169 677597 654085 705520 770859
35134 770859 704026 518432 477582 735426 1020408 956207 606676 385940 476078 674855
$$ packed form
35209F37660j73807L8574J97756J54662k0713j07749j9096J02576J06490J3003
35199I29356q4951j48012j43544l7276P3105r11k32484l08456m9503K78202L08766
35188E84292R1110k1609R0443J96794J30731J6760K541J2916q4732k33013k62016
35177E24217j36427Q946O1101N4842Q1236J35489J28731M8203J0597Q5552J48742
35166A151229M1488j71109k67765j85264p9572n3929k9358N5428J19302J05418
35156F85868Q4533R1299M4020o3486q5553K8468J05147J9131r0436n0270O7883
35145H36604Q8602J2736l5027k7033k6553m8240o2920o0572k3512N1435O5339
35134G70859o6833j85594m0850K57844K84982o4201l49531k20736R0138J98777
$$ plain form
35124 674855 809149 928568 1039130 1014244 879465 855422 993900 1077153 997136 921730
35114 921730 953259 944183 810311 710128 734134 726609 610318 576606 734435 877088 839992
35103 839992 790515 894349 986158 873879 702501 689642 738270 649427 503071 480893 512368
35092 512368 458378 455091 679010 929275 875733 624528 593463 851698 1012846 832600
35082 832600 534217 438023 568008 743529 840961 864379 899872 1036588 1229865 1293628
35072 1293628 1153023 995622 1006774 1097707 1103492 1075005 1096340 992294 587253 136034
35062 136034 79243 408532 687523 707381 698729 834923 957968 944150 956981 1129783 1303565
35051 1303565 1297671 1195604 1155659 1145102 1062657 955089 922106 935826 916801 883522 893672
$$ packed form
35124F74855J34294J19419J10562k4886j34779k4043J38478Q3253q0017p5406
35114I21730L1529r076j33872j00183K4006p525j16291l3712J57829J42653l7096
35103H39992m9477J03834R1809j12279j71378j2859M8628q8843j46356k2178L1475
35092E12368n3990l287K23919K50265n3542k51205l1065K58235J61148j80246
35082H32600k98383r6194J29985J75521R7432K3418L5493J36716J93277O3763
35072A293628j40605j57401J1152R0933N785k8487K1335j04046m05041m51219
35062A36034n6791L29289K78991J9858q652J36194J23045j3818J2831J72802J73782
35051A303565n894j02067l9945j0557q2445j07568l2983J3720j9025l3279J0150
$$ plain form
35040 893672 929427 945410 943430 923814 856124 755530 690134 677017 682557 736630 891585
35029 891585 1041937 971834 657995 362437 331104 532551 772762 930705 987760 949352
35019 949352 852402 779808 785814 849416 924839 970464 926936 764466 561430 440068 424513
35008 424513 458605 535633 677238 804042 787032 641358 528247 549938 667375 811226
34998 811226 932197 952976 825536 635076 505245 424845 321423 251276 312298 413995
34988 413995 383488 289361 383130 681329 890855 843995 744039 835371 1043327 1108049 931499
34977 931499 653625 487989 569652 860123 1142290 1215356 1119514 1041626 1009350 869467
34967 869467 592085 384643 431220 683664 957969 1079045 925529 541129 225051 285289
$$ packed form
35040H93672L5755J5983j980j9616o7690j00594o5396j3117N540N4073J54955
35029H91585J50352p0103l13839k95558l1333K01447K40211J57943N7055l8408
35019I49352r6950p2594O006O3602P5423M5625m3528j62470k03036j21362j5555
35008D24513L4092P7028J41605J26804j7010j45674j13111K1691J17437J43851
34998H11226J20971K0779j27440j90460j29831q0400j03422p0147O1022J01697
34988D13995l0507r4127R3769K98199K09526m6860r9956R1332K07956O4722j76550
34977I31499k77874j65636Q1663K90471K82167P3066r5842p7888l2276j39883
34967H69467k77382k07442M6577K52444K74305J21076j53516l84400l16078O0238
$$ plain form
34957 285289 661154 1007744 1161533 1248235 1315410 1218347 983544 923075 1179982 1456100
34947 1456100 1426462 1182080 1029277 1062269 1164585 1243623 1236910 1057355 753474 572145
34937 572145 662151 866733 985843 1055355 1167713 1226228 1128862 1012365 1038751 1095624 996685
34926 996685 842235 866838 1029378 1087360 1031713 1111285 1400674 1643436 1606640 1364835
34916 1364835 1144953 1062476 1088673 1142802 1144672 1065240 965214 921926 923674 909364 891544
34905 891544 952855 1123514 1322031 1412782 1311034 1085256 952545 1061782 1270734 1296866
34895 1296866 1125177 1055672 1248359 1454702 1380179 1109196 936776 939243 981642 1041269
34885 1041269 1220864 1459834 1509617 1258600 894549 679744 688594 807783 901630 942684
$$ packed form
34957B85289L75865L46590J53789Q6702O7175r7063k34803o0469K56907K76118
34947A456100k9638k44382j52803L2992J02316P9038o713j79555l03881j81329
34937E72145R0006K04582J19110O9512J12358N8515r7366j16497K6386N6873r8939
34926I96685j54450K4603J62540N7982n5647P9572K89389K42762l6796k41805
34916A364835k19882q2477K6197N4129J870p9432j00026m3288J748j4310j7820
34905H91544O1311J70659J98517R0751j01748k25778j32711J09237K08952K6132
34895A296866j71689o9505J92687K06343p4523k70983j72420K467M2399N9627
34885A041269J79595K38970M9783k51017l64051k14805Q850J19189R3847M1054
$$ plain form
34875 942684 1016218 1180828 1323061 1254200 992904 803818 857331 1002393 1019556 960274
34865 960274 1047915 1329268 1609986 1699557 1586795 1412223 1357959 1492514 1652215 1589648
34855 1589648 1306919 1074236 1028724 981544 782187 628179 763807 1068452 1230745 1185489
34845 1185489 1092827 1016158 924495 904460 1046315 1193314 1126173 941398 920343 1067467
34835 1067467 1132207 1077114 1136223 1344292 1392463 1112849 796785 820512 1161003 1474050
34825 1474050 1512201 1309521 1051005 884830 820816 767229 700179 742644 964405 1179455
34815 1179455 1131481 847671 606001 567382 652373 770400 925552 1067874 1088247 1024043
34805 1024043 1041927 1148877 1152500 993333 875494 942051 1046630 1010419 911146 922752 1018336
$$ packed form
34875I42684P3534J64610J42233o8861k61296j89086N3513J45062J7163n9282
34865I60274Q7641K81353K80718Q9571j12762j74572n4264J34555J59701o2567
34855A589648k82729k32683m5512m7180j99357j54008J35628L04645J62293m5256
34845A185489r2662p6669r1663k0035J41855J46999o7141j84775k1055J47124
34835A067467O4740n5093N9109K08069M8171k79614l16064K3727L40491L13047
34825A474050L8151k02680k58516j66175o4014n3587o7050M2465K21761K15050
34815A179455m7974k83810k41670l8619Q4991J18027J55152J42322K0373o4204
34805A024043J7884J06950L623j59167j17839O6557J04579l6211r9273J1606R5584
$$ plain form
34794 1018336 1048975 1030877 1138616 1423506 1706719 1786749 1648563 1427808 1238106 1094157
34784 1094157 988141 967101 1064931 1182589 1153185 970849 839636 909184 1072078 1142812
34774 1142812 1131168 1173737 1269307 1276714 1156256 1032835 1000672 1010491 981897 920247 893765
34763 893765 957356 1094326 1200935 1186536 1116775 1143761 1255720 1276594 1196297 1257925 1544414
34752 1544414 1735462 1544407 1178552 1038154 1135823 1186447 1134502 1167093 1268647 1204759
34742 1204759 963239 800719 804089 797959 749045 856524 1131913 1287564 1203629 1140245 1291508
34731 1291508 1461849 1412630 1245162 1195497 1275906 1352539 1394785 1434085 1421797 1311747 1171622
34720 1171622 1084408 1050741 1060913 1116714 1136909 1031488 913009 1006316 1290044 1478818
$$ packed form
34794A018336L0639j8098J07739K84890K83213Q0030j38186k20755j89702j43949
34784A094157j06016k1040R7830J17658k9404j82336j31213O9548J62894P0734
34774A142812j1644M2569R5570P407j20458j23421l2163R819k8594o1650k6482
34763H93765O3591J36970J06609j4399o9761K6986J11959K0874q0297O1628K86489
34752A544414J91048j91055l65855j40398R7669N0624n1945L2591J01554o3888
34742A204759k41520j62520L370o130m8914J07479K75389J55651q3935o3384J51263
34731A291508J70341m9219j67468m9665Q0409P6633M2246L9300j2288j10050j40125
34720A171622q7214l3667J0172N5801K0195j05421j18479R3307K83728J88774
$$ plain form
34710 1478818 1436739 1339627 1333060 1318819 1211624 1121982 1123964 1109447 1042172 1093384 1338224
34699 1338224 1564888 1583536 1504247 1525355 1659883 1834036 2024127 2134846 1996763 1661965
34689 1661965 1440281 1459015 1469214 1288820 1123804 1195227 1358756 1399984 1421634 1593889
34679 1593889 1770524 1722468 1547162 1474565 1443642 1249433 968276 862428 965858 1104486
34669 1104486 1220758 1351392 1406724 1317437 1281554 1504328 1802143 1841910 1670832 1600306
34659 1600306 1647050 1543318 1278939 1160805 1280784 1374220 1310770 1296855 1435916 1490614
34649 1490614 1298356 1078925 1077051 1181108 1168457 1104587 1202143 1427213 1541205 1480375
34639 1480375 1434584 1526541 1616637 1516883 1282866 1166462 1286201 1455361 1421230 1214698
$$ packed form
34710A478818m2079r7112o567j4241j07195q9642J982j4517o7275N1212K44840
34699A338224K26664J8648p9289K1108J34528J74153J90091J10719j38083l34798
34689A661965k21684J8734J0199j80394j65016P1423J63529M1228K1650J72255
34679A593889J76635m8056j75306p2597l0923j94209k81157j05848J03430J38628
34669A104486J16272J30634N5332q9287l5883K22774K97815L9767j71078p0526
34659A600306M6744j03732k64379j18134J19979R3436o3450j3915J39061N4698
34649A490614j92258k19431j874J04057j2651o3870R7556K25070J13992o0830
34639A480375m5791R1957R0096r9754k34017j16404J19739J69160l4131k06532
$$ plain form
34629 1214698 1118120 1282233 1546771 1700480 1730552 1700930 1585548 1410193 1382022 1625736
34619 1625736 1904813 1871642 1534740 1229655 1171070 1279792 1417905 1531069 1554981 1435964
34609 1435964 1280598 1264002 1358378 1364230 1234987 1143872 1183992 1234122 1203387 1194560 1305005
34598 1305005 1432193 1411415 1247194 1104786 1126565 1305387 1495035 1544603 1468721 1434289
34588 1434289 1512858 1557836 1460411 1389936 1552943 1811644 1833306 1591462 1406801 1451683
34578 1451683 1529800 1459113 1379235 1486699 1682652 1710710 1524128 1317314 1253802 1316761
34568 1316761 1396049 1407170 1337778 1250227 1227904 1287419 1370591 1426608 1448061 1430618 1374394
34557 1374394 1325338 1325725 1319790 1212644 1041568 975806 1097619 1279848 1350791 1314014 1321265
$$ packed form
34629A214698r6578J64113K64538J53709L0072k9622j15382j75355k8171K43714
34619A625736K79077l3171l36902l05085n8585J08722J38113J13164K3912j19017
34609A435964j55366j6596R4376N852j29243r1115M0120N0130l0735q827J10445
34598A305005J27188k0778j64221j42408K1779J78822J89648M9568p5882l4432
34588A434289P8569M4978r7425p0475J63007K58701K1662k41844j84661M4882
34578A451683P8117p0687p9878J07464J95953K8058j86582k06814o3512O2959
34568A316761P9288J1121o9392q7551k2323N9515Q3172N6017K1453j7443n6224
34557A374394m9056L87n935j07146j71076o5762J21813J82229P0943l6777P251
$$ plain form
34546 1321265 1447213 1569588 1518473 1320145 1208670 1341501 1586195 1714798 1743757 1871030
34536 1871030 2079528 2078364 1745026 1360591 1220554 1247874 1228108 1206743 1336797 1488702
34526 1488702 1382555 1058158 866953 984269 1234744 1431972 1591225 1733300 1758231 1641241
34516 1641241 1542280 1589369 1704058 1743183 1688481 1618257 1601281 1676220 1836175 1991905 2037624
34505 2037624 1974626 1895992 1862440 1872571 1912144 1935040 1855975 1676062 1542606 1557781 1619131
34494 1619131 1599418 1579928 1719150 1980059 2185378 2261397 2234648 2095507 1888590 1819207
34484 1819207 2002897 2214761 2182900 2030748 2086004 2321935 2380991 2152645 1931427 1936663
34474 1936663 2041875 2079678 2078284 2077337 2018785 1944467 2008420 2166809 2147586 1871862 1621661
$$ packed form
34546A321265J25948J22375n1115j98328j11475J32831K44694J28603K8959J27273
34536A871030K08498j164l33338l84435j40037K7320j9766k1365J30054J51905
34526A488702j06147l24397j91205J17316K50475J97228J59253J42075K4931j16990
34516A641241r8961M7089J14689L9125n4702p0224j6976P4939J59955J55730M5719
34505B037624o2998p8634l3552J0131L9573K2896p9065j79913j33456J5175O1350
34494A619131j9713j9490J39222K60909K05319P6019k6749j39141k06917o9383
34484A819207J83690K11864l1861j52152N5256K35931N9056k28346k21218N236
34474A936663J05212L7803j394r47n8552p4318O3953J58389j9223k75724k50201
$$ plain form
34463 1621661 1622464 1727221 1708250 1620229 1643311 1746488 1744913 1592461 1423600 1351444 1356530
34452 1356530 1358622 1336271 1379051 1591028 1901554 2076344 2029630 1988813 2167112 2421616
34442 2421616 2482337 2366958 2252059 2081650 1713712 1363406 1418337 1803936 2014542 1848772
34432 1848772 1641753 1655781 1730737 1723384 1813496 2104104 2330451 2270653 2104077 2071324 2095471
34421 2095471 2035157 2012284 2164169 2316174 2222173 1944842 1722003 1624767 1587208 1603806
34411 1603806 1677337 1734616 1777888 1938206 2221748 2423092 2446185 2454406 2530132 2481113 2207301
34400 2207301 1961497 1973689 2086911 2059552 1977086 2042892 2181396 2193173 2134834 2204565 2370979
34389 2370979 2430680 2349688 2270872 2248344 2210023 2124207 2014706 1885797 1781728 1810768 1975649
$$ packed form
34463A621661Q03J04757j8971q8021K3082J03177j575j52452j68861p2156N086
34452A356530K092k2351M2780K11977L10526J74790m6714m0817J78299K54504
34442B421616O0721j15379j14899j70409l67938l50306N4931L85599K10606j65770
34432A848772k07019J4028P4956p353R0112K90608K26347n9798j66576l2753K4147
34421B095471o0314k2873J51885J52005r4001k77331k22839r7236l7559J6598
34411A603806P3531N7279M3272J60318K83542K01344K3093Q221P5726m9019k73812
34400B207301k45804J2192J13222k7359q2466O5806J38504J1777n8339O9731J66414
34389B370979N9701q0992p8816k2528l8321q5816j09501j28909j04069K9040J64881
$$ plain form
34378 1975649 2118416 2155244 2190849 2279085 2293505 2193818 2179828 2375261 2575317 2530823 2302413
34367 2302413 2130524 2121013 2229091 2376062 2438065 2319018 2150713 2179198 2358157 2368702
34357 2368702 2155270 2054562 2219124 2342555 2205075 2050504 2101900 2138011 1940427 1755025
34347 1755025 1863807 2064329 2059223 2033406 2313078 2717560 2804583 2571766 2384951 2359147
34337 2359147 2322831 2274749 2366756 2504961 2441896 2225938 2141391 2248693 2365214 2432908
34327 2432908 2533470 2617091 2574529 2491683 2500449 2502380 2371219 2256330 2321218 2385523 2243530
34316 2243530 2124701 2349832 2704647 2693861 2317334 2060084 2157057 2373689 2497455 2562485
34306 2562485 2577207 2477536 2373718 2448555 2615134 2641014 2559402 2579239 2668230 2630211 2515352
$$ packed form
34378A975649J42767L6828L5605Q8236J4420r9687j3990J95433K00056m4494k28410
34367B302413j71889r511J08078J46971O2003j19047j68305K8485J78959J0545
34357B368702k13432j00708J64562J23431j37480j54571N1396L6111j97584j85402
34347A755025J08782K00522n106k5817K79672M04482Q7023k32817j86815k5804
34337B359147l6316m8082R2007J38205o3065k15958q4547J07302J16521O7694
34327B432908J00562Q3621m2562q2846Q766J931j31161j14889O4888O4305j41993
34316B243530j18829K25131L54815j0786l76527k57250R6973K16632J23766O5030
34306B562485J4722r9671j03818P4837J66579K5880q1612J9837Q8991l8019j14859
$$ plain form
34295 2515352 2538093 2668092 2713098 2706118 2790128 2850150 2715597 2584414 2750181 3048358
34285 3048358 3101747 2973244 3002234 3130678 3026774 2778142 2779170 2975933 2934690 2667000
34275 2667000 2649356 2951220 3091793 2906504 2815263 3015808 3129202 2934949 2791440 2980756
34265 2980756 3225902 3219617 3106812 3086349 3017112 2777199 2582545 2605511 2660207 2571266 2490865
34254 2490865 2574919 2698712 2742221 2808160 2937169 2966064 2871285 2882445 3065841 3179961
34244 3179961 3120700 3099664 3206213 3236840 3150904 3215856 3461374 3482106 3089312 2702181
34234 2702181 2742594 3039628 3192164 3171856 3205138 3342305 3472751 3542589 3512358 3331441
34224 3331441 3135411 3192617 3492875 3692574 3614811 3472418 3458245 3481976 3459034 3469060
$$ packed form
34295B515352K2741J29999M5006o980Q4010O0022j34553j31183J65767K98177
34285C048358N3389j28503K8990J28444j03904k48632J028J96763m1243k67690
34275B667000j7644L01864J40573j85289r1241K00545J13394j94253j43509J89316
34265B980756K45146o285j12805k0463o9237k39913j94654K2966N4696q8941q0401
34254B490865Q4054J23793M3509O5939J29009K8895r4779J1160J83396J14120
34244C179961n9261k1036J06549L0627q5936O4952K45518K0732l92794l87131
34234B702181M0413K97034J52536k0308L3282J37167J30446O9838l0231j80917
34224C331441j96030N7206L00258J99699p7763j42393j4173K3731k2942J0026
$$ plain form
34214 3469060 3471411 3275750 2968244 2939803 3292095 3634192 3672442 3583732 3597816 3634089 3574861
34203 3574861 3500081 3454184 3370066 3358293 3619473 3956257 3910138 3528640 3393174 3684702
34193 3684702 3878894 3652127 3409391 3529659 3743786 3725603 3694729 3912139 4117006 4010014
34183 4010014 3822203 3866831 3964088 3842803 3699495 3819789 4024006 4022674 3971822 4147715
34173 4147715 4394038 4411739 4303792 4330147 4392700 4248525 3993942 3889382 3926527 3961899
34163 3961899 4038202 4212406 4326769 4282549 4253755 4332139 4307634 4103786 4030196 4264287
34153 4264287 4502451 4486708 4437986 4580979 4701760 4607871 4565105 4800525 5005634 4833418
34143 4833418 4496151 4383148 4460770 4514156 4593766 4756385 4755986 4460015 4190918 4215510 4303323
$$ packed form
34214C469060K351j95661l07506k8441L52292L42097L8250q8710J4084L6273n9228
34203C574861p4780m5897q4118j1773K61180L36784m6119l81498j35466K91528
34193C684702J94192k26767k42736J20268K14127j8183l0874K17410K04867j06992
34183D010014j87811M4628R7257j21285j43308J20294K04217j332n0852J75893
34173D147715K46323J7701j07947K6355O2553j44175k54583j04560L7145L5372
34163C961899P6303J74204J14363m4220k8794P8384k4505k03848p3590K34091
34153D264287K38164j5743m8722J42993J20781r3889m2766K35420K05109j72216
34143D833418l37267j13003P7622N3386P9610J62619l99k95971k69097K4592Q7813
$$ plain form
34132 4303323 4216496 4181093 4417081 4668516 4669614 4605481 4657990 4617676 4418313 4477351 4971313
34121 4971313 5363605 5230473 4961180 5033188 5217690 5167452 5152546 5474434 5768281 5671806
34111 5671806 5581227 5913081 6219202 5938440 5457650 5455536 5706841 5562979 5179978 5207855
34101 5207855 5601412 5782215 5712335 5805636 6004469 5913501 5654082 5669489 5874671 5864082
34091 5864082 5735182 5853261 6059637 5975057 5809936 5999843 6329244 6302298 6077406 6136859
34081 6136859 6355139 6312552 6186533 6384370 6654844 6543151 6341320 6563971 6893819 6743941
34071 6743941 6446948 6695734 7191030 7123675 6681172 6730865 7231872 7333645 6928550 6754432
34061 6754432 7000347 7112679 6979590 7059798 7335827 7338476 7177739 7369260 7725418 7632620
$$ packed form
34132D303323q6827l5403K35988K51435J098o4133N2509m0314j99363N9038M93962
34121D971313L92292j33132k69293P2008J84502n0238j4906L21888K93847r6475
34111E671806r0579L31854L06121k80762m80790k114K51305j43862l83001K7877
34101E207855L93557J80803o9880R3301J98833r0968k59419J5407K05182j0589
34091E864082j28900J18079K06376q4580j65121J89907L29401k6946k24892N9453
34081F136859K18280m2587j26019J97837K70474j11693k01831K22651L29848j49878
34071F743941k96993K48786M95296o7355m42503M9693N01007J01773m05095j74118
34061F754432K45915J12332j33089Q0208K76029K649j60737J91521L56158r2798
$$ plain form
34051 7632620 7307715 7501642 8070575 8176407 7822120 7809526 8209070 8271907 7883039 7723925
34041 7723925 7947304 8031684 7968331 8250950 8702588 8674378 8358123 8508688 8969384 8947793
34031 8947793 8618676 8859610 9502182 9536186 9001113 8924271 9387584 9468919 9139762 9338614
34021 9338614 10055706 10266066 9918752 10039805 10686617 10824033 10444944 10701152 11632868
34012 11632868 11938478 11377692 11197117 11732260 11852464 11303101 11277546 12045715 12355226
34003 12355226 11880460 11903260 12805903 13288756 12905676 12942222 13877407 14439250 14139392 14231121
33993 14231121 15126664 15446076 14753088 14603249 15646806 16349996 15908041 15730104 16625265
33984 16625265 17251394 16865724 16857877 17963956 18737932 18427610 18531585 19810700 20678966
$$ packed form
34051G632620l24905J93927N68933J05832l54287j2594L99544O2837l88868j59114
34041G723925K23379Q4380o3353K82619M51638k8210l16255J50565M60696k1591
34031H947793l29117K40934O42572L4004n35073p6842M63313Q1335l29157J98852
34021I338614P17092K10360l47314J21053O46812J37416l79089K56208R31716
34012A1632868L05610n60786j80575N35143J20204n49363k5555P68169L09511
34003A2355226m74766K2800R02643M82853l83080L6546R35185N61843k99858R1729
33993A4231121Q95543L19412o92988j49839J043557P03190m41955j77937Q95161
33984A6625265O26129l85670p847J106079P73976l10322J03975J279115Q68266
$$ plain form
33975 20678966 20317749 20353084 21609458 22377240 21847417 21930072 23567749 24728227 24309282
33966 24309282 24381700 26124642 27390946 26973845 27228429 29500519 31200586 30695024 30689342
33957 30689342 33146486 35437397 35489864 35950501 38892232 41461615 41589361 42655606 47126729
33948 47126729 51259174 52122362 53772927 59658131 65495531 67534333 70719706 79477350
33940 79477350 88212343 91881833 97296266 110471159 122793283 127722497 139786701 168812739
33932 168812739 180330390 119333947 -14142662 -144873604 -199489671 -181515448 -147848404
33925 -147848404 -132567623 -125186617 -111475692 -98317552 -93729730 -90757175 -82362784
33918 -82362784 -74005624 -71518566 -70244310 -64919365 -59202873 -57489939 -56545398 -52491178
$$ packed form
33975B0678966l61217L5335J256374P67782n29823Q2655J637677J160478m18945
33966B4309282P2418J742942J266304m17101K54584K272090J700067n05562n682
33957C0689342K457144K290911N2467M60637K941731K569383J27746J066245M471123
33948D7126729M132445Q63188J650565N885204N837400K038802L185373Q757644
33940G9477350Q734993L669490N414433J3174893J2322124M929214J2064204K9026038
33932A68812739J1517651o0996443j33476609j30730942n4616067J7974223L3667044
33925a47848404J5280781P381006J3710925J3158140M587822K972555Q394391
33918h2362784Q357160K487058J274256N324945N716492J712934R44541M054220
$$ plain form
33910 -52491178 -48207719 -47162337 -46716067 -43660734 -40370615 -39787059 -39697601 -37314727 -34653091
33901 -34653091 -34331476 -34479860 -32603200 -30432302 -30336386 -30641594 -28963308 -26815984 -26624570
33892 -26624570 -27190136 -26208365 -24532962 -24064981 -23973025 -22719340 -21438985 -21719154 -22258036
33883 -22258036 -21200586 -19698400 -19765244 -20550335 -20063595 -18814451 -18491907 -18653391 -17883147
33874 -17883147 -16783581 -16771560 -17213228 -16656618 -15682830 -15734861 -16276055 -15845392 -14865068
33865 -14865068 -14741034 -15159755 -14860755 -14179464 -14296369 -14789224 -14393420 -13455405 -13254469
33856 -13254469 -13565935 -13208870 -12397874 -12290754 -12723777 -12567059 -11881892 -11670720 -11902743
33847 -11902743 -11742298 -11325435 -11432239 -11807062 -11612484 -11118764 -11172504 -11444872 -10986794
$$ packed form
33910e2491178M283459J045382M46270L055333L290119N83556Q9458K382874K661636
33901c4653091L21615j48384J876660K170898R5916l05208J678286K147324J91414
33892b6624570n65566R81771J675403M67981R1956J253685J280355k80169n38882
33883b2258036J057450J502186o6844p85091M86740J249144L22544j61484P70244
33874a7883147J099566J2021m41668N56610R73788n2031n41194M30663R80324
33865a4865068J24034m18721K99000O81291j16905m92855L95804R38015K00936
33856a3254469l11466L57065Q10996J07120m33023J56718O85167K11172k32023
33847a1902743J60445M16863j06804l74823J94578M93720n3740k72368M58078
$$ plain form
33838 -10986794 -10094071 -9851475 -10208548 -10229735 -9875863 -9834604 -9954664 -9558266 -8980787 -9111190
33828 -9111190 -9693077 -9735595 -9328145 -9388079 -9853688 -9799074 -9180744 -8848096 -8930256 -8774835
33818 -8774835 -8398260 -8466404 -8880393 -8850639 -8356339 -8144655 -8328116 -8329508 -8133939 -8243675
33808 -8243675 -8481383 -8201528 -7617231 -7558085 -7967275 -7995118 -7543098 -7348838 -7544488 -7505164
33798 -7505164 -7184266 -7243620 -7727172 -7891358 -7520754 -7214466 -7216371 -7111230 -6815981 -6757326
33788 -6757326 -6940493 -6907198 -6695687 -6790608 -7094136 -7027143 -6658278 -6620033 -6901960 -6880515
33778 -6880515 -6563499 -6601115 -6989558 -6991354 -6491361 -6223453 -6442047 -6539269 -6234075 -6019445
33768 -6019445 -6147321 -6229648 -6120962 -6179128 -6401765 -6311004 -5926471 -5839582 -6099313 -6064019
$$ packed form
33838a0986794Q92723K42596l57073k1187L53872M1259j20060L96398N77479j30403
33828i111190n81887m2518M07450n9934m65609N4614O18330L32648q2160J55421
33818h774835L76575o8144m13989K9754M94300K11684j83461j392J95569j09736
33808h243675k37708K79855N84297N9146m09190k7843M52020J94260j95650L9324
33798g505164L20898n9354m83552j64186L70604L06288j905J05141K95249N8655
33788f757326j83167L3295K11511r4921l03528O6993L68865L8245k81927K1445
33778f880515L17016l7616l88443j796M99993K67908k18594r7222L05194K14630
33768f019445j27876q2327J08686n8166k22637R0761L84533Q6889k59731L5294
$$ plain form
33758 -6064019 -5603893 -5383327 -5644774 -5772317 -5437536 -5166134 -5336830 -5549090 -5430168
33749 -5430168 -5226574 -5177939 -5084093 -4865512 -4819688 -5010477 -5107150 -5047231 -5122265 -5265008
33739 -5265008 -5081130 -4726068 -4837268 -5409216 -5684567 -5392244 -5121603 -5198416 -5197839 -4923553
33729 -4923553 -4867604 -5253632 -5545868 -5372451 -5085099 -4976290 -4793701 -4457355 -4396758 -4713888
33719 -4713888 -4837931 -4478364 -4130773 -4196805 -4393363 -4456250 -4612122 -4915911 -4947201 -4616894
33709 -4616894 -4453370 -4651254 -4697065 -4380188 -4237547 -4479136 -4460104 -3858285 -3402850 -3677395
33699 -3677395 -4110103 -3996678 -3689330 -3841067 -4196906 -4127620 -3792179 -3790947 -4095277 -4226949
33689 -4226949 -4154964 -4191145 -4293123 -4213614 -4064927 -4073585 -4071456 -3843170 -3645416 -3776872 -3983130
$$ packed form
33758f064019M60126K20566k61447j27543L34781K71402j70696k12260J18922
33749e430168K03594M8635R3846K18581M5824j90789r6673N9919p5034j42743
33739e265008J83878L55062j11200n71948k75351K92323K70641p6813N77K74286
33729d923553N5949l86028k92236J73417K87352J08809J82589L36346O0597l17130
33719d713888j24043L59567L47591o6032j96558o2887j55872l03789l1290L30307
33709d616894J63524j97884m5811L16877J42641k41589J9032O01819M55435k74545
33699c677395m32708J13425L07348j51737l55839O9286L35441J232l04330j31672
33689d226949P1985l6181j01978P9509J48687q658K129K28286J97754j31456k06258
$$ plain form
33678 -3983130 -3896531 -3711954 -3806820 -4030400 -3995168 -3768113 -3675792 -3714612 -3712593 -3765310 -3966617
33667 -3966617 -4040103 -3787535 -3555216 -3694005 -3919419 -3800404 -3523156 -3531981 -3728472 -3682832
33657 -3682832 -3384671 -3158810 -3065458 -2975101 -3003651 -3284703 -3532864 -3413662 -3140562 -3148864
33647 -3148864 -3392165 -3515108 -3501516 -3578047 -3671203 -3536537 -3277198 -3199478 -3286203 -3292289 -3209679
33636 -3209679 -3196773 -3233666 -3257642 -3395639 -3655239 -3700994 -3384154 -3126697 -3272777 -3466595
33626 -3466595 -3273653 -3006908 -3215105 -3688996 -3772953 -3435367 -3220802 -3279515 -3248030 -3039679
33616 -3039679 -2982872 -3150093 -3246488 -3211759 -3293963 -3482275 -3474897 -3256353 -3129626 -3142682 -3051321
33605 -3051321 -2873889 -2899825 -3102303 -3124561 -2926409 -2881707 -3130894 -3367468 -3380764 -3308399
$$ packed form
33678c983130Q6599J84577r4866k23580L5232K27055R2321l8820K019n2717k01307
33667c966617p3486K52568K32319j38789k25414J19015K77248q825j96491M5640
33657c682832K98161K25861R3352R0357k8550k81052k48161J19202K73100q302
33647c148864k43301j22943J3592p6531r3156J34666K59339P7720q6725o086Q2610
33636c209679J2906l6893k3976j37997k59600m5755L16840K57457j46080j93818
33626c466595J92942K66745k08197m73891q3957L37586K14565n8713L1485K08351
33616c039679N6807j67221r6395L4729q2204j88312P378K18544J26727j3056R1361
33605c051321J77432k5936k02478k2258J98152M4702k49187k36574j3296P2365
$$ plain form
33595 -3308399 -3235449 -3032568 -2727747 -2584452 -2663287 -2707314 -2586644 -2486055 -2553508 -2712116
33585 -2712116 -2885840 -3067692 -3131831 -2938144 -2646412 -2560247 -2646099 -2585774 -2319481 -2145137
33575 -2145137 -2243752 -2475939 -2680480 -2827134 -2866235 -2767915 -2690615 -2773177 -2831267 -2637552
33565 -2637552 -2394577 -2470209 -2746899 -2757540 -2451209 -2282337 -2487441 -2793020 -2933495 -2966385
33555 -2966385 -2957454 -2822363 -2620444 -2574432 -2660285 -2582451 -2282540 -2072294 -2131169 -2260870
33545 -2260870 -2274035 -2253177 -2285370 -2293475 -2269677 -2354323 -2564930 -2742967 -2838553 -2936093 -2962896
33534 -2962896 -2729908 -2313712 -2034734 -1999994 -2025046 -2036699 -2151280 -2311227 -2279170 -2077482
33524 -2077482 -2009242 -2149012 -2240688 -2199374 -2259999 -2489297 -2608186 -2486343 -2384408 -2490282
$$ packed form
33595c308399P2950K02881L04821J43295p8835m4027J20670J00589o7453j58608
33585b712116j73724j81852o4139J93687K91732Q6165q5852O0325K66293J74344
33575b145137r8615k32187k04541j46654l9101R8320P7300q2562n8090J93715
33565b637552K42975p5632k76690j0641L06331J68872k05104l05579j40475l2890
33555b966385Q931J35091K01919M6012q5853P7834K99911K10246n8875j29701
33545b260870j3165K0858l2193q105K3798q4646k10607j78037r5586r7540k6803
33534b962896K32988M16196K78978L4740k5052j1653j14581j59947L2057K01688
33524b077482O8240j39770r1676M1314o0625k29298j18889J21843J01935j05874
$$ plain form
33514 -2490282 -2609745 -2546290 -2429622 -2436484 -2507381 -2554526 -2648358 -2797279 -2829829 -2683912 -2545051
33503 -2545051 -2536403 -2537224 -2446000 -2348530 -2299065 -2213697 -2091825 -2056893 -2084348 -1995086 -1803646
33492 -1803646 -1747209 -1889588 -2044341 -2161992 -2399414 -2708293 -2785343 -2583341 -2449568 -2572279
33482 -2572279 -2697997 -2601463 -2432677 -2366534 -2296173 -2133217 -2055990 -2185651 -2329354 -2306256
33472 -2306256 -2241831 -2295729 -2368666 -2309657 -2171807 -2074545 -2046899 -2132673 -2370990 -2574351 -2462377
33461 -2462377 -2119610 -1945577 -2045567 -2101386 -1975482 -1948745 -2156209 -2299306 -2196090 -2124937
33451 -2124937 -2296105 -2450283 -2343713 -2189150 -2226621 -2277123 -2137796 -2025271 -2184675 -2411794
33441 -2411794 -2405290 -2265774 -2213890 -2146623 -1928287 -1798077 -1998228 -2278149 -2258855 -2036008
$$ packed form
33514b490282j19463O3455J16668o862p0897m7145r3832j48921l2550J45917J38861
33503b545051Q648q21R1224R7470M9465Q5368J21872L4932k7455Q9262J91440
33492a803646N6437j42379j54753j17651k37422l08879p7050K02002J33773j22711
33482b572279j25718R6534J68786O6143P0361J62956P7227j29661j43703K3098
33472b306256O4425n3898p2937N9009J37850R7262K7646q5774k38317k03361J11974
33461b462377L42767J74033r9990n5819J25904K6737k07464j43097J03216P1153
33451b124937j71168j54178J06570J54563l7471n0502J39327J12525j59404k27119
33441b411794O504J39516N1884O7267K18336J30210k00151k79921J9294K22847
$$ plain form
33431 -2036008 -1938985 -1947748 -1855912 -1770262 -1903176 -2065315 -1926440 -1635707 -1621094 -1870048
33421 -1870048 -1967491 -1804961 -1712713 -1873841 -2098456 -2221784 -2283721 -2265455 -2063913 -1795360
33411 -1795360 -1749081 -1960111 -2147665 -2135054 -2037713 -1991850 -1971337 -1920070 -1841203 -1740309 -1661802
33400 -1661802 -1728069 -1953877 -2124965 -2071069 -1921279 -1856142 -1788725 -1581946 -1390796 -1436197
33390 -1436197 -1599202 -1616846 -1541456 -1607783 -1763704 -1752979 -1580102 -1477975 -1483891 -1458565 -1450138
33379 -1450138 -1603828 -1775964 -1704095 -1521045 -1603582 -1905603 -1959606 -1612386 -1256047 -1204475
33369 -1204475 -1316237 -1395326 -1507110 -1683472 -1724649 -1543940 -1372684 -1387081 -1430869 -1333425
33359 -1333425 -1223272 -1288859 -1463113 -1573310 -1610548 -1646292 -1648239 -1565368 -1465723 -1443119 -1493643
$$ packed form
33431b036008R7023q763R1836Q5650j32914j62139J38875K90733J4613k48954
33421a870048r7443J62530R2248j61128k24615j23328o1937J8266K01542K68553
33411a795360M6279k11030j87554J2611R7341M5863K0513N1267P8867J00894P8507
33400a661802o6267k25808j71088N3896J49790O5137O7417K06779J91150m5401
33390a436197j63005j7644P5390o6327j55921J0725J72877J02127n916K5326Q427
33379a450138j53690j72136P1869J83050q2537l02021n4003L47220L56339N1572
33369a204475j11762p9089j11784j76362m1177J80709J71256j4397m3788R7444
33359a333425J10153o5587j74254j10197l7238l5744j947Q2871R9645K2604n0524
$$ plain form
33348 -1493643 -1573677 -1660507 -1703605 -1655431 -1576787 -1556073 -1535637 -1418903 -1319128 -1433882 -1677050
33337 -1677050 -1751128 -1627005 -1609232 -1824777 -1996340 -1892750 -1684360 -1625785 -1652924 -1558512
33327 -1558512 -1376689 -1326080 -1475367 -1678537 -1779710 -1733874 -1588871 -1460625 -1465640 -1605668
33317 -1605668 -1784327 -1955663 -2141114 -2292030 -2296306 -2154836 -1992048 -1864305 -1727398 -1605063
33307 -1605063 -1581380 -1599728 -1504503 -1332781 -1310560 -1479214 -1594214 -1518382 -1449085 -1580310
33297 -1580310 -1777414 -1804635 -1691429 -1641904 -1707548 -1769917 -1769654 -1757915 -1755770 -1710830 -1583286
33286 -1583286 -1393790 -1217412 -1167266 -1307278 -1542535 -1688687 -1684235 -1631031 -1609498 -1597470
33276 -1597470 -1602992 -1703637 -1880142 -1974597 -1914311 -1838369 -1892049 -2006409 -1990410 -1769306 -1456875
$$ packed form
33348a493643q0034q6830m3098M8174P8644K0714K0436J16734R9775j14754k43168
33337a677050p4078J24123J7773k15545j71563J03590K08390N8575k7139R4412
33327a558512J81823N0609j49287k03170j01173M5836J45003J28246n015j40028
33317a605668j78659j71336j85451j50916m276J41470J62788J27743J36907J22335
33307a605063K3683j8348R5225J71722K2221j68654j15000P5832O9297j31225
33297a580310j97104k7221J13206M9525o5644o2369K63J1739K145M4940J27544
33286a583286J89496J76378N0146j40012k35257j46152M452N3204K1533J2028
33276a597470n522j00645j76505r4455O0286P5942n3680j14360J5999K21104L12431
$$ plain form
33265 -1456875 -1245813 -1251072 -1391092 -1436782 -1278740 -1103787 -1157298 -1381966 -1503131 -1448378
33255 -1448378 -1426557 -1563757 -1728701 -1789377 -1779604 -1713210 -1500928 -1192565 -1048342 -1187119
33245 -1187119 -1376851 -1367307 -1243317 -1243686 -1392428 -1530078 -1591676 -1638835 -1690859 -1705621 -1672328
33234 -1672328 -1582008 -1378994 -1078995 -856793 -868233 -1039140 -1161416 -1151430 -1097219 -1096454 -1161028
33223 -1161028 -1251554 -1311794 -1291227 -1204413 -1143289 -1177814 -1272275 -1337026 -1331389 -1290141 -1275209
33212 -1275209 -1306555 -1323800 -1253268 -1139986 -1127521 -1244515 -1333035 -1298208 -1281714 -1418981 -1579229
33201 -1579229 -1578045 -1504269 -1547694 -1625471 -1525110 -1334693 -1342220 -1541898 -1649837 -1607770 -1629164
33190 -1629164 -1708687 -1572377 -1223729 -1036904 -1124003 -1110054 -794203 -551149 -738302 -1133035
$$ packed form
33265a456875K11062n259j40020m5690J58042J74953n3511k24668j21165N4753
33255a448378K1821j37200j64944o0676R773O6394K12282L08363J44223j38777
33245a187119j89732R544J23990l69j48742j37650o1598m7159n2024j4762L3293
33234a672328R0320K03014K99999K22202j1440j70907j22276R986N4211P65o4574
33223a161028r0526o0240K0567Q6814O1124l4525r4461o4751N637M1248J4932
33212a275209l1346j7245P0532J13282J2465j16994q8520L4827J6494j37267j60248
33201a579229J184P3776m3425p7777J00361J90417p527j99678j07939M2067k1394
33190a629164p9523J36310L48648J86825q7099J3949L15851K43054j87153l94733
$$ plain form
33180 -1133035 -1339190 -1372152 -1432094 -1442464 -1265190 -1093418 -1171773 -1353582 -1375598 -1351582
33170 -1351582 -1528329 -1745553 -1641645 -1273888 -1042713 -1075544 -1157179 -1215094 -1388461 -1617139
33160 -1617139 -1634264 -1422970 -1260483 -1247550 -1197458 -1063106 -1063624 -1264130 -1405176 -1306734 -1120594
33149 -1120594 -1029538 -992946 -945417 -963965 -1062696 -1075210 -931892 -840284 -995064 -1281254 -1453163
33138 -1453163 -1470448 -1474116 -1524109 -1530642 -1410829 -1200444 -1019273 -970996 -1052939 -1156050 -1187496
33127 -1187496 -1164243 -1137909 -1102703 -1070535 -1140211 -1343226 -1502999 -1431542 -1213740 -1106346
33117 -1106346 -1191152 -1315945 -1342656 -1260578 -1095779 -920558 -912819 -1167339 -1465970 -1482885
33107 -1482885 -1217531 -976316 -929649 -967353 -1008806 -1131614 -1304623 -1311513 -1098195 -929287
$$ packed form
33180a133035k06155l2962n9942j0370J77274J71772p8355j81809k2016K4016
33170a351582j76747k17224J03908L67757K31175l2831q1635n7915j73367k28678
33160a617139j7125K11294J62487J2933N0092J34352n18k00506j41046R8442J86140
33149a120594R1056L6592M7529j8548r8731j2514J43318R1608j54780k86190j71909
33138a453163j7285l668m9993o533J19813K10385J81171M8277q1943j03111l1446
33127a187496K3253K6334L5206L2168o9676k03015j59773P1457K17802J07394
33117a106346q4806j24793k6711Q2078J64799J75221P739k54520k98631j6915
33107a482885K65354K41215M6667l7704m1453j22808j73009o890K13318J68908
$$ plain form
33097 -929287 -1012305 -1186492 -1184190 -1019578 -906411 -925609 -989744 -1057361 -1179731 -1345751 -1424549
33086 -1424549 -1294776 -985858 -694078 -649156 -901662 -1246430 -1432947 -1430454 -1386479 -1372072
33076 -1372072 -1330929 -1261215 -1250723 -1302998 -1315235 -1274112 -1290657 -1382852 -1407081 -1284736 -1130794
33065 -1130794 -1073047 -1093020 -1120266 -1135871 -1115586 -1024708 -931763 -960120 -1064165 -1043965 -866921
33054 -866921 -772405 -937442 -1226751 -1410067 -1448958 -1418680 -1320664 -1155037 -1041407 -1082036
33044 -1082036 -1204583 -1291500 -1351815 -1415659 -1393593 -1226331 -1056640 -1044004 -1099762 -1029681 -875708
33033 -875708 -868206 -1042102 -1143037 -986730 -728995 -669660 -891334 -1190558 -1324900 -1265082
33023 -1265082 -1203649 -1325135 -1578189 -1723174 -1627248 -1438036 -1395903 -1533023 -1655924 -1603121
$$ packed form
33097i29287q3018j74187K302J64612J13167j9198o4135o7617j22370j66020p8798
33086a424549J29773L08918K91780M4922k52506l44768j86517K493M3975J4407
33076a372072M1143O9714J0492n2275j2237M1123j6545r2195k4229J22345J53942
33065a130794N7747j9973k7246j5605K0285R0878R2945k8357j04045K0200J77044
33054h66921R4516j65037k89309j83316l8891L0278R8016J65627J13630m0629
33044a082036j22547q6917o0315o3844K2066J67262J69691J2636n5758P0081J53973
33033h75708P502j73896j00935J56307K57735N9335k21674k99224j34342N9818
33023a265082O1433j21486k53054j44985R5926J89212M2133j37120j22901N2803
$$ plain form
33013 -1603121 -1420240 -1260812 -1185750 -1115086 -971951 -831624 -864272 -1100085 -1323604 -1298692
33003 -1298692 -1061303 -865024 -847760 -900457 -888905 -842914 -852916 -917794 -987633 -1043120 -1044250
32992 -1044250 -916534 -691025 -549936 -616133 -786778 -889493 -913249 -954739 -1013455 -990336
32982 -990336 -856133 -694273 -593138 -590622 -693642 -859233 -989733 -1036186 -1071245 -1176110
32972 -1176110 -1302081 -1338069 -1269991 -1171953 -1079839 -982460 -908700 -910607 -969457 -1016787 -1044450
32961 -1044450 -1108454 -1228669 -1359635 -1451581 -1475443 -1408762 -1262305 -1095441 -950677 -823809
32951 -823809 -758788 -878736 -1202151 -1507282 -1545080 -1350569 -1168242 -1086882 -958741 -719121
32941 -719121 -560561 -661391 -909343 -1060078 -1059959 -1038033 -1050113 -1021982 -931937 -868169 -870558
$$ packed form
33013a603121J82881J59428P5062P0664J43135J40327l2648k35813k23519K4912
33003a298692K37389J96279J7264n2697J1552M5991j0002o4878o9839n5487j130
32992a044250J27716K25509J41089o6197j70645j02715k3756m1490n8716K3119
32982i90336J34203J61860J01135K516j03020j65591j30500m6453l5059j04865
32972a176110j25971l5988O8078R8038R2114R7379P3760j907n8850m7330k7663
32961a044450o4004j20215j30966r1946k3862O6681J46457J66864J44764J26868
32951h23809O5021j19948l23415l05131l7798J94511J82327Q1360J28141K39620
32941g19121J58560j00830k47952j50735J19K1926j2080K8131R0045O3768k389
$$ plain form
32930 -870558 -868878 -837114 -872835 -1035582 -1216290 -1273425 -1217962 -1155341 -1115516 -1062774 -1013619
32919 -1013619 -1000755 -958584 -806222 -633993 -636042 -838214 -1060537 -1179712 -1246600 -1296657
32909 -1296657 -1255622 -1127831 -1062383 -1095993 -1047106 -846075 -749137 -971448 -1293206 -1342056
32899 -1342056 -1141972 -1042219 -1172161 -1327567 -1385555 -1455457 -1554964 -1499318 -1246360 -1035990
32889 -1035990 -1015313 -997239 -785889 -509862 -421816 -552989 -768420 -998485 -1208414 -1281773
32879 -1281773 -1154106 -966405 -894178 -907760 -874448 -805448 -810298 -873890 -876526 -810163 -800096
32868 -800096 -907252 -1047365 -1124528 -1145837 -1182931 -1273736 -1365751 -1346398 -1171301 -956738 -854433
32857 -854433 -833724 -721529 -485858 -319167 -374515 -576028 -770876 -906481 -964681 -899609
$$ packed form
32930h70558J680L1764l5721j62747j80708n7135N5463O2621L9825N2742M9155
32919a013619J2864M2171J52362J72229k049k02172k22323j19175o6888n0057
32909a296657M1035J27791O5448l3610M8887K01031R6938k22311l21758m8850
32899a342056K00084R9753j29942j55406n7988o9902r9507N5646K52958K10370
32889a035990K0677J8074K11350K76027Q8046j31173k15431k30065k09929p3359
32879a281773J27667J87701P2227j3582L3312O9000m850o3592k636O6363J0067
32868h00096j07156j40113p7163k1309l7094r0805r2015J9353J75097K14563J02305
32857h54433K0709J12195K35671J66691n5348k01513j94848j35605n8200O5072
$$ plain form
32847 -899609 -767249 -744828 -875945 -963038 -873272 -777370 -885373 -1101234 -1174118 -1075101 -974283
32836 -974283 -922054 -811023 -632621 -538880 -622787 -803309 -945518 -973056 -878535 -737691
32826 -737691 -682578 -758422 -855443 -867374 -829866 -812334 -803548 -822329 -975632 -1235259 -1329847
32815 -1329847 -1089257 -751854 -667637 -815984 -908124 -873520 -913182 -1099029 -1250017 -1240846
32805 -1240846 -1150264 -1056008 -940124 -847637 -893575 -1051586 -1154570 -1150823 -1146750 -1174419 -1159457
32794 -1159457 -1146063 -1275321 -1475630 -1468005 -1194202 -957656 -979190 -1071279 -957744 -701789
32784 -701789 -578010 -666538 -810088 -885487 -905592 -898513 -869444 -869777 -958254 -1086866 -1135444
32773 -1135444 -1078793 -1040903 -1142568 -1319772 -1340644 -1055292 -625393 -405134 -538202 -791745
$$ packed form
32847h99609J32360K2421j31117q7093Q9766R5902j08003k15861p2884R9017J00818
32836i74283N2229J11031J78402R3741q3907j80522j42209k7538R4521J40844
32826g37691N5113p5844r7021j1931L7508J7532Q786j8781j53303k59627r4588
32815a329847K40590L37403Q4217j48347r2140L4604l9662j85847j50988R171
32805a240846R0582R4256J15884R2487m5938j58011j02984L747M073k7669J4962
32794a159457J3394j29258k00309P625K73803K36546k1534r2089J13535K55955
32784g01789J23779q8528j43550p5399k0105P079K9069l33q8477j28612m8578
32773a135444N6651L7890j01665j77204k0872K85352M29899K20259j33068k53543
$$ plain form
32763 -791745 -891988 -875090 -922308 -995366 -919854 -750820 -717367 -804671 -749174 -520293 -437632
32752 -437632 -652726 -864907 -793786 -635295 -738044 -1044644 -1202269 -1107970 -1003045 -1057220
32742 -1057220 -1157867 -1145077 -1024034 -884875 -776490 -710476 -674125 -617296 -521047 -469430
32732 -469430 -549930 -702468 -785343 -782688 -822324 -969772 -1111453 -1082234 -845041 -522480 -297347
32721 -297347 -281932 -430709 -572229 -565158 -430465 -314923 -340082 -501543 -686985 -770957
32711 -770957 -717208 -602153 -517735 -468793 -416037 -388429 -453514 -578952 -642591 -611722 -597563
32700 -597563 -678128 -771126 -753082 -624145 -489103 -437670 -487076 -576982 -597918 -509026 -435152
32689 -435152 -524753 -697349 -702567 -492743 -348528 -505791 -816980 -951552 -818611 -611305
$$ packed form
32763g91745j00243J6898m7218p3058P5512J69034L3453q7304N5497K28881Q2661
32752d37632k15094k12181P1121J58491j02749l06600j57625R4299J04925n4175
32742a057220j00647J2790J21043J39159J08385O6014L6351N6829R6249N1617
32732d69430q0500j52538q2875K655l9636j47448j41681K9219K37193L22561K25133
32721b97347J5415j48777j41520P071J34693J15542k5159j61461j85442q3972
32711g70957N3749J15055Q4418M8942N2756K7608o5085j25438o3639L0869J4159
32700e97563q0565r2998J8044J28937J35042N1433m9406q9906k0936Q8892P3874
32689d35152q9601j72596n218K09824J44215j57263l11189j34572J32941K07306
$$ plain form
32679 -611305 -509754 -523524 -590719 -660830 -679466 -628330 -589869 -665630 -830412 -960791 -996726
32668 -996726 -978683 -938542 -863948 -780795 -766721 -843233 -925881 -926562 -862539 -820011 -825435 -797155
32656 -797155 -651997 -442337 -327140 -380319 -496726 -549921 -562416 -608040 -625724 -511296
32646 -511296 -361724 -404496 -647369 -822455 -768903 -659410 -713882 -886496 -1018317 -1130597
32636 -1130597 -1329310 -1517430 -1461295 -1140973 -823787 -739057 -825932 -867302 -775859 -669152
32626 -669152 -686539 -788696 -788697 -602684 -397288 -385773 -529450 -603809 -546055 -527397 -640064
32615 -640064 -745419 -735173 -715520 -780538 -814667 -710483 -593264 -610824 -667696 -609193 -519002
32604 -519002 -561353 -649034 -572652 -387068 -352047 -505488 -601608 -503091 -356604 -321111 -371512
$$ packed form
32679f11305J01551j3770o7195p0111j8636N1136L8461p5761j64782j30379l5935
32668i96726J8043M0141P4594Q3153J4074p6512q2648o81O4023M2528n424K8280
32656g97155J45158K09660J15197n3179j16407n3195j2495m5624j7684J14428
32646e11296J49572m2772k42873j75086N3552J09493n4472j72614j31821j12280
32636a130597j98713j88120N6135L20322L17186Q4730q6875m1370R1443J06707
32626f69152j7387j02157jJ86013K05396J1515j43677p4359N7754J8658j12667
32615f40064j05355J0246J9653o5018l4129J04184J17219j7560n6872N8503R0191
32604e19002m2351q7681P6382J85584L5021j53441r6120R8517J46487L5493n0401
$$ plain form
32593 -371512 -445309 -558815 -692154 -755065 -748014 -777973 -844960 -800337 -601914 -429347 -440270
32582 -440270 -565876 -654077 -677344 -690045 -695734 -660473 -570884 -413809 -199829 -52252 -130875
32571 -130875 -390523 -561315 -477853 -299035 -272358 -392316 -451254 -361227 -253673 -259473 -329460
32560 -329460 -327645 -232133 -175245 -276443 -470405 -564168 -490314 -416956 -508792 -653569 -598715
32549 -598715 -349395 -222366 -423566 -750952 -857024 -681280 -455991 -356615 -329983 -266439
32539 -266439 -179760 -155625 -223767 -358882 -553411 -803903 -1031557 -1099334 -962070 -759196
32529 -759196 -678206 -725666 -725345 -579895 -431267 -470211 -669075 -837588 -899955 -955958 -1058583
32518 -1058583 -1097030 -974959 -782987 -692346 -747069 -852275 -919286 -931839 -896025 -819996 -755353
$$ packed form
32593c71512p3797j13506j33339o2911P051k9959o6987M4623J98423J72567j0923
32582d40270j25606q8201k3267j2701n689L5261Q9589J57075K13980J47577p8623
32571a30875k59648j70792Q3462J78818K6677j19958n8938R0027J07554n800o9987
32560c29460J815R5512N6888j01198j93962r3763P3854P3358r1836j44777N4854
32549e98715K49320J27029k01200l27386j06072J75744K25289R9376K6632O3544
32539b66439Q6679K4135o8142j35115j94529k50492k27654o7777J37264K02874
32529g59196Q0990m7460L21J45450J48628l8944j98864j68513o2367n6003j02625
32518a058583l8447J22071J91972R0641n4723j05206o7011j2553L5814P6029O4643
$$ plain form
32507 -755353 -782649 -912285 -1039635 -1049870 -952679 -855865 -804947 -736403 -640767 -667904 -929052
32496 -929052 -1243668 -1276866 -964186 -614716 -507561 -566739 -573610 -532385 -612509 -823537 -978459
32485 -978459 -964842 -861841 -775982 -717415 -659688 -596477 -526664 -481715 -540193 -696487 -760972
32474 -760972 -552352 -174697 60832 -3691 -239179 -450087 -562826 -587981 -574198 -633221
32464 -633221 -840434 -1065376 -1066844 -813118 -548918 -481259 -556654 -623026 -648751 -675182 -692590
32453 -692590 -691239 -738701 -888422 -1072621 -1167476 -1107554 -892528 -575828 -301571 -237078 -376739
32442 -376739 -504514 -449057 -301035 -275829 -421285 -577590 -608461 -565653 -587757 -687027 -701260
32431 -701260 -494471 -180402 -55851 -269951 -649237 -923241 -1019408 -1018432 -932326 -719587
$$ packed form
32507g55353k7296j29636j27350j0235R7191R6814N0918O8544R5636k7137k61148
32496i29052l14616l3198L12680L49470J07155n9178o871M1225q0124k11028j54922
32485i78459J3617J03001Q5859N8567N7727O3211O9813M4949n8478j56294o4485
32474g60972K08620L77655K35529o4523k35488k10908j12739k5155J3783n9023
32464f33221k07213k24942j468K53726K64200O7659p5395o6372k5725k6431j7408
32453f92590J351m7462j49721j84199r4855N9922K15026L16700K74257O4493j39661
32442c76739j27775N5457J48022K5206j45456j56305l0871M2808k2104r9270j4233
32431g01260K06789L14069J24551k14100l79286k74004r6167R76Q6106K12739
$$ plain form
32421 -719587 -462422 -317584 -298982 -296016 -291751 -357442 -442538 -414385 -334746 -436579 -747936
32410 -747936 -988709 -956724 -788070 -698403 -683558 -642906 -605131 -635665 -667699 -618237 -558049
32399 -558049 -589567 -657327 -651896 -614670 -667760 -803839 -902689 -909835 -862712 -782372 -664080
32388 -664080 -544641 -478000 -472784 -523887 -652439 -844744 -1010137 -1064310 -1001668 -851774 -645736
32377 -645736 -451187 -333292 -257621 -162101 -136218 -337729 -680738 -834926 -657623 -421093
32367 -421093 -451917 -721549 -966245 -1049519 -1009834 -880448 -669634 -442554 -260739 -113993
32357 -113993 -27791 -112913 -371825 -596191 -618312 -534017 -516736 -555615 -555918 -547510 -587330 -591849
32345 -591849 -482348 -366075 -349748 -311744 -114765 82551 18603 -253330 -439142 -442940
$$ packed form
32421g19587K57165J44838J8602K966M265o5691q5096K8153P9639j01833l11357
32410g47936k40773L1985J68654Q9667J4845M0652L7775l0534l2034M9462O0188
32399e58049l1518o7760N431L7226n3090j36079r8850p146M7123Q0340J18292
32388f64080J19439O6641N216n1103j28552j92305j65393n4173O2642J49894K06038
32377f45736J94549J17895P5671R5520K5883k01511l43009j54188J77303K36530
32367d21093l0824k69632k44696q3274L9685J29386K10814K27080J81815J46746
32357a13993Q6202q5122k58912k24366k2121Q4295J7281l8879l03Q408l9820m519
32345e91849J09501J16273J6327L8004J96979J97316o3948k71933j85812l798
$$ plain form
32335 -442940 -434383 -503710 -553035 -552934 -627452 -821222 -1002541 -1049809 -954001 -727879 -410402
32324 -410402 -163654 -152174 -301236 -366995 -262540 -128624 -80505 -88626 -126444 -236184 -413200
32313 -413200 -588702 -734587 -836329 -806678 -614292 -437145 -458168 -567088 -534168 -426239
32303 -426239 -516812 -780913 -850200 -561379 -205257 -86460 -142791 -178155 -196792 -291015 -413785
32292 -413785 -483305 -555544 -700136 -832723 -835114 -733746 -633070 -587961 -640077 -830674 -1061999
32281 -1061999 -1097870 -834652 -449808 -182513 -106387 -197772 -432368 -685588 -737859 -555764
32271 -555764 -401764 -482527 -648861 -650045 -533361 -533687 -657858 -658452 -422896 -155435 -108607
32260 -108607 -285713 -480937 -531792 -479024 -500492 -695648 -948755 -1059009 -991653 -892637
$$ packed form
32335d42940Q557o9327m9325J01p4518j93770j81319m7268R5808K26122L17477
32324d10402K46748J1480j49062o5759J04455J33916M8119q121l7818j09740j77016
32313d13200j75502j45885j01742K9651J92386J77147k1023j08920L2920J07929
32303d26239r0573k64101o9287K88821L56122J18797n6331l5364j8637r4223j22770
32292d13785o9520p2239j44592j32587k391J01368J00676M5109n2116j90597k31325
32281a061999l5871K63218L84844K67295P6126r1385k34596k53220n2271J82095
32271e55764J54000q0763j66334j184J16684l26j24171n94K35556K67461M6828
32260a08607j77106j95224n0855N2768k1468j95156k53107j10254O7356R9016
$$ plain form
32250 -892637 -851516 -808062 -741051 -756837 -867691 -856074 -545118 -97093 145528 58860 -181359
32239 -181359 -364913 -431685 -417077 -367646 -330988 -335690 -371129 -429330 -520475 -599801 -567049
32228 -567049 -420850 -320606 -389154 -545028 -651544 -729833 -858945 -952346 -855866 -648397
32218 -648397 -607973 -814087 -985583 -841675 -485300 -266993 -335520 -493416 -505918 -397021
32208 -397021 -351095 -421618 -480993 -444906 -402785 -471286 -628474 -773641 -860704 -877923 -783867
32197 -783867 -586051 -410774 -357470 -348619 -277008 -230429 -368280 -614240 -708098 -581992 -456795
32186 -456795 -508893 -650481 -714919 -668651 -559577 -434501 -382176 -478214 -622199 -628011 -538357
32175 -538357 -608167 -876021 -1020436 -807300 -433279 -222697 -208047 -240196 -304135 -451317
$$ packed form
32250h92637M1121M3454O7011j5786j10854J1617L10956M48025K42621q6668k40219
32239a81359j83554o6772J4608M9431L6658m702l5439n8201r1145p9326L2752
32228e67049J46199J00244o8548j55874j06516p8289j29112r3401R6480K07469
32218f48397M0424k06114j71496J43908L56375K18307o8527j57896j2502J08897
32208c97021M5926p0523n9375L6087M2121o8501j57188j45167q7063j7219R4056
32197g83867J97816J75277N3304Q851P1611M6579j37851k45960r3858J26106J25197
32186d56795n2098j41588o4438M6268J09074J25076N2325r6038j43985n812Q9654
32175e38357o9810k67854j44415K13136L74021K10582J4650l2149o3939j47182
$$ plain form
32165 -451317 -579770 -568306 -515469 -573285 -644008 -522969 -269218 -148407 -245591 -406088
32155 -406088 -536818 -691508 -851195 -890711 -809181 -758802 -792198 -798060 -741404 -747007 -859815
32144 -859815 -924477 -817067 -634380 -532972 -513068 -491941 -494403 -627871 -898321 -1158518
32134 -1158518 -1254311 -1172716 -1024252 -894424 -752621 -551244 -379568 -399142 -594345 -726749
32124 -726749 -631888 -432985 -323244 -255941 -52475 238571 319610 21968 -458020 -765196
32114 -765196 -724437 -433400 -115027 61247 63360 -36938 -158200 -254310 -297227 -300218 -359804
32103 -359804 -556897 -790066 -855238 -745837 -692432 -803807 -876838 -734687 -548881 -568743
32093 -568743 -681912 -560868 -188749 79979 10487 -235976 -388087 -395261 -366748 -359220 -358235
$$ packed form
32165d51317j28453J1464N2837n7816p0723J21039K53751J20811r7184j60497
32155d06088j30730j54690j59687l9516Q1530N0379l3396n862N6656n603j12808
32144h59815o4662J07410J82687J01408J9904K1127k462j33468k70450k60197
32134a158518r5793Q1595J48464J29828J41803K01377J71676j9574j95203j32404
32124g26749R4861J98903J09741O7303K03466K91046Q1039k97642m79988l07176
32114g65196M0759K91037L18373J76274K113j00298j21262r6110m2917k991n9586
32103c59804j97093k33169o5172J09401N3405j11375p3031J42151J85806j9862
32093e68743j13169J21044L72119K68728o9492k46463j52111p174K8513P528R85
$$ plain form
32082 -358235 -377005 -465187 -639984 -842700 -961843 -934819 -844643 -834459 -890328 -837682 -625352
32071 -625352 -445543 -441666 -474566 -368118 -225589 -264835 -460165 -598008 -599858 -553183 -510473
32060 -510473 -488419 -555174 -672288 -598668 -259060 -49754 -378680 -1002009 -1265138 -966031
32050 -966031 -512068 -222014 -6061 161021 16926 -474828 -862618 -802748 -565177 -604073
32040 -604073 -912849 -1145192 -1139352 -983981 -750027 -486557 -348953 -431755 -567651 -539917
32030 -539917 -397804 -340795 -401942 -471406 -532178 -648611 -800539 -925297 -1042206 -1159812
32020 -1159812 -1162516 -973040 -725312 -593128 -550463 -480511 -403805 -399470 -414077 -364448 -334033
32009 -334033 -448135 -634617 -722239 -702421 -686394 -687568 -670832 -730634 -954375 -1157203 -1041645
$$ packed form
32082c58235j8770q8182j74797k02716j19143K7024R0176J0184n5869N2646K12330
32071f25352J79809L877l2900J06448J42529l9246j95330j37843j850M6675M2710
32060e10473K2054o6755j17114P3620L39608K09306l28926o23329k63129K99107
32050i66031M53963K90054K15953J67082j44095m91754l87790N9870K37571l8896
32040f04073l08776k32343N840J55371K33954K63470J37604q2802j35896K7734
32030e39917J42113N7009o1147o9464o0772j16433j51928j24758j16909j17606
32020a159812k704J89476K47728J32184M2665O9952P6706M335j4607M9629L0415
32009c34033j14102j86482q7622J9818J6027j174J6736n9802k23741k02828J15558
$$ plain form
31998 -1041645 -641074 -342086 -399187 -643033 -754764 -649670 -484934 -419052 -476903 -588318
31988 -588318 -675241 -710352 -714580 -704429 -677644 -660672 -700946 -783915 -844795 -895813 -1022060
31977 -1022060 -1193875 -1226519 -1023138 -725547 -517773 -412946 -340461 -287048 -223732 -67612
31967 -67612 126670 127855 -120985 -309134 -173735 65145 -1128 -361737 -618658 -570963
31957 -570963 -416955 -363932 -364769 -309389 -205385 -88309 25904 46791 -115333 -340439 -393056
31946 -393056 -273961 -245049 -437235 -664209 -716942 -628945 -538936 -477832 -413622 -362314 -351534
31935 -351534 -384006 -482605 -640212 -714864 -560195 -285990 -174100 -286747 -394344 -364816
31925 -364816 -355161 -482574 -579087 -487940 -380363 -509627 -794181 -919951 -783758 -584398
$$ packed form
31998a041645M00571K98988n7101k43846j11731J05094J64736O5882n7851j11415
31988e88318q6923l5111m228J0151K6785J6972m0274q2969o0880n1018j26247
31977a022060j71815l2644K03381K97591K07774J04827P2485N3413O3316J56120
31967f7612J94282J185k48840j88149J35399K38880o6273l60609k56921M7695
31957e70963J54008N3023q37N5380J04004J17076J14213K0887j62124k25106n2617
31946c93056J19095K8912j92186k26974n2733Q7997R0009O1104O4210N1308J0780
31935c51534l2472r8599j57607p4652J54669K74205J11890j12647j07597K9528
31925c64816R655j27413r6513R1147J07577j29264k84554j25770J36193J99360
$$ plain form
31915 -584398 -504476 -535210 -628026 -803789 -1035351 -1168941 -1066721 -774732 -489406 -371354
31905 -371354 -409053 -462234 -443039 -432724 -568645 -833182 -1049537 -1101956 -1051022 -990465 -910887
31894 -910887 -782243 -660736 -610045 -603388 -611051 -699276 -907511 -1092143 -1058606 -841715 -697253
31883 -697253 -772838 -915104 -881947 -658090 -451994 -406141 -423416 -330078 -137778 -37501
31873 -37501 -129838 -276327 -298771 -245482 -327020 -605982 -893346 -993818 -934581 -871977 -856342
31862 -856342 -794749 -621408 -416933 -335463 -440660 -624063 -691353 -550040 -308124 -157369
31852 -157369 -167667 -242034 -267088 -237782 -209803 -194936 -162629 -121327 -139297 -260811 -421063
31841 -421063 -486274 -406633 -296816 -300864 -393743 -415339 -314325 -232834 -291859 -423483 -511982
$$ packed form
31915e84398P9922l0734r2816j75763k31562j33590J02220K91989K85326J18052
31905c71354l7699n3181J9195J0315j35921k64537k16355n2419N0934O0557P9578
31894i10887J28644J21507N0691O657p663q8225k08235j84632L3537K16891J44462
31883f97253p5585j42266L3157K23857K06096M5853j7275R3338J92300J00277
31873c7501r2337j46489k2444N3289q1538k78962k87364j00472N9237O2604J5635
31862h56342O1593J73341K04475Q1470j05197j83403o7290J41313K41916J50755
31852a57369j0298p4367k5054K9306K7979J4867L2307M1302j7970j21514j60252
31841d21063o5211P9641J09817m048r2879k1596J01014Q1491n9025j31624q8499
$$ plain form
31830 -511982 -572270 -655176 -697300 -638519 -589573 -679370 -809130 -785456 -647340 -601140 -641959
31819 -641959 -532462 -218335 22088 -28688 -226985 -317893 -274804 -209989 -134933 -30658
31809 -30658 -22860 -244857 -583702 -774041 -729437 -608962 -560126 -556047 -512977 -437578 -399526
31798 -399526 -425228 -460851 -420808 -275688 -107855 -50127 -145973 -307696 -431054 -496006 -529315
31787 -529315 -535198 -505597 -445400 -355334 -243397 -167218 -189835 -278403 -336661 -351290 -392280
31776 -392280 -446977 -401105 -245334 -149098 -229740 -380856 -445870 -439526 -458926 -479982 -407773
31765 -407773 -269429 -195740 -228325 -274638 -254042 -191028 -159516 -197674 -271658 -296638 -234873
31754 -234873 -181929 -264928 -435716 -501033 -410046 -341343 -400826 -422013 -245707 -36483 -77168
$$ packed form
31830e11982o0288q2906m2124N8781M8946q9797j29760K3674J38116M6200m0819
31819f41959J09497L14127K40423n0776j98297r0908M3089O4815P5056J04275
31809c0658P798k21997l38845j90339M4604J20475M8836M079M3070P5399L8052
31798c99526k5702l5623M0043J45120J67833N7728r5846j61723j23358o4952l3309
31787e29315n883K9601O0197R0066J11937P6179k2617q8568n8258j4629m0990
31776c92280n4697M5872J55771R6236q0642j51116o5014O344j9400k1056P2209
31765d07773J38344P3689l2585m6313K0596O3014L1512l8158p3984k4980O1765
31754b34873N2944q2999j70788o5317R0987O8703n9483k1187J76306K09224m0685
$$ plain form
31743 -77168 -340401 -523892 -483330 -385249 -417007 -572200 -767775 -963202 -1086954 -1030581
31733 -1030581 -824912 -683732 -757891 -938307 -994737 -832304 -532080 -216381 29030 144000
31723 144000 103512 -50482 -224900 -332498 -341356 -296531 -287287 -353217 -428191 -422210 -345567
31712 -345567 -286945 -273183 -237880 -161016 -159181 -361031 -718684 -1013495 -1066950 -905239 -683430
31701 -683430 -479920 -242290 46056 245812 208335 -12722 -228196 -371825 -535072 -727526
31691 -727526 -790159 -639003 -436743 -391463 -501885 -627853 -693954 -676359 -508715 -198035
31681 -198035 40163 -26030 -337730 -609578 -683394 -642156 -593602 -548090 -532499 -617642 -764774
31670 -764774 -818198 -727641 -623450 -592330 -537775 -371136 -194833 -150424 -188828 -151652 -23664
$$ packed form
31743g7168k63233j83491M0562R8081l1758j55193j95575j95427j23752N6373
31733a030581K05669J41180p4159j80416n6430J62433L00224L15699K45411J14970
31723A44000m0488j53994j74418j07598q858M4825R244o5930p4974N981P6643
31712c45567N8622J3762L5303P6864J835k01850l57653k94811n3455J61711K21809
31701f83430K03510K37630K88346J99756l7477k21057k15474j43629j63247j92454
31691g27526o2633J51156K02260M5280j10422j25968o6101J7595J67644L10680
31681a98035K38198o6193l11700k71848p3816M1238M8554M5512J5591q5143j47132
31670g64774n3424R0557J04191L1120N4555J66639J76303M4409l8404L7176J27988
$$ plain form
31659 -23664 52384 -1035 -96326 -123677 -81895 -24270 37196 104422 120505 7181 -223043
31648 -223043 -450361 -562447 -545771 -449455 -320411 -217373 -216052 -304679 -323192 -138969 128122
31637 128122 208835 39912 -147616 -164599 -119794 -216349 -433642 -573146 -526788 -342543
31627 -342543 -102915 98616 130649 -42822 -238802 -239758 -77791 34212 25995 25151 82304
31616 82304 52597 -175701 -492653 -692126 -683600 -531298 -380364 -369679 -509835 -629880
31606 -629880 -564708 -406983 -425172 -694584 -966883 -979092 -754566 -506623 -363962 -304075
31596 -304075 -274312 -258022 -250525 -252944 -280842 -336748 -389993 -407261 -389511 -378743 -440349 -603298
31584 -603298 -788487 -859869 -800116 -747762 -777681 -765035 -610829 -476949 -577009 -818834
$$ packed form
31659b3664P6048n3419r5291k7351M1782N7625O1466O7226J6083j13324k30224
31648b23043k27318j12086J6676R6316J29044J03038J321q8627j8513J84223K67091
31637A28122Q0713j68923j87528j6983M4805r6555k17293j39504M6358J84245
31627c42543K39628K01531L2033j73471j95980r56J61967J12003q217q44N7153
31616H2304k9707k28298l16952j99473Q526J52302J50934J0685j40156j20045
31606f29880O5172J57725j8189k69412k72299j2209K24526K47943J42661N9887
31596c04075K9763J6290P497k419k7898n5906n3245j7268J7750J0768o1606j62949
31584f03298j85189p1382N9753N2354k9919J2646J54206J33880j00060k41825
$$ plain form
31574 -818834 -922929 -858441 -854397 -956326 -912988 -619723 -348841 -338631 -428342 -359793 -223092
31563 -223092 -288220 -519193 -588130 -358980 -72026 11116 -75715 -141281 -133427 -158981 -267750
31552 -267750 -346351 -268890 -95176 -27434 -145747 -288776 -295912 -274861 -450108 -786756 -994090
31541 -994090 -935811 -801373 -780093 -797321 -721052 -619206 -611004 -625919 -535569 -409854 -410052
31530 -410052 -499501 -487239 -325530 -157525 -82965 -68673 -92534 -189614 -325924 -390101 -359560
31519 -359560 -343973 -411433 -476813 -419542 -244427 -85369 -86245 -279983 -546397 -705434 -689548
31508 -689548 -592416 -521477 -477947 -436800 -446216 -545081 -656465 -673872 -595858 -482313 -359755
31497 -359755 -276782 -343245 -556335 -685039 -527723 -224467 -97919 -217839 -359228 -391552
$$ packed form
31574h18834j04095O4488M044j01929M3338K93265K70882J0210q9711O8549J36701
31563b23092o5128k30973o8937K29150K86954Q3142q6831o5566P854k5554j08769
31552b67750p8601P7461J73714O7742j18313j43029p136K1051j75247l36648k07334
31541i94090N8279J34438K1280j7228P6269J01846Q202j4915R0350J25715j98
31530d10052q9449J2262J61709J68005P4560J4292k3861r7080j36310o4177L0541
31519c59560J5587o7460o5380N7271J75115J59058q76j93738k66414j59037J5886
31508f89548R7132P0939M3530M1147r416r8865j11384j7407P8014J13545J22558
31497c59755Q2973o6463k13090j28704J57316L03256J26548j19920j41389l2324
$$ plain form
31487 -391552 -443173 -606010 -731475 -673607 -546670 -549693 -646094 -611601 -366286 -99099 -39032
31476 -39032 -196788 -367618 -351187 -151432 33775 24150 -155339 -327326 -381491 -379620 -440795
31465 -440795 -588482 -733417 -762473 -634816 -434712 -326059 -397643 -557150 -642519 -625653
31455 -625653 -613095 -643456 -611657 -455024 -303183 -329395 -503557 -608819 -503694 -277529
31445 -277529 -125205 -142722 -287097 -473709 -637650 -725092 -714355 -664795 -668156 -712780 -671422
31434 -671422 -484795 -280597 -217869 -280745 -345527 -387827 -459036 -497362 -374911 -151610 -57309
31423 -57309 -150928 -221432 -137574 -61957 -145501 -233879 -125780 50424 19908 -177225 -228992
31412 -228992 -35270 161673 171776 91115 40134 -70983 -342447 -630222 -691050 -499963
$$ packed form
31487c91552n1621j62837j25465N7868J26937l023r6401L4493K45315K67187O0067
31476c9032j57756j70830J6431J99755J85207r625j79489j71987n4165J871o1175
31465d40795j47687j44935k9056J27657K00104J08653p1584j59507q5369J6866
31455f25653J2558l0361L1799J56633J51841k6212j74162j05262J05125K26165
31445b77529J52324j7517j44375j86612j63941q7442J0737M9560l361m4624M1358
31434f71422J86627K04198O2728o2876o4782m2300p1209l8326J22451K23301R4301
31423e7309r3619p0504Q3858P5617q3544q8378J08099J76204l0516j97133n1767
31412b28992J93722J96943J0103q0661n0981j11117k71464k87775o0828J91087
$$ plain form
31402 -499963 -259797 -127167 -62481 36418 149953 150355 -13556 -204917 -236887 -114664 -45715
31391 -45715 -169658 -381111 -499607 -514834 -548082 -649414 -761671 -825453 -797332 -629842
31381 -629842 -361876 -154748 -97667 -61957 91577 260491 256922 121899 40442 14645 -98335
31370 -98335 -260896 -281900 -182465 -209713 -419936 -569062 -529040 -499650 -644038 -800044 -757924
31359 -757924 -584325 -454359 -371578 -277977 -253732 -369758 -498429 -507896 -506853 -654738 -849698
31348 -849698 -859434 -672421 -468501 -313745 -144991 -10592 -48389 -210721 -264556 -123623
31338 -123623 27103 11531 -104837 -147110 -66126 41907 63824 -43650 -234588 -404446
31328 -404446 -479365 -474992 -431785 -340289 -203513 -111883 -137241 -186008 -92509 139506 309779
$$ packed form
31402d99963K40166J32630O4686R8899J13535M02j63911j91361l1970J22223O8949
31391d5715j23943k11453j18496j5227l3248j01332j12257o3782K8121J67490
31381f29842K67966K07128N7081L5710J53534J68914l569j35023q1457k5797j12980
31370i8335j62561k1004R9435k7248k10223j49126M0022K9390j44388j56006M2120
31359g57924J73599J29966Q2781R3601K4245j16026j28671r467J043j47885j94960
31348h49698r736J87013K03920J54756J68754J34399l7797j62332n3835J40933
31338a23623J50726j5572j16368m2273Q0984J08033K1917j07474j90938j69858
31328d04446p4919M373M3207R1496J36776R1630k5358m8767R3499K32015J70273
$$ plain form
31317 309779 258361 37098 -170775 -222036 -101201 77521 145659 32959 -147181 -226533
31307 -226533 -184669 -148317 -200872 -282917 -295772 -232912 -187262 -262961 -467063 -656378 -642143
31296 -642143 -410549 -180768 -154430 -268551 -321196 -290228 -348532 -550097 -693726 -600760
31286 -600760 -391181 -333198 -476170 -587537 -469863 -208330 -25211 16858 26127 26121 -114153
31275 -114153 -402353 -560286 -354356 11810 112482 -104667 -254077 -128089 -33809 -282109
31265 -282109 -623600 -553836 -46753 389757 376930 54343 -242518 -392659 -454703 -457423
31255 -457423 -398778 -327742 -291293 -271562 -252022 -266281 -318636 -334016 -244960 -71684 108264
31244 108264 205811 143286 -65118 -253588 -248534 -94159 -10902 -100506 -224692 -221742 -110099
$$ packed form
31317C09779n1418k21263k07873n1261J20835J78722O8138j12700j80140p9352
31307b26533M1864L6352n2555q2045j2855O2860M5650p5699k04102j89315J4235
31296f42143K31594K29781K6338j14121n2645L0968n8304k01565j43629R2966
31286f00760K09579N7983j42972j11367J17674K61533J83119M2069R269oj40274
31275a14153k88200j57933K05930L66166J00672k17149j49410J25988R4280k48300
31265b82109l41491O9764N07083M36510j2827l22587k96861j50141o2044k720
31255d57423N8645P1036L6449J9731J9540j4259n2355j5380Q9056J73276J79948
31244A08264R7547o2525k08404j88470N054J54375Q3257q9604j24186K950J11643
$$ plain form
31233 -110099 -12839 -1384 -83417 -230476 -345365 -318797 -199903 -191965 -378189 -563064 -510937
31222 -510937 -256761 -46487 -28509 -139185 -259465 -347747 -411103 -454024 -488022 -529809 -567785
31211 -567785 -563589 -489118 -344221 -161560 -16467 8231 -92377 -224169 -292656 -296096 -299008
31200 -299008 -352990 -463375 -582140 -613447 -495875 -312962 -243107 -348200 -489504 -512829
31190 -512829 -432517 -356182 -320676 -312508 -367821 -504081 -594820 -471472 -154475 149075 286092
31179 286092 265996 123771 -156774 -513614 -749456 -728765 -553390 -436161 -457100 -536640
31169 -536640 -587904 -584801 -523253 -435943 -425103 -559325 -740397 -793699 -701511 -619550 -634999
31158 -634999 -649919 -567515 -451225 -392153 -341848 -219888 -97447 -107476 -220836 -278715 -228223
$$ packed form
31233a10099R7260J1455q2033j47059j14889K6568J18894P938j86224j84875N2127
31222e10937K54176K10274J7978j10676j20280q8282o3356m2921l3998m1787l7976
31211e67785M196P4471J44897J82661J45093K4698j00608j31792o8487l440k912
31200b99008n3982j10385j18765l1307J17572J82913O9855j05093j41304k3325
31190e12829Q0312P6335L5506Q168n5313j36260r0739J23348L16997L03550J37017
31179B86092k0096j42225k80545l56840k35842K0691J75375J17229k0939p9540
31169e36640n1264L103O1548Q7310J0840j34222j81072n3302R2188Q1961j5449
31158f34999j4920Q2404J16290N9072N0305J21960J22441j0029j13360n7879N0492
$$ plain form
31147 -228223 -166293 -157913 -174964 -217371 -314958 -386882 -297348 -106381 -56442 -213756 -334807
31136 -334807 -233667 -78180 -117277 -282452 -317840 -204576 -175098 -327431 -486152 -487150 -388539
31125 -388539 -333494 -368837 -462568 -564305 -593875 -491357 -325941 -245973 -284733 -322235 -268998
31114 -268998 -180162 -158881 -247371 -429433 -635268 -739625 -675508 -551094 -521756 -555429 -490394
31103 -490394 -324198 -236332 -283165 -298514 -189605 -104949 -163155 -222568 -118310 32467 -7908
31092 -7908 -227701 -383062 -340799 -201549 -94557 -33547 3991 7225 -12002 6852 103162
31081 103162 248181 365011 359771 180553 -97883 -310442 -391670 -451585 -577445 -663641
31071 -663641 -574419 -385080 -282480 -277768 -216811 -66703 12573 -78056 -232079 -313981 -329777
$$ packed form
31147b28223O1930Q380j7051m2407r7587p1924Q9534J90967M9939j57314j21051
31136c34807J01140J55487l9097j65175l5388J13264K9478j52333j58721r98R8611
31125c88539N5045l5343r3731j01737k9570J02518J65416P9968l8760l7502N3237
31114b68998Q8836K1281q8490j82062k05835j04357O4117J24414K9338l3673O5035
31103d90394J66196Q7866m6833j5349J08909Q4656n8206n9413J04258J50777m0375
31092g908k19793j55361M2263J39250J06992O1010L7538L234j9227J8854R6310
31081A03162J45019J16830n240j79218k78436k12559q1228n9915j25860q6196
31071f63641Q9222J89339J02600M712O0957J50108P9276r0629j54023q1902j5796
$$ plain form
31060 -329777 -346262 -373328 -408142 -478585 -561302 -569531 -504508 -495005 -582322 -597891 -406255 -162414
31048 -162414 -136024 -342826 -562743 -696947 -856090 -1048066 -1053278 -776939 -506488 -563964
31038 -563964 -824270 -868005 -582682 -312199 -345164 -536570 -590687 -487752 -406953 -381731
31028 -381731 -291486 -131541 -50274 -123898 -292809 -518149 -800366 -1026283 -1010021 -752910
31018 -752910 -487923 -391462 -402581 -389472 -328774 -240222 -114236 -11040 -71657 -303260 -496372
31007 -496372 -490242 -385096 -347084 -343507 -250149 -99576 -13528 27544 129195 249365 241512
30996 241512 110626 6020 -49104 -195612 -451286 -595048 -448977 -131022 87150 77244
30986 77244 -81203 -247155 -335947 -347809 -357030 -439371 -564113 -601141 -475571 -269461 -128024
$$ packed form
31060c29777j6485k7066l4814p0443q2717q229O5023R503q7317j5569J91636K43841
31048a62414K6390k06802k19917j34204j59143j91976n212K76339K70451n7476
31038e63964k60306m3735K85323K70483l2965j91406n4117J02935Q0799K5222
31028c81731R0245J59945Q1267p3624j68911k25340k82217k25917J6262K57111
31018g52910K64987R6461j1119J3109O0698Q8552J25986J03196o0617k31603j93112
31007d96372O130J05146L8012L577R3358J50573Q6048M1072J01651J20170p853
30996B41512j30886j04606n5124j46508k55674j43762J46071L17955K18172r906
30986G7244j58447j65952q8792j1862r221q2341j24742l7028J25570K06110J41437
$$ plain form
30975 -128024 -104471 -137010 -144744 -105070 -55291 -50800 -120721 -256248 -436834 -638278 -794079
30964 -794079 -795760 -598009 -311606 -131479 -168159 -382393 -655279 -863390 -918559 -829501
30954 -829501 -729401 -755058 -873487 -900997 -728134 -464889 -318259 -364088 -482446 -501503
$$ packed form
30975a28024K3553l2539p734L9674M9779M491o9921j35527j80586k01444j55801
30964g94079j681J97751K86403J80127l6680k14234k72886k08111n5169Q9058
30954h29501J00100k5657j18429k7510J72863K63245J46630m5829j18358j9057
$$ [...]
##END NTUPLES=NMR SPECTRUM
##END=
