##TITLE=31Pdec_LY-TMF-3.5.R.t
 D2O, 24 sc
 27.2.2020
##JCAMPDX= 6.0         $$ Bruker NMR JCAMP-DX V2.0
##DATA TYPE= NMR SPECTRUM
##DATA CLASS= NTUPLES
##ORIGIN= UXNMR, Bruker Analytische Messtechnik GmbH
##OWNER= root
$$ XWIN-NMR		Version 3.5
$$ Thu Feb 27 13:57:20 2020 Russian Standard Time (UT+4h)  she@DPX200
##.OBSERVE FREQUENCY= 81.013821
##.OBSERVE NUCLEUS= ^31P
##.ACQUISITION MODE= SIMULTANEOUS
##.ACQUISITION SCHEME= undefined
##.AVERAGES= 24
##.DIGITISER RES= 17
##SPECTROMETER/DATA SYSTEM= spect
##.PULSE SEQUENCE= zgpg30
##.SOLVENT NAME= CDCl3
##.SHIFT REFERENCE= (INTERNAL, CDCl3, 0, 182.463)
##AUDIT TRAIL= $$ (NUMBER, WHEN, WHO, WHERE, WHAT)
$$ ##TITLE= Audit trail, XWIN-NMR		Version 3.5
$$ ##JCAMPDX= 5.01
$$ ##ORIGIN= Bruker BioSpin GmbH
$$ ##OWNER= she
$$ F:/spectra/data/she/nmr/P31/1/pdata/1/auditp.txt
$$ ##AUDIT TRAIL=  $$ (NUMBER, WHEN, WHO, WHERE, WHAT)
(   1,<2020-02-27 13:55:53.87 +0400>,<she>,<DPX200>,
      <created by zg, POWCHK disabled, PULCHK disabled
       configuration hash MD5:
       00 E9 B6 7A A2 85 ED C7 34 08 36 98 17 FE 4E 26
       data hash MD5: 32K
       2F F9 E9 14 29 F5 5E 38 1A 92 48 C2 EF 1B ED A9>)
(   2,<2020-02-27 13:56:07.23 +0400>,<she>,<DPX200>,
      <Start of raw data processing
       efp BC_mod = 2 LB = 1 FT_mod = 6 PKNL = 1 PHC0 = -1518.573 PHC1 = 112.2013 SI = 64K 
       data hash MD5: 64K
       7D 64 22 60 0D F3 DC AE 3F 17 91 9A C4 5E 28 7F>)
(   3,<2020-02-27 13:56:22.39 +0400>,<she>,<DPX200>,
      <pk PHC0 = -2.529552 PHC1 = 0 
       data hash MD5: 64K
       49 26 2B AC 26 34 BA C4 C9 68 93 05 DD 16 30 C2>)
$$ ##END=
$$ 
$$ hash MD5
$$ 26 AD FB 6E A5 24 72 02 FF 94 9C 73 C0 DA 60 69
##$RELAX= 
##$RELAX= 
##$RELAX= 
##$RELAX= 
##$RELAX= 
##$RELAX= 
##$RELAX= 
##$RELAX= 
$$ Bruker specific parameters
$$ --------------------------
##$DU= <F:/spectra>
##$EXPNO= 1
##$NAME= <P31>
##$PROCNO= 1
##$TYPE= <nmr>
##$USER= <she>
##$AMP= (0..31)
100 100 100 100 100 100 100 100 100 100 100 100 100 100 100 100 100 100 
100 100 100 100 100 100 100 100 100 100 100 100 100 100 
##$AQSEQ= 0
##$AQ_mod= 1
##$AUNM= <au_zg>
##$AUTOPOS= <>
##$BF1= 81.014009
##$BF2= 200.13
##$BF3= 200.13
##$BF4= 200.13
##$BF5= 200.13
##$BF6= 200.13
##$BF7= 200.13
##$BF8= 200.13
##$BYTORDA= 1
##$CFDGTYP= 0
##$CFRGTYP= 5
##$CHEMSTR= <none>
##$CNST= (0..31)
1 1 145 1 1 1 1 1 1 1 1 1 1 1 1 1 1 1 1 1 1 1 1 1 1 1 1 1 1 1 1 1 
##$CPDPRG= <waltz16>
##$CPDPRG1= <>
##$CPDPRG2= <waltz16>
##$CPDPRG3= <>
##$CPDPRG4= <mlev>
##$CPDPRG5= <mlev>
##$CPDPRG6= <mlev>
##$CPDPRG7= <mlev>
##$CPDPRG8= <mlev>
##$CPDPRGB= <>
##$CPDPRGT= <>
##$D= (0..31)
0 1 0 0 0 0 0 0 0 0 0 0.03 2e-05 3e-06 0 0 0 0 0 0 0 0 0 0 0 0 0 0 0 0 
0 0 
##$DATE= 1582797353
##$DBL= (0..7)
120 120 120 11 120 120 24 19 
##$DBP= (0..7)
150 150 150 150 150 150 150 150 
##$DBP07= 0
##$DBPNAM0= <>
##$DBPNAM1= <>
##$DBPNAM2= <>
##$DBPNAM3= <>
##$DBPNAM4= <>
##$DBPNAM5= <>
##$DBPNAM6= <>
##$DBPNAM7= <>
##$DBPOAL= (0..7)
0.5 0.5 0.5 0.5 0.5 0.5 0.5 0.5 
##$DBPOFFS= (0..7)
$$ [...]
##$SUBNAM2= <"">
##$SUBNAM3= <"">
##$SUBNAM4= <"">
##$SUBNAM5= <"">
##$SUBNAM6= <"">
##$SUBNAM7= <"">
##$SUBNAM8= <"">
##$SUBNAM9= <"">
##$SW= 369.568048894756
##$SWIBOX= (0..15)
0 1 3 0 0 0 0 0 0 0 0 0 0 0 0 0 
##$SW_h= 29940.119760479
##$TD= 32768
##$TD0= 1
##$TE= 0
##$TE2= 300
##$TE3= 300
##$TEG= 300
##$TL= (0..7)
0 120 53 12 22 120 120 120 
##$TP= (0..7)
150 150 150 150 150 150 150 150 
##$TP07= 0
##$TPNAME0= <>
##$TPNAME1= <>
##$TPNAME2= <>
##$TPNAME3= <>
##$TPNAME4= <>
##$TPNAME5= <>
##$TPNAME6= <>
##$TPNAME7= <>
##$TPOAL= (0..7)
0.5 0.5 0.5 0.5 0.5 0.5 0.5 0.5 
##$TPOFFS= (0..7)
0 0 0 0 0 0 0 0 
##$TUNHIN= 0
##$TUNHOUT= 0
##$TUNXOUT= 0
##$USERA1= <user>
##$USERA2= <user>
##$USERA3= <user>
##$USERA4= <user>
##$USERA5= <user>
##$V9= 5
##$VALIST= <valist>
##$VCLIST= <CCCCCCCCCCCCCCC>
##$VD= 0
##$VDLIST= <DDDDDDDDDDDDDDD>
##$VPLIST= <PPPPPPPPPPPPPPP>
##$VTLIST= <TTTTTTTTTTTTTTT>
##$WBST= 1024
##$WBSW= 4
##$XGAIN= (0..3)
0 0 0 0 
##$XL= 0
##$YL= 0
##$YMAX_a= 1836
##$YMIN_a= -1785
##$ZGOPTNS= <>
##$ZL1= 120
##$ZL2= 120
##$ZL3= 120
##$ZL4= 120
##$ABSF1= 0
##$ABSF2= 0
##$ABSG= 0
##$ABSL= 0
##$ALPHA= 0
##$AQORDER= 0
##$ASSFAC= 0
##$ASSFACI= 0
##$ASSFACX= 0
##$ASSWID= 0
##$AUNMP= <proc_1d>
##$AZFE= 0.1
##$AZFW= 0.5
##$BCFW= 0
##$BC_mod= 2
##$BYTORDP= 0
##$COROFFS= 0
##$CY= -3
##$DATMOD= 1
##$DC= 0
##$DFILT= <>
##$DTYPP= 0
##$F1P= 0
##$F2P= 0
##$FCOR= 1
##$FTSIZE= 65536
##$FT_mod= 6
##$GAMMA= 0
##$GB= 0
##$INTBC= 1
##$INTSCL= 5.30512e-09
##$ISEN= 30
##$LB= 1
##$LEV0= 0
##$LPBIN= 0
##$MAXI= 10000
##$MC2= 0
##$MEAN= 0
##$ME_mod= 0
##$MI= 50
##$NCOEF= 0
##$NC_proc= -7
##$NLEV= 6
##$NOISF1= 182.463
##$NOISF2= 159.3651
##$NSP= 0
##$NTH_PI= 0
##$NZP= 0
##$OFFSET= 182.463
##$PC= 4
##$PHC0= -1521.103
##$PHC1= 112.2013
##$PH_mod= 1
##$PKNL= yes
##$PPARMOD= 0
##$PSCAL= 0
##$PSIGN= 0
##$REVERSE= no
##$SF= 81.0140089999434
##$SI= 65536
##$SIGF1= 159.3651
##$SIGF2= -187.1042
##$SINO= 113.3802
##$SIOLD= 16384
##$SREGLST= <1H.CDCl3>
##$SSB= 0
##$STSI= 65536
##$STSR= 0
##$SW_p= 29940.119760479
##$SYMM= 0
##$S_DEV= 0
##$TDeff= 32768
##$TDoff= 0
##$TI= <>
##$TILT= no
##$TM1= 0
##$TM2= 0
##$TOPLEV= 0
##$USERP1= <user>
##$USERP2= <user>
##$USERP3= <user>
##$USERP4= <user>
##$USERP5= <user>
##$WDW= 1
##$XDIM= 65536
##$YMAX_p= 447151298
##$YMIN_p= -13854852
$$ End of Bruker specific parameters
$$ ---------------------------------
##NTUPLES= NMR SPECTRUM
##VAR_NAME=  FREQUENCY,     SPECTRUM/REAL,   SPECTRUM/IMAG
##SYMBOL=    X,             R,               I
##VAR_TYPE=  INDEPENDENT,   DEPENDENT,       DEPENDENT
##VAR_FORM=  AFFN,          ASDF,            ASDF
##VAR_DIM=   65536,         65536,           65536
##UNITS=     HZ,            ARBITRARY UNITS, ARBITRARY UNITS
##FACTOR=    0.456856943014862, 1,           1
##FIRST=     14782.0589164792, 0,            0
##LAST=      -15158.0608439998, 0,           0
##MIN=       -15158.0608439998, -13854852,   0
##MAX=       14782.0589164792, 447151298,    0
$$ Real data points
##PAGE= N=1
##DATA TABLE= (X++(R..R)), XYDATA
$$ [...]
36992a04725R9199k18835p7345L20278L12371j08026k62775O7940K84015Q665
36982C20762k69068n0807L05866J81247k88881m46449j17049K41899K99448J95991
36972C72959J20830L1211j04799j57321o6280K7680m447j10502j60893q7397Q7223
36961e1736K29367J49771j60771m12826l33828m8919Q1151l2110j22565r445J57706
36950e54205J80270R6050N4743R2873J61451K26083K25642Q3379j22820j64093
36940B79373J8570J59630K6736k10367k12695K2645J74537Q5789o2546j03862
36930A77810j08459j43141j01077M4513P6404j29579l13177j66710J92866M03865
36920f6685L88492L47267L09908J08824j93182k87176j33590p5349k62810l67441
$$ plain form
36992 -104725 -5526 -224361 -301706 18572 330943 222917 -39858 28082 312097 320762
36982 320762 51694 887 306753 488000 199119 -247330 -364379 -122480 176968 372959
36972 372959 493789 525000 420201 262880 196600 224280 219833 109331 -51562 -138959 -51736
36961 -51736 177631 327402 166631 -246195 -580023 -628942 -547791 -579901 -702466 -711911 -554205
36950 -554205 -373935 -277885 -223142 -130269 31182 257265 482907 566286 443466 279373
36940 279373 297943 457573 484309 273942 61247 83892 258429 344218 281672 177810
36930 177810 69351 -73790 -174867 -130354 -53950 -183529 -496706 -663416 -470550 -66685
36920 -66685 321807 669074 978982 1087806 894624 607448 473858 398509 135699 -231742
36910b31742j20431K25808K94200J42992P2090J06701N7124p4200j26885j13079
36900B32578j58897k03868j00837N9934O7417l3224k5292P3566N5511n9281l7706
36889a30099J17516J27510q4003k41523j57278J3880Q5042R3751J04730L7824
36879c2650j41341k81286k38053l6575K24885M30981M01583P2720k46446j46620
36869G198K66617M12123L8346m06237m36577j77138k3320q20J14310K65874J82520
36858B42896j00001k10659J4908K91523K79309j1556l14409m37898l89388k57195
36848h92470q4878J21426L05803L57923K46254Q9912l95q2596k36380l35375j97606
36837g08382O9644J61621M5022K3671K31958L78551J90371j46171k36137p572
$$ plain form
36910 -231742 -352173 -126365 167835 310827 382917 489618 546742 472542 345657 232578
36900 232578 73681 -130187 -231024 -171090 -103673 -136897 -162189 -88623 -33112 -92393 -130099
36889 -130099 -12583 114927 30924 -210599 -367877 -353997 -268955 -175204 -70474 -32650
36879 -32650 -173991 -455277 -693330 -729905 -505020 -74039 327544 400264 153818 7198
36869 7198 273815 685938 724284 318047 -118530 -295668 -318988 -319808 -205498 60376 242896
36858 242896 142895 -67764 -52856 238667 517976 506420 192011 -245887 -635275 -892470
36848 -892470 -977348 -855922 -550119 -192196 54058 143970 143575 60979 -175401 -510776 -708382
36837 -708382 -638738 -477117 -432095 -408424 -176466 202085 392456 246285 10148 2576
36827B576K35030K03987p8709l20671k30544J48767L91906J70325k58646l53284
36817h9263p3236O7600j64171l41617r7434K69173L17885J84246K51883M12651
36807G37717K46883k08666m56458k84098q419O7843O78o7572j31388j69385j00031
36796c72896R934j6641j37452q4118K12644M54580L66596N4291j59384j16360
36786B11194N8291J38788N1421l0144R5957L14392K55556j63573n04080l66503
36776F1299L5262K05233Q3919J0947R1042Q8810n6611j08099l810M328j75654
36765B36666k80345j42268M4174R8644J32382K29698K02129o4439l10384k51107
36755a04850l626J18371N3699k7193l5322r90P3677J68761J67426L0798o8942
$$ plain form
36827 2576 237606 441593 362884 42213 -188331 -39564 352342 522667 264021 -89263
36817 -89263 -162499 -94899 -259070 -600687 -698121 -428948 -111063 73183 325066 737717
36807 737717 984600 775934 319476 35378 26959 94802 95480 27908 -103480 -272865 -372896
36796 -372896 -362962 -379603 -517055 -601173 -388529 66051 432647 486938 327554 211194
36786 211194 269485 408273 459694 429550 525507 839899 1095455 931882 427802 61299
36776 61299 96561 301794 385713 396660 487702 576512 519901 411802 407992 412320 236666
36765 236666 -43679 -185947 -141773 -43129 89253 318951 521080 456641 146257 -104850
36755 -104850 -108476 9895 63594 36401 1079 89 73766 242527 409953 440751 371809
36744C71809K501Q5474m9961l22426m21297k17946J16752L66125M40702L25910
36734F97643N9919k10987l07098j92846m100J05418Q9626J0884k8320J3372N3505
36723B87016j4557j45051j69473l3563J26007J86942J70463J06239m4058k23538
36713B46427k35540j6037K18971K63915J93721J61414J11231o3048k32345j99558
36703D49151n1686m0304j73946k43137k10397k25698k47672m3495L33565M66296
36693A2677J83651j07899q017K54447J81130j96101l44726m0929L08165K80907
36683E23305k514j66241j26429o0369k7296M7096R8922l0083k75243l68086k24644
36672f11582n3756k137M4377J79586K57033J50211K1170Q3855K48018K56427P3162
$$ plain form
36744 371809 374310 459784 409823 87397 -333900 -551846 -435094 -68969 371733 697643
36734 697643 757562 546575 239477 46631 42531 147949 237575 248459 220139 233511 287016
36723 287016 272459 127408 -42065 -75628 50379 237321 407784 514023 469965 246427
36713 246427 10887 -5150 213821 477736 671457 832871 944102 881054 648709 449151
36703 449151 397465 357161 183215 -59922 -270319 -496017 -743689 -787184 -453619 12677
36693 12677 196328 88429 80412 334859 515989 319888 -24838 -65767 242398 523305
36683 523305 520791 354550 228121 167752 140456 187552 286474 256391 -18852 -386938 -611582
36672 -611582 -665338 -667475 -623098 -443512 -186479 -36268 -15098 68757 316775 573202 646364
36661F46364j22699k45576l23902k73517J6015L50629L37800n5171l55379j89756
36651b15192K08389L38262J00061j54675j56547j4575M8216J6664K0423Q5785
36641B76811J03942K1200o5560n3792K109l0898j51484k15119j61986j07313j21386
36630e03476p4732J37926L45816L00538O8431k4446J47536L37636K76926o21k61716
36619G49818l34954j94699N5155K02487Q5288j88167l18718j85544J9807R9868
36609i659J04000J56454K12959J60408L4809l2909q720N1033J23212J95299J83464
36598A170350J8758k09931l14847k10447M662J44269Q3611j31019k94352k36702
36588B4352k4141J29242J50281J62684K29435K27893P3743j00831j25501k6690
$$ plain form
36661 646364 523665 278089 -45813 -319330 -303315 47314 385114 329943 -25436 -215192
36651 -215192 -6803 331459 431520 276845 120298 105723 153939 170603 191026 276811
36641 276811 380753 401953 336393 282601 284710 253812 102328 -112791 -274777 -382090 -503476
36630 -503476 -578208 -440282 -94466 206072 274503 250057 397593 735229 1012155 1011534 749818
36619 749818 414864 220165 275320 477807 563095 374928 56210 -129334 -109527 -9659
36609 -9659 94341 250795 463754 624162 658971 626062 617342 668375 791587 986886 1170350
36598 1170350 1189108 979177 664330 453883 458545 602814 686425 555406 261054 24352
36588 24352 211 129453 279734 442418 671853 899746 973489 872658 747157 720467
36578G20467L7351j9980j65562k98240k82522o5120J78044J81063m4738j83588
36568E7175o7149P6811k407j88136k14693q0026L8008J24979K75520L87184K42417
36557F49683j03414l08496j83189P1902J40685m1786k57084k54303j4299K09246
36547i1055J75429q313q305K20904L10182L2072l10842l37986j55433q3731o3599
36536c20677J61684M18492K61953k23659m01027k3347L69235K77421m7819j12244
36526C60012M1317N6611l8050P3822L30133K85591j72869n75798n01394j10220
36516b50845J54919J48709O0538K3098n0710k41309m21961l78348p6336K62519
36506g69726L78479K48152R4243J00165J74553Q3523j98965l92967k41637J30316
$$ plain form
36578 720467 757818 737838 572276 274036 -8486 -73606 104438 285501 240763 57175
36568 57175 -9974 66837 64430 -123706 -338399 -418425 -380417 -255438 20082 407266 649683
36557 649683 546269 237773 54584 126486 267171 225385 -31699 -286002 -300301 -91055
36547 -91055 84374 76061 67756 288660 598842 630914 320072 -17914 -173347 -257078 -320677
36536 -320677 -158993 259499 521452 297793 -103234 -126581 242654 520075 472256 360012
36526 360012 401329 457940 419890 493712 823845 1109436 936567 360769 -140625 -250845
36516 -250845 -95926 52783 113321 136419 85709 -155600 -577561 -955909 -1032245 -769726
36506 -769726 -391247 -143095 -48852 51313 225866 309389 110424 -282543 -524180 -393864
36496c93864L17697J15544k22229k99497p0112J40282Q8505r4382j37982R76J46668
36485d08394J79331J42750J13430R8298O3049j9910j35334j94221j14089J9261
36475b55829O320j50345j66023J04741L52263K08268j69537k77515J852K44932
36465a00873J30778j47431k67000k16388j26589L2441K98912M85562M01348J62214
36455F52974J5399j4426m6566n5381L8289R7795o3818k97417k59765L3921J64146
36444B65151p6121l51629k62266J12500L79633L51857J50938p4441k61395l17667
36434h3440j60240J00594K24743J47505M9687O0263O6774o4289k34319k52584
36424a45306j34755o2325p5954k2902J47257K38556Q6765j59471k05018M569K20518
$$ plain form
36496 -393864 -76167 39377 -182852 -482349 -552461 -412179 -323674 -418056 -556038 -555062 -408394
36485 -408394 -229063 -86313 27117 125415 188464 168554 33220 -161001 -275090 -255829
36475 -255829 -249509 -399854 -565877 -461136 -108873 99395 -70142 -347657 -345805 -100873
36465 -100873 29905 -117526 -384526 -600914 -727503 -695062 -396150 89412 490760 652974
36455 652974 668373 653947 607381 552000 590289 688084 624266 326849 67084 101005 265151
36444 265151 189030 -162599 -424865 -312365 67268 419125 570063 495622 234227 -83440
36434 -83440 -243680 -143086 81657 229162 278849 339112 405886 341597 107278 -145306
36424 -145306 -280061 -342386 -418340 -441242 -293985 -55429 31336 -128135 -333153 -328584 -108066
36413a08066K08150o51j86499j72226M7712L21120M51084L55437J34668n5166
36403I95563j73581k73612l46125l04414j33104O2957J92858K59523K64597J48253
36393F92915r1481l03195l16097j43047L6174R0718O8734R1748J66438J58811
36383D51718k1801k54051l03501j09440J23565J86945J20568Q7651R2047N890
36373C79591j56878k10743p9044Q9026J50127J37850J16260M3158r4221j67249
36363B07877q7020K9375L6497r353K5124J02795J04971Q3701J71294K71165J29852
36352A066278k28637m27823k44873M8248O8407j28507j62667Q0480K91698K23185
36342E85789M7152N5082J96434J68300j09126l64266l52952j50767K3125R6656
$$ plain form
36413 -108066 100084 99433 -87066 -259292 -211580 109540 560624 916061 1050729 995563
36403 995563 821982 548370 202245 -102169 -235273 -172316 20542 280065 544662 692915
36393 692915 601434 298239 -17858 -160905 -124731 -34013 34721 126469 292907 451718
36383 451718 429917 175866 -127635 -237075 -113510 73435 194003 281654 373701 379591
36373 379591 222713 11970 -67074 21952 172079 309929 426189 469347 375126 207877
36363 207877 120857 150232 186729 177376 202500 305295 410266 493967 665261 936426 1066278
36352 1066278 837641 409818 164945 213193 281600 153093 -9574 70906 362604 585789
36342 585789 632941 688023 884457 1052757 943631 579365 226413 75646 98771 195427
36332A95427J23377J05561J2782r4706j28315j16801j36604j42570n0606M2341
36322a90114m6607k44256k35363O8020L20722K08649q2957j39784O9999J86082
36312h5609L6936j24927p7461Q409r8855k35419o3915L39637M99233K07256j57763
36301B47522j71736M3375N7986j99231l69750k29177L3507J81551K46837L08295
36291A49179K41485m2985l07520k46219O1456K56973K19825J69724K27049J83771
36281I12738j45327n61110o62267l09369K16021M91372L51722L6246p8860P2239
36271C23405J64620m4347l18273k63752N9929K07603K8101j21476K5818K20489
36261B82117J32386r3502p2718K02386L50523J54781j84246l66108l20332j78645
$$ plain form
36332 195427 318804 424365 437147 342441 214126 97325 -39279 -181849 -232455 -190114
36322 -190114 -236721 -480977 -716340 -648320 -327598 -118949 -201906 -341690 -271691 -85609
36312 -85609 -48673 -173600 -251061 -242652 -341507 -576926 -640841 -301204 198029 405285 247522
36301 247522 75786 119161 177147 -22084 -391834 -621011 -587504 -405953 -159116 149179
36291 149179 390664 347679 40159 -206060 -144604 112369 332194 501918 728967 912738
36281 912738 767411 206301 -455966 -765335 -549314 -57942 293780 330026 251166 323405
36271 323405 488025 443678 125405 -138347 -78418 129185 157286 35810 61628 282117
36261 282117 414503 321001 248283 450669 801192 955973 771727 405619 85287 -93358
36251i3358r4992j25697j65869k4009L12417N45873L86494l4939k88216j91688
36241B26016j6895p4401k97844l76445j69015J65163L84160L83529K24929N1656
36231E00853j7982J4151K4159q7767k43622k52234o8867Q6917j9074k98545m05991
36220g68002j81107J40836K69614K36837K33394K23408L6043k07830j44302K56438
36210I5329N15218K62853k40446m73519l31488j26408n9056m3151j1307m6341
36200d58316j44214j30491O5713K60155K66362J46823P9608R3501Q7169M4366
36190C10676O1902J48591J42977o5897l08807k82907M2830L21085K40225p3165
36180E37510k38932j28647L8898P4448K1959n0811j82734l32851l25910j34491
$$ plain form
36251 -93358 -188350 -314047 -479916 -503925 -191508 354365 740859 705920 417704 226016
36241 226016 209121 134720 -163124 -539569 -708584 -543421 -159261 224268 449197 500853
36231 500853 482871 497022 521181 433414 189792 -62442 -131309 -44392 -63466 -362011 -768002
36220 -768002 -949109 -808273 -538659 -301822 -68428 154980 191023 -16807 -161109 95329
36210 95329 610547 873400 632954 159435 -172053 -298461 -357517 -400668 -411975 -458316
36200 -458316 -602530 -733021 -667308 -407153 -140791 6032 85640 179141 266310 310676
36190 310676 372578 521169 664146 598249 289442 6535 49365 370450 610675 537510
36180 537510 298578 169931 208829 283277 305236 254425 71691 -261160 -587070 -721561
36170g21561K0693J1910j547R3712J16715n8679j72719M8019L88341M20229J57819
36159C02932P917J12384J78457J0629j97222k25712j44826j04653q2690l735R9833
36148d6686J84381K64406K79533R5881k37352m32631l18764q6000j3123q3239
36138c93594n6424J43962L01200J92264r5771k24818r129L07958L19580j056k42433
36127B41739j39332N6336J7911j17739k8480J82989J45339j04264j43650R8079
36117B08928J85560q6217l35818k35233j7121L62l8178J23671L06308J82229j25154
36106A69337k19536o4085L1409k5217j0952J51963K51735J59372M294q8838j48828
36095B10654j84669j25215J2667J20253J77058K11000J19430j70395l95162k02338
$$ plain form
36170 -721561 -700868 -688958 -690505 -596793 -480078 -538757 -711476 -663457 -275116 145113 302932
36159 302932 310849 423233 601690 612319 415097 189385 44559 -60094 -142784 -146519 -46686
36148 -46686 137695 402101 681634 777515 540163 107532 -211232 -297232 -310355 -393594
36138 -393594 -450018 -306056 -4856 187408 91637 -133181 -142310 165648 485228 484172 241739
36127 241739 102407 158743 176654 58915 30435 213424 358763 254499 110849 208928
36117 208928 394488 308271 -27547 -262780 -279901 -279539 -317717 -194046 112262 294491 169337
36106 169337 -50199 -114284 -82875 -108092 -119044 32919 284654 444026 448320 359482 210654
36095 210654 25985 -99230 -86563 33690 210748 421748 541178 370783 -24379 -226717
36085b26717K44251L44341q3730m62772k64188K30064L82390J26073o6346J2728
36075B36094Q7614l316l3019J21242J77114p2549l39403k52398O6394K13367J03409
36064C04549l6546j32851k76999l40797q3824L07419L09264j41035m37997j72303
36054g01120K67755L34327J28531Q0771J74627Q5147j34306j50976l4974j72472
36044a22690m83754m12054J51248N73858L94146k8208j21492J03684K56967J88914
36034E00619J7658j66396k67573j26903J83953K92214N1090j83789j27593l1733
36024A41547j64098k36662Q7904M63996L16455j94959l95074j67832l8106j66613
36014c53442q3020L72237O17958K41140k95472l48431j7068J56364N5008N61J07561
$$ plain form
36085 -226717 17534 361875 278145 -184627 -448815 -218751 163639 289712 223366 236094
36075 236094 323708 320392 287373 408615 585729 513180 173777 -78621 -12227 201140 304549
36064 304549 268003 135152 -141847 -482644 -566468 -259049 50215 -90820 -528817 -701120
36054 -701120 -433365 -99038 29493 110264 284891 370038 235732 84756 49782 -122690
36044 -122690 -606444 -1018498 -867250 -293392 100754 72546 -48946 54738 311705 500619
36034 500619 518277 351881 84308 -42595 141358 433572 484662 300873 173280 141547
36024 141547 -22551 -259213 -171309 292687 609142 414183 19109 -148723 -186829 -353442
36014 -353442 -436462 -64225 553733 794873 499401 150970 133902 290266 345274 345835 453396
36003D53396J55715L9314q9666j22796j04776n2567M4820O8498r9756k95538k16901
35992b20257J05580K68679L8922k98305l04907L7027L14546K14653j01435k26704
35982a72201k5944K13435J85909j4562m6133J68938L21602J70391j10738k06217
35972D84480j11843q4430k20104l25599k18830M3201K86855M10458L80601J81915
35962H26704j14659l13808k54587q776J56004M3234k59829m50966l05063Q7903
35952e93843L83119L08562n6796l52198k92146O4544M06771M90099L24674Q3202
35942G65988q4152j16051k0692J08049J01837j24395m14177m89361k72921J2483
35932e33392J25072P6884M4841J07457J82157J65410L6343j33961k06632q2694
$$ plain form
36003 453396 609111 648425 558759 435963 331187 278620 323440 391938 292182 -3356 -220257
35992 -220257 -114677 154002 192924 -105381 -410288 -373261 -58715 155938 54503 -172201
35982 -172201 -198145 15290 201199 186637 140504 309442 631044 801435 690697 484480
35972 484480 372637 288207 68103 -257496 -476326 -433125 -146270 264188 644789 826704
35962 826704 712045 398237 143650 134874 290878 334112 74283 -376683 -681746 -593843
35952 -593843 -210724 97838 41042 -311156 -603302 -538758 -131987 358112 682786 765988
35942 765988 681836 565785 545093 653142 754979 630584 216407 -272954 -545875 -533392
35932 -533392 -408320 -331436 -286595 -179138 3019 168429 204772 70811 -135821 -218515
35922b18515J40958K27497J03223l2059k5145k3048j90392l40433j69150K22800
35912c04264M04644K21989k7017q5775m5980l2647M7887K23388K45241l9066l46831
35901B61569l15423k2457J62008R9376n9866k14443l50702l22242J4380M36625
35891c11175N11622J93003q6604l6553J17914O2193j21282j54408j8049R2134
35881B48795J16561J38013J17416p2881l46413m04268j23716K45553L76218K26651
35871E21929J6407o2975q038P6131J15561J13827J03108Q0085P851j15504k20805
35860F27577k30032j39623k1011M2531J1076p8977j28253q3580m1347j35675k92802
35849d70116k57309L2975K75135J96104l3224n1333J31405J75840J71r0098L9508
$$ plain form
35922 -218515 -77557 149940 253163 221104 195959 172911 -17481 -357914 -527064 -304264
35912 -304264 100380 322369 295352 209577 163597 130950 178837 402225 647466 608400 261569
35901 261569 -53854 -76311 85697 185073 125207 -89236 -439938 -762180 -747800 -311175
35891 -311175 200447 393450 306846 270293 388207 450400 329118 174710 156661 248795
35881 248795 365356 503369 620785 547904 201491 -202777 -326493 -80940 295278 521929
35871 521929 538336 475361 467323 543454 659015 772842 875950 956035 963886 848382 627577
35860 627577 397545 257922 236911 279442 290518 211541 83288 -292 -41639 -177314 -470116
35849 -470116 -727425 -694450 -419315 -223211 -256435 -307768 -176363 -523 -352 -90450 -50942
35838e0942R5829r9859k17899M7731L72768K33600k35280l88005n1529K27087
35828f6499O4711j84152n6185K72139L17409P8437k2395J29325J76755q8268l76411
35817B44866l43866o6347J48100J94167J76034J29893N093j36197j54083p8758
35807A18902r1329j95316j46079J43370L48506J50632k31486k81900N7062K73489
35797A45851N9187k16696j04411K07458K27017m790J5702L70468N00672O2056
35787A262514n05148n91403k34933O0864P4282J6805O7362J48950J53856Q1166
35777E34315o8621k87247m29994l22347l4202J49869Q9524m3387j8145J60612
35767b69623K85301K01488k3478j72814j18205K5910M2935j03768k41975k44683
$$ plain form
35838 -50942 44887 -54972 -272871 -225140 147628 381228 145948 -242057 -293586 -66499
35828 -66499 -1788 -185940 -242125 30014 347423 425860 403465 532790 709545 621277 244866
35817 244866 -99000 -165347 -17247 176920 352954 482847 487940 351743 197660 118902
35807 118902 27573 -167743 -313822 -170452 178054 328686 97200 -184700 -127638 145851
35797 145851 205038 -11658 -116069 91389 318406 313616 329318 699786 1200458 1262514
35787 1262514 757366 165963 -68970 -8106 66176 82981 150343 299293 453149 534315
35777 534315 465694 178447 -251547 -573894 -608096 -458227 -368703 -412090 -430235 -269623
35767 -269623 15678 217166 193688 20874 -97331 -71421 -28486 -132254 -374229 -618912
35757f18912j47069J5800K61236M66019L91819P0559j10271N2069K21337L4580
35747F37167k80944k41597J00567K17783n7693k84497j28085J40521J04933j90565
35737A7590l84626l15895j22920K7496Q2618O3866N1258J32023K57223K60014
35727F8647J13027J7856J04803J96570N7224k34044l75826k66504j13639r3693
35717e25579j01459M8226K97917L97744K54680O0969J1227M5352J4209k9263N8629
35706E32652J69578K3589l51725n43801l14325N4883J90205J25439R5905Q9707
35696G2107l7311j86485j52725j8524j5760p8656M9229L04784L42049J01296q9513
35685B90491n4519O116n0577n7906R7009K06421O2979k09967l46662k61483m8346
$$ plain form
35757 -618912 -765981 -750181 -488945 -22926 368893 439452 329181 381250 602587 637167
35747 637167 356223 114626 215193 432976 375283 90786 -37299 103222 208155 17590
35737 17590 -367036 -682931 -805851 -778355 -695737 -631871 -580613 -448590 -191367 68647
35727 68647 181674 199530 304333 500903 558127 324083 -51743 -318247 -431886 -525579
35717 -525579 -627038 -578812 -280895 116849 371529 432498 443725 489077 503286 474023 532652
35706 532652 702230 725819 374094 -169707 -484032 -429149 -238944 -113505 -17600 72107
35696 72107 34796 -151689 -304414 -322938 -338698 -417354 -368125 -63341 278708 380004 290491
35685 290491 235972 242088 191511 133605 230614 437035 500014 290047 -56615 -318098 -366444
35674c66444J54696K13370J03652P737Q4776J69861N352k65264k47652M0204J43662
35663D3950q0952k20739j8917J98043J24138M627J42584L04642J20961k42728
35653C75609l40276j52585k7750o4006n2616M4164L6594q0373q6572N3162J09010
35642a85639j7774j35641q3508M8407J04151O2632k0909j08912j53107r3274O6214
35631e17360K42313L35729K77125P7314j26634j71905o1779N4892J11146J58357
35621C79198J63961K0060j88307k11030l4001N3415p3477j75956r5551k3245q9149
35610b74082q2398R8971J21266k36779n64222l58566J79665M40916L05358J74714
35600a95157K17939J85087j4604j07860M9939K25430J97966N5814j6210L1956
$$ plain form
35674 -366444 -211748 1622 105274 113011 197787 367648 373000 107736 -139916 -99712 43950
35663 43950 -37002 -257741 -276658 -78615 45523 50150 192734 497376 618337 375609
35653 375609 35333 -117252 -145002 -209008 -261624 -217460 -180866 -261239 -347811 -294649 -185639
35642 -185639 -203413 -339054 -422562 -374155 -270004 -207372 -228281 -337193 -490300 -583574 -517360
35631 -517360 -275047 60682 337807 415121 288487 116582 54803 109695 220841 379198
35621 379198 543159 563219 374912 163882 129881 183296 109819 -66137 -161688 -184933 -274082
35610 -274082 -356480 -257509 -136243 -373022 -937244 -1295810 -1116145 -675229 -369871 -195157
35600 -195157 22782 207869 193265 85405 135344 360774 558740 614554 598344 630300
35590F30300J60453K65922J60679k06474n39226n02200j97860o522n445N8292
35580a82081K30031K33362j8622k21759j55267k104l816r6173r9291l0080p554
35569c53354k0061J1122M8520m999j17497j32270K2443J93823J47637j10794k58030
35558e73460n9050K33300J88685j10290j27918K57310M73062J43121k73772k11521
35548f0533J09481J32894p4560n0663J37514J7806l40357l45793R2963L65603
35538a5645J46491j54460j65954r0538j55169j56599O5296K39579J52952O3559
35528g0488K17906L62113J66106j91263k89735q4199J28169J80621J44228Q7676
35518F51134N00j14464k25313k61934r2103K97280N95652M52568Q672k20293p6131
$$ plain form
35590 630300 790753 1056675 1217354 1010880 471654 -30546 -228406 -234928 -240373 -182081
35580 -182081 47950 281312 262690 40931 -114336 -116440 -120256 -216429 -315720 -345800 -353354
35569 -353354 -373415 -362293 -313773 -318772 -436269 -568539 -546096 -352273 -204636 -315430 -573460
35558 -573460 -632510 -399210 -210525 -320815 -448733 -191423 281639 424760 150988 -60533
35548 -60533 48948 181842 107282 56619 194133 211939 -128418 -474211 -381248 -15645
35538 -15645 130846 -23614 -189568 -280106 -435275 -591874 -526578 -286999 -134047 -70488
35528 -70488 147418 509531 675637 484374 194639 110440 238609 419230 563458 651134
35518 651134 651634 537170 311857 49923 -42180 255100 850752 1303320 1311992 1091699 1015568
35507A015568L7139j62274l82254k59249O0275J76400J0821j95892k80063k69422
35497b48951k20330j50345n8427R1071L05307M59072M08065J96779k5927k26905
35487E29409l86936l15031P8640M43214L61228j5307j81063n3871J1952p0221
35477D02014l8812Q5205j9544k80109k38125J03604J89174j35824l47236j75546
35467d55199j7209r2711k7481L12895M13426M7750k00726N4016K85347J7709k95746
35456D2071j31083J39604J3251j34585K07174N75885K69758l28998l44801O4358
35446C72634J5924m84166n27044J00160N34103K59389j70504j59836R6861J83189
35436B20710J14240N7218p339o0845J5982J12613j1675k19833j31995J83436K52690
$$ plain form
35507 1015568 1052707 890433 508179 248930 309205 485605 496426 300534 20471 -248951
35497 -248951 -469281 -619626 -678053 -586982 -281675 177397 585462 782241 756314 529409
35487 529409 142473 -172558 -93918 349296 710524 695217 514154 460283 472235 402014
35477 402014 363202 448407 428863 148754 -89371 14233 203407 67583 -279653 -455199
35467 -455199 -472408 -565119 -592600 -279705 133721 181471 -19255 34761 320108 337817 42071
35456 42071 -89012 50592 63843 -70742 136432 712317 982075 653077 308276 372634
35446 372634 388558 -95608 -622652 -522492 11611 271000 100496 -59340 37521 220710
35436 220710 334950 392168 384829 323984 339966 452579 440904 221071 89076 272512 525202
35425E25202k337j36645L7161J74015N2248j01436j12931j15696j41698j4551
35415A63332J91199J37879j69407l12363j49446k2544j15806j74668m8196M6420
35405d53600J69J3399J31700J24649P312J04025L87707L67625r8471m86672m17140
35394c19297j92524j62748j26979J81375N06025M60853J44883q5946j61270k12458
35384C1914k14117p8143J02042J88717J89533J23114n4244k38985k05027J6540
35374a38656J18280L947q4948m6296p4084j93540j38952J09988J96583L1126R935
35363b06617K86022L94291P206m63353m85231j69779N9566J43324K33323K37432
35353C6184L3521j59025r7305O2160P7665O0139J76536K40789N7693j37403o0345
$$ plain form
35425 525202 522865 386220 423381 597396 649644 548208 435277 319581 177883 163332
35415 163332 354531 492410 323003 10640 -138806 -161350 -277156 -451824 -500020 -453600
35405 -453600 -453431 -440032 -308332 -183683 -176371 -72346 315361 682986 584515 97843 -319297
35394 -319297 -511821 -674569 -801548 -620173 -114148 346705 491588 405642 244372 31914
35384 31914 -182203 -260346 -158304 30413 219946 343060 288816 49831 -155196 -138656
35374 -138656 -20376 -16429 -101377 -147673 -221757 -415297 -554249 -444261 -247678 -216552 -206617
35363 -206617 79405 473696 480902 17549 -467682 -637461 -577895 -434571 -201248 36184
35353 36184 69705 -89320 -186625 -124465 -46800 13339 189875 430664 488357 350954 290609
35342B90609R9579L2309j13512l3672J22748K1213k05173j69787O2921R3404r3434
35331A07205j25724P5685J93660J10968O6183J45101J20646q2912k14073j33242
35321B63497m7969j44048k89928k69436p2118J71822L47361L56865J54271j31455
35311C38862k51316r9843J52977K32063L5700k29521k10858J72606N05378L12229
35301I58277k55746n11859j42517L52299L74426J9385k00019j20472N884J1489
35291D91147m7925j36596k40557k20565q198J54319J7827k32077k07756P8179
35281c52202K33794R9036m9330K5632J68359J01158j60543l22659j78672J27154
35271c08273K44411N1968j48518l6582K37442K76888R2913Q5936L20352L55402
$$ plain form
35342 290609 390188 422497 308985 275313 398061 419274 214101 44314 107235 200639 107205
35331 107205 -18519 57166 250826 361794 427977 573078 693724 610812 396739 263497
35321 263497 215528 71480 -218448 -487884 -560002 -388180 -40819 316046 470317 338862
35311 338862 87546 -12297 140680 372743 408443 178922 -31936 140670 646048 958277
35301 958277 702531 190672 48155 400454 774880 794265 594246 473774 479658 491147
35291 491147 443222 306626 66069 -154496 -162694 -8375 9452 -222625 -430381 -352202
35281 -352202 -118408 -19372 -68702 -43070 125289 226447 65904 -256755 -435427 -308273
35271 -308273 -63862 -11894 -160412 -196994 40448 317336 410249 496185 816537 1171939
35261A171939O114k77844j38916R3264j7295k81644k58505q80J19313N4299J1214
35250D81059k4383j74019k85698j70822j4662o3067j36610K7881K13043P9328
35240f7950j56319m5063K81935L09649J7874j34201k7393J7186o7655r021J66739
35229B85781J08065j62522k00982P4594K02807m3437l04586k60312n2529J12801
35219b40320K58797L41881J75491j54620k81487j37065o3087j94582k44799p1339
35209f11130P2680M9400P0408K02623J70837r2200k15342K924K37927J88424K5943
35198A02494o693l692q7990j09345K9870J25038M1767k4901O8278J40076M0796
35187C15698r6432j76293k92111l54595p3095M36271N78441J57350k30890r4162
$$ plain form
35261 1171939 1178053 900209 761293 854557 837262 555618 297113 296233 415546 469845 481059
35250 481059 456676 282657 -3041 -173863 -188525 -251592 -388202 -360321 -147278 -67950
35240 -67950 -224269 -269332 12603 322252 340126 205925 178532 195718 128063 119042 285781
35229 285781 393846 231324 30342 104936 307743 264306 -40280 -300592 -353121 -240320
35219 -240320 18477 360358 535849 381229 99742 -37323 -100410 -294992 -539791 -611130
35209 -611130 -538450 -489050 -418642 -216019 -45182 -137382 -352724 -349800 -111873 76551 102494
35198 102494 95801 92109 4119 -105226 -75356 49682 91449 66548 134826 274902 315698
35187 315698 219266 42973 -249138 -603733 -676828 -240557 337884 495234 264344 170182
35177A70182K22011J87793o5566j44406j50118l49434m72894j03324M72440N65349
35167C32033J41165j39655N1032K96778J66665j91066l74022k48598K5515K21926
35157B81773J92770j4636j63798j14678k5994p9859j52573l1052J87498K38587
35147C18038J25372O7568R0998K0109j52905k29560j41808l4892n015r560k6279
35136B2066n6609j623K09342L93784K82589r1770m08248m50067k73122k2063J86296
35125b09425K25570N2202j58969j77984j2475J43277K05241K38366K45969J55215
35115G06987M481o9398m0688j3628l7072o2683p0453q4739r2185p4712p1703r2187
35103B020n9342L4446N7781k4138l0242J14645J58908p4664k73864l6829M28310
$$ plain form
35177 170182 392193 579986 514420 370014 219896 -129538 -602432 -705756 -233316 332033
35167 332033 473198 333543 384575 681353 848018 656952 282930 34332 59847 281773
35157 281773 474543 459907 296109 181431 155437 75578 -76995 -108047 79451 318038
35147 318038 443410 510978 601976 622085 469180 239620 97812 62920 57905 48345 22066
35136 22066 -34543 -36166 173176 566960 849549 757779 349531 -100536 -373658 -395721 -209425
35125 -209425 16145 68347 -90622 -268606 -281081 -137804 67437 305803 551772 706987
35115 706987 711468 642070 601382 587754 550682 487999 417546 332807 240622 165910 94207 2020
35103 2020 -57322 -22876 34905 10767 -19475 95170 254078 179414 -94450 -131279 297031
35092B97031M85386k0511n01079m29234j8862J46524j02131l88753l23351O7703
35082g87277M24206M35651J30229j81370k44464r7181O8276J67909K15780J60373
35072B92132m3176k30633j53342J42284K88106O0934k97861l73800p9173K83952
35062a10577L98526K28157m8373k56297l16093k14741j5010J20720N7410j11029
35052b67307j27356O5523J87485J9409k24966j94930N4477J74051J12731J53184
35042d7699L13752K27918j79399m02285r7690L12427K54258j13118j86491J08547
35032A90220K52701J2932k14828q4905J79908K02639J2191j14396j26154j95945
35022A14363l49862l80369j53313J70347K95531J17480j73739l14470k44327j08445
$$ plain form
35092 297031 782417 761906 260827 -168407 -187269 -40745 -142876 -531629 -854980 -787277
35082 -787277 -363071 72580 202809 21439 -223025 -320206 -251930 -84021 131759 292132
35072 292132 248956 18323 -135019 7265 295371 356305 58444 -315356 -394529 -110577
35062 -110577 287949 516106 467733 211436 -104657 -319398 -334408 -213688 -156278 -267307
35052 -267307 -394663 -329140 -141655 -122246 -347212 -542142 -487665 -313614 -200883 -47699
35042 -47699 266053 493971 314572 -87713 -185403 127024 381282 268164 81673 190220
35032 190220 442921 455853 241025 156120 336028 538667 550858 436462 310308 114363
35022 114363 -235499 -615868 -769181 -598834 -303303 -185823 -359562 -674032 -918359 -1026804
35012a026804k1349N2424J66162K81633L57572M11605M06291K19824j39659m22140
35002B85559m04051j78072r859K0277N0320J48244J87996O1709j22363j57330
34992a17570j8370P2953o9192l01623k94623L163K55168K20699R7357J33170J64232
34981A45364n7416k90542j11222L00716L24020j01308l13117K7332L98500K74499
34971E96826q9673j83397l8720N036p9549j30581j86803k79732j82994J64170
34961d05417L54773J29024j09740N2230K97823J53880j02382Q3127M70939L46669
34951A270926k35960m81028j42668J30963q2033l64103k62007K8554J45592J27962
34941A36198J34081Q8000n9959j35852p2789m6144q3289J9581K06078R7144l24572
$$ plain form
35012 -1026804 -1048153 -995729 -829567 -547934 -190362 221243 627534 847358 707699 285559
35002 285559 -118492 -296564 -306423 -286146 -235826 -87582 100414 162123 39760 -117570
34992 -117570 -135940 -62987 -132179 -433802 -728425 -725262 -470094 -249395 -152038 -18868 145364
34981 145364 87948 -202594 -313816 -13100 310920 209612 -103505 -76173 322327 596826
34971 596826 507153 323756 285036 290072 210523 79942 -106861 -386593 -569587 -405417
34961 -405417 -50644 78380 -31360 20870 318693 472573 370191 453318 924257 1270926
34951 1270926 1034966 553938 411270 542233 460200 96097 -165910 -137356 8236 136198
34941 136198 270279 358279 298320 162468 89679 43535 -39754 -20173 185905 283049 -41523
34930d1523m95480q9511M18669M28209N3949j61991p0326L4153r927n5273J6837
34919B7786J27337J58307P3499p6805j52672m4680J10204K5165l02356m83108
34909e37323k41931J77333L24858J03130j91346k63094p7283J79179K58607O7771
34899b00099j80127j48732J94806M79765L76441J1481k06030r5692J07189Q5904
34889D24906j34516k06807N0297L17425J60945k93425m48942j06286K02835L2434
34879a134k78354j81173J89535K97693J11360N1900J81015J43185j06994k08864
34869A98169q0655m4658j72672j47880Q6279J70374r591j19527j8429J7891q7503
34858b08202k5183K26234K15992j66793l71891p5148K68012K20946Q0760K37910
$$ plain form
34930 -41523 -537003 -626514 -207845 220364 274313 112322 41996 76149 66222 10949 27786
34919 27786 155123 313430 386929 310124 157452 112772 222976 248141 -54215 -537323
34909 -537323 -779254 -601921 -277063 -173933 -365279 -628373 -705656 -526477 -267870 -200099
34899 -200099 -380226 -528958 -334152 145613 522054 533535 327505 231813 339002 424906
34889 424906 290390 83583 133880 451305 612250 318825 -130117 -236403 -33568 -1134
34879 -1134 -279488 -460661 -271126 26567 137927 189827 370842 514027 407033 198169
34869 198169 117514 72856 -99816 -247696 -161417 8957 -634 -120161 -138590 -120699 -208202
34858 -208202 -233385 -7151 208841 42048 -329843 -404991 -136979 83967 164727 402637
34848D02637M06034J52623k64027k91864P305J25574m4212j68526j30195j32323
34838F3026k17156j95393l4767R0275J08665Q9411M3577k9483j5992J32720K45148
34827B80031J88433Q3166L5365p7698k89960l26332l2448K73846K52062O1134
34817D47599L7462J17742J7323k32313l60689l05402j89293k4170J87720K51358
34807e2663O7283p6579R1948L33343K42496q6135k15477p0076K847j55647k86671
34796b05331j43684J76471L91432L21001K6439k18652j99658o3598j14606k60847
34786b91033q3428L89972N25152L4332m58543l03987K00043L18038l1317l41563
34776d2334l71583k68259o9775K55659M49974K69695n453L9766K46570J76432
$$ plain form
34848 402637 808671 961294 697267 405403 412708 538282 494070 325544 195349 63026
34838 63026 -154130 -349523 -384290 -294015 -185350 -95939 -52362 -81845 -97837 34883 280031
34827 280031 468464 551630 586995 509297 219337 -106995 -139443 134403 386465 447599
34817 447599 485061 602803 620126 387813 27124 -278278 -467571 -491741 -304021 -52663
34807 -52663 14620 -61959 29989 363332 605828 519693 304216 234140 236987 81340 -205331
34796 -205331 -349015 -172544 218888 539889 566328 347676 148018 84420 -30186 -291033
34786 -291033 -374461 15511 540663 574995 116452 -187535 12508 330546 299229 -42334
34776 -42334 -413917 -682176 -751951 -496292 -46318 223377 217924 257690 504260 680692
34766F80692q7781j11338Q9380J23207k5032m5987J11j97330m60847l10852J29357
34755b16420K48386k16l6737K42382K30812k61461n56657j95883L22960L84265
34745A61431J40500L0218J0445j59702l42476k83620r5220m580O0099K20484L04009
34734D1588J45201o5052r3930l5215l1536L9030K36881K62194r6392m99830m84504
34723e81565j27342J32830J42093Q1844L8308m6256r1190M3705K34149K04043
34713C0619m5835k31023k03150q9442J264J30550L17599M07498K75448K4342j33117
34702D84753j15347j0910P0676Q7962J3389j83791m13517m37810j56768J41168
34692e20195R4811j53466o9142M51815P98408M81821j42916m20875l14642k39231
$$ plain form
34766 680692 592911 481573 570953 694160 669128 623141 623252 425922 -34925 -345777 -216420
34755 -216420 31966 31750 -4987 237395 468207 206746 -349911 -545794 -222834 161431
34745 161431 301931 332149 342594 182892 -159584 -443204 -538424 -543004 -482905 -262421 41588
34734 41588 186789 121737 27807 -7408 -38944 86 236967 499161 402769 -97061 -581565
34723 -581565 -708907 -576077 -433984 -352140 -313832 -360088 -451278 -407573 -173424 30619
34713 30619 -15216 -246239 -449389 -538831 -537567 -407017 -89418 318080 593528 617870 484753
34702 484753 369406 358496 429172 517134 530523 346732 -66785 -504595 -661363 -520195
34692 -520195 -425384 -578850 -647992 -196177 602231 1084052 941136 520261 205619 -33612
34682c3612k60828j12024J47878J87515P9119K08386M63798K66992m05087p69295
34672b27158l43455L38832N36648K75158M2360k2142j03539j98011j43515Q491
34662A63669O3426K746p1303j60417k75870k84852r7971J43843K66411K68243
34652A7925J79801l0263k36884j53627K17035M32036J92511j98392k78592p0566
34642G0984P3691N5331N8264J23100Q2680j00692k43784k08941n2649R0682J24240
34631G2906K5808j11816j39499l7916N2084M8475K9284M5390K1919n4366n0392
34620i8123Q8098K17579K18405J36678O020k24687m51656l83102M2303M35088
34610a3397L94234J708l30644l59214j63817N3667J40809P1265j5228M3491J78271
$$ plain form
34682 -33612 -294440 -406464 -258586 -71071 8048 216434 680232 947224 542137 -227158
34672 -227158 -570613 -231781 304867 580025 622385 600243 496704 298693 155178 163669
34662 163669 227095 229841 158538 -1879 -277749 -562601 -660572 -516729 -250318 17925
34652 17925 197726 167463 -69421 -223048 -6013 426023 618534 420142 141550 70984
34642 70984 144675 200006 258270 381370 464050 363358 119574 -89367 -142016 -51334 72906
34631 72906 98714 -13102 -152601 -190517 -138433 -89958 -60674 -15284 6635 -47731 -98123
34620 -98123 -10025 207554 425959 562637 568657 343970 -107686 -490788 -448485 -13397
34610 -13397 380837 382545 51901 -307313 -471130 -417463 -276654 -205389 -220617 -177126 1145
34599A145J49692p2239k22072j38387N747K3893J5546J42347L15116L27863J57666
34588G06317o0856k42291l72051m19217l52555j78226P6277L19522L72828J68211
34578A7959p0823p2450J07285K15121K30137L15722M06038K68813k7028j70405
34568A220369j55022k54384m02575k04583K83582M37886J9234l83993k65939K6921
34558C21496n6851l57059l37562J3489K39959J70494N3032M4441M7946J3665J5405
34547A68455N4390P2897J06197J99380K72320K42017J32858n9056l70263o12201
34537B06994m57115J1314K27281p4626l98985k05604K71664M09120J30962q0157
34527D0848J7079J40818K5348j81590j82521N9444K92076K64063O141j88313j27673
$$ plain form
34599 1145 150837 78598 -143474 -281861 -276114 -252221 -236675 -94328 220788 548651 706317
34588 706317 645461 403170 31119 -388098 -740653 -918879 -842602 -523080 -150252 17959
34578 17959 -52864 -125314 -18029 197092 427229 742951 1148989 1417802 1390774 1220369
34568 1220369 1065347 810963 408388 203805 487387 925273 944507 560514 294575 321496
34558 321496 264645 -92414 -429976 -416487 -176528 -6034 46998 91439 139385 153050 168455
34547 168455 222845 295742 401939 601319 873639 1115656 1248514 1189458 819195 206994
34537 206994 -250121 -238807 -11526 -86152 -485137 -690741 -419077 -9957 121005 40848
34527 40848 57927 198745 224093 42503 -140018 -80574 211502 475565 481706 293393 165720
34516A65720J1486l3395j70867j18166P5720R8414n3979p2257O1189J9588k15581
34505b32128k47769K1923J93273Q9589L4678J56626J15689j49005j47506K60581
34495I5951M51017N0525l72481k55895L0511p2653l09096j57171J85108K25035
34485a29149J02392K19186L66159J12746k89077k91072l3195l9389j99316P453
34475a73262M60012N16369R9406k24536k15120j75394k21903j37052M2954L8196
34465I670p8685m69J48101j0905l19719k45493J83625L81771J77601J3784R6597
34454C55878R9634j38183l05185j91616N759J01270J44642J54496Q7195O0373
34444C74263J56150J17248k51521n63249l35509J86722L60075J21766o7171q0689
$$ plain form
34516 165720 177206 143811 -27056 -145222 -69502 28912 -25067 -97324 -36135 -16547 -232128
34505 -232128 -479897 -457974 -264701 -175112 -140434 16192 131881 -17124 -164630 95951
34495 95951 546968 597493 225012 -30883 -372 -73025 -382121 -539292 -354184 -129149
34485 -129149 -26757 192429 558588 671334 382257 91185 57990 18601 -180715 -173262
34475 -173262 286750 803119 902525 677989 462869 287475 65572 -71480 -28526 9670
34465 9670 -69015 -69484 78617 67712 -252007 -497500 -313875 67896 245497 259281 355878
34454 355878 455512 317329 12144 -179472 -173713 -72443 72199 226695 313890 374263
34444 374263 530413 647661 396140 -167109 -502618 -315896 44179 165945 98774 18085
34434A8085j58909k28762j1811K90069K39325n199N4128K83308J31252k76632
34424C34854k78296J01131J45740k32525k82658K40988N97634K82362k40485m24185
34414B44560l74506k98726n7901L11241L87462P1329j88555j71805j71133k65466
34404e13500j13723K58327L13289m4191k25141N958J46762k4263L45M12908N55227
34393G71998L3078n05613l85917O5832K02570Q0075R4280J87865J11615n844M0571
34382F90510R1323j6837r6887m1147j01088l45413l96104r8137J40406O7310Q182
34371i7882J70162K16339j8407j10338J51045K75227n8647l72445k39696m3887
34361a28529k11623l79802p9077L60370L65786P1984l2137N0994M1657J1566J28299
$$ plain form
34434 18085 -140824 -369586 -381397 -91328 147997 142798 196926 480234 611486 334854
34424 334854 56558 157689 303429 70904 -211754 29234 626868 909230 668745 244560
34414 244560 -129946 -428672 -486573 -175332 212130 283459 94904 -76901 -248034 -513500
34404 -513500 -627223 -368896 -55607 -99798 -324939 -318981 -172219 -196482 -196137 216771 771998
34393 771998 805076 299463 -86454 -20622 181948 262023 356303 544168 655783 649939 690510
34382 690510 781833 764996 668109 626962 525874 180461 -215643 -313780 -173374 -106064 -97882
34371 -97882 72280 288619 270212 159874 310919 586146 527499 155054 -84642 -128529
34361 -128529 -340152 -719954 -799031 -438661 -72875 -891 -33028 17966 59623 71189 199488
34350A99488J83615K045j04658J12513K94245P9026k22473j77941K4159J7967
34340D07986m0510J17526K35510n148l08965k35661M6808J23016M3495N2110K1771
34329D57938k06663l50376j78242l0004k05463l19047M3991N03578M62265P8846
34319B56823q9403k3831o7097j71322p8841O3529j2386j07151P4619K92483J75083
34308C12506q6942j06242R459k2282n0642J30630K30553j7198k30662q215K87974
34297D48939J54280j29983m9115J43900r4178n02904l93903J47108L93929J36812
34287B54885j70945k60868k30872n7806K93778M67740J60160k60360k78352o6619
34277a49259o7272j30482R8245L27728Q8060k93033j64006K76087K88185j27364
$$ plain form
34350 199488 383103 385148 280490 393003 687248 766274 543801 365860 390019 407986
34340 407986 367476 485002 720512 715364 406399 170738 217546 340562 384057 436167 457938
34329 457938 251275 -99101 -277343 -307347 -512810 -831857 -787866 -284288 177977 256823
34319 256823 167420 143589 76492 -94830 -173671 -110142 -122528 -229679 -155060 137423 312506
34308 312506 225564 119322 128781 106499 55857 186487 417040 399842 169180 160965 448939
34297 448939 603219 473236 424121 568021 473843 -29061 -422964 -275856 118073 254885
34287 254885 83940 -176928 -407800 -465606 -171828 295912 456072 195712 -82640 -149259
34277 -149259 -216531 -347013 -248768 78960 167020 -126013 -290019 -13932 274253 146889
34267A46889k83100j3852J58156K1277q1679q36M9249M2158J38748K28953J36110
34256E42073O5838J91180J41454l45837p02575l44655K39863K18734j96463k00995
34246c91383J45155J33692j90532j28492L12587M25343J17146q745J26255j0084
34236E30942l97843m20650n7749N8065j38642n3856L18916K76036k62615m85957
34226f33353n7487L53978K46154k6068o4953M39O2032K70820M69931K39191k79311
34215E81373m31599r5682J52298L7095r3856m3331j2312j2756J27732J88441j32886
34204B64517m22151n6868N91660N74616p3290l82613o8585J52017m0206j34264
34194D04833M7490J1932l02927k88829J62457L82805J07915j59903j91943l08416
$$ plain form
34267 146889 -136211 -150063 8093 29370 -52309 -53145 -3896 38262 177010 405963 542073
34256 542073 607911 799091 940545 594708 -107867 -452522 -212659 6075 -190388 -391383
34246 -391383 -246228 -112536 -303068 -431560 -118973 306370 423516 414771 541026 530942
34236 530942 133099 -287551 -345300 -287235 -425877 -479733 -160817 115219 -147396 -633353
34226 -633353 -690840 -336862 -90708 -116776 -181729 -181290 -119258 151562 621493 860684 581373
34215 581373 149774 54092 206390 243485 149629 106298 93986 81230 208962 397403 264517
34204 264517 -157634 -214502 377158 951774 878484 495871 427286 579303 539097 404833
34194 404833 452323 464255 161328 -127501 34956 417761 525676 365773 173830 -134586
34184a34586m27622n1358N72677N36613j83233n33442q0830L61357K03104p6221
34174A86459j5820P4023o5627j47574q1130j73955l00979K9354N67563N00384
34164E72698o6038j47611L50497L86225l28157p25814k16008L70114L01769J5984
34154E13659j024n5226k93900k05404K75753M14516J4121j66941J32465J74740
34144H02759k77506m09813Q1951L51841j0380k38984P4763K23774j25586k36836
34134B35983J59001K30876k63591l32119L46792O13060r8602o35701j84857L07386
34124C78228j2578l71343j9505K76942j68636n00849L6433N45314J17558m50943
34114a69379j76821L14636J21209k13849M5494K40747l19927p71019k10741N05507
$$ plain form
34184 -134586 -562208 -613566 -40889 495724 312491 -220951 -301781 59576 262680 186459
34174 186459 170639 244662 179035 31461 -49669 -223624 -524603 -495249 72314 572698
34164 572698 506660 359049 709546 1095771 767614 41800 -174208 195906 497675 513659
34154 513659 512635 457409 163509 -41895 233858 648374 662495 495554 628019 802759
34144 802759 525253 115440 197391 549232 538852 299868 374631 598405 472819 235983
34134 235983 394984 625860 362269 30150 376942 990002 891400 255699 70842 378228
34124 378228 365650 -5693 -25198 251744 83108 -417741 -381308 164006 281564 -169379
34114 -169379 -346200 -31564 89645 -124204 -78710 162037 -157890 -928909 -1139650 -634143
34104f34143K85025j91658J53626O87896L15238l53295j51853L77820R002p93343
34094b95685o70252J91805N12453K02295J89190M79062L16149j45347j21515K40263
34084H98418K09943o8488L093J51819j73111n10818j87630K81968R2342l05647
34074C91889q5412L20151N1052m93158m00446P7135J51434J4775K12384L56647
34064E96451l3346l51832n1403J13459m79532q73806j85419O14260L71570j57605
34054d37203J71229O79628K72442l34830k2536M66225n827o08511j09395N74680
34044F45902J4442q75639m09111O83119N63410l30058k37585N71394M83516k81481
34034H27909k60523K72164j4575o24484j39597P63622L88301o49750m41770N85711
$$ plain form
34104 -634143 -349118 -540776 -387150 300746 615984 262689 110836 488656 497658 -295685
34094 -295685 -965937 -774132 -261679 -59384 129806 608868 925017 779670 658155 898418
34084 898418 1108361 1039873 1042966 1194785 1021674 510856 323226 605194 697536 391889
34074 391889 306477 626628 677680 184522 -215924 -138789 12645 27420 239804 596451
34064 596451 563105 211273 159870 273329 -206203 -1080009 -1265428 -651168 -279598 -437203
34054 -437203 -265974 413654 686096 351266 328730 794955 789128 180617 71222 645902
34044 645902 660344 -215295 -624406 58713 622123 292065 54480 625874 1109390 827909
34034 827909 567386 839550 824975 200491 60894 824516 1212817 563067 121297 707008
34024G07008M57196n87759o13064K77602K78491m99171l39216N35790L65001n45224
34014C6654l00457P94589O85443m38241m36758O59169P31894k96850l82520N82344
34004A635267N96306m74578o93912Q4042Q5959o35544l35292O18511K26212r80009
33994A26962o02170R30912R04810n50072o64102O66309P91512m08825l74746Q33918
33984A654508N09281j150797j079679O80556Q62537o94906o86233J093742J200837
33975B389846o52523q72059R57996J156494p63497j016095R25404J137047r29248
33966B333365j172409R58525J128489j198820j351156J237121J472697j304815
33958B102997j502259J730748K229199j213118j899218J845690K898403q65277
$$ plain form
34024 707008 1164204 576445 -36619 240983 519474 20303 -318913 216877 581878 36654
34014 36654 -263803 530786 1216229 777988 341230 1000399 1732293 1435443 1052923 1635267
34004 1635267 2231573 1756995 1063083 1147125 1233084 597540 262248 880759 1106971 126962
33994 126962 -475208 455704 1360514 810442 146340 812649 1604161 1195336 820590 1654508
33984 1654508 2163789 1012992 -66687 613869 1476406 781500 95267 1189009 2389846
33975 2389846 1737323 865264 1823260 2979754 2216257 1200162 2125566 3262613 2333365
33966 2333365 1160956 2119481 3247970 2049150 697994 1935115 3407812 2102997
33958 2102997 600738 2331486 4560685 3347567 1448349 3294039 6192442 5327165
33950E327165j938003K148849L408111q53786j857103L420835N182707J02501
33942A4941276l97584P736673J1088736M707360M932174J7987312K3164130J4546340
33934I8706417K9008087Q8526713J36930145R3979936k8372781j23337351j18731273
33927A76709893n6538750j8051063j9398325k2141465j0076922k855698q550971
33920C9096699j0840118l189275R18645m081651o552862j243788J922623j940952
33912A4089321m311221o98736J508131j677036l561379m22901J653229q85576
33904E693832k536168P7386J960646j12312j672429K12985J401308p63040k230942
33895B031266l23751J194132l24381j461255K26936J445741k01023j561801j87465
$$ plain form
33950 5327165 3389162 5538011 8946122 8092336 6235233 9656068 14838775 14941276
33942 14941276 14543692 22280365 33369101 38076461 43008635 60995947 84160077 98706417
33934 98706417 127714504 216241217 353171362 447151298 418778517 295441166 176709893
33927 176709893 120171143 102120080 82721755 60580290 50503368 47647670 39096699
33920 39096699 28256581 25067306 25985951 21904300 15351438 14107650 16030273 14089321
33912 14089321 9778100 9079364 10587495 8910459 5349080 4926179 6579408 5693832
33904 5693832 3157664 3235050 5195696 5083384 3410955 3623940 5025248 4262208 2031266
33895 2031266 1707515 2901647 2577266 1116011 1342947 2788688 2587665 1025864 838399
33886H38399J076430j24123j216002n3729R22344k22322j037983K83842J163939
33877A630795k95251j435359n4223J387525M13479r96702m14455O31840M5213
33868I12862q08103j48409O07670j68817r67434j44526Q05137K07707n49242J27902
33858a25253Q48588J8720r48948k92240P95145N02655l42324k00090K69923q8222
33848D37954m97197l4548L17033k43753m52431N34549J125883J04981r31374l56735
33838D362O18246L40767l28615o816M79426m8793o27302r9755M54018j87791q59666
33827b61919j87367O62746J23471p48103k05903R14063P40945k76584m17666J71458
33817E15141J56426k75672n9108L83707j6286o64678k99912N36954M15009l80026
$$ plain form
33886 838399 1914829 1790706 574704 520975 1443319 1220997 183014 466856 1630795
33877 1630795 1335544 -99815 -154038 1233487 1646966 650264 235809 867649 912862
33868 912862 104759 -43650 564020 395203 -572231 -716757 88380 296087 -253155 -125253
33858 -125253 723335 742055 -206893 -499133 296012 798667 456343 256253 526176 437954
33848 437954 -59243 -93791 223242 -20511 -472942 61607 1187490 1292471 361097 4362
33838 4362 622608 963375 634760 627944 1107370 1058577 431275 331520 785538 597747 -261919
33827 -261919 -449286 213460 336931 -411172 -617075 296988 1037933 761349 343683 515141
33817 515141 671567 395895 336787 720494 704208 39530 -260382 276572 691581 311555
33807C11555m68656J00773J93219j86529j51051J65443j4695l87312j26248M07243
33797a56258L24876m8411J38889N15803K00017m10954l22983K12733K46048j12913
33787E86847j23663N1603j55443l80952n1090L01482j3627m04559p6515L56290
33777I0373j920n29910j93718M64193L12679k48996j14072L76165J37308m72648
33767a80546k70829M70030M59279k61688m57519N1084K45485j11814k16814J03286
33757a70046J71216j07710j50063M6376p184j24927K10744O10839L24134k92156
33747E11223l07411J21314J20678k27053j39167K63096J85813k63486k78788J04707
33737I0926J63860q7452q3736J6267k86802n74077j66020M07603K10302l09265
$$ plain form
33807 311555 -157101 -56328 136891 -49638 -200689 -35246 -49941 -437253 -563501 -156258
33797 -156258 168618 120207 259096 774899 974916 563962 240979 453712 699760 586847
33787 586847 463184 514787 359344 -21608 -72698 228784 215157 -189402 -265917 90373
33777 90373 88453 -441457 -635175 -170982 141697 -107299 -221371 154794 292102 -180546
33767 -180546 -451375 18655 477934 216246 -241273 -190189 55296 -56518 -273332 -170046
33757 -170046 1170 -106540 -256603 -210227 -217411 -342338 -131594 479245 803379 511223
33747 511223 203812 325126 445804 218751 79584 342680 528493 265007 -13781 90926
33737 90926 254786 167334 83598 99865 -186937 -761014 -927034 -519431 -309129 -618394
33727f18394o6301N92638M63440k62396l35021K21928K18875l67014l26619M30747
33717d8117O10986j12139n43580j56565J42036r3861j09471L27230L04356m51352
33707a30477q72134l54100K87082L50691K61048L85952K91707j48770k78727O8100
33697a39628J46995k58592l43283J83044M71638J03452j33484K25861M09842j23848
33687E41997o13927l18290K52178L47334J63321J22898j7026m40962n98439j45369
33677g06285K88438J15766k29708j35591J53665J46481J7377J20122K47848J17428
33667A35541k0486P6600J03432j65385l31750p5881K09504R9502j31091n6282
33657a56296J64120J69904K7822m3595j09893k33196k09791K3968J85211J36756
$$ plain form
33727 -618394 -684695 -92057 371383 108987 -226034 -4106 214769 -152245 -478864 -48117
33717 -48117 562869 450730 -92850 -249415 -107379 -201240 -310711 16519 320875 -130477
33707 -130477 -1002611 -1356711 -1069629 -718938 -457890 -71938 219769 70999 -207728 -139628
33697 -139628 7367 -251225 -594508 -411464 60174 163626 30142 256003 665845 541997
33687 541997 -71930 -390220 -138042 209292 372613 495511 478485 37523 -560916 -706285
33677 -706285 -417847 -302081 -531789 -667380 -513715 -367234 -349857 -229735 18113 135541
33667 135541 115055 191655 295087 129702 -202048 -277929 -68425 31077 -100014 -156296
33657 -156296 7824 177728 205550 161955 52062 -181134 -390925 -366957 -181746 -44990
33647d4990Q3496P0593j13250l50776k16479K14546L45912P4121j4484K72399
33637C21088L67297K0788k02675K2843J63317j77809n07854l25705K4593L9309
33627b54808r9339j3631J47853R4868l8893m7232m9503j03636J1108K45589J61561
33616E3937k57557l87602K5983L83754K21531p4914n2199P2097O187j8055J69802
33605A42964J98111j46074m01369j93441J42621K40070L01562M75503L84731j08663
33595A036015m19435j78711Q6206r8832k91128P629L66154J72782k72628l20124
33585H7928p0955j9846q7568Q9815L23677K01715r8101j40432l8202j36567k43005
33574a31541R354L38981J97525k48903l37482K4882K67726Q0258k20523k56156
$$ plain form
33647 -44990 38506 109099 -4151 -354927 -571406 -356860 -10948 63173 48689 321088
33637 321088 688385 709173 506498 529341 692658 514849 6995 -318710 -294117 -254808
33627 -254808 -354147 -367778 -219925 -125057 -163950 -211182 -260685 -364321 -353213 -107624 53937
33616 53937 -203620 -591222 -565239 -181485 40046 -34868 -87067 -14970 -8783 -26838 142964
33605 142964 341075 195001 -206368 -399809 -257188 -17118 284444 759947 1144678 1036015
33595 1036015 616580 437869 524075 425243 134115 141744 507898 680680 408052 87928
33585 87928 16973 -2873 -90441 -626 323051 524766 426665 286233 248031 111464 -131541
33574 -131541 -122187 216794 414319 165416 -172066 -147184 120542 200800 -19723 -275879
33564b75879l2436J84351J32301j97569m14065j27928L76506L85640j42272m08952
33554e20303k9754L42679J44759j77695n0735K08912P1971j90384o2503K28579
33544c4474J93108L1213J82450L90582J62817k49672k78593o5836j06755k36066
33534a1226J3278L54262J34009m22945m59936R3874M11379J13881k57447k45649
33524b76520o9660k4367l7690j4929j8441L376J46100K26360M5779j50283n1189
33513b21464Q3263j59503n02862l44838J79387L51781M4444j25019J34220L89390
33503a71201K99475P2122p2700k19498l56379k68050R65J20544L1754J3661J33802
33492d15505J67407J01734J59254K77142J42660j88026k77059L195K95703L43323
$$ plain form
33564 -275879 -308315 -123964 8337 -189232 -603297 -731225 -354719 30921 -111351 -520303
33554 -520303 -550057 -207378 -62619 -240314 -291049 -82137 -10166 -200550 -263053 -34474
33544 -34474 158634 189847 372297 762879 925696 676024 397431 331595 224840 -11226
33534 -11226 2052 356314 490323 67378 -392558 -298684 112695 226576 -30871 -276520
33524 -276520 -346180 -370547 -408237 -423166 -441607 -438231 -292131 -65771 -19992 -170275 -221464
33513 -221464 -138201 -297704 -800566 -1145404 -966017 -614236 -569792 -694811 -560591 -171201
33503 -171201 128274 200396 127696 -91802 -448181 -716231 -715266 -594722 -562968 -549307 -415505
33492 -415505 -248098 -146364 12890 290032 432692 244666 -32393 -29198 266505 609828
33482F09828K39953O9259j83738l44912k08685J7298k9455k02756n6933L11418
33472B21277L35581m8233k37497N1322L38303J96689j10893j58358p177L8048
33462F19062n7064j27327j28423j22608j13167m5574J29662L88187N13221K20622
33452A276591l77755o99385m22082K681P757k37957k04511O7192J08933q9962
33442e68498r8750J29744J94345M067j00566r022M1455K0314J13777J92414l4361
33431a15081l43546k24259K06393L01508m3375k37893k8308J64250J11078J24883
33421h4350K99014K47543q8055k02314N2423J35218j78837k94400J77392O55512
33411G19146M76182r7345l91703l08771j69577m9910J03506R1220k03701m23104
$$ plain form
33482 609828 849781 919040 735302 390390 181705 199003 169548 -33208 -90141 221277
33472 221277 556858 508625 271128 322450 660753 857442 746549 588191 581014 619062
33462 619062 561998 434671 306248 183640 70473 24899 154561 542748 1055969 1276591
33452 1276591 898836 199451 -222631 -219950 -212193 -450150 -654661 -587469 -478536 -568498
33442 -568498 -667248 -537504 -343159 -339092 -439658 -448680 -407225 -386911 -273134 -80720 -115081
33431 -115081 -458627 -682886 -476493 -174985 -218360 -456253 -484561 -320311 -209233 -84350
33421 -84350 214664 462207 374152 171838 224261 359479 180642 -113758 63634 719146
33411 719146 1195328 1097983 706280 397509 227932 178022 281528 372748 169047 -254057
33401b54057k19298J61258K72953J49340R7402J04047l7706k33490k15917k0071
33391a95539R4109O9976M3491L3012l2409q8228k0158J23367K14499K22560J59627
33380F24307J8971j11951q7376M4358O4675o2919j50279j46467j86604k23451
33370b16736m5161K38320K20356j19528k76670j0410K48937J06052j79702j79246
33360b13788K5937Q9270n014k1198R0477J91957J96831O3494k07074l82209j48238
33349c19555L44131M96006R0174l28724k34737J50973L06612J77174L8458n7813
33339F62699k06492k78203j10817J14180J14926l5124p8276k7043o8715j71255
33329h4120j55337l7629L2183O6230J69168K80382K54960J03692o6951k32707
$$ plain form
33401 -254057 -473355 -312097 -39144 110196 207598 311645 273939 40449 -175468 -195539
33391 -195539 -101430 -31454 12037 45049 12640 -75588 -95746 27621 242120 464680 624307
33380 624307 643278 531327 443951 488309 552984 490065 339786 193319 6715 -216736
33370 -216736 -261897 -23577 196779 77251 -199419 -209829 39108 145160 -34542 -213788
33360 -213788 -187851 -98581 -103595 -124793 -34316 157641 354472 417966 210892 -171317 -319555
33349 -319555 24576 520582 610756 282032 47295 198268 504880 682054 720512 662699
33339 662699 456207 178004 67187 181367 296293 261169 182893 155850 87135 -84120
33329 -84120 -239457 -277086 -244903 -178673 -9505 270877 525837 629529 562578 329871
33319C29871l82121m18852l04330j39679J7424K09175L59922K93846Q5260M2619
33309I3135J91922J73185j41671l57490j67806J53249K11655P2815J4904M5625
33299B89523M5849Q4418K08716K12646j2377j85877p6189O8969o1858k86164k36555
33288E1101J2958J00343j9051p5006K4046J09656R3393M7547J1166j5769J8529
33277C58913R3519M8596j54973k91914j94675q69J11880J76276K20374J11254
33267D78381j44164k57190q2813J19919J13209L8561P9828J15901O478j10331
33257C57779r4440m6809l3017N3819J39587m3678l82220l72817R167J14676k87534
33246e85487m79820M5315O41925N05118n0598k11646p748k6943k15365m5751L69285
$$ plain form
33319 329871 -52250 -471102 -775432 -915111 -897687 -688512 -328590 -34744 50516 93135
33309 93135 285057 458242 316571 -40919 -208725 -55476 156179 228994 243898 289523
33299 289523 335372 419790 628506 841152 828775 642898 566709 635678 573820 287656 51101
33288 51101 64059 164402 145351 70345 94391 204047 297440 344987 356153 340384 358913
33277 358913 452432 501028 346055 54141 -140534 -141403 -29523 146753 367127 478381
33267 478381 334217 77027 -5786 114133 227342 265903 345731 461632 468110 357779
33257 357779 263339 216530 183513 237332 376919 333241 -48979 -421796 -412629 -297953 -585487
33246 -585487 -1065307 -1019992 -378067 127051 76453 -135193 -142941 -169884 -385249 -431000 -61715
33235f1715M10368Q1892j7577J83595J45741j98259k62877J24011L85319J66824
33225I57322j58220k15593j37265q7709M3148K17643J46321j46094k34743P75
33215C85585J57751J2812j28526j9884J37315J40512J04995R6352n4483l26097
33205E06332l81707j20380R9677K5833j35871j46191o7062L9566K81724N62928
33195F64849M98781J921m53038m45904j40888O4860P8433K8208m0253j14793j18685
33184B3491p3259j13983k00273j05225J67704K99809J60499M1553J72285L40400
33174G13001K62469M3585l2361L4387L093k03914l79145k99605p3K40134J91290
33163E72861m2436j48973n7910k5119j40906j05165K15551L88812M2273m30881
$$ plain form
33235 -61715 348653 430545 412968 596563 742304 544045 281168 405179 790498 957322
33225 957322 799102 583509 446244 358535 401683 619326 765647 619553 384810 385585
33215 385585 543336 556148 427622 407738 545053 685565 790560 886912 832429 506332
33205 506332 124625 4245 103922 129755 -6116 -152307 -219369 -179803 101921 664849
33195 664849 1163630 1165551 712513 266609 125721 190581 269014 297222 256969 142176 23491
33184 23491 -49768 -163751 -364024 -469249 -301545 -1736 158763 200316 372601 713001
33174 713001 975470 1019055 986694 1021081 1024174 820260 441115 141510 141437 381571 572861
33163 572861 530425 381452 323542 298423 157517 52352 267903 656715 698988 268107
33153B68107l81544J00283L42632J08272k05807l04129k53794n8590L21882N35628
33143D72940J64083m66334n60420l8753L37915J67616r9754q6440m1601j43791
33133b94539r5214J66627J68006j97162k65476K97283P58293M00709l11643m60909
33123A65975m6905K14301Q1681p4452r2401j63804k60805j35309J32013J89492
33113I786J9129m4372J01693K01662J10988l0424j08774j51536j30859J3470J57449
33102A48212J01128j08206k18651j24628M4353J50303J66764J12828K4589n0932
33092B45760j18163j95596j94738k8312J48042Q9067j05017p3140J96506K75116
33082B39525j3431k67420j39374J42792K04618P3930l5038j00786j16696O7891
$$ plain form
33153 268107 -113437 -13154 329478 437750 231943 -72186 -325980 -384570 -62688 472940
33143 472940 637023 170689 -389731 -428484 -90569 77047 -22707 -109147 -150748 -294539
33133 -294539 -389753 -223126 -55120 -252282 -517758 -220475 537818 938527 626884 165975
33123 165975 119070 333371 415052 340600 248199 84395 -176410 -311719 -179706 9786
33113 9786 28915 -15457 86236 287898 398886 368462 259688 108152 -22707 -9237 148212
33102 148212 249340 141134 -77517 -202145 -157792 -7489 159275 272103 296692 245760
33092 245760 127597 -67999 -262737 -291049 -143007 -53940 -158957 -232097 -35591 239525
33082 239525 226094 -41326 -180700 -37908 166710 240640 205602 104816 -11880 56011
33072E6011L67076L45435r9753l89075r1822L29086K04802k80906m20229j14132
33062i3507P4980r1720k18143n351L20335M48763L72846J98850l3223k15776j87979
33051E70075P442J34882R1459P141P133P1545J21000Q2613p4433k44396k48631
33040E25830j05807l7093p9656P547K65626L31659P443l38654l20621j36744j69547
33029e0017k99940j52395K04458L53908J85573n1471k22095l44544k90638M1190
33019f25971L52338K55019j09731k54126p7359P5928L4337k9284k1053k6498N785
33008d20615K04681M06576L15287K2956j02309k8675n4327j98356j50900J19037
32998A13355K66849J83808J48504K24830Q3888l37298n47126k18027K44026K50499
$$ plain form
33072 56011 423087 768522 668769 279694 187872 516958 721760 440854 20625 -93507
33062 -93507 -18527 -110247 -328390 -333741 -13406 435357 808203 1007053 973830 758054 570075
33051 570075 577517 712399 803858 810999 818132 889677 1010677 1093290 1018857 774461 525830
33040 525830 420023 382930 303274 310821 576447 908106 915549 576895 256274 119530 -50017
33029 -50017 -349957 -502352 -297894 56014 241587 190116 -31979 -376523 -667161 -625971
33019 -625971 -273633 -18614 -128345 -382471 -459830 -383902 -349565 -378849 -399902 -426400 -420615
33008 -420615 -215934 190642 505929 528885 426576 397901 343574 145218 -5682 113355
32998 113355 380204 564012 712516 937346 1021234 683936 136810 -81217 162809 413308
32988D13308j52926m15222k45822R6640K15859K6860k17624k31883n093K07372
32978c08531K19010J23812P4280K6086r4270j52346k3201J13225L2734j12876
32968a02077k2532K10131K10279o5586k73757k47748j79658j79796p7876K13728
32958e14892M82705M90968K18271k03821n52523n47262j30673L24407M09468K10977
32948A87625R8609J10608O366j70515j38806K2976p5862m04785m25945O3834N49866
32937a76029N24621J37032j63257k32604j92477j07093J3974J12149J62323J70041
32927B48680M3051k52288m17520j17162M10746N20006N6676l96166l60077n9002
32917c23056P6742M0020N6330J45049K04978K38845K14820m926l51632m74970
$$ plain form
32988 413308 260382 -154840 -400662 -304022 -88163 -61303 -278927 -510810 -515903 -308531
32978 -308531 -89521 34291 108571 134657 40387 -111959 -135160 -21935 10799 -102077
32968 -102077 -124609 85522 295801 230215 -43542 -291290 -470948 -650744 -728620 -514892
32958 -514892 -32187 458781 677052 473231 -79292 -626554 -757227 -432820 -23352 187625
32948 187625 286234 396842 403208 232693 93887 116863 41001 -363784 -789729 -725895 -176029
32937 -176029 348592 485624 322367 89763 -102714 -209807 -195833 -83684 78639 248680
32927 248680 291731 39443 -378077 -495239 -84493 435513 492189 96023 -264054 -323056
32917 -323056 -246314 -206294 -149964 -4915 200063 438908 653728 648802 297170 -177800
32907a77800k32339N2835P3146l5386j5784P4328N8959M906O2626J55779J26242
32896A47512J7612m0310o7469j27790j44852l2926J20582J73773J15117K1857
32886A83106l5577M039J21903J45990m0139k46707k04627J0794J10568O8633O0838
32875A78821J7821k40027m68771k27624L16204M87742J39388j27968J3360J38293
32865B27239o0767j99888K8129K30074L2981k08564o3175J85320Q4959j40601
32855A15707l1932K29727J49470j86979k99973j62808j24068j59546N6848M18546
32845D992M33184K4155l25848k98070j00971m6324j67446k94315k08695K06338
32835g73000P09226P87434L09443j82285j97322J4515m4547k98738l39526j74807
$$ plain form
32907 -177800 -410139 -357304 -284158 -319544 -335328 -261000 -202041 -197135 -134509 21270 147512
32896 147512 165124 124814 57345 -70445 -215297 -248223 -127641 46132 161249 183106
32886 183106 147529 151568 273471 419461 379322 132615 -72012 -61218 49350 117983 178821
32875 178821 196642 -43385 -512156 -739780 -423576 64166 203554 75586 88946 227239
32865 227239 166472 -33416 -5287 224787 257768 49204 -13971 171349 256308 115707
32855 115707 83775 313502 462972 275993 -23980 -186788 -310856 -470402 -413554 4992
32845 4992 438176 462331 136483 -161587 -262558 -308882 -476328 -770643 -979338 -773000
32835 -773000 -63774 723660 1033103 850818 653496 668011 623464 324726 -14800 -189607
32825a89607j00360p6852J03507K53042Q1950j50504j0163K73897J42333k68413
32815E8830l07135M6828J53177j24577j91388J55885L34409L1698k38814p3590
32805a54677J42264P772j69138o448K13513P4132k05357j65740J15705K47865
32795I9891K03128J92890J40402j36141m08850k85352J24389L04654Q0027j75695
32785A39343j10619J77199L45181J92906j95215n22168m97976j19313L01243M65844
32775A76425L64913J65444j2462j10799r4472j8827n034p4289j45039k02459k66390
32764b22989k21690J5566J88817k2548l80531k64758L64867P47224L73756k74983
32754C02731m74398k45229o1834K877J84482L61855J93914j90221k96450m8772
$$ plain form
32825 -189607 -289967 -366819 -263312 -10270 71680 -78824 -88987 184910 327243 58830
32815 58830 -248305 -201477 -48300 -172877 -364265 -208380 126029 157727 -81087 -154677
32805 -154677 -12413 -4641 -173779 -180227 33286 107418 -97939 -263679 -147974 99891
32795 99891 303019 495909 636311 500170 91320 -194032 -69643 235011 315038 139343
32785 139343 28724 205923 551104 744010 548795 26627 -471349 -590662 -289419 176425
32775 176425 541338 706782 694320 583521 489049 470222 465188 390899 245860 43401 -222989
32764 -222989 -444679 -429113 -240296 -262844 -643375 -908133 -543266 203958 577714 302731
32754 302731 -171667 -416896 -478730 -475853 -291371 70484 264398 74177 -222273 -271045
32744b71045J25273J7876j14846r7519p7213j08541j9185J63838J59932k1813
32734b43243o542K54214K66513j87037n45443k76529K49214K97310j07341k73050
32724e71934N1787L53644K24211o0794q2054Q6681J21161o279p9953l7042J6377
32713A5805O0324J41375J77304M9296j44725j66982L0446K48566L14737K37148
32703I63294R2270n9709j36461q8452k0079r1692k68591l29618j71155M9850J31116
32692G0773M7667q8894j61760r5692R2345K40413J70755p7881k67034k43169q3634
32681c96111N6734R9574L0224j03356j55961j9753J87074K42413J32113L6901
32671A09852K1522j2983p2390n8266k4746j13555k07934m0945K89438L58693Q8004
$$ plain form
32744 -271045 -145772 -127896 -242742 -340261 -417474 -526015 -545200 -381362 -221430 -243243
32734 -243243 -249785 4429 270942 83905 -461538 -738067 -488853 -191543 -298884 -571934
32724 -571934 -520147 -166503 57708 -3086 -85140 1541 122702 116423 36470 -572 15805
32713 15805 76129 217504 394808 444104 299379 132397 162843 411409 726146 963294
32703 963294 1055564 995855 859394 770942 750863 659171 390580 60962 -110193 -60343 70773
32692 70773 118440 29546 -132214 -227906 -135561 104852 275607 197726 -69308 -312477 -396111
32681 -396111 -339377 -239803 -209579 -312935 -468896 -488649 -301575 -59162 72951 109852
32671 109852 131374 118391 46001 -12265 -37011 -150566 -358500 -399445 -110007 248686 336690
32660C36690j05651n627R1380Q370M3630L14848L53950j07883n06270k64201K21516
32649C80752J91353k39759l27380L6039K26654J8182j14935N4827J16640j64732
32639A77641l98118k68866n2641n8458j11995J8403J57253Q2928m1454J5225J29847
32628c50235Q1677l7342k542J64202K77555K76371K06083P7796q0345j81812k02810
32617B28598j89620j16647M7982J51205J9323k03708k20998o2449r982p5410j7710
32606d49416J28381P5921j29256j33455M2709o217k72976k47007J56996L39535
32596d94785K3249k40195j4311L04571K40854O773p2371j98435n00018n11610
32586a456278n0002J07388n84471j198322n03821J027656J718161J042791J54413
$$ plain form
32660 336690 231039 225412 316792 325162 368792 683640 1037590 929707 423437 159236 380752
32649 380752 572105 332346 4966 41005 267659 285841 170906 225733 342373 177641
32639 177641 -220477 -489343 -541984 -600442 -712437 -694034 -536781 -453853 -495307 -480082 -350235
32628 -350235 -268558 -305900 -308442 -144240 133315 409686 615769 693565 613220 431408 228598
32617 228598 38978 -77669 -29687 121518 140841 -62867 -283865 -346314 -356296 -431706 -449416
32606 -449416 -321035 -245114 -374370 -507825 -465116 -471333 -744309 -991316 -834320 -494785
32596 -494785 -471536 -711731 -726042 -421471 -180617 -173844 -246215 -444650 -944668 -1456278
32586 -1456278 -1506280 -1398892 -1983363 -3181685 -3685506 -2657850 -939689 103102 257515
32577B57515k8524R1812l0782j00030J80340L11853j32762o01132l67223K81789
32567a37144M93079J33844j68121q7680M4162m9309j62646m3724J87022K48746
32557D58229O8737k03554l82021l55110j36051J32895K95953L20675K71620J80370
32547F51743K3647j76963l08842k60032n3452J34697J42812K3318r407J24596
32537B92117K47603J97260Q2190Q8668J47653L4628k46994m31523l48410r5302
32527c2110J62121L44926L81683K00679j11052l14202k76259j07491Q187l33r5298
32516A60851j85388j55497K1871J88031J53884l0405j15255J1207J80108J81231
32506D10638J0375j68893j96142j9271K52425L78231J98095j44962l10207j39798
$$ plain form
32577 257515 228991 320803 290021 189991 370331 682184 549422 -51710 -418933 -137144
32567 -137144 355935 489779 321658 233978 278140 228831 66185 22461 209483 458229
32557 458229 526966 323412 -58609 -413719 -549770 -416875 -120922 199753 471373 651743
32547 651743 675390 498427 189585 -70447 -123899 10798 153610 176928 167521 292117
32537 292117 539720 736980 819170 907838 1055491 1090119 843125 411602 63192 -32110
32527 -32110 130011 474937 856620 1057299 946247 632045 355786 248295 256482 256149 160851
32516 160851 -24537 -180034 -158163 29868 183752 153347 38092 49299 229407 410638
32506 410638 421013 252120 55978 36707 289132 667363 865458 720496 410289 270491
32496B70491J55072K43058M9026j74766j52067P1983J63230n7869l15065k24538
32486B8555J20717K44056K357k00836r5931R240j88329l82859j52579K55131K59595
32475a00883r6355k01987J28157L96908K73293M6454M177l4554k30942l08778
32465a24510n5693J94170O4454k12322j69534J09435J44671j19425k25791K3848
32455c70697K45568J11686j21497l3612K95544M09317J47955j55044j78872j7812
32445C32536N8729K0380K8639J07421J20815L7331m1351j13968k64453l82314
32435i6235k30638R8007J61998j80631m68153k87217J14650K67271K13453K95929
32425a11566M47766L06461o6227k15076n8758m520j93848k49781K0584K53698
$$ plain form
32496 270491 425563 668621 717647 542881 390814 462797 626027 568158 253093 28555
32486 28555 149272 393328 395685 194849 98918 108158 -80171 -463030 -615609 -360478 -100883
32475 -100883 -197238 -399225 -271068 125840 399133 445587 449764 415210 184268 -124510
32465 -124510 -180203 13967 78421 -133901 -303435 -194000 -49329 -168754 -394545 -370697
32455 -370697 -125129 -13443 -134940 -168552 126992 536309 684264 529220 350348 332536
32445 332536 391265 411645 440284 547705 668520 705851 664500 550532 286079 -96235
32435 -96235 -326873 -228866 -66868 -247499 -715652 -1002869 -888219 -620948 -407495 -111566
32425 -111566 336200 642661 576434 361358 302600 298080 104232 -145549 -124965 128733
32415A28733J54603k0124M0535J63844M8883j97093k79808j93229j02941o831
32405b63428J35891J77919L4513p1041L9506J39096l7256k98817k91634p9221
32395e14472K6927M3874K08458L98957K39898j97072l67985p5464K06558P0634
32385D0313k12144j60712J72487L34302J59862p6221j44070j32108j73777j81643
32375c73711p032K83427M45773L31749L3483k22928k70545j17946O2736Q1652
32365B46658p1844j96585j16533P9368J49509L6651p4407o5670m1457p4895l5121
32354a64326J37328K05153k5892l11006k69038K0842J35632o008l3712K19143
32344i1884M20685L05200J06840J26688K17640P5398k09798l00431j62947p4156
$$ plain form
32415 128733 283336 263212 303747 467591 516474 319381 39573 -153656 -256597 -263428
32405 -263428 -127537 50382 84895 13854 53360 192456 155200 -143617 -435251 -514472
32395 -514472 -487545 -443671 -235213 163744 403642 206570 -161415 -236879 -30321 40313
32385 40313 -171831 -332543 -160056 174246 334108 257887 113817 -18291 -192068 -373711
32375 -373711 -380743 -97316 348457 680206 713689 490761 220216 102270 165006 246658
32365 246658 174814 -21771 -138304 -58936 90573 127224 52817 -12853 -54310 -129205 -164326
32354 -164326 -26998 178155 152263 -158743 -427781 -406939 -271307 -277315 -311027 -91884
32344 -91884 328801 634001 740841 867529 1085169 1160567 950769 650338 487391 413235
32334D13235j36923j55199n971J71034K07429Q9364j32137l85152m85053k41977
32324f61350K27487M98407L14430o1199j56828J07266L35960K05570j14036k36183
32314D59524j13475n5718k06578l10732j42951J03039J10235o8186j24673N305
32304c44210R7838M7703j6077k7947p4706j47726j12023K8221J25393J77101K94069
32293D7636L56799J02308l55297n15710j80918K35288K95825P4796j18102j79597
32283b36972j23315R0801L43628L10079o2412l47619k29201L4827P7373k614N8123
32272h7302J48822L5814j23904m2928J37448Q2098j18242j12172O3338P3982o0252
32261c298p013K06654J84872j11008k37649k1605J41756k6442k27104j16263J32790
$$ plain form
32334 413235 276312 121113 115142 286176 493605 582969 450832 65680 -419373 -661350
32324 -661350 -433863 64544 378974 317775 160947 268213 604173 809743 695707 459524
32314 459524 346049 290331 83753 -226979 -369930 -266891 -156656 -224842 -349515 -344210
32304 -344210 -246372 -198669 -214746 -242693 -317399 -465125 -577148 -548927 -423534 -246433 47636
32293 47636 404435 506743 151446 -364264 -545182 -309894 -14069 60727 -57375 -236972
32283 -236972 -360287 -269486 74142 384221 321809 -25810 -255011 -220184 -142811 -145425 -87302
32272 -87302 61520 97334 -26570 -69498 67950 150048 31806 -80366 -17028 56954 -3298
32261 -3298 -10311 196343 381215 270207 32558 10953 152709 126267 -100837 -217100 -84310
32250h4310J55291l5058j46878o2717J01872K28839K58117J56601m016q2371r2826
32239C92544k00313l84937l69075m3730K91643L31346J71520P1201K9449r2868
32229A96780k05022j08837Q8851P2774j43625j56703K00513M99789K72202k83070
32219D33652n16881k20939R2345n4804m15407m02228M4678L93294K90404j9875
32209c75761j47938n3483R8623K48944L56653K71702j6573k17875j25565L0375
32199F9102o4166k79452k40478O4491K76028K25247J15523J20444J56684J28941
32189E72364R4233Q5710K1471j20724k36798k61557k26810j41707L213J26641
32179h3964J45956J37076J88048J63366j02240m24250m25295r2553J67637J09759
$$ plain form
32250 -84310 70981 35923 -110955 -173672 -71800 157039 415156 571757 567741 485370 392544
32239 392544 192231 -192706 -561781 -605511 -313868 17478 188998 260199 289648 196780
32229 196780 -8242 -117079 -28228 44546 -99079 -255782 -55269 444520 716722 433652
32219 433652 -83229 -304168 -211823 -266627 -682034 -1084262 -1039584 -646290 -355886 -375761
32209 -375761 -523699 -577182 -478559 -229615 127038 398740 382167 164292 38727 69102
32199 69102 4936 -274516 -514994 -450503 -174475 50772 166295 286739 443423 572364
32189 572364 666597 752307 773778 653054 416256 154699 -72111 -213818 -210605 -83964
32179 -83964 61992 199068 387116 550482 448242 23992 -401303 -493856 -326219 -216460
32169b16460m6425j8857J29180J65510M9169p3178q8742J084J19207J52543M8211
32158B21242j02108j73967j75373j62158o3156J96020M52919M55577K33720N5072
32148I37788J6551l1322j37054j44647j0664P4648n296j20206j34701r0957n3326
32137C00814K383M9356j9882j85387k64880j74044l3694M2311O8091N3547k7705
32126a89090r5251k1383J21236J20913j4020l1992J44423K57709R9736j85393
32116B06888l25807k54063q9147M7898R4452N3441K787n767l8616j38362j74315
32105f20611l6356J23182R8652k0918j2828Q0017O3952M076J05861K63093J83488
32094B31608o9742j46550j2473K8250p2083l4940J60315J95168J6487o3108L092
$$ plain form
32169 -216460 -262885 -281742 -152562 12948 62117 -11061 -99803 -98719 20488 173031 221242
32158 221242 119134 -54833 -230206 -392364 -455520 -259500 193419 648996 882716 937788
32148 937788 954339 923017 785963 641316 630652 705300 700004 579798 445097 354140 300814
32137 300814 303197 352553 332671 147284 -117596 -291640 -325334 -283023 -214932 -161385 -189090
32126 -189090 -284341 -305724 -184488 -63575 -77595 -109587 34836 292545 392281 206888
32116 206888 -118919 -372982 -462129 -414231 -319779 -266338 -263551 -269318 -307934 -446296 -620611
32105 -620611 -656967 -533785 -435133 -456051 -468879 -388862 -324910 -320834 -214973 48120 231608
32094 231608 161866 15316 2843 31093 -40990 -75930 84385 279553 296040 232932 236024
32083B36024j11606m02151l80610R5878M87518L97621J22739J2749r2663l48316
32073A7183m34010j32049J56175L5102k06521j12937J61836J79985l8930j74415
32063e48581j79450j55914K0736M07412O38263M10854K6184q6855n1533j85458
32053B95658l23820j46400J33091R7858j02670j9142K65606K82510j094k04640
32043B76957k45427l22991l16456N5682N31513N14936O808l78421l57074k41422
32033d75895k19371r3589J46650J92261K3175J0569K37149L28582J36155k3220
32023B62466Q199j4211j45392n8839K71016L28876j19190n27405l46970J52332
32013a89118L17401L6391k40071j96652L6155J82475J43918L2603k041O133j35046
$$ plain form
32083 236024 124418 -277733 -658343 -562465 -74947 322674 445413 458162 365499 17183
32073 17183 -416827 -548876 -392701 -357599 -564120 -677057 -515221 -335236 -374166 -548581
32063 -548581 -728031 -883945 -863209 -455797 182466 593320 619504 532649 481116 295658
32053 295658 -28162 -174562 -41471 56387 -46283 -65425 200181 482691 481597 276957
32043 276957 31530 -291461 -607917 -552235 -20722 494214 501022 122601 -234473 -475895
32033 -475895 -695266 -788855 -642205 -449944 -426769 -416200 -179051 149531 285686 262466
32023 262466 270665 256454 111062 52223 323239 652115 532925 5520 -341450 -189118
32013 -189118 128283 164674 -75397 -272049 -235894 -53419 90499 123102 121061 127194 -7852
32002g852l99043l86172J27170O75206O19865O5021l08926k61065j82661k49294
31992c07751j32822K42147L94055Q4079k29536j48120M1080m4260j97249n7533
31982c55910K03745J91432m4439j69648j38747j23902r2837P7943K42353J65725
31972d4285o4847j73324j01065L1715J91920L44630K97330k4468l27363l16122
31962a85879j28913o2677o4254R9480L22808K70939m6775k46530j38100M9437
31952a30464P6200L523j2584J1921k8742j32085j92483j36999O833J44761J92230
31941a97889J30496k075j39878j86472o1870J62200K70596J74791N6749P6511
31931B83159R7043n1895k13961j56278k0425q9578k27759p4971K56048K79623
$$ plain form
32002 -7852 -406895 -793067 -665897 9309 629174 694195 385269 124204 -58457 -307751
31992 -307751 -440573 -198426 195629 279708 50172 -97948 -56868 -101128 -298377 -355910
31982 -355910 -152165 39267 -5172 -174820 -313567 -437469 -530306 -452363 -210010 -44285
31972 -44285 -109132 -282456 -383521 -351806 -159886 184744 482074 457606 130243 -185879
31962 -185879 -314792 -377469 -441723 -342243 -19435 251504 204729 -41801 -179901 -130464
31952 -130464 -54264 -50741 -63325 -51404 -80146 -212231 -404714 -541713 -534880 -390119 -197889
31941 -197889 -67393 -69468 -209346 -395818 -457688 -295488 -24892 149899 206648 283159
31931 283159 380202 328307 114346 -41932 -62357 -151935 -379694 -454665 -198617 81006
31921H1006l0436j54638Q7865K35686J4092j88414l0496J96810J30997m5068k3347
31910B74057N5914n2513j83596q5871Q8957R0101K9724R3483J30718j6553j27903
31899B96518j0870P4293j13435k82814j10892J24041J1459k46750k18084l9000
31889e15534j07403k45626K9714N55787O57666K05787k20260k59333j49409j11091
31879a59702l7411P2795K619k02082k01047M7957J96136J21766R5615J98745J46372
31868B81763j16036j97677R3999L85406L07886J9057j46853j87387k71376l43439
31858a74657k04906J45844M60802M71622J32305k71126l30714o614K44622Q1576
31848E48754k03650j51932J23187J83520N3659J08726K76109R2995l99520n88354
$$ plain form
31921 81006 50570 -104068 -16203 219483 233575 45161 14665 211475 342472 297404 274057
31910 274057 329971 277458 93862 7991 96948 187049 216773 310256 440974 424421 296518
31899 296518 285648 359941 246506 -36308 -147200 -23159 -11700 -258450 -476534 -515534
31889 -515534 -622937 -868563 -838849 -283062 374604 580391 360131 100798 -48611 -159702
31879 -159702 -197113 -124318 -121699 -323781 -524828 -476871 -280735 -158969 -63354 135391 281763
31868 281763 165727 -31950 62049 447455 755341 774398 627545 440158 168782 -174657
31858 -174657 -379563 -233719 227083 698705 831010 559884 229170 222556 467178 548754
31848 548754 345104 193172 316359 499879 553538 662264 938373 1031368 631848 43494
31838D3494k82473k3001j31251j88440J37029M27939K11907k32191l38618j10937
31828d86542N3614P2239J46307K48821J77246p615n7552K1334m121j65235k22026
31817b23530k2727L01825M96561L98465O6094k15331j93848J0402K6903k24080
31807D20734l81050j71711J88450L25171J85541j8961j31516j14128Q539R8291
31797D09360n872k12146k24111J2064J87829J06164l1517K771J11699J09867L0235
31786D96343k5024p4825j06353j2078J43953J13904j04385j93625o7468n7236
31776A13206k82924l27419O6648M39534K69963j80381k56111J08532L74000K16756
31766E41804j58068m29990m29211r3029M00639N68166J44852m20613m62012j0053
$$ plain form
31838 43494 -238979 -261980 -393231 -581671 -444642 -16703 195204 -36987 -375605 -486542
31828 -486542 -432928 -360689 -214382 34439 211685 204070 146518 167852 163731 -1504 -223530
31817 -223530 -246257 55568 552129 950594 1016688 801357 607509 617911 644814 420734
31807 420734 39684 -132027 56423 381594 567135 548174 416658 302530 311069 409360
31797 409360 403488 191342 -32769 -20705 167124 273288 241771 244542 356241 466108 496343
31786 496343 471319 396494 290141 278063 422016 535920 431535 237910 170442 113206
31776 113206 -169718 -497137 -430489 9045 279008 98627 -157484 -48952 325048 541804
31766 541804 383736 -46254 -475465 -568494 -167855 400311 545163 124550 -337462 -347515
31756c47515K78782P8348k34607k32605O586J56955J07062j2538m6336N2898J73630
31745a9340J31350o8179j61403n813J45807J8330k16180j86796R7484K99787K88414
31734C23461K20085J56316R758j46849j22451K6915N0176o5663q7420K0185L4249
31723D18762q6443r3990J04672K50393J30838j05751j87918o4865R3841Q6746
31713E46285j59797m69839n06786j72997J86894K29634J10004J90654L99366L32393
31703F85811m8612l16056k31431m6787l8899j47319k11319k10435j41919K0839
31693f86127J56592J02465j5272R0113L67275M56566K67792Q2668Q701j59513
31683F71260l93650l06754J56871M31465J05722m35749n59990k41421M7800N4292
$$ plain form
31756 -347515 -68733 9615 -224992 -457597 -451011 -294056 -186994 -199532 -245868 -192970 -19340
31745 -19340 112010 43831 -117572 -123385 22422 40752 -175428 -362224 -264740 35047 323461
31734 323461 543546 699862 709620 562771 440320 467235 517411 451748 364328 384513 418762
31723 418762 332319 238329 343001 593394 724232 618481 430563 365698 459539 546285
31713 546285 386488 -83351 -590137 -763134 -576240 -346606 -236602 -45948 353418 685811
31703 685811 637199 321143 89712 42925 4026 -143293 -354612 -565047 -706966 -686127
31693 -686127 -529535 -427070 -442342 -352229 15046 471612 739404 822072 830773 671260
31683 671260 277610 -29144 127727 559192 664914 229165 -330825 -572246 -524446 -470154
31673d70154n2204m3458J14421K80725K42035m9702k67658l7405M40999N24807
31663F82406N6115l44397k04788J08238O2858j74079j27481J21376J27434j04956
31653B02726j75502l0536r741j87320k62156j31080l1683n5862j4557J40977K21736
31642c32998J95712K36503L09193J66281j43462k27669L5101K70774J86226l7665
31632F57996j38547j64831k21077j77136O4491K84369K31309l829j48963j12536
31622B71246J8096J51370J74917k6356l30094l68903J460M17479M37440Q6824
31612H33479k66818m09797l80825k28194J8127K10744K04719P4369r971m3470
31602B363j02629j14695J4234J42487P9624m7081L0472K18703J46811k07524m10592
$$ plain form
31673 -470154 -522358 -565816 -451395 -170670 71365 21663 -245995 -283400 157599 682406
31663 682406 738521 394124 189336 297574 360432 186353 58872 180248 307682 202726
31653 202726 27224 -3312 -13053 -200373 -462529 -593609 -625292 -681154 -695711 -554734 -332998
31642 -332998 -137286 99217 408410 574691 431229 203560 238661 509435 695661 657996
31632 657996 519449 354618 133541 -43595 20896 305265 536574 532745 383782 271246
31622 271246 289342 440712 615629 589273 259179 -109724 -108264 309215 746655 833479
31612 833479 566661 156864 -223961 -452155 -434028 -223284 -18565 55804 45833 2363
31602 2363 -100266 -214961 -200727 -58240 21384 -25697 4775 223478 370289 162765 -247827
31591b47827k26913L7843P1142L8540K10007M24679L44147M2186r5225K4628J10140
31580G33347k892j36217j39594j33916k44009l54223k94181q1761J52595L27278
31570a73573L90559K99074J17376r941o8181j86731l64565l91342j70339Q5453
31560d72210J44523O0617J1853K0521L2990J03524K69546L89002L24297J45755
31550A030418m8399l07261n75693n45257j36909J39977j51165n44135j93080P82908
31540e48596J251405O01114l94919o85429k99665m822o3329p1728J54650K74420
31530B13101O3103k10173k27490m7143R0969R6679K3487m7650k2933J11475J66741
31519B10166n5166m01690m57766q2772L77347N26469L47315P3087j37832k21218
$$ plain form
31591 -247827 -474740 -436897 -365755 -327215 -117208 307471 651618 693804 598579 623207 733347
31580 733347 730455 594238 454644 320728 76719 -277504 -571685 -653446 -500851 -173573
31570 -173573 216986 516060 633436 623495 555314 368583 4018 -387324 -557663 -472210
31560 -472210 -327687 -267070 -255217 -234696 -201706 -98182 171364 560366 884663 1030418
31550 1030418 982019 674758 99065 -446192 -583101 -443124 -594289 -1138424 -1331504 -548596
31540 -548596 702809 1303923 909004 223575 -76090 -80912 -144241 -215969 -61319 213101
31530 213101 276204 66031 -161459 -208602 -117633 -20954 2533 -45117 -68050 43425 210166
31519 210166 155000 -246690 -704456 -787228 -409881 116588 463903 536990 399158 177940
31509A77940j09260J39410K39857j5730l92170m14874R986M11863L29802r5264
31499B81560l09619o5241K91846L15158K5163j95612j44133J0867N5409J268l8627
31488B28039m2279l3314M037N3529L9787l1283m1646L8684Q2166L8331M3404J51913
31476E31368J75720l485j74020j15800O870r2435l08210k84438j3370J23872m4067
31465a97995k33878j78692O055R9754J21363J82022K23627J39353J225m8890l2467
31454H1477o4714j18124l9396J97958L90363L07509l5041l49258l59692j01112
31444i0030J60182K96121M09397M85085K57780l09874p04053m55047J14882K68903
31434D33346p7010k67681K4987K96299N3610m08812n12808k36282L3573J56465
$$ plain form
31509 177940 68680 208090 447947 432217 40047 -374827 -364841 47022 376824 281560
31499 281560 -28059 -93300 198546 513704 538867 343255 199122 209989 265398 266666 228039
31488 228039 185760 152446 156483 210012 249799 218516 176870 215554 297720 336051 379455 531368
31476 531368 707088 703603 529583 413783 420653 328218 20008 -264430 -277800 -153928 -197995
31465 -197995 -431873 -610565 -604510 -504756 -383393 -201371 22256 161609 162834 113944 81477
31454 81477 16763 -101361 -140757 57201 447564 755073 720032 370774 11082 -90030
31444 -90030 70152 366273 775670 1260755 1518535 1208661 504608 49561 164443 433346
31434 433346 356336 88655 113642 409941 463551 54739 -458069 -694351 -660778 -504313
31424e04313K41700K32173K487k62076k59632o4018L327q5260q1190L9668M4817
31413f92317q9267j20868M040O4267M995N4287K76027L95248K39076J2380n0425
31402I7443l517K8213R3436K27013K78983J60912L6823L7506M013k18768m25130
31391C16927l02833O6313K85565J96742N0152P0113J25362r986k42087k35630
31381C20638J01579M12907L04791j34103m27131l24653q3520k7637r6592p2216
31371b5937j9774j30999k65166j01074K65755L56869M5478k09370o6976J91305
31361D0111J57725p9603j77740j04129n4626k9341Q2338J44718n2965l36195k90423
31350g00130J10585M05847K64863j04145k78926j23971J47660K56838J20205q4177
$$ plain form
31424 -504313 -262613 -30440 -27953 -290029 -549661 -613679 -610352 -695612 -776802 -737134 -692317
31413 -692317 -781584 -902452 -898412 -834145 -829150 -774863 -498836 -103588 135488 147868 97443
31402 97443 93926 122139 215575 442588 721571 882483 919306 956812 960825 742057 316927
31391 316927 14094 80407 365972 562714 612866 682979 808341 798355 556268 320638
31381 320638 422217 835124 1139915 1005812 578681 254028 170508 142871 46279 -25937
31371 -25937 -45711 -176710 -441876 -542950 -277195 79674 125152 -84218 -151194 40111
31361 40111 197836 118233 -59507 -163636 -218262 -247603 -165265 -20547 -73512 -409707 -700130
31350 -700130 -589545 -183698 81165 -22980 -301906 -425877 -278217 -21379 98826 14649
31340A4649j09397M4767J15515k0917j25290J7053J99708J09009j44662k17885
31330a17450j31620j89063l37661j73381L18108N86310L20049p2832j16189M4393
31320A30664J2870j60968j56788j9613p7719l04243k81733J23169M78544L57259
31310A01442j02224m04252k93681L1289K20386J44982k9923q6733k1746j4005
31300d54465j30326j93712m6107J72565J85206j9769j40189K9883K91105K76219
31290b9590m3129k48051J6951N10170O01561Q7384m67627m46698k1074J31184
31280I1081j53649l18091l566L74169K96507n7725j54839M3079J11452p5126j59801
31269f509O3404K91823J69789k04301m33685l19552l6612J17988N2976m5069K5531
$$ plain form
31340 14649 -94748 -49981 65534 44617 -80673 -63620 136088 245097 100435 -117450
31330 -117450 -249070 -438133 -775794 -949175 -631067 -44757 275292 202460 86271 130664
31320 130664 143534 -17434 -174222 -193835 -271554 -575797 -857530 -734361 -255817 101442
31310 101442 -782 -405034 -698715 -667426 -447040 -302058 -331981 -418714 -440460 -454465
31300 -454465 -584791 -778503 -824610 -652045 -466839 -486608 -626797 -596914 -305809 -29590
31290 -29590 -72719 -320770 -303819 206351 807912 895296 427669 -19029 -40103 91081
31280 91081 -62568 -380659 -384225 -10056 286451 228726 73887 116966 228418 153292 -6509
31269 -6509 56895 348718 518507 314206 -119479 -439031 -475643 -357655 -304679 -349748 -324217
31258c24217J83175J70513k2065q7371J15099K87520J47590j11656j52310n6383
31248A49895j37709l35670k73706J09258M37865M44826K36504j8327k60718l51930
31238B88j33030K22090L04732L9665k15632k40097k10351k63162k34106l2589
31228g62192J34352J44980J78817L06995K71781l3080k58364j21466J30496J54248
31218A46567N9872J05768J65628j4041k73170k67643o5600r294j10103r0840N0146
31207c02710L7555j34764j63047J6041J09725n928q7666K1538J46554J39745J11337
31196a11620J29820N3575j28656j30963J79998M45433K55529k35996m68530j91145
31186b02555K56618M03097J66766j64958l36399l53307l25178k32154R586K99724
$$ plain form
31258 -324217 -141042 29471 7406 -79965 35134 322654 470244 358588 206278 149895
31248 149895 12186 -323484 -597190 -487932 -50067 394759 631263 612936 352218 288
31238 288 -132742 89348 394080 433745 218113 -21984 -232335 -495497 -729603 -762192
31228 -762192 -627840 -482860 -304043 2952 274733 241653 -16711 -138177 -7681 146567
31218 146567 206439 312207 477835 463794 190624 -77019 -142619 -151913 -262016 -352856 -302710
31207 -302710 -265155 -399919 -562966 -546925 -437200 -443128 -530794 -509256 -362702 -222957 -111620
31196 -111620 18200 71775 -56881 -187844 -7846 437587 693116 457120 -11410 -202555
31186 -202555 54063 457160 623926 458968 122569 -230738 -555916 -788070 -778484 -478760
31176d78760L80648J86415k3938j6619J04759J10592O19p7229j16508j91369k18438
31165c39828p7586J04870J05261j6098j0344J14508J04613p0565j44099k0289
31155b49557O3251k9371j01499o808P9867R20q3001K628J06163J6748j40225j03671
31143d44555P2683J09165l2656r9407L4037J83249J58730K3309n4974l8837P317
31132h1939O5142J42558J60241J1568k30719l00606n1231K89051L42688O1745
31122D08498k13549k22843q2730J862O2266J75782J89159m0879k95963k57013
31112b75410j3010Q4798O980M2787K25051K44336J8928j33766n1890J5109p6210
31101H7703n5660K39726M51044J96400l21012n96390m86226k33418l9630M5047
$$ plain form
31176 -478760 -98112 88303 64365 47746 152505 263097 263716 186487 69979 -121390 -339828
31165 -339828 -417414 -312544 -207283 -223381 -233725 -119217 -14604 -85169 -229268 -249557
31155 -249557 -186306 -215677 -317176 -323984 -244117 -243197 -326198 -323570 -217407 -200659 -340884 -444555
31143 -444555 -371872 -262707 -295363 -394770 -360733 -177484 -18754 4555 -50419 -89256 -81939
31132 -81939 -16797 125761 286002 297570 66851 -233755 -284986 4065 346753 408498
31122 408498 194949 -27894 -110624 -108762 -46496 129286 318445 277566 -18397 -275410
31112 -275410 -288420 -203622 -196642 -153855 71196 315532 334460 200694 148804 163913 87703
31101 87703 32043 271769 722813 919213 598201 1811 -484415 -717833 -757463 -712416
31091g12416K84p0254P0985L87425M10394j02562o10692m25348K55605N57599
31081b38980J61665k94893k01323K10118L40493R2369j39470j11979K0220L7442
31071a24338o1337j38936j08169J3125J47377K12672J65538L2165q0256l8676
31061A9165J64869L20970J97139j26256k81240r1363J42916L4158l37061n05476
31051d62179k30315K09643L74675J53728j74683k81384j21068O8063Q8253L2765
31041c42502J00906K35446J85065o0881k03600j02459J1452l6150o0329R5997
31031a77055K05139L8805j73583q5498J89935K85081J76059J05318O0687j44234
31021D80654l58364k20822J98371M23593K90955J21092J00201K7008j83978k76496
$$ plain form
31091 -712416 -712132 -782386 -711401 -323976 86418 -16144 -626836 -1052184 -796579 -238980
31081 -238980 -77315 -372208 -573531 -363413 -22920 69449 -70021 -182000 -161780 -124338
31071 -124338 -185675 -324611 -432780 -419655 -272278 -59606 105932 138097 57841 19165
31061 19165 184034 505004 702143 575887 294647 203284 346200 380358 43297 -462179
31051 -462179 -692494 -482851 -108176 45552 -129131 -410515 -531583 -463520 -375267 -342502
31041 -342502 -241596 -6150 178915 118034 -85566 -188025 -176573 -212723 -273052 -177055
31031 -177055 28084 66889 -106694 -192192 -2257 282824 458883 564201 624888 480654
31021 480654 122290 -98532 99839 523432 814387 935479 1035680 1062688 878710 602214
31011F02214j34996j2022n1833m9336Q0829O7222k06199m14509l39330k40809
31001f98769l09920k23802K61781O91709M90707j06126l37653p77L61647L33299
30991D62096J03206k1054o9188j76295k65840j94963M252J91309K72985K10925
30981E17433L0431j22437q8246R2341K09331J52555J3721r0166j47673j85775
30971C81515k04558k04287j79139r3728L7905R6669J0032q9137r133K23913L91480
30960C61532L68299K28483P4340q1081k35881l33811l17570j78422L9363K24017
30950A49269K41780Q5789q0838j22073q8759q2545p7114k0607M316q5069j75036
30939b50887j10513L0996N8127l342L3204J56529J55081M353m8627J11336K57109
$$ plain form
31011 602214 467218 455196 403363 354027 434856 502078 295879 -118630 -457960 -698769
31001 -698769 -1008689 -1232491 -970710 -279001 211706 105580 -232073 -232850 128797 462096
30991 462096 565302 544248 475060 298765 32925 -162038 -157786 33523 306508 517433
30981 517433 547864 425427 337181 429522 638853 791408 805129 714963 567290 381515
30971 381515 176957 -27330 -206469 -300197 -262292 -165623 -155591 -244728 -253861 -29948 361532
30960 361532 729831 958314 1032654 951573 715692 381881 64311 -114111 -74748 149269
30950 149269 391049 476838 396000 273927 185168 102623 25509 4902 9218 -75851 -250887
30939 -250887 -361400 -330404 -272277 -275619 -242415 -85886 69195 73548 24921 136257 393366
30928C93366J68545l7119j16533o6470o0465j26519j14069L7549J82526J64825
30918D25636J9891q3826o2242j3496p2674j95513j72544Q2325L33186K46801j77513
30907C30031n29766m18167P7505M63160L61945n3195k42068M7302M26559L46482
30897H09788j46167m38955k02435J57413J28017j67416k47605n1750O5145J6399
30887g7566J01153L72498M36940J02860k40178j99547M5765J07291L854m401L6005
30876F84674j34243m48668n31181k60220P4006K25097K51824K48554J53255m3189
30866B19909j82889j85982j63965j55502j9344K36966L10832M6357k30222j49151
$$ plain form
30928 393366 561911 524792 408259 341789 281324 154805 40736 78285 260811 425636
30918 425636 445527 361701 299459 285963 213289 17776 -154768 -72443 260743 507544 330031
30907 330031 -199735 -617902 -540397 -77237 284708 231513 -10555 36747 463306 809788
30897 809788 663621 224666 22231 179644 307661 140245 -107360 -159110 -93965 -77566
30887 -77566 23587 396085 833025 935885 695707 496160 541925 649216 653070 648669 684674
30876 684674 550431 101763 -429418 -689638 -615632 -390535 -138711 109843 263098 219909
30866 219909 37020 -148962 -312927 -468429 -487773 -250807 60025 106382 -123840 -272991
$$ [...]
##END NTUPLES=NMR SPECTRUM
##END=
