##TITLE=31Pdec_LY-TMF-3.40.3
 D2O, 24 sc
 27.2.2020
##JCAMPDX= 6.0         $$ Bruker NMR JCAMP-DX V2.0
##DATA TYPE= NMR SPECTRUM
##DATA CLASS= NTUPLES
##ORIGIN= UXNMR, Bruker Analytische Messtechnik GmbH
##OWNER= root
$$ XWIN-NMR		Version 3.5
$$ Thu Feb 27 14:43:06 2020 Russian Standard Time (UT+4h)  she@DPX200
##.OBSERVE FREQUENCY= 81.013821
##.OBSERVE NUCLEUS= ^31P
##.ACQUISITION MODE= SIMULTANEOUS
##.ACQUISITION SCHEME= undefined
##.AVERAGES= 24
##.DIGITISER RES= 17
##SPECTROMETER/DATA SYSTEM= spect
##.PULSE SEQUENCE= zgpg30
##.SOLVENT NAME= CDCl3
##.SHIFT REFERENCE= (INTERNAL, CDCl3, 0, 182.463)
##AUDIT TRAIL= $$ (NUMBER, WHEN, WHO, WHERE, WHAT)
$$ ##TITLE= Audit trail, XWIN-NMR		Version 3.5
$$ ##JCAMPDX= 5.01
$$ ##ORIGIN= Bruker BioSpin GmbH
$$ ##OWNER= she
$$ F:/spectra/data/she/nmr/P31/1/pdata/1/auditp.txt
$$ ##AUDIT TRAIL=  $$ (NUMBER, WHEN, WHO, WHERE, WHAT)
(   1,<2020-02-27 14:41:55.15 +0400>,<she>,<DPX200>,
      <created by zg, POWCHK disabled, PULCHK disabled
       configuration hash MD5:
       00 E9 B6 7A A2 85 ED C7 34 08 36 98 17 FE 4E 26
       data hash MD5: 32K
       33 88 78 81 BB 2C 1E A6 2A 3E 7C A0 32 05 8B 3E>)
(   2,<2020-02-27 14:41:57.48 +0400>,<she>,<DPX200>,
      <Start of raw data processing
       efp BC_mod = 2 LB = 1 FT_mod = 6 PKNL = 1 PHC0 = -1605.078 PHC1 = 665.0014 SI = 64K 
       data hash MD5: 64K
       5C 52 98 73 19 E7 08 5F CA D1 3F DC F2 B1 40 B9>)
(   3,<2020-02-27 14:42:18.98 +0400>,<she>,<DPX200>,
      <pk PHC0 = -61.46938 PHC1 = 104.2 
       data hash MD5: 64K
       38 A0 FC 15 BA 08 34 8F 1D 27 7E ED B9 EB B6 87>)
(   4,<2020-02-27 14:42:22.45 +0400>,<she>,<DPX200>,
      <abs ABSG = 5 
       data hash MD5: 64K
       89 CF 67 63 19 F4 B0 54 EE 0E 62 50 F1 EA 26 E8>)
(   5,<2020-02-27 14:42:37.56 +0400>,<she>,<DPX200>,
      <pk PHC0 = -4.601482 PHC1 = 0 
       data hash MD5: 64K
       74 9E 2C F8 7F 45 22 A6 82 C9 EE AB 1F 1F 36 44>)
$$ ##END=
$$ 
$$ hash MD5
$$ 94 A4 38 C8 DF 48 BD CA 1F E2 66 D2 EC 82 B4 58
##$RELAX= 
##$RELAX= 
##$RELAX= 
##$RELAX= 
##$RELAX= 
##$RELAX= 
##$RELAX= 
##$RELAX= 
$$ Bruker specific parameters
$$ --------------------------
##$DU= <F:/spectra>
##$EXPNO= 1
##$NAME= <P31>
##$PROCNO= 1
##$TYPE= <nmr>
##$USER= <she>
##$AMP= (0..31)
100 100 100 100 100 100 100 100 100 100 100 100 100 100 100 100 100 100 
100 100 100 100 100 100 100 100 100 100 100 100 100 100 
##$AQSEQ= 0
##$AQ_mod= 1
##$AUNM= <au_zg>
##$AUTOPOS= <>
##$BF1= 81.014009
##$BF2= 200.13
##$BF3= 200.13
##$BF4= 200.13
##$BF5= 200.13
##$BF6= 200.13
##$BF7= 200.13
##$BF8= 200.13
##$BYTORDA= 1
##$CFDGTYP= 0
##$CFRGTYP= 5
##$CHEMSTR= <none>
##$CNST= (0..31)
1 1 145 1 1 1 1 1 1 1 1 1 1 1 1 1 1 1 1 1 1 1 1 1 1 1 1 1 1 1 1 1 
##$CPDPRG= <waltz16>
##$CPDPRG1= <>
##$CPDPRG2= <waltz16>
##$CPDPRG3= <>
##$CPDPRG4= <mlev>
##$CPDPRG5= <mlev>
##$CPDPRG6= <mlev>
##$CPDPRG7= <mlev>
##$CPDPRG8= <mlev>
##$CPDPRGB= <>
##$CPDPRGT= <>
##$D= (0..31)
0 1 0 0 0 0 0 0 0 0 0 0.03 2e-05 3e-06 0 0 0 0 0 0 0 0 0 0 0 0 0 0 0 0 
$$ [...]
##$SUBNAM3= <"">
##$SUBNAM4= <"">
##$SUBNAM5= <"">
##$SUBNAM6= <"">
##$SUBNAM7= <"">
##$SUBNAM8= <"">
##$SUBNAM9= <"">
##$SW= 369.568048894756
##$SWIBOX= (0..15)
0 1 3 0 0 0 0 0 0 0 0 0 0 0 0 0 
##$SW_h= 29940.119760479
##$TD= 32768
##$TD0= 1
##$TE= 0
##$TE2= 300
##$TE3= 300
##$TEG= 300
##$TL= (0..7)
0 120 53 12 22 120 120 120 
##$TP= (0..7)
150 150 150 150 150 150 150 150 
##$TP07= 0
##$TPNAME0= <>
##$TPNAME1= <>
##$TPNAME2= <>
##$TPNAME3= <>
##$TPNAME4= <>
##$TPNAME5= <>
##$TPNAME6= <>
##$TPNAME7= <>
##$TPOAL= (0..7)
0.5 0.5 0.5 0.5 0.5 0.5 0.5 0.5 
##$TPOFFS= (0..7)
0 0 0 0 0 0 0 0 
##$TUNHIN= 0
##$TUNHOUT= 0
##$TUNXOUT= 0
##$USERA1= <user>
##$USERA2= <user>
##$USERA3= <user>
##$USERA4= <user>
##$USERA5= <user>
##$V9= 5
##$VALIST= <valist>
##$VCLIST= <CCCCCCCCCCCCCCC>
##$VD= 0
##$VDLIST= <DDDDDDDDDDDDDDD>
##$VPLIST= <PPPPPPPPPPPPPPP>
##$VTLIST= <TTTTTTTTTTTTTTT>
##$WBST= 1024
##$WBSW= 4
##$XGAIN= (0..3)
0 0 0 0 
##$XL= 0
##$YL= 0
##$YMAX_a= 12928
##$YMIN_a= -13287
##$ZGOPTNS= <>
##$ZL1= 120
##$ZL2= 120
##$ZL3= 120
##$ZL4= 120
##$ABSF1= 182.463
##$ABSF2= -187.1042
##$ABSG= 5
##$ABSL= 3
##$ALPHA= 0
##$AQORDER= 0
##$ASSFAC= 0
##$ASSFACI= 0
##$ASSFACX= 0
##$ASSWID= 0
##$AUNMP= <proc_1d>
##$AZFE= 0.1
##$AZFW= 0.5
##$BCFW= 0
##$BC_mod= 2
##$BYTORDP= 0
##$COROFFS= 0
##$CY= -3
##$DATMOD= 1
##$DC= 0
##$DFILT= <>
##$DTYPP= 0
##$F1P= 0
##$F2P= 0
##$FCOR= 1
##$FTSIZE= 65536
##$FT_mod= 6
##$GAMMA= 0
##$GB= 0
##$INTBC= 1
##$INTSCL= 5.30512e-09
##$ISEN= 30
##$LB= 1
##$LEV0= 0
##$LPBIN= 0
##$MAXI= 10000
##$MC2= 0
##$MEAN= 0
##$ME_mod= 0
##$MI= 50
##$NCOEF= 0
##$NC_proc= -4
##$NLEV= 6
##$NOISF1= 182.463
##$NOISF2= 159.3651
##$NSP= 0
##$NTH_PI= 0
##$NZP= 0
##$OFFSET= 182.463
##$PC= 4
##$PHC0= -1671.148
##$PHC1= 769.2014
##$PH_mod= 1
##$PKNL= yes
##$PPARMOD= 0
##$PSCAL= 0
##$PSIGN= 0
##$REVERSE= no
##$SF= 81.0140089999434
##$SI= 65536
##$SIGF1= 159.3651
##$SIGF2= -187.1042
##$SINO= 113.3802
##$SIOLD= 16384
##$SREGLST= <1H.CDCl3>
##$SSB= 0
##$STSI= 65536
##$STSR= 0
##$SW_p= 29940.119760479
##$SYMM= 0
##$S_DEV= 0
##$TDeff= 32768
##$TDoff= 0
##$TI= <>
##$TILT= no
##$TM1= 0
##$TM2= 0
##$TOPLEV= 0
##$USERP1= <user>
##$USERP2= <user>
##$USERP3= <user>
##$USERP4= <user>
##$USERP5= <user>
##$WDW= 1
##$XDIM= 65536
##$YMAX_p= 376352263
##$YMIN_p= -2633374
$$ End of Bruker specific parameters
$$ ---------------------------------
##NTUPLES= NMR SPECTRUM
##VAR_NAME=  FREQUENCY,     SPECTRUM/REAL,   SPECTRUM/IMAG
##SYMBOL=    X,             R,               I
##VAR_TYPE=  INDEPENDENT,   DEPENDENT,       DEPENDENT
##VAR_FORM=  AFFN,          ASDF,            ASDF
##VAR_DIM=   65536,         65536,           65536
##UNITS=     HZ,            ARBITRARY UNITS, ARBITRARY UNITS
##FACTOR=    0.456856943014862, 1,           1
##FIRST=     14782.0589164792, 0,            0
##LAST=      -15158.0608439998, 0,           0
##MIN=       -15158.0608439998, -2633374,    0
##MAX=       14782.0589164792, 376352263,    0
$$ Real data points
##PAGE= N=1
##DATA TABLE= (X++(R..R)), XYDATA
$$ [...]
$$ plain form
37022 -265360 -231305 249155 682815 631044 258200 25616 71658 144653 25296 -215217
37012 -215217 -351559 -251989 9347 217624 222552 117626 150694 405043 644770 557846
37002 557846 111415 -403338 -653172 -535520 -200533 124298 309018 356812 318232 216269
36992 216269 60846 -115625 -277067 -403501 -458226 -387188 -205675 -31601 42243 61082
36982 61082 106010 129858 19309 -192952 -311365 -208054 23292 182802 167856 38448
36972 38448 -60507 -27047 92476 121323 -67189 -387550 -616096 -618503 -450307 -261534 -176418
36961 -176418 -233553 -347574 -351217 -176216 27441 57566 -81830 -206005 -197069 -80799 103402
36950 103402 314217 402196 231934 -39749 -57391 251127 522318 444952 179885 79408
$$ packed form
37022b65360L4055M80460M33660n1771l72844k32584M6042P2995j19357k40513
37012b15217j36342R9570K61336K08277M928j04926L3068K54349K39727q6924
37002E57846m46431n14753k49834J17652L34987L24831J84720M7794l8580j01963
36992B16269j55423j76471j61442j26434n4725P1038J81513J74074P3844J8839
36982F1082M4928K3848j10549k12261j18413J03311K31346J59510j4946j29408
36972C8448r8955L3460J19523K8847j88512l20361k28546k407J68196J88773Q5116
36961a76418n7135j14021l643J75001K03657L0125j39396j24175Q936J16270J84201
36950A03402K10815Q7979j70262k71683j7642L08518K71191p7366k65067j00477
$$ plain form
36940 79408 171746 193878 28905 -169900 -257196 -246232 -174165 -37328 98859 100765 -72031
36929 -72031 -320351 -519659 -572182 -403788 -75265 158621 109847 -57681 -37637 149284
36919 149284 181556 -46391 -259728 -251115 -160320 -138679 -59845 181834 363062 239931 -35841
36908 -35841 -137909 -50290 783 -30725 -18116 1604 -107334 -217135 -52678 308309 470863
36897 470863 334393 239843 366441 423846 185593 -81412 -55552 107564 72245 -109799
36887 -109799 -161123 -126438 -292249 -628402 -756001 -499491 -98912 171600 259991 176755
36877 176755 -54966 -204363 37995 570473 851693 577141 97743 -87336 4583 1386
36867 1386 -186339 -272239 -88185 184456 333126 375943 395136 342548 176765 35869 79193
$$ packed form
36940G9408R2338K2132j64973j98805q7296J0964P2067J36837J36187J906j72796
36929g2031k48320j99308n2523J68394L28523K33886m8774j67528K0044J86921
36919A49284L2272k27947k13337Q613R0795K1641P8834K41679J81228j23131k75772
36908c5841j02068Q7619N1073l1508J2609J9720j08938j09801J64457L60987J62554
36897D70863j36470r4550J26598N7405k38253k67005K5860J63116l5319j82044
36887a09799n1324L4685j65811l36153j27599K56510M00579K70512Q8391q3236
36877A76755k31721j49397K42358N32478K81220k74552m79398j85079R1919l197
36867A386j87725q5900J84054K72641J48670M2817J9193n2588j65783j40896M3324
$$ plain form
36856 79193 233101 281532 185711 121241 161336 125240 -126163 -402840 -403810 -144466 72690
36845 72690 97848 82479 145189 179496 127018 159565 372398 539499 445876 255617 231555
36834 231555 271587 111383 -135696 -90672 263399 518238 458121 302718 227320 85378
36824 85378 -201984 -393771 -327601 -225142 -319144 -477997 -491962 -449068 -503700 -520440 -299841
36813 -299841 35323 224314 274411 347551 401579 304637 177163 240085 406159 397390 215259
36802 215259 119823 166990 148476 11858 -32656 103810 229621 192853 77719 -4466 -59557
36791 -59557 -76533 -14990 3069 -231405 -649088 -883752 -743895 -454731 -296422 -242954
36781 -242954 -125428 56170 175480 189636 144955 78876 29785 39947 70569 32217 -49470
$$ packed form
36856G9193J53908M8431r5821o4470M0095l6096k51403k76677r70K59344K17156
36845G2690K5158j5369O2710L4307n2478L2547K12833J67101r3623j90259k4062
36834B31555M0032j60204k47079M5024L54071K54839o0117j55403p5398j41942
36824H5378k87362j91787O6170J02459r4002j58853j3965M2894n4632j6740K20599
36813b99841L35164J88991N0097P3140N4028r6942j27474O2922J66074q769j82131
36802B15259r5436M7167j8514j36618m4514J36466J25811l6768j15134q2185n5091
36791e9557j6976O1543J8059k34474m17683k34664J39857K89164J58309N3468
36781b42954J17526J81598J19310J4156m4681o6079m9091J0162L0622l8352q1687
$$ plain form
36770 -49470 -47798 40866 70113 933 -20844 64656 96893 -41890 -224965 -289212 -272187
36759 -272187 -290459 -336187 -344641 -325587 -292799 -205085 -100812 -125230 -286687 -371625 -272521
36748 -272521 -206885 -389835 -662164 -712094 -541397 -415213 -414595 -343468 -83958 235397 478831
36737 478831 664000 792007 732104 423411 55906 -106275 -26540 96180 94703 5367
36727 5367 -41985 -22145 -32228 -130779 -243809 -275194 -244303 -229105 -213724 -106989 89624
36716 89624 247878 273607 209646 156095 170552 250138 317173 234065 -46247 -356639 -484154
36705 -484154 -442459 -398783 -355263 -157535 147512 264576 85041 -117140 -111651 -67208 -231978
36694 -231978 -490055 -550603 -419933 -338830 -329535 -161903 214684 526465 552349 401718
$$ packed form
36770d9470J672Q8664K9247o9180k1777Q5500L2237j38783j83075o4247J7025
36759b72187j8272m5728q454J9054L2788Q7714J04273k4418j61457q4938R9104
36748b72521O5636j82950k72329m9930J70697J26184O18P1127K59510L19355K43434
36737D78831J85169J28007n9903l08693l67505j62181P9735J22720j477q9336
36727E367m7352J9840j0083r8551j13030l1385L0891J5198J5381J06735J96613
36716H9624J58254K5729o3961n3551J4457P9586O7035q3108k80312l10392j27515
36705d84154M1695M3676M3520J97728L05047J17064j79535k02181N489M4443j64770
36694b31978k58077o0548J30670Q1103R295J67632L76587L11781K5884j50631
$$ plain form
36684 401718 305622 321561 370271 423056 505815 577203 524380 294687 -14164 -223382 -245191
36673 -245191 -171294 -151404 -203727 -224148 -168617 -101264 -43981 72645 257482 410814 490608
36662 490608 555387 565583 358026 -42356 -304946 -194467 88108 194752 102326 33367
36652 33367 33559 -66201 -311628 -525684 -549072 -366467 -17874 403667 696522 712118 558926
36641 558926 456349 435878 395565 368064 454412 538805 398694 124462 95533 433316 767553
36630 767553 702947 297799 -81456 -211473 -162114 -115916 -173633 -277872 -263163 -39396
36620 -39396 270424 467725 526361 567010 618197 589244 480572 420379 457320 495672 469544
36609 469544 410949 328448 207243 146402 282133 533371 638530 504297 312345 220789
$$ packed form
36684D01718r6096J5939M8710N2785Q2759P1388n2823k29693l08851k09218k1809
36673b45191P3897J9890n2323k0421N5531O7353N7283J16626J84837J53332P9794
36662D90608O4779J0196k07557m00382k62590J10479K82575J06644r2426o8959
36652C3367J92r9760k45427k14056k3388J82605L48593M21541K92855J5596j53192
36641E58926j02577k0471m0313k7501Q6348Q4393j40111k74232k8929L37783L34237
36630G67553o4606m05148l79255j30017M9359M6198n7717j04239J4709K23767
36620c9396L09820J97301N8636M0649N1187k8953j08672o0193L6941L8352k6128
36609D69544n8595q2501j21205o0841J35731K51238J05159j34233j91952r1556
$$ plain form
36599 220789 174293 85265 -10814 -75610 -150643 -231424 -240086 -191172 -187740 -193745 -40717 257224
36587 257224 440572 367174 198878 107408 46661 -38215 -40747 74333 109971 -68230 -281607
36576 -281607 -309250 -216589 -173543 -126689 70141 328957 415296 296508 162451 143131 205522
36565 205522 286726 355491 381383 371682 366849 302538 21508 -441203 -761983 -707072 -445828
36554 -445828 -284694 -268143 -286463 -385846 -639235 -837162 -679727 -240332 98807 166104
36544 166104 138761 166098 194926 212518 319219 457073 386335 82324 -129064 -19753
36534 -19753 199985 208114 40166 -21264 101971 210274 160921 32014 -71650 -166605 -258721
36523 -258721 -225490 18191 307842 354992 108733 -157495 -208206 -164150 -296056 -582917
$$ packed form
36599B20789m6496q9028r6079o4796p5033q0781q662M8914L432o005J53028K97941
36587B57224J83348p3398j68296r1470o0747q4876k532J15080L5638j78201k13377
36576b81607k7643R2661M3046M6854J96830K58816Q6339j18788j34057j9320O2391
36565B05522Q1204O8765K5892r701m833o4311k81030m62711l20780N4911K61244
36554d45828J61134J6551j8320r9383k53389j97927J57435M39395L39139O7297
36544A66104k7343K7337K8828J7592J06701J37854p0738l04011k11388J09311
36534a9753K19738Q129j67948o1430J23235J08303m9353j28907j03664r4955r2116
36523b58721L3231K43681K89651M7150k46259k66228n0711M4056j31906k86861
$$ plain form
36513 -582917 -706140 -495309 -147233 75472 144569 148756 98420 26224 89543 345376 566033
36502 566033 519615 322898 263517 360270 378277 237859 118995 138732 183408 124573 -1364
36491 -1364 -93891 -117368 -99312 -124322 -296681 -555224 -607084 -280411 123480 138493 -210351
36480 -210351 -405867 -166457 184412 242789 83346 27756 106232 84176 -94519 -212845
36470 -212845 -123960 58100 161264 177480 206489 274647 292416 184815 25955 -10196 129440
36459 129440 272916 246357 144612 201598 399906 443422 201393 -53388 -23782 173450
36449 173450 181778 -80366 -332462 -350968 -238485 -196074 -209168 -112310 110452 255545 165537
36438 165537 -45800 -136440 -68281 -65910 -297526 -613690 -719506 -547807 -329119 -299114
$$ packed form
36513e82917j23223K10831L48076K22705O9097M187n0336p2196O3319K55833K20657
36502E66033m6418j96717n9381R6753J8007j40418j18864J9737M4676n8835j25937
36491a364r2527k3477J8056k5010j72359k58543n1860L26673M03891J5013l48844
36480b10351j95516K39410L50869N8377j59443n5590P8476k2056j78695j18326
36470b12845Q8885J82060J03164J6216K9009O8158J7769j07601j58860l6151J39636
36459A29440J43476k6559j01745N6986J98308M3516k42029k54781K9606J97232
36449A73450Q328k62144k52096j8506J12483M2411j3094R6858K22762J45093r0008
36438A65537k11337r0640O8159K371k31616l16164j05816J71699K18688L0005
$$ plain form
36428 -299114 -449063 -582054 -536582 -342440 -196685 -248963 -374683 -274658 98151 365313
36418 365313 185570 -228809 -354364 -74686 185005 98047 -134684 -154823 50131 239398
36408 239398 292832 244255 101230 -115238 -249924 -162485 60619 228501 311685 404004
36398 404004 490119 454394 291376 128011 52041 63639 153342 269604 264113 59524 -164335
36387 -164335 -161106 14263 49776 -186301 -478977 -600533 -582578 -540749 -446639 -258260 -112875
36376 -112875 -159203 -285668 -252834 -67076 17637 -102223 -225121 -189276 -140275 -262817
36366 -262817 -424451 -356994 -102690 31531 -34921 -44689 120293 190415 -42566 -323827
36356 -323827 -310551 -136767 -197861 -474900 -525669 -177386 212864 331200 341648 506678
$$ packed form
36428b99114j49949j32991M5472J94142J45755n2278j25720J00025L72809K67162
36418C65313j79743m14379j25555K79678K59691q6958k32731k0139K04954J89267
36408B39398N3434m8577j43025k16468j34686Q7439K23104J67882Q3184R2319
36398D04004Q6115l5725j63018j63365p5970J1598Q9703J16262n491k04589k23859
36387a64335L229J75369L5513k36077k92676j21556J7955M1829R4110J88379J45385
36376a12875m6328j26465L2834J85758Q4713j19860j22898L5845M9001j22542
36366b62817j61634O7457K54304J34221o6452r768J64982P0122k32981k81261
36356c23827J3276J73784o1094k77039n0769L48283L90250J18336J0448J65030
$$ plain form
36346 506678 696140 598245 229819 -77846 -110938 57930 260427 369425 298423 67207
36336 67207 -158469 -245442 -256651 -293715 -271558 -47625 285435 452859 338717 99010
36326 99010 -62652 -76544 26072 171963 268113 291956 343849 492166 617453 561628 380962
36315 380962 271034 273976 254012 145576 18378 -103800 -266017 -396780 -332734 -97665
36305 -97665 60421 3854 -124381 -164438 -159545 -173352 -101857 127944 337450 315113 150592
36294 150592 102004 189266 183824 7091 -125176 -38017 147829 233963 244700 326979 453473
36283 453473 432730 202164 -66704 -196056 -197367 -176269 -160038 -119243 -82873 -112050 -186029
36272 -186029 -218121 -179096 -113728 -38359 74618 190750 200504 70132 -76673 -101111 -18088
$$ packed form
36346E06678J89462r7895l68426l07665l3092J68868K02497J08998p1002k31216
36336F7207k25676q6973j1209l7064K2157K23933L33060J67424j14142k39707
36326I9010j61662j3892J02616J45891R6150K3843N1893J48317J25287n5825j80666
36315C80962j09928K942j9964j08436j27198j22178j62217j30763O4046K35069
36305i7665J58086n6567j28235m0057M893j3807P1495K29801K09506k2337j64521
36294A50592m8588Q7262n442j76733j32267Q7159J85846Q6134J0737Q2279J26494
36283D53473k0743k30566k68868j29352j311K1098J6231M0795L6370k9177p3979
36272a86029l2092L9025O5368P5369J12977J16132R754j30372j46805k4438Q3023
$$ plain form
36261 -18088 50062 48690 40280 92609 190936 276554 322083 334807 303987 188516 -12469 -196722
36249 -196722 -233498 -129314 -53030 -134429 -293695 -349614 -242842 -52074 156280 358894
36239 358894 489942 482788 394496 333904 268173 81640 -157742 -205548 17854 298881 438793
36228 438793 487249 546403 550586 418899 258356 214328 242812 222330 182928 230355 334392
36217 334392 385168 386181 409430 427840 369505 273194 218983 172160 62869 -55753 -94760
36206 -94760 -78949 -36279 129056 427418 589736 384927 37324 -17684 240032 398614
36196 398614 247065 43442 44224 126238 69106 -74750 -123677 -75016 -48175 -64282 -71656
36185 -71656 -75777 -87108 -48241 53757 122289 127332 208630 447405 667478 656349 489789
$$ packed form
36261a8088O8150j372q410N2329R8327Q5618M5529J2724l0820j15471k00985j84253
36249a96722l6776J04184P6284q1399j59266n5919J06772J90768K08354K02614
36239C58894J31048p154q8292o0592o5731j86533k39382m7806K23402K81027J39912
36228D38793M8456N9154M183j31687j60543m4028K8484k0482l9402M7427J04037
36217C34392N0776J013K3249J8410n8335r6311n4211m6823j09291j18622l9007
36206i4760J5811M2670J65335K98362J62318k04809l47603n5008K57716J58582
36196C98614j51549k03623P82Q2014n7132j43856m8927M8661K6841j6107p374
36185g1656m121j1331L8867J01998O8532N043Q1298K38775K20073j1129j66560
$$ plain form
36174 489789 425272 517414 554516 397655 196432 182475 359137 500454 433882 254367
36164 254367 227889 492024 886025 1105424 1000709 681872 360851 169831 125528 170297
36154 170297 205202 149630 23234 -57648 1637 166679 294322 265380 115931 24777 119679
36143 119679 310458 404483 373783 354942 364204 230348 -85675 -335920 -331388 -225935 -214547
36132 -214547 -156959 171160 604147 754421 595865 483547 578959 640577 462135 165607
36122 165607 -61984 -219098 -350685 -427365 -476284 -577788 -640758 -457931 -86108 121325
36112 121325 -9286 -241948 -307077 -225480 -125876 -40044 -31555 -218259 -492774 -535544 -292961
36101 -292961 -106035 -151136 -131148 185506 498984 441739 190438 161866 329770 324860 79775
$$ packed form
36174D89789o4517R2142L7102j56861k01223j3957J76662J41317o6572j79515
36164B54367k6478K64135L94001K19399j04715l18837l21021j91020m4303M4769
36154A70297L4905n5572j26396q0882N9285J65042J27643k8942j49449r1154R4902
36143A19679J90779R4025l0700j8841R262j33856l16023k50245M532J05453J1388
36132b14547N7588L28119M32987J50274j58556j12318R5412O1618j78442k96528
36122A65607k27591j57114j31587p6680m8919j01504o2970J82827L71823K07433
36112A21325j30611k32662o5129Q1597R9604Q5832Q489j86704k74515m2770K42583
36101b92961J86926m5101J9988L16654L13478n7245k51301k8572J67904m910k45085
$$ plain form
36090 79775 -90817 -5729 183958 293324 273809 127238 -48038 2122 382172 754356
36080 754356 684268 222261 -190737 -337797 -389162 -486259 -545177 -510253 -464422 -426304 -321430
36069 -321430 -191636 -164409 -200698 -146102 -30817 -27378 -111462 -74308 116394 287141 406018
36058 406018 615734 870359 891045 583295 187597 -79853 -238477 -321883 -279487 -209043
36048 -209043 -347341 -672481 -825049 -599058 -229411 -20602 29974 56303 55985 20350 84858
36037 84858 309537 503537 483316 330150 204987 100324 -26378 -65447 75528 265312
36027 265312 310601 189376 -29629 -317537 -563083 -531028 -170173 216005 342357 317173
36017 317173 396555 535982 490832 252376 68632 74621 177528 283515 379939 402124 272214
$$ packed form
36090G9775j70592Q5088J89687J09366j9515j46571j75276N0160L80050L72184
36080G54356p0088m62007m12998j47060n1365r7097n8918L4924M5831L8118J04874
36069c21430J29794K7227l6289N4596J15285L439q4084L7154J90702J70747J18877
36058D06018K09716K54625K0686l07750l95698k67450j58624q3406M2396P0444
36048b09043j38298l25140j52568K25991L69647K08809N0576K6329l18l5635O4508
36037H4858K24679J94000k0221j53166j25163j04663j26702l9069J40975J89784
36027B65312M5289j21225k19005k87908k45546L2055L60855L86178J26352k5184
36017C17173P9382J39427m5150k38456j83744N989J02907J05987R6424K2185j29910
$$ plain form
36006 272214 96524 99448 308923 488251 433978 196656 -36743 -153058 -159985 -115671 -53523
35995 -53523 52179 220066 345674 263961 3323 -164808 -71580 87914 32268 -177840
35985 -177840 -234482 -50977 136263 152571 109637 157698 234149 202242 90818 34734 50150
35974 50150 12787 -150409 -347489 -424835 -338753 -190803 -96160 -51958 21333 127521 172591
35963 172591 126589 112041 245540 447980 508613 320030 -19594 -320356 -459227 -446706
35953 -446706 -390995 -388332 -425871 -420399 -354642 -301974 -291655 -242086 -86526 112034 236769
35942 236769 245538 172836 74052 15777 41487 95925 67226 -51329 -141161 -142409 -131992 -158875
35930 -158875 -149947 -73191 -45995 -159181 -326469 -437002 -521658 -623208 -640438 -479456 -248163
$$ packed form
36006B72214j75690K924K09475J79328n4273k37322k33399j16315o927M4314O2148
35995e3523J05702J67887J25608q1713k60638j68131R3228J59494n5646k10108
35985a77840n6642J83505J87240J6308m2934M8061P6451l1907j11424n6084J5416
35974E0150l7363j63196j97080p7346Q6082J47950R4643M4202P3291J06188M5070
35963A72591m6002j4548J33499K02440O0633j88583l39624l00762j38871J2521
35953d46706N5711K663l7539N472O5757N2668J0319M9569J55560J98560J24735
35942B36769Q769p2702r8784n8275K5710N4438k8699j18555q9832j248J0417k6883
35930a58875Q928P6756K7196j13186j67288j10533q4656j01550j7230J60982K31293
$$ plain form
35919 -248163 -118220 -89132 -63152 -46168 -77582 -65456 81329 233579 190099 -8288 -147830
35908 -147830 -180244 -242868 -363350 -407035 -337288 -279963 -285757 -257180 -163003 -103323 -97348 -23470
35896 -23470 144199 239914 150359 -12576 -79881 -20363 109656 260135 352307 300469 152455
35885 152455 68564 87199 61367 -92648 -242620 -236131 -103203 40667 154413 226182 206504
35874 206504 109895 63665 135290 220689 211988 152082 105036 13785 -158861 -276700 -207051
35863 -207051 -59480 -48861 -180685 -276379 -277612 -304522 -388379 -356199 -75344 322169 561389
35852 561389 503215 244838 4998 -43397 119247 367992 564164 674769 728429 696253
35842 696253 523781 280513 142413 167462 211302 161457 133857 270077 414285 231456
$$ packed form
35919b48163J29943K9088K5980J6984l1414J2126J46785J52250m3480j98387j39542
35908a47830l2414o2624j20482m3685O9747N7325n794K8577R4177N9680N975P3878
35896b3470J67669R5715q9555j62935o7305N9518J30019J50479R2172n1838j48014
35885A52455q3891J8635k5832j54015j49972O489J32928J43870J13746P1769j9678
35874B06504r6609m6230P1625Q5399q701n9906m7046r1251j72646j17839O9649
35863b07051J47571J0619j31824r5694j233k6910q3857L2180K80855L97513K39220
35852E61389n8174k58377k39840m8395J62644K48745J96172J10605N3660l2176
35842F96253j72472k43268j38100K5049M3840m9845k7600J36220J44208j82829
$$ plain form
35832 231456 -307586 -783775 -812306 -499671 -230239 -130200 -7154 227872 390940 349136
35822 349136 234430 187325 125602 -35725 -145492 -56632 51042 -102826 -427126 -536097
35812 -536097 -296483 11671 134447 146172 197037 223045 81137 -212874 -537838 -795619
35802 -795619 -849629 -534454 67049 518295 459305 64356 -170185 -46190 176556 227133
35792 227133 148820 93469 42358 -83841 -186849 -80035 219041 459574 446310 240089
35782 240089 36323 -56088 -56573 -12595 53388 120603 164965 178338 154230 74243 -46077
35771 -46077 -131603 -135846 -120888 -156270 -169576 -31245 214778 371421 384081 436473 650241
35760 650241 859573 845330 666685 570115 642398 740462 729662 620396 473593 305265
$$ packed form
35832B31456n39042m76189k8531L12635K69432J00039J23046K35026J63068m1804
35822C49136j14706m7105o1723j61327j09767Q8860J07674j53868l24300j08971
35812e36097K39614L08154J22776J1725N0865K6008j41908k94011l24964k57781
35802g95619n4010L15175O01503M51246n8990l94949k34541J23995K22746N0577
35792B27133p8313n5351n1111j26199j03008J06814K99076K40533j3264k06221
35782B40089k03766r2411m85M3978O5983O7215M4362J3373k4108p9987j20320
35771d6077q5526m243J4958l5382j3306J38331K46023J56643J2660N2392K13768
35760F50241K09332j4243j78645r6570P2283R8064j0800j09266j46803j68328
$$ plain form
35750 305265 85850 -244237 -698203 -1098899 -1135638 -717834 -158935 170170 252259 285472
35740 285472 288256 144887 -54868 -81526 45751 88775 27939 109376 392919 616350 615285
35729 615285 525472 443795 263388 19354 6149 292026 471982 223046 -195673 -343979
35719 -343979 -234464 -177793 -209852 -106680 147017 321261 329946 298008 270509 191668 151805
35708 151805 317390 606126 750855 709032 693626 757754 678355 353712 20964 -69858
35698 -69858 30761 130679 181031 254649 374803 493213 553669 505548 336641 129007 -4035
35687 -4035 -40691 -15001 100746 327985 533875 547992 426767 395845 502217 533846 345186
35676 345186 68282 -84537 -70073 7765 30684 -76322 -283159 -418122 -342080 -170912
$$ packed form
35750C05265k19415l30087m53966m00696l6739M17804N58899L29105Q2089L3213
35740B85472K784j43369j99755k6658J27277M3024o0836Q1437K83543K23431j065
35729F15285q9813q1677j80407k44034j3205K85877J79956k48936m18719j48306
35719c43979J09515N6671l2059J03172K53697J74244Q685l1938k7499p8841l9863
35708A51805J65585K88736J44729m1823j5406O4128p9399l24643l32748r0822
35698f9858J00619R9918N0352P3618J20154J18410O0456m8121j68907k07634j33042
35687d035l6656K5690J15747K27239K05890J4117j21225l0922J06372L1629j88660
35676C45186k76904j52819J4464P7838K2919j07006k06837j34963P6042J71168
$$ plain form
35666 -170912 -137581 -216362 -123535 234734 565268 580149 378620 262126 322420 395365 328004
35655 328004 138435 -33512 -41608 133207 312984 286981 77952 -93040 -126245 -124830 -107638
35644 -107638 94292 511959 861115 898940 749001 640705 529783 273657 25380 88679
35634 88679 424449 647142 549816 334908 247072 249682 197285 105553 71572 70889 18591 -43050
35622 -43050 10496 167193 246488 124717 -102168 -246764 -263676 -259281 -279569 -219441 -17746
35611 -17746 176933 188592 90012 94859 194952 150017 -110844 -340265 -349868 -277736 -279782
35600 -279782 -197025 172404 632981 775756 549423 312518 302701 374335 341905 285995 356200
35589 356200 483482 481028 319669 149914 103729 166305 204712 85834 -177053 -388089
$$ packed form
35666a70912L3331p8781R2827L58269L30534J4881k01529j16494O0294P2945o7361
35655C28004j89569j71947q096J74815J79777k6003k09029j70992l3205J415J7192
35644a07638K01930M17667L49156L7825j49939j08296j10922k56126k48277O3299
35634H8679L35770K22693r7326k14908q7836K610n2397r1732l3981o83n2298o1641
35622d3050N3546J56697P9295j21771k26885j44596j6912M395k0288O0128K01695
35611a7746J94679J1659r8580M847J00093m4935k60861k29421r603P2132k046
35600b79782Q2757L69429M60577J42775k26333k36905r817P1634l2430n5910P0205
35589C56200J27282k454j61359j69755m6185O2576L8407j18878k62887k11036
$$ plain form
35579 -388089 -359069 -125673 123070 285423 362136 283521 -32358 -420842 -537919 -296744
35569 -296744 -7278 50327 -36545 -62079 -45425 -86972 -85563 100511 339498 385959 276278
35558 276278 240859 258421 58015 -380020 -677249 -564735 -254728 -106537 -143715 -134649
35548 -134649 4466 137231 158107 93870 -10556 -116732 -120736 62861 333085 474486
35538 474486 423387 329013 323886 370231 383669 380529 415177 453952 403236 231748 12267
35527 12267 -138741 -150641 -71132 -50122 -181503 -354373 -353405 -131386 126298 258967 331633
35516 331633 482039 668930 713241 545286 280149 62133 -53987 -76945 -45600 -27056
35506 -27056 -53018 -57110 33177 157145 190990 152233 190382 345247 462836 411476 242424
$$ packed form
35579c88089K9020K33396K48743J62353P6713p8615l15879l88484j17077K41175
35569b96744K89466N7605q6872k5534J6654m1547J409J86074K38987M6461j09681
35558B76278l5419J7562k00406m38035k97229J12514L10007J48191l7178R066
35548a34649J39115J32765K0876o4237j04426j06176m004J83597K70224J41401
35538D74486n1099r4374n127M6345J3438l140L4648L8775n0716j71488k19481
35527A2267j51008j1900P9509K1010j31381j72870R68K22019K57684J32669P2666
35516C31633J50406J86891M4311j67955k65137k18016j16120k2958L1345J8544
35506b7056k5962m092R0287J23968L3845l8757L8149J54865J17589n1360j69052
$$ plain form
35495 242424 63146 -98223 -196858 -100426 215080 515383 552792 385914 246352 150316
35485 150316 -88602 -449449 -606171 -367642 26699 237963 267476 336100 458183 422459
35475 422459 178355 -25794 34521 286443 497314 543451 458014 341997 326465 505955
35465 505955 785739 882668 617333 160700 -133957 -114784 67435 205876 238919 198380
35455 198380 109529 13254 -13219 54812 126084 82176 -89529 -279697 -352452 -257607 -92927
35444 -92927 -49248 -227318 -507165 -674784 -675035 -631640 -605419 -484894 -196047 119642 271554
35433 271554 273619 287443 371297 435100 415138 348279 280336 233060 256455 376758 491478
35422 491478 465497 346720 318840 396593 357225 80861 -212760 -234341 -19188 136008
$$ packed form
35495B42424j79278j61369r8635R6432L15506L00303L7409j66878j39562r6036
35485A50316k38918l60847j56722K38529L94341K11264K9513O8624J22083l5724
35475D22459k44104k04149O0315K51922K10871M6137q5437j16017j5532J79490
35465E05955K79784R6929k65335m56633k94657J9173J82219J38441L3043m0539
35455A98380q8851r6275k6473O8031P1272m3908j71705j90168p2755R4845J64680
35444i2927M3679j78070k79847j67619k51M3395K6221J20525K88847L15689J51912
35433B71554K065J3824Q3854O3803j9962o6859o7943m7276K3395J20303J14720
35422D91478k5981j18777k7880P7753l9368k76364k93621k1581K15153J55196
$$ plain form
35412 136008 77474 -45365 -16839 205754 507143 728815 737236 508145 196350 12684
35402 12684 -22608 -93766 -291482 -427346 -268782 130507 489144 644382 673315 666014 561331
35391 561331 299310 10492 -81964 85948 356667 527256 529546 451866 429317 501093 559055
35380 559055 478165 307221 242811 368641 525112 523318 385233 252088 157390 60863 33350
35369 33350 194681 479167 663906 646417 513388 337025 124331 -14033 86782 341128
35359 341128 418571 185947 -101238 -203949 -239877 -407877 -613027 -640188 -520363 -437858
35349 -437858 -413413 -361442 -332907 -407938 -466642 -376705 -291417 -414427 -574129 -438056 -97354
35338 -97354 7304 -240154 -484043 -496083 -454990 -481652 -364204 5408 329359 342051
$$ packed form
35412A36008n8534j22839K8526K22593L01389K21672Q421k29091l11795j83666
35402A2684l5292p1158j97716j35864J58564L99289L58637J55238K8933p301j04683
35391E61331k62021k88818r2456J67912K70719J70589K290p7680k2549P1776N7962
35380E59055q0890j70944o4410J25830J56471j794j38085j33145r4698r6527k7513
35369C3350J61331K84486J84739j7489j33029j76363k12694j38364J00815K54346
35359C41128P7443k32624k87185j02711l5928j68000k05150k7161J19825Q2505
35349d37858K4445N1971K8535p5031n8704Q9937Q5288j23010j59702J36073L40702
35338i7354J04658k47458k43889j2040M1093k6662J17448L69612L23951J2692
$$ plain form
35328 342051 211317 186956 160609 -65523 -332325 -345462 -168874 -110423 -227557 -304486
35318 -304486 -242722 -135512 -4725 209048 407114 381752 125535 -146377 -285179 -309908
35308 -309908 -251882 -121953 -3728 40929 118654 328247 496949 367107 16704 -201210
35298 -201210 -145926 -17605 33898 108807 265836 329599 161652 -91535 -197473 -135622
35288 -135622 -51334 -28818 -32243 8788 129410 268692 259227 -6029 -389100 -637062 -703326
35277 -703326 -758697 -865401 -865403 -665962 -412120 -253322 -132851 46677 216782 262889 215548
35266 215548 161341 77089 -77618 -185935 -70769 253285 555959 625332 456945 226286
35256 226286 120618 172279 232559 141078 -92104 -332122 -494298 -547295 -395986 24071
$$ packed form
35328C42051j30734k4361k6347k26132k66802j3137J76588N8451j17134p6929
35318c04486O1764J07210J30787K13773J98066k5362k56217k71912j38802k4729
35308c09908N8026J29929J18225M4657P7725K09593J68702j29842l50403k17914
35298b01210N5284J28321N1503P4909J57029O3763j67947k53187j05938O1851
35288a35622Q4288K2516l425M1031J20622J39282r465k65256l83071k47962o6264
35277g03326n5371j06704kJ99441K53842J58798J20471J79528J70105M6107m7341
35266B15548n4207q4252j54707j08317J15166L24054L02674O9373j68387k30659
35256B26286j05668N1661O0280r1481k33182k40018j62176n2997J51309M20057
$$ plain form
35246 24071 513516 704751 489623 163372 43331 138977 315286 554002 848275 1013343
35236 1013343 857996 474824 159253 82139 186840 333476 389847 261203 3644 -149215
35226 -149215 -30721 242800 437831 496631 502787 458737 309517 116010 -19904 -146711
35216 -146711 -340154 -441047 -210986 235865 463677 268462 -67381 -193558 -113475 -32752
35206 -32752 -21037 -30416 -65645 -109555 -24723 228485 390682 191405 -223250 -435096 -319592
35195 -319592 -176384 -237671 -337852 -219868 70770 304748 408596 456751 449234 355079
35185 355079 310150 487543 758441 761420 398405 13310 -68193 40076 25974 -129675
35175 -129675 -171676 -9292 143432 103455 -31706 -70998 -11251 -2229 -104904 -203632 -162859
$$ packed form
35246B4071M89445J91235k15128l26251j20041R5646J76309K38716K94273J65068
35236A013343j55347l83172l15571p7114J04701J46636N6371j28644k57559j52859
35226a49215J18494K73521J95031N8800O156m4050j49220j93507j35914j26807
35216a46711j93443j00893K30061M46851K27812j95215l35843j26177Q0083Q0723
35206c2752J1715r379l5229m3910Q4832K53208J62197j99277m14655k11846J15504
35195c19592J43208o1287j00181J17984K90638K33978J03848M8155p517r4155
35185C55079m4929J77393K70898K979l63015l85095q1503J08269j4102j55649
35175a29675m2001J62384J52724l9977j35161l9292N9747R022j02675r8728M0773
$$ plain form
35164 -162859 -12850 59426 -75237 -303441 -375546 -221045 -53310 -85465 -252984 -344404
35154 -344404 -310372 -269747 -265460 -207997 -55435 120359 250854 306508 238653 53990 -87166
35143 -87166 -50379 24717 -101579 -361224 -438810 -269270 -138073 -187498 -186458 21372 199345
35132 199345 130085 29390 179858 391617 260965 -165785 -432050 -337424 -135682 -28581
35122 -28581 119468 420629 673279 652872 451826 311696 285773 268324 230605 227533 241230
35111 241230 194627 96514 39880 61810 100923 90399 22616 -68842 -128251 -86409 86127
35100 86127 320415 488646 528745 505190 513375 539275 477513 315745 220043 336141 548966
35089 548966 586981 383276 179745 205324 389305 490879 392577 155294 -102895 -255057
$$ packed form
35164a62859J50009P2276j34663k28204p2105J54501J67735l2155j67519r1420
35154c44404L4032M0625M287N7463J52562J75794J30495N5654o7855j84663j41156
35143h7166L6787P5096j26296k59645p7586J69540J31197m9425J040K07830J77973
35132A99345o9260j00695J50468K11759j30652m26750k66265R4626K01742J07101
35122b8581J48049L01161K52650k0407k01046j40130k5923j7449l7719l072J3697
35111B41230m6603r8113n6634K1930L9113j0524o7783r1458n9409M1842J72536
35100H6127K34288J68231M0099k3555Q185K5900o1762j61768r5702J16098K12825
35089E48966L8015k03705k03531K5579J83981J01574r8302k37283k58189j52162
$$ plain form
35079 -255057 -201736 -7808 87889 -46058 -228130 -202678 6071 171273 212375 230511
35069 230511 237197 116505 -109161 -227119 -142698 -40278 -114556 -283517 -295503 -44020
35059 -44020 313553 509049 400911 103789 -120204 -142868 -84619 -74591 -20382 202403
35049 202403 436182 393911 113667 -31946 152598 433778 518470 424317 327273 261933
35039 261933 173530 107478 140031 220246 252312 250344 265022 248925 144611 20096 -36296
35028 -36296 -78093 -200469 -344329 -365205 -255655 -142369 -88501 -47558 2444 28118 50252
35017 50252 145882 307613 410059 364691 238904 179706 251930 364561 337910 63901 -363363
35006 -363363 -690818 -710084 -415192 21628 369743 457196 299735 157960 329528 786986
$$ packed form
35079b55057N3321J93928R5697j33947j82072K5452K08749J65202M1102J8136
35069B30511O686j20692k25666j17958Q4421J02420p4278j68961j1986K51483
35059d4020L57573J95496j08138k97122k23993k2664N8249J0028N4209K22785
35049B02403K33779m2271k80244j45613J84544K81180Q4692r4153r7044o5340
35039B61933q8403o6052L2553Q0215L2066j968J4678j6097j04314j24515n6392
35028c6296m1797j22376j43860k0876J09550J13286N3868M0943N0002K5674K2134
35017E0252R5630J61731J02446m5368j25787n9198P2224J12631k6651k74009m27264
35006c63363l27455j9266K94892M36820L48115Q7453j57461j41775J71568M57458
$$ plain form
34996 786986 1134362 1045255 652929 369332 395154 570097 657644 592911 444260 302930
34986 302930 262311 371501 536209 557084 337877 3211 -234017 -274495 -172526 -31514
34976 -31514 91651 202181 320539 419488 419897 279006 69330 -78200 -110772 -88695 -82733
34965 -82733 -91687 -84638 -76585 -112082 -183269 -208817 -119301 52395 198858 256841 253179 211097
34953 211097 73984 -206661 -547099 -788419 -863833 -817562 -680346 -458445 -249837 -203000
34943 -203000 -296441 -319483 -174900 -48664 -134278 -324076 -371009 -268701 -238803 -358709
34933 -358709 -436491 -316116 -116547 -58005 -168697 -269874 -189962 70593 331719 356580
34923 356580 63725 -335703 -495040 -288572 55757 234157 198484 134043 177491 262446
$$ packed form
34996G86986L47376q9107l92326k83597K5822J74943Q7547o4733j48651j41330
34986C02930m0619J09190J64708K0875k19207l34666k37228m0478J01969J41012
34976c1514J23165J10530J18358R8949M09j40891k09676j47530l2572K2077N962
34965h2733q954P049Q053l5497p1187k5548Q9516J71696J46463N7983l662m2082
34953B11097j37113k80645l40438k41320p5414M6271J37216K21901K08608M6837
34943b03000r3441k3042J44583J26236q5614j89798m6933J02308K9898j19906
34933c58709p7782J20375J99569N8542j10692j01177P9912K60555K61126K4861
34923C56580k92855l99428j59337K06468L44329J78400l5673o4441M3448Q4955
$$ plain form
34913 262446 223861 -21070 -377632 -604234 -489123 -84972 272415 290348 50406 -98848
34903 -98848 25831 252650 321066 184902 -25754 -203006 -299226 -277934 -179023 -163971 -341175
34892 -341175 -589776 -703174 -656026 -561038 -422139 -163719 110788 168025 11110 -80173
34882 -80173 16752 77589 -59739 -187969 -80433 113316 140449 97812 229611 424312
34872 424312 352364 50210 -84380 87871 266836 245985 204770 304958 382072 260735
34862 260735 48980 -113137 -292207 -505141 -532356 -277506 -29028 -31617 -56761 220661
34852 220661 642452 797169 665341 560115 518255 269389 -171129 -400494 -259646 -105020
34842 -105020 -227553 -393814 -256995 81934 260273 201212 139996 205140 276784 239546
$$ packed form
34913B62446l8585k44931l56562k26602J15111M04151L57387J7933k39942j49254
34903i8848J24679K26819O8416j36164k10656j77252r6220K1292R8911J5052j77204
34892c41175k48601j13398M7148R4988J38899K58420K74507N7237j56915r1283
34882h0173R6925O0837j37328j28230J07536J93749K7133m2637J31799J94701
34872D24312p1948l02154j34590J72251J78965k0851m1215J00188P7114j21337
34862B60735k11755j62117j79070k12934k7215K54850K48478k589k5144K77422
34852B20661M21791J54717j31828j05226m1860k48866m40518k29365J40848J54626
34842a05020j22533j66261J36819L38929J78339n9061o1216O5144P1644l7238
$$ plain form
34832 239546 133215 31521 -50473 -97681 -72037 21518 120766 156950 77683 -120452 -313837
34821 -313837 -295257 -13757 299102 384884 288574 269212 409981 516467 432848 255235
34811 255235 132981 33481 -143991 -346347 -437923 -416773 -370450 -261330 23154 389143
34801 389143 537066 341338 36019 -117433 -179466 -363219 -644935 -781202 -671576 -476673
34791 -476673 -358334 -293834 -190442 -24614 180628 381762 486106 437101 357229 451000
34781 451000 719438 925963 902657 733785 570359 432456 292565 197266 182672 189647
34771 189647 171687 175646 224502 248233 230484 286827 475441 649809 625174 397743 107565
34760 107565 -105619 -141089 11962 176590 122657 -97239 -155471 76413 304607 253037
$$ packed form
34832B39546j06331j01694q1994m7208K5644R3555R9248L6184p9267j98135j93385
34821c13837J8580K81500L12859Q5782r6310j9362J40769J06486q3619j77613
34811B55235j22254r9500j77472k02356r1576K1150M6323J09120K84484L65989
34801C89143J47923j95728l05319j53452o2033j83753k81716j36267J09626J94903
34791d76673J18339O4500J03392J65828K05242K01134J04344m9005p9872R3771
34781D51000K68438K06525k3306j68872j63426j37903j39891r5299j4594O975
34771A89647j7960L959M8856K3731j7749N6343J88614J74368k4635k27431k90178
34760A07565k13184l5470J53051J64628n3933k19896n8232K31884K28194n1570
$$ plain form
34750 253037 73207 54226 154210 151280 92715 221529 532380 744247 689720 444083 112145
34739 112145 -221801 -375198 -207018 129647 344096 386404 404243 401631 278042 149644
34729 149644 236774 432383 399537 148391 77789 325105 518215 378510 163938 235948
34719 235948 524488 735911 819036 888867 888571 671135 310447 46405 -11599 92729 344145
34708 344145 733028 1111421 1278508 1192422 970512 739638 590906 573222 599265 474338
34698 474338 170290 -43786 83140 432490 658391 608019 423284 281275 217193 188256
34688 188256 155165 87425 -6559 -55361 -4816 101330 181541 215199 230804 257757 334674
34677 334674 477796 587652 496705 188980 -129916 -262984 -218381 -101453 57378 254943
$$ packed form
34750B53037j79830j8981R9984k930n8565J28814L10851K11867n4527k45637l31938
34739A12145l33946j53397J68180L36665K14449M2308J7839k612j23589j28398
34729A49644Q7130J95609l2846k51146p0602K47316J93110j39705k14572P2010
34719B35948K88540K11423Q3125O9831k96k17436l60688k64042n8004J04328K51416
34708C44145L88883L78393J67087q6086k21910k30874j48732j7684K6043j24927
34698D74338l04048k14076J26926L49350K25901n0372j84735j42009o4082k8937
34688A88256l3091o7740r3984m8802N0545J06146Q0211L3658J5605K6953P6917
34677C34674J43122J09856r0947l07725l18896j33068M4603J16928J58831J97565
$$ plain form
34667 254943 414870 466866 437564 351571 149159 -164706 -391653 -326932 -28486 237919
34657 237919 292888 179518 49217 14653 85487 167610 150867 43186 -31670 2905 93868
34646 93868 159266 166473 94985 -35938 -77781 125819 470296 644547 538097 371670 307750
34635 307750 190850 -132400 -483745 -611495 -580733 -594754 -571664 -257791 281734 635200
34625 635200 562772 274221 105291 125177 165187 92081 -49433 -108492 -3888 158898
34615 158898 205223 162083 272523 621081 901380 767638 313711 -44886 -112583 -74253
34605 -74253 -120677 -192635 -174658 -104795 -55840 24954 203051 377218 357111 101060 -212999
34594 -212999 -365306 -305184 -169525 -102697 -99180 -70346 -23045 -53293 -158285 -206261 -149444
$$ packed form
34667B54943J59927N1996k9302q5993k02412l13865k26947O4721K98446K66405
34657B37919N4969j13370j30301l4564P0834Q2123j6743j07681p4856L4575R0963
34646I3868O5398P207p1488j30923m1843K03600L44477J74251j06450j66427o3920
34635C07750j16900l23250l51345j27750L0762j4021K3090L13873N39525L53466
34625F35200p2428k88551j68930J9886M0010p3106j41514n9059J04604J62786
34615A58898M6325m3140J10440L48558K80299j33742m53927l58597o7697L8330
34605g4253m6424p1958J7977O9863M8955Q0794J78097J74167k0107k56051l14059
34594b12999j52307O0122J35659O6828L517K8834M7301l0248j04992m7976N6817
$$ plain form
34583 -149444 -109240 -157331 -179808 -99192 -66268 -227431 -422069 -355223 -21873 275671 334152
34572 334152 259853 231090 231964 113531 -179161 -519087 -708239 -661308 -488250 -355657 -258141
34561 -258141 -30514 356973 644175 546710 99510 -380439 -614369 -551582 -320995 -110561
34551 -110561 -45626 -96795 -142970 -145546 -155845 -141099 8891 239194 315481 169577 31783
34540 31783 61871 87151 -80288 -294265 -309061 -175751 -114474 -142022 -126145 -88514 -144459
34529 -144459 -226648 -167305 2480 104432 100798 79476 38441 -52283 -72483 80103 243150
34518 243150 215216 126222 244880 502282 582098 441798 356748 443792 518565 463033 381153
34507 381153 336848 264772 187114 201383 222840 72303 -151595 -147285 95407 252314 191053
$$ packed form
34583a49444M0204m8091k2477Q0616L2924j61163j94638O6846L33350K97544N8481
34572C34152p4299k8763Q74j18433k92692l39926j89152M6931J73058J32593R7516
34561b58141K27627L87487K87202r7465m47200m79949k33930O2787K30587K10434
34551a10561O4935n1169m6175k576j0299J4746J49990K30303P6287j45904j37794
34540C1783L0088K5280j67439k13977j4796J33310O1277k7548J5877L7631n5945
34529a44459q2189N9343J69785J01952l634k1322m1035r0724k0200J52586J63047
34518B43150k7934q8994J18658K57402P9816j40300q5050Q7044P4773n5532q1880
34507C81153m4305p2076p7658J4269K1457j50537k23898M310K42692J56907o1261
$$ plain form
34496 191053 149048 269701 355981 263366 177615 280794 442898 472409 419008 408185 391305
34485 391305 268605 91214 -28344 -66278 -40943 29407 59010 -29741 -125091 -44070 140916
34474 140916 163809 -5321 -99786 670 92675 26993 -61695 -47041 -26646 -88821 -150639
34463 -150639 -173841 -246957 -311581 -135619 262961 501427 362503 125443 123629 272334
34453 272334 315769 273290 321140 427862 417925 275672 139082 87433 112921 195145 280064
34442 280064 320742 408883 662406 926184 867470 467655 104195 12346 7589 -90126 -131370
34431 -131370 22963 188143 172829 116014 222133 420488 543480 579848 527634 308586
34421 308586 62354 155908 606479 880043 615066 162394 2956 24005 -126644 -317088
$$ packed form
34496A91053m2005J20653Q6280r2615q5751J03179J62104K9511n3401j0823j6880
34485C91305j22700j77391j19558l7934K5335P0350K9603q8751r5350Q1021J84986
34474A40916K2893j69130r4465J00456R2005o5682q8688J4654K0395o2175o1818
34463a50639k3202p3116o4624J75962L98580K38466j38924k37060j814J48705
34453B72334M3435m2479M7850J06722r937j42253j36590n1649K5488Q2224Q4919
34442B80064M0678Q8141K53523K63778n8714l99815l63460r1849m757r7715m1244
34431a31370J54333J65180j5314n6815J06119J98355J22992L6368n2214k19048
34421C08586k46232R3554M50571K73564k64977m52672j59438K1049j50649j90444
$$ plain form
34411 -317088 -155320 291757 592751 623479 596055 536937 297111 21229 46472 312365
34401 312365 373672 63967 -290306 -382747 -260068 -81684 89706 190920 171041 152188
34391 152188 301693 539873 642724 590360 518906 401430 125267 -172421 -231986 -115683
34381 -115683 -136815 -332396 -391752 -157559 169322 395988 564459 723291 787240 734764
34371 734764 688722 715409 763900 840918 1010728 1195783 1217589 1064746 901671 807515 724551
34360 724551 648249 641895 684647 714390 758900 808404 680137 293605 -45420 15774 338669
34349 338669 462940 261330 50416 74051 251206 437036 574244 575656 397352 226782
34339 226782 269635 389972 321729 172316 283855 618422 751974 519431 208572 45001
$$ packed form
34411c17088J61768M47077L00994L0728k7424n9118k39826k75882K5243K65893
34401C12365O1307l09705l54273r2441J22679J78384J71390J01214j9879j8853
34391A52188J49505K38180J02851n2364p1454j17476k76163k97688n9565J16303
34381a15683k1132j95581n9356K34193L26881K26666J68471J58832O3949n2476
34371G34764m6042K6687M8491P7018J69810J85055K1806j52843j63075r4156q2964
34360G24551p6302o354M2752K9743M4510M9504j28267l86532l39025O1194L22895
34349C38669J24271k01610k10914K3635J77155J85830J37208J412j78304j70570
34339B26782M2853J20337o8243j49413J11539L34567J33552k32543l10859j63571
$$ plain form
34329 45001 -63135 -176424 -174507 -82491 -117371 -264866 -218248 113832 438070 562360 648039
34318 648039 818248 924950 894314 903534 1002308 947867 655635 444414 562154 791755
34308 791755 804857 627115 488209 458129 477359 524366 534451 362876 20417 -256014
34298 -256014 -319508 -282091 -250659 -162094 -16228 20186 -85848 -103644 112583 398516 557186
34287 557186 596400 547697 346739 65871 -27067 169714 436135 584652 669347 697145
34277 697145 498302 106058 -95804 108982 413421 449667 322504 348392 497168 458234
34267 458234 136013 -225770 -353871 -187911 98130 191828 -96861 -564037 -776056 -588784
34257 -588784 -283618 -116496 -22603 116770 238243 301226 425865 632181 720196 596668
$$ packed form
34329D5001j08136j13289J917R2016l4880j47495M6618L32080L24238J24290Q5679
34318F48039J70209J06702l0636R220R8774n4441k92232k11221J17740K29601
34308G91755J3102j77742j38906l0080J9230M7007J0085j71575l42459k76431
34298b56014o3494L7417L1432Q8565J45866L6414j06034j7796K16227K85933J58670
34287E57186L9214m8703k00958k80868r2938J96781K66421J48517Q4695K7798
34277F97145j98843l92244k01862K04786L04439L6246j27163K5888J48776l8934
34267D58234l22221l61783j28101J65960K86041R3698k88689m67176k12019J87272
34257e88784L05166J67122R3893J39373J21473O2983J24639K06316Q8015j23528
$$ plain form
34247 596668 448298 420731 417756 382480 449929 634689 711726 609530 555084 609599 476000
34236 476000 57586 -220010 -25136 323808 356940 184621 249890 596042 883055 981293
34226 981293 1063923 1171513 1117961 845981 547018 394341 383259 430525 459535 419287 334780
34215 334780 267813 179083 -11212 -195215 -161127 40692 129030 66181 116662 308764 297738
34204 297738 -7133 -158465 147539 539699 532297 248240 137915 278619 407181 411173
34194 411173 354137 205095 -61930 -269049 -276838 -238420 -309556 -344525 -196021 -45909 -87577
34183 -87577 -153656 -31950 125434 106762 80130 294371 583423 619294 458497 400406 483418
34172 483418 544347 604125 773606 928164 875814 712766 656323 684179 672974 697542 847660
$$ packed form
34247E96668j48370k7567k975l5276O7449J84760P7037j02196n4446N4515j33599
34236D76000m18414k77596J94874L48944L3132j72319O5269L46152K87013R8238
34226I81293Q2630J07590n3552k71980k98963j52677j1082M7266K9010m0248q4507
34215C34780o6967q8730j90295j84003L4088K01819Q8338o2849N0481J92102j1026
34204B97738l04871j51332L06004L92160p402k84057j10325J40704J28562L992
34194D11173n7036j49042k67025k07119p789L8418p1136l4969J48504J50112m1668
34183h7577o6079J21706J57384j8672k6632K14241K89052L5871j60797n8091Q3012
34172D83418O0929N9778J69481J54558n2350j63048n6443K7856j1205K4568J50118
$$ plain form
34161 847660 955802 854105 689845 658487 669705 605059 617318 818518 978896 909785
34151 909785 817387 886727 881285 596264 334934 446168 743381 877932 917490 1031985
34141 1031985 1005612 648959 314555 375795 556666 430393 216449 377571 770984 949671
34131 949671 989386 1224464 1444557 1193535 654863 401769 435993 304283 18766 11094
34121 11094 272881 377128 282048 305025 381032 171616 -160971 -128799 186710 256492 70740
34110 70740 119100 433345 538723 371392 354167 524243 485777 288620 432181 887117
34100 887117 1032379 723199 532835 753789 1021117 1106062 1220884 1344432 1111976 598852
34090 598852 376137 564662 651358 441159 346614 530005 630117 571849 765829 1244356
$$ packed form
34161H47660J08142j01697j64260l1358J1218o4646J2259K01200J60378o9111
34151I09785r2398O9340n442k85021k61330J11234K97213J34551L9558J14495
34141A031985k6373l56653l34404O1240J80871j26273k13944J61122L93413J78687
34131I49671L9715K35078K20093k51022n38672k53094L4224j31710k85517p672
34121A1094K61787J04247r5080K2977P6007k09416l32587L2172L15509O9782j85752
34110G0740M8360L14245J05378j67331j7225J70076l8466j97157J43561M54936
34100H87117J45262l09180j90364K20954K67328Q4945J14822J23548k32456n13124
34090E98852k22715J88525Q6696k10199r4545J83391J00112n8268J93980M78527
$$ plain form
34080 1244356 1477865 1328358 1306385 1587371 1664796 1314430 1024917 1104402 1201363 1074235
34070 1074235 1008224 1113080 1035573 725722 666634 998806 1240507 1193275 1255011 1515118
34060 1515118 1468696 1006301 750195 987860 1196544 1058936 1013710 1334730 1598026 1547354
34050 1547354 1560766 1770751 1673627 1133333 815094 1066938 1317119 1147310 1001341 1225654
34040 1225654 1368782 1087421 833911 994390 1226334 1255061 1409861 1773812 1772007 1239760
34030 1239760 916600 1219957 1522405 1318312 1080360 1245413 1391893 1179207 1071161
34021 1071161 1357397 1492705 1176313 1019699 1366336 1570253 1258664 1129599 1612879
34012 1612879 1956922 1613569 1305383 1674286 2091631 1924155 1767242 2225797 2647765
$$ packed form
34080A244356K33509j49507k1973K80986P7425l50366k89513P9485R6961j27128
34070A074235o6011J04856p7507l09851n9088L32172K41701m7232O1736K60107
34060A515118m6422m62395k56106K37665K08684j37608m5226L21020K63296n0672
34050A547354J3412K09985r7124n40294l18239K51844K50181j69809j45969K24313
34040A225654J43128k81361k53510J60479K31944K8727J54800L63951j805n32247
34030A239760l23160L03357L02448k04093k37952J65053J46480k12686j08046
34021A071161K86236J35308l16392j56614L46637K03917l11589j29065M83280
34012A612879L44043l43353l08186L68903M17345j67476j56913M58555M21968
$$ plain form
34003 2647765 2330725 1878873 2085715 2520239 2470491 2253013 2371669 2433467 2079137 1883763
33993 1883763 2190915 2262610 1728260 1521667 2167497 2630008 2197709 1905669 2583681 3163295
33983 3163295 2618456 1923193 2238390 2797184 2545132 2234235 2816584 3401371 2979168
33974 2979168 2517897 3086480 3622071 2963501 2310656 3071600 4086750 3769836 3155384
33965 3155384 3835833 4749673 4243444 3462282 4244607 5490168 5268354 4670894 5686140
33956 5686140 7148913 6959953 6378983 7651058 9397776 9195299 8594072 10302996 12680125
33947 12680125 12890955 13079475 16739659 21536271 23386385 25040526 31754131 41157010
33939 41157010 47932492 55792164 71969996 92962430 113673637 149716658 224218113
$$ packed form
34003B647765l17040m51852K06842M34524m9748k17478J18656O1798l54330j95374
33993A883763L07152P1695n34350k06593O45830M62511m32299k92040O78012N79614
33983C163295n44839o95263L15197N58794k52052l10897N82349N84787m22203
33974B979168m61271N68583N35591o58570o52845P60944J015150l16914o14452
33965C155384O80449R13840n06229p81162P82325J245561k21814n97460J015246
33956E686140J462773j88960n80970J272075J746718k02477o01227J708924K377129
33947A2680125K10830J88520L660184M796612J850114J654141O713605R402879
33939D1157010O775482P859672J6177832K0992434K0711207L6043021P4501455
$$ plain form
33932 224218113 321040664 376352263 341102691 239608421 143139284 93414561 75648782
33925 75648782 61005359 44912453 35856398 31907158 25439373 17911717 15158733 15389712
33917 15389712 13113573 9358354 8475656 9268751 7684046 4727478 4179172 5307650
33909 5307650 4619770 2502667 1973897 2756127 2219380 638823 376053 1142664 780018
33900 780018 -384189 -303730 668493 469136 -740171 -1066755 -517429 -634721 -1259760
33891 -1259760 -989113 -183657 -364668 -1233262 -1277924 -722858 -971488 -1725194 -1524459 -639300
33881 -639300 -623888 -1417533 -1585911 -1083563 -1151205 -1756154 -1693801 -1038136 -1030775 -1655012
33871 -1655012 -1673156 -1002710 -798131 -1203218 -1194207 -668139 -606765 -1112280 -1245403 -867585
$$ packed form
33932B24218113R6822551N5311599l5249572j01494270r6469137m9724723j7765779
33925G5648782j4643423j6092906r056055l949240o467785p527656k752984K30979
33917A5389712k276139l755219q82698P93095j584705k956568n48306J128478
33909E307650o87880k117103n28770P82230n36747j580557k62770P66611l62646
33900G80018j164207Q0459R72223j99357j209307l26584N49326j17292o25039
33891a259760K70647Q05456j81011q68594m4662N55066k48630p53706K00735Q85159
33881f39300J5412p93645j68378N02348o7642o04949O2353O55665P361o24237
33871a655012j8144O70446K04579m05087R011N26068O1374n05515j33123L77818
$$ plain form
33861 -867585 -782362 -1038207 -904543 -506707 -683516 -1255886 -1228954 -675466 -618551 -1073345
33851 -1073345 -1037861 -453099 -318876 -752245 -772604 -224280 -117334 -752088 -1204919 -1030822
33841 -1030822 -869646 -1000018 -851277 -353956 -285750 -833782 -1188066 -970936 -762027 -849299
33831 -849299 -767179 -434798 -462328 -940594 -1155366 -869796 -702183 -908131 -989297 -826559
33821 -826559 -974451 -1472836 -1575902 -1057158 -626597 -665717 -683000 -401055 -248721 -383753
33811 -383753 -348503 -91350 -213202 -791616 -1071840 -752267 -479044 -633269 -732967 -494590
33801 -494590 -375989 -568152 -545701 -146313 -7506 -371611 -548112 -179532 40552 -392764
33791 -392764 -870913 -751944 -422423 -476931 -678599 -546043 -242139 -122557 -74207 16464
$$ packed form
33861h67585Q5223k55845J33664L97836j76809n72370K6932N53488N6915m54794
33851a073345L5484N84762J34223m33369k0359N48324J06946o34754m52831J74097
33841a030822J61176j30372J48741M97321O8206n48032l54284K17130K08909q7272
33831h49299Q2120L32381k7530m78266k14772K85570J67613k05948q1166J62738
33821h26559j47892m98385j03066N18744M30561l9120j7283K81945J52334j35032
33811c83753L5250K57153j21852n78414k80224L19573K73223j54225r9698K38377
33801d94590J18601j92163K2451L99388J38807l64105j76501L68580K20084m33316
33791c92764m78149J18969L29521n4508k01668J32556L03904J19582M8350R0671
$$ plain form
33781 16464 -172062 -704258 -972637 -648506 -330040 -543597 -833273 -622354 -275934 -423148
33771 -423148 -810494 -762239 -347100 -182544 -381355 -523135 -466742 -455647 -556770 -618078
33761 -618078 -668322 -845727 -1052925 -1093983 -991882 -847805 -629548 -386038 -346957 -517505
33751 -517505 -552582 -332115 -221451 -421849 -547779 -265388 118369 168049 -12110 -103211
33741 -103211 -156292 -345475 -500512 -402062 -241158 -300168 -445559 -383949 -165529 -22965
33731 -22965 31707 72767 3453 -201850 -290997 -130829 -11716 -201578 -506734 -634628
33721 -634628 -672099 -825887 -996980 -1001211 -933889 -944761 -913231 -693048 -429523 -328809 -368473
33710 -368473 -485602 -735935 -1023929 -1043937 -756397 -536682 -587312 -632207 -477783 -395481
$$ packed form
33781A6464j88526n32196k68379L24131L18466k13557k89676K10919L46420j47214
33771d23148l87346M8255M15139J64556j98811j41780N6393J1095j01123o1308
33761f18078n0244j77405k07198m1058J02101J44077K18257K43510L9081j70548
33751e17505l5077K20467J10664k00398j25930K82391L83757M9680j80159r1101
33741a03211n3081j89183j55037R8450J60904n9010j45391O1610K18420J42564
33731b2965N4672M1060o9314k05303q9147J60168J19113j89862l05156j27894
33721f34628l7471j53788j71093m231O7322j0872L1530K20183K63525J00714l9664
33710c68473j17129k50333k87994k0008K87540K19715n0630m4895J54424Q2302
$$ plain form
33700 -395481 -597638 -813740 -778962 -676382 -685489 -576513 -215691 -447 -268848 -688528
33690 -688528 -762989 -575724 -510614 -580576 -555558 -449340 -391188 -304827 -144585 -120812 -292883
33679 -292883 -338940 -138928 -101230 -429162 -605901 -214683 254666 136525 -328360 -431257
33669 -431257 -151963 -47203 -244417 -378735 -373030 -486171 -669579 -605710 -338327 -210267
33659 -210267 -243860 -201041 -147453 -319286 -549247 -487553 -281681 -350064 -585148 -519361 -224135
33648 -224135 -254493 -658891 -831220 -497694 -125808 -129216 -311445 -368322 -385959 -539010
33638 -539010 -727225 -778361 -691079 -517831 -305186 -219666 -405039 -679987 -716612 -520769
33628 -520769 -384162 -397279 -396494 -342764 -338175 -327449 -219460 -221010 -561791 -969657 -966680 -640724
$$ packed form
33700c95481k02157k16102L4778J02580r107J08976L60822K15244k68401m19680
33690f88528p4461J87265O5110o9962K5018J06218N8152Q6361J60242K3773j72071
33679b92883m6057K00012L7698l27932j76739L91218M69349j18141m64885j02897
33669d31257K79294J04760j97214j34318N705j13141j83408O3869K67383J28060
33659b10267l3593M2819N3588j71833k29961O1694K05872o8383k35084O5787K95226
33648b24135l0358m04398j72329L33526L71886l408j82229n6877j7637j53051
33638e39010j88215n1136Q7282J73248K12645Q5520j85373k74948l6625J95843
33628e20769J36607j3117P85N3730M589J0726J07989j550l40781m07866K977L25956
$$ plain form
33616 -640724 -536019 -778053 -924700 -748727 -541690 -503937 -429634 -192821 -8097 3697
33606 3697 21893 100921 9989 -298975 -509375 -432707 -273831 -225059 -202726 -153404 -205498
33595 -205498 -345622 -359084 -259127 -345689 -655214 -796369 -558652 -259867 -227144 -318504
33585 -318504 -249014 -70752 -40045 -240070 -546771 -770057 -718943 -371846 -40157 -58998
33575 -58998 -284392 -273470 3780 103333 -137140 -297219 -47741 346061 477394 346257
33565 346257 153696 -92361 -438330 -725215 -764298 -582394 -306824 -19898 154992 99515
33555 99515 -56205 -44215 93017 24955 -290890 -467911 -281079 20321 172806 242508
33545 242508 300264 196300 -84499 -263901 -233030 -252101 -417968 -396961 -28296 271503
$$ packed form
33616f40724J04705k42034j46647J75973K07037L7753P4303K36813J84724J1794
33606C697J8196P9028r0932l08964k10400P6668J58876M8772K2333M9322n2094
33595b05498j40124j3462R9957q6562l09525j41155K37717K98785L2723r1360
33585c18504O9490J78262L0707k00025l06701k23286N1114L47097L31689j8841
33575e8998k25394J0922K77250R9553k40473j60079K49478L93802J31333j31137
33565C46257j92561k46057l45969k86885l9083J81904K75570K86926J74890n5477
33555I9515j55720J1990J37232o8062l15845j77021J86832L01400J52485O9702
33545B42508N7756j03964k80799j79402L0871j9071j65867K1007L68665K99799
$$ plain form
33535 271503 129858 -170533 -173953 12238 -21034 -265788 -374686 -279841 -233884 -335753
33525 -335753 -452411 -544560 -688484 -822851 -800296 -649976 -531568 -503051 -545100 -677798
33515 -677798 -835437 -807550 -553038 -375108 -503673 -704412 -622551 -336518 -215323 -351084
33505 -351084 -490753 -468814 -388330 -388909 -480461 -590286 -610442 -476665 -329691 -433447 -770453
33494 -770453 -932526 -635601 -130423 155805 178195 184174 259874 299867 292901 311630 308913
33483 308913 206827 91419 57773 -15434 -255172 -477879 -390751 -32650 268384 316092
33473 316092 173952 -43849 -245989 -298507 -149703 15019 -38335 -290219 -529010 -632497
33463 -632497 -618461 -525701 -421500 -407642 -459454 -414968 -274970 -289281 -547656 -752683 -668155
$$ packed form
33535B71503j41645l00391l420J86191l3272k44754j08898R4845M5957j01869
33525c35753j16658r2149j43924j34367K2555J50320J18408K8517m2049j32698
33515f77798j57639K7887K54512J77930j28565k00739Q1861K86033J21195j35761
33505c51084j39669K1939Q0484n79r1552j09825k0156J33777J46974j03756l37006
33494g70453j62073K96925N05178K86228K2390N979P5700L9993o966J8729k717
33483C08913j02086j15408l3646p3207k39738k22707Q7128L58101L01034M7708
33473C16092j42140k17801k02140n2518J48804J64722n3354k51884k38791j03487
33463f32497J4036R2760J04201J3858n1812M4486J39998j4311k58375k05027Q4528
$$ plain form
33452 -668155 -518232 -598012 -741742 -594823 -222274 6884 18506 59980 197845 243444
33442 243444 168899 163162 234664 156760 -119512 -359180 -439469 -520836 -706689 -826798 -713508
33431 -713508 -477725 -356278 -408035 -461699 -309776 53326 347995 255669 -172355 -501923
33421 -501923 -437886 -172254 -40985 -64381 -83973 -125681 -278389 -378149 -202221 111443
33411 111443 207900 25252 -180520 -270177 -339094 -434700 -491495 -536700 -658612 -794804 -834022
33400 -834022 -863518 -1008791 -1116813 -956243 -659672 -569600 -679297 -643438 -356743 -107438
33390 -107438 -97256 -198090 -274236 -392556 -603949 -810407 -929789 -941729 -765886 -381335
33380 -381335 -39684 -27682 -245866 -376247 -407386 -559247 -732823 -570939 -123805 108786
$$ packed form
33452f68155J49923p9780j43730J46919L72549K29158J1622M1474J37865M5599
33442B43444p4545n737P1502p7904k76272k39668q0289q1367j85853j20109J13290
33431g13508K35783J21447n1757n3664J51923L63102K94669r2326m28024l29568
33421e01923O4037K65632J31269k3396j9592m1708j52708r9760J75928L13664
33411A11443R6457j82648k05772q9657o8917r5606n6795m5205j21912j36192l9218
33400h34022k9496j45273j08022J60570K96571R0072j09697L5859K86695K49305
33390a07438J0182j00834p6146j18320k11393k06458j19382j1940J75843L84551
33380c81335L41651J2002k18184j30381l1139j51861j73576J61884M47134K32591
$$ plain form
33370 108786 -40387 -121406 198859 622075 741915 632086 554564 466530 221295 -31481
33360 -31481 -56243 51398 23023 -140995 -205081 -84768 60867 67725 -82707 -285225 -368518
33349 -368518 -235372 -20851 38577 -58307 -84833 16841 29811 -136921 -251409 -140057
33339 -140057 24249 33958 -15243 54217 167046 144492 14375 -72511 -92843 -105507 -93434
33328 -93434 -37261 -4975 -7519 63536 196294 170136 -91194 -294565 -156425 173330 333165
33317 333165 245488 113329 42411 -39791 -152880 -230219 -299474 -452246 -619075 -584857 -280095
33306 -280095 89924 262013 173461 -31456 -196247 -309049 -450155 -599504 -593083 -348135
33296 -348135 -25508 175865 281816 407437 477471 357465 170772 138930 158435 -53557
$$ packed form
33370A08786j49173q1019L20265M23216J19840j09829p7522q8034k45235k52776
33360c1481k4762J07641k8375j64018o4086J20313J45635O858j50432k02518q3293
33349c68518J33146K14521N9428r6884k6526J01674J2970j66732j14488J11352
33339a40057J64306R709m9201O9460J12829k2554j30117q6886k0332j2664J2073
33328i3434N6173L2286k544P1055J32758k6158k61330k03371J38140L29755J59835
33317C33165q7677j32159p0918q2202j13089p7339o9255j52772j66829L4218L04762
33306b80095L70019J72089q8552k04917j64791j12802j41106j49349O421K44948
33296c48135L22627K01373J05951J25621P0034j20006j86693l1842J9505k11992
$$ plain form
33286 -53557 -389460 -404008 -37507 211022 38900 -206635 -116348 173563 310172 275735
33276 275735 219313 72609 -232276 -429866 -256211 78112 172493 27063 -59687 -25384
33266 -25384 -42456 -93690 11418 238131 338002 247435 137303 92204 59156 71148 191932
33255 191932 273565 102964 -224064 -392450 -318033 -198498 -135344 -35435 104434 146948
33245 146948 87536 71343 93276 -15603 -240548 -321759 -140641 90894 136109 11606
33235 11606 -131641 -202300 -157193 13049 195716 217587 75042 -39757 -1178 100945
33225 100945 124277 49813 -55498 -131597 -136688 -68535 -9314 -69886 -270991 -524140 -696752
33214 -696752 -657778 -354504 76663 383135 466302 450030 408088 243684 -12983 -58098
$$ packed form
33286e3557l35903j4548L66501K48529j72122k45535R0287K89911J36609l4437
33276B75735n6422j46704l04885j97590J73655L34323R4381j45430q6750L4303
33266b5384j7072n1234J05108K26713R9871r0567j10132m5099l3048J1992J20784
33255A91932Q1633j70601l27028j68386P4417J19535O3154R9909J39869M2514
33245A46948n9412j6193K1933j08879k24945q1211J81118K31535M5215j24503
33235A1606j43247p0659M5107J70242J82667K1871j42545j14799L8579J02123
33225A00945K3332p4464j05311p6099n091O8153N9221o0572k01105k53149j72612
33214f96752L8974L03274M31167L06472Q3167j6272m1942j64404k56667m5115
$$ plain form
33204 -58098 266013 632970 649627 430083 371289 495418 459385 169031 -78428 -113199
33194 -113199 -124137 -249671 -310790 -125823 195848 439773 537357 503862 345307 147649
33184 147649 58835 75919 35471 -104504 -177765 -93684 -949 -55214 -200573 -294088 -300041
33173 -300041 -267962 -247815 -291826 -410615 -483544 -349030 -18211 328582 555329 631430
33163 631430 515493 190614 -183052 -373488 -363307 -327900 -319672 -212877 1582 121835
33153 121835 25108 -157588 -248249 -228630 -171675 -130077 -144651 -211967 -223944 -96343 61179
33142 61179 91968 65501 159649 302349 226244 -100015 -394235 -468673 -433232 -427403 -425251
33131 -425251 -380870 -309139 -165376 90949 280998 160929 -167861 -343590 -301300 -369359
$$ packed form
33204e8098L24111L66957J6657k19544n8794J24129l6033k90354k47459l4771
33194a13199j0938j25534o1119J84967L21671K43925R7584l3495j58555j97658
33184A47649q8814J7084m0448j39975p3261Q4081R2735n4265j45359r3515n953
33173c00041L2079K0147m4011j18789p2929J34514L30819L46793K26747P6101
33163F31430j15937l24879l73666j90436J0181L5407Q228J06795K14459J20253
33153A21835r6727j82696r0661J9619N6955M1598j4574o7316j1977J27601J57522
33142F1179L0789k6467R4148J42700p6105l26259k94220p4438L5441N829K152
33131d25251M4381P1731J43763K56325J90049j20069l28790j75729M2290o8059
$$ plain form
33121 -369359 -704609 -1027705 -1083644 -979456 -863860 -655015 -339173 -181996 -340659 -558953
33111 -558953 -540650 -360468 -226454 -108551 91160 250570 230411 146580 133704 57981
33101 57981 -211039 -455897 -396934 -157030 -84681 -239738 -391612 -417074 -370097 -254271
33091 -254271 -56008 68956 -37951 -234576 -238389 -53635 38610 -108891 -356992 -508128
33081 -508128 -467725 -236070 41735 94388 -175873 -491262 -524998 -327247 -172999 -109288
33071 -109288 26790 221029 271611 157140 73855 66914 -54001 -342842 -543280 -424829
33061 -424829 -99325 123768 74733 -159652 -357373 -352572 -174118 -1586 45241 -5226
33051 -5226 -139038 -434303 -841190 -1066928 -893450 -476013 -114390 127197 334102 442472
$$ packed form
33121c69359l35250l23096n5939J04188J15596K08845L15842J57177j58663k18294
33111e58953J8303J80182J34014J17903J99711J59410k0159q3831j2876p5723
33101E7981k69020k44858N8963K39904P2349j55057j51874k5462M6977J15826
33091b54271J98263J24964j06907j96625l813J84754R2245j47501k48101j51136
33081e08128M0403K31655K77805N2653k70261l15389l3736J97751J54248O3711
33071a09288J36078J94239N0582j14471q3285o941j20915k88841k00438J18451
33061d24829L25504K23093m9035k34385j97721M801J78454J72532M6827n0467
33051e226j33812k95265m06887k25738J73478M17437L61623K41587K06905J08370
$$ plain form
33041 442472 341367 161548 126562 182218 105605 -73102 -116142 -21906 -40496 -212458 -274294
33030 -274294 -117008 20953 -39500 -143672 -116479 -65470 -146587 -245416 -144792 108065
33020 108065 229882 72619 -183169 -234699 -9106 219700 113372 -320333 -714290 -803290
33010 -803290 -721254 -686093 -603480 -277572 131068 236944 -8138 -242944 -217032 -47928
33000 -47928 98484 246910 417413 488128 399121 259842 136166 -45059 -274205 -375330
32990 -375330 -269908 -117672 -74191 -94212 -78580 -34395 2237 28446 -6525 -160613 -334171
32979 -334171 -354556 -256642 -238703 -311164 -275172 -101220 -5346 -56190 -47013 107234 194316
32968 194316 102078 43822 167505 276090 194428 89256 124790 112312 -140226 -402421
$$ packed form
33041D42472j01105j79819l4986N5656p6613j78707m3040R4236j8590j71962o1836
33030b74294J57286J37961o0453j04172K7193N1009q1117r8829J00624K52857
33020A08065J21817j57263k55788n1530K25593K28806j06328m33705l93957q9000
33010h03290Q2036L5161Q2613L25908M08640J05876k45082k34806K5912J69104
33000d7928J46412J48426J70503P0715q9007j39279j23676j81225k29146j01125
32990c75330J05422J52236M3481k0021J5632M4185L6632K6209l4971j54088j73558
32979c34171k0385R7914J7939p2461L5992J73952R5874n0844R177J54247Q7082
32968A94316r2238n8256J23683J08585q1662j05172L5534j2478k52538k62195
$$ plain form
32958 -402421 -354666 -143634 -172121 -461447 -652197 -581419 -450149 -415848 -395664 -331435 -325073
32947 -325073 -414135 -462117 -364040 -175006 17877 182409 272797 241523 144287 84877 49851
32936 49851 -57073 -225887 -339391 -355093 -341112 -339855 -336529 -348478 -409452 -482906 -513058
32925 -513058 -523859 -548051 -524541 -402021 -260913 -179734 -85522 80174 173872 68459 -62415
32914 -62415 19121 181025 82966 -254423 -441291 -332436 -232731 -345626 -429943 -258759
32904 -258759 -53160 -102370 -225446 -39306 386542 593496 427441 236040 283412 358750
32894 358750 170398 -176408 -376194 -399462 -456679 -577710 -550987 -300412 -34851 71663
32884 71663 105876 182218 200086 37791 -169739 -192008 -52502 32300 16193 61669 214316
$$ packed form
32958d02421M7755K11032k8487k89326j90750P0778J31270L4301K0184O4229O362
32947c25073q9062m7982R8077J89034J92883J64532R0388l1274r7236n9410l5026
32936D9851j06924j68814j13504j5702J3981J257L326j1949o0974p3454l0152
32925e13058j0801k4192K3510J22520J41108Q1179R4212J65696R3698j05413j30874
32914f2415Q1536J61904r8059l37389j86868J08855R9705j12895q4317J71184
32904b58759K05599m9210j23076J86140M25848K06954j66055j91401M7372P5338
32894C58750j88352l46806j99786k3268n7217j21031K6723K50575K65561J06514
32884G1663L4213P6342J7868j62295k07530k2269J39506Q4802j6107M5476J52647
$$ plain form
32873 214316 311787 276400 238789 270567 244688 105805 40741 177173 308248 165485 -158604
32862 -158604 -313907 -160703 90484 189674 109151 -12509 -42140 45410 142019 103122 -61358
32851 -61358 -163884 -93219 13022 -24038 -150843 -178688 -71641 40796 80327 71957 22091
32840 22091 -82184 -179342 -196145 -176013 -202007 -239422 -208391 -157780 -195256 -289806 -318267
32829 -318267 -268698 -230586 -234715 -270479 -382162 -552000 -588585 -380005 -162364 -232243 -460924
32818 -460924 -452569 -163380 43396 4770 -27896 71558 9484 -397385 -786838 -739545 -437553
32807 -437553 -401385 -709465 -911796 -706265 -321615 -144308 -248140 -420182 -470356 -394708
32797 -394708 -327904 -402156 -595770 -715285 -599915 -326591 -124096 -106421 -189051 -242842
$$ packed form
32873B14316R7471l5387l7611L1778k5879j38883o5064J36432J31075j42763l24089
32862a58604j55303J53204K51187R9190q0523j21660k9631Q7550R6609l8897j64480
32851f1358j02526P0665J06241l7060j26805k7845J07047J12437L9531q370m9866
32840B2091j04275r7158j6803K0132k5994l7415L1031N0611l7476r4550k8461
32829c18267M9569L8112m129l5764j11683j69838l6585K08580K17641o9879k28681
32818d60924Q355K89189K06776l8626l2666R9454o2074m06869l89453M7293L01992
32807d37553L6168l08080k02331K05531L84650J77307j03832j72042n0174P5648
32797c94708O6804p4252j93614j19515J15370K73324K02495J7675q2630n3791
$$ plain form
32787 -242842 -215437 -113836 10045 51461 -48981 -179989 -149429 63153 249494 219117
32777 219117 10907 -200020 -317027 -358462 -348687 -286234 -202886 -150250 -112122 -15569 142972
32766 142972 265141 289336 276908 286792 253116 112778 -10468 70137 297996 387011 202048
32755 202048 -61464 -178545 -185169 -210327 -199097 -46917 95361 -62530 -521726 -918515
32745 -918515 -935288 -618368 -244661 -30116 -18624 -116046 -170025 -110000 -28020 -29939 -39189
32734 -39189 103836 367909 537063 501592 364339 238060 128814 59460 108578 253468
32724 253468 348455 330914 287993 263997 177846 -8145 -216723 -402135 -569018 -609513 -383913
32713 -383913 -45480 16456 -283160 -531921 -383558 -45106 71208 -52353 -115863 -8505
$$ packed form
32787b42842K7405J01601J23881M1416j00442j31008L0560K12582J86341l0377
32777B19117k08210k10927j17007m1435R775O2453Q3348N2636L8128R6553J58541
32766A42972J22169K4195j2428R884l3676j40338j23246Q0605K27859Q9015j84963
32755B02048k63512j17081o624k5158J1230J52180J42278j57891m59196l96789
32745i18515j6773L16920L73707K14545J1492r7422n3979O0025Q1980j919r250
32734c9189J43025K64073J69154l5471j37253j26279j09246o9354M9118J44890
32724B53468R4987j7541m2921k3996q6151j85991k08578j85412j66883m0495K25600
32713c83913L38433O1936k99616k48761J48363L38452J16314j23561o3510J07358
$$ plain form
32703 -8505 119817 203143 320712 427265 340852 45114 -247532 -385359 -422711 -438920 -410946
32692 -410946 -324204 -247903 -236657 -264634 -280189 -236551 -91882 115421 237132 184122 67760
32681 67760 37295 54282 -3200 -99777 -124884 -148357 -328923 -582370 -627090 -411516 -223223
32670 -223223 -267418 -382743 -329936 -159559 -92072 -157562 -165282 212 214090 268243 109673
32659 109673 -107810 -183412 -67479 106522 184337 137331 19463 -142953 -331845 -464380
32649 -464380 -452108 -316134 -158660 -49699 -19323 -101453 -273193 -399077 -355423 -174013
32639 -174013 35983 234033 391378 389611 165236 -105889 -171537 -20154 151749 242878
32629 242878 302386 318514 201544 -12636 -176431 -265197 -369358 -451016 -376679 -215662
$$ packed form
32703h505J28322Q3326J17569J06553q6413k95738k92646j37827l7352j6209K7974
32692d10946Q6742P6301J1246k7977j5555M3638J44669K07303J21711n3010j16362
32681F7760l0465J6987n7482r6577k5107k3473j80566k53447m4720K15574J88293
32670b23223m4195j15325N2807J70377O7487o5490p720J65494K13878N4153j58570
32659A09673k17483p5602J15933J74001P7815m7006j17868j62416j88892j32535
32649d64380J2272J35974J57474J08961L0376q2130j71740j25884M3654J81410
32639a74013K09996J98050J57345j767k24375k71125o5648J51383J71903R1129
32629B42878N9508J6128j16970k14180j63795q8766j04161q1658P4337J61017
$$ plain form
32619 -215662 -203022 -339305 -350720 -164642 -83860 -291120 -501912 -390366 -104447 -26089
32609 -26089 -192875 -310178 -250045 -191548 -265212 -363559 -374706 -366439 -434871 -541215 -608184
32598 -608184 -652124 -698015 -647913 -387686 -24484 137592 -33297 -252115 -137591 231412
32588 231412 336704 -86936 -645466 -808417 -600648 -422348 -364912 -183697 108336 170775
32578 170775 -39112 -106476 150672 325035 80512 -265577 -234707 85076 265680 233204
32568 233204 245005 337840 285897 40048 -216842 -409927 -584010 -630068 -395967 -42307
32558 -42307 104552 49324 93574 305896 434832 389340 385581 515773 568838 424907 267852
32547 267852 237190 197411 39588 -84208 -24555 126720 246758 385244 575653 680561
$$ packed form
32619b15662J2640j36283j1415J86078Q0782k07260k10792J11546K85919P8358
32609b6089j66786j17303O0133N8497p3664r8347j1147Q267o8432j06344o6969
32598f08184m3940m5891N0102K60227L63202J62076j70889k18818J14524L69003
32588B31412J05292m23640n58530j62951K07769J78300N7436J81215K92033O2439
32578A70775k09887o7364K57148J74363k44523l46089L0870L19783J80604l2476
32568B33204J1801R2835n1943k45849k56890j93085j74083m6058K34101L53660
32558d2307J46859n5228M4250K12322J28936m5492l759J30192N3065j43931j57055
32547B67852l0662l9779j57823j23796N9653J51275J20038J38486J90409J04908
$$ plain form
32537 680561 615175 507926 461916 382377 222886 156680 277472 360167 183642 -99793
32527 -99793 -198076 -125444 -118628 -220469 -255526 -172924 -124215 -184587 -231223 -146684 24656
32516 24656 166889 224701 222367 222742 256583 253803 112201 -123972 -272323 -270752 -280745 -420842
32504 -420842 -553149 -493062 -296138 -154853 -119422 -105070 -78752 -52178 16098 118026 94448
32493 94448 -144791 -386734 -353155 -121673 -41143 -232013 -442384 -451405 -360761 -368269 -441918
32482 -441918 -374225 -80512 261103 352614 55768 -426159 -684191 -501641 -74616 243589
32472 243589 330879 302772 236636 98456 -92107 -234689 -299385 -337716 -346811 -290312 -236515
32461 -236515 -282160 -345123 -247677 -26061 68102 -67011 -224902 -177306 58536 309322
$$ packed form
32537F80561o5386j07249m6010p9539j59491o6206J20792Q2695j76525k83435
32527i9793r8283P2632O816j01841l5057Q2602M8709o0372m6636Q4539J71340
32516B4656J42233N7812k334L75L3841k780j41602k36173j48351J571r993j40097
32504d20842j32307O0087J96924J41285L5431J4352K6318K6574O8276J01928k3578
32493I4448k39239k41943L3579K31482Q0530j90870k10371r021R0644p508p3649
32482d41918O7693K93713L41615R1511k96846m81927k58032J82550M27025L18205
32472B43589Q7290k8107o6136j38180j90563j42582o4696l8331r095N6499N3797
32461b36515m5645o2963R7446K21616R4163j35113j57891M7596K35842K50786
$$ plain form
32451 309322 428900 330116 23783 -290403 -354917 -170572 -9527 -29100 -73322 24481
32441 24481 153417 115822 -60841 -203343 -273001 -376449 -557309 -720399 -718560 -443597
32431 -443597 55618 471110 435888 -21006 -394141 -279762 114859 275687 60785 -222131
32421 -222131 -342826 -408934 -560622 -717410 -755268 -705623 -639600 -538432 -416310 -395929
32411 -395929 -486283 -431452 -12296 561706 802112 517421 46408 -167012 -74125 34888
32401 34888 -30130 -174679 -256593 -302445 -395316 -484129 -442318 -257460 -45716 91177 132708
32390 132708 111129 117183 272445 557357 715427 503626 26283 -364321 -506465 -558510
32380 -558510 -649906 -649507 -421070 -114266 -6522 -156646 -376771 -482213 -445339 -363093 -368104
$$ packed form
32451C09322J19578r8784l06333l14186o4514J84345J61045j9573m4222R7803
32441B4481J28936l7595j76663j42502o9658j03448j80860j63090J839K74963
32431d43597M99215M15492l5222m56894l73135J14379L94621J60828k14902k82916
32421b22131j20695o6108j51688j56788l7858M9645O6023J01168J22122K0381
32411c95929r0354N4831M19156N74002K40406k84691m71013k13420R2887J09013
32401C4888o5018j44549q1914m5852r2871q8813M1811J84858K11744J36893M1531
32390A32708k1579O054J55262K84912J58070k11801m77343l90604j42144n2045
32380e58510r1396L99K28437L06804J07744j50124k20125j05442L6874Q2246n011
$$ plain form
32369 -368104 -505475 -636117 -570518 -355886 -267275 -416400 -564524 -482885 -303639 -287748
32359 -287748 -405199 -420939 -297196 -219342 -261048 -296920 -245349 -150682 -15924 205329 424568
32348 424568 457586 294849 129806 79637 74447 48146 19628 -54581 -272562 -564265 -708644
32337 -708644 -657207 -603000 -622769 -511685 -145221 235432 336354 230366 196223 254385
32327 254385 158214 -169756 -466126 -471185 -260309 -120544 -204421 -418336 -602110 -697210
32317 -697210 -710083 -607185 -357892 -66321 72771 7658 -95531 -96170 -69888 -126666 -180520
32306 -180520 -110174 -42668 -207208 -551010 -788719 -828977 -840709 -865430 -723620 -423804
32296 -423804 -297245 -505230 -725445 -605039 -266418 -50163 24263 167783 329790 210369
$$ packed form
32369c68104j37371j30642O5599K14632Q8611j49125j48124Q1639J79246J5891
32359b87748j17451j5740J23743P7854m1706l5872N1571R4667J34758K21253K19239
32348D24568L3018j62737j65043n0169n190k6301k8518p4209k17981k91703j44379
32337g08644N1437N4207j9769J11084L66464L80653J00922j05988l4143N8162
32327B54385r6171l27970k96370n059K10876J39765q3877k13915j83774r5100
32317f97210j2873J02898K49293K91571J39092o5113j03189o39K6282n6778n3854
32306a80520P0346O7506j64540l43802k37709m0258j1732k4721J41810K99816
32296d23804J26559k07985k20215J20406L38621K16255P4426J43520J62007j19421
$$ plain form
32286 210369 -231844 -632014 -667907 -416812 -178356 -122378 -199704 -282990 -318368 -365955 -475157
32275 -475157 -519049 -295851 122243 341245 140931 -160130 -114285 206191 315354 33285
32265 33285 -270851 -229901 59626 282481 344426 355484 348517 246674 52892 -104334 -125272
32254 -125272 -49758 4594 -12763 -16899 103133 294208 346356 166355 -49735 -45375 168049
32243 168049 360441 397800 336907 252679 159562 84380 38742 -57722 -247577 -376024 -281617
32232 -281617 -107611 -157127 -435333 -618222 -515503 -275904 -70439 114533 256681 194576
32222 194576 -72263 -265637 -223101 -147861 -227480 -266088 -10623 359604 441355 211123
32212 211123 60989 233682 528970 629078 477774 254479 137121 161493 211973 125567
$$ packed form
32286B10369m42213m00170l5893K51095K38456N5978p7326q3286l5378m7587j09202
32275d75157m3892K23198M18094K19002k00314l01061M5845L20476J09163k82069
32265C3285l04136M0950K89527K22855O1945J1058o967j01843j93782j57226k0938
32254a25272P5514N4352j7357m136J20032J91075N2148j80001k16090M360K13424
32243A68049J92392L7359o0893q4228r3117p5182m5638r6464j89855j28447R4407
32232b81617J74006m9516k78206j82889J02719K39599K05465J84972J42148o2105
32222A94576k66839j93374M2536P5240p9619l8608K55465L70227Q1751k30232
32212B11123j50134J72693K95288J00108j51304k23295j17358K4372N0480q6406
$$ plain form
32202 125567 -114325 -309367 -263146 -23716 191483 249260 159914 -33081 -256398 -359631
32192 -359631 -253478 -72048 -19129 -70798 -23564 157452 250004 97463 -157298 -258268
32182 -258268 -135083 73446 203142 189532 71516 -57710 -126935 -147604 -190250 -312215
32172 -312215 -521893 -757750 -863217 -680945 -275441 28746 -17838 -275509 -403076 -308067
32162 -308067 -200365 -211140 -213961 -104578 -24441 -141079 -354636 -403120 -191173 125984
32152 125984 341570 365824 236797 77275 25524 111787 204013 152922 -12639 -116886
32142 -116886 -78529 -35932 -169413 -447260 -641582 -607565 -454580 -375635 -387613 -364722 -284452
32131 -284452 -257123 -284148 -199910 25530 125171 -111743 -462212 -512991 -225387 27628
$$ packed form
32202A25567k39892j95042M6221K39430K15199N7777q9346j92995k23317j03233
32192c59631J06153J81430N2919n1669M7234J81016R2552j52541k54761j00970
32182b58268J23185K08529J29696j3610j18016j29226o9225k0669m2646j21965
32172c12215k09678k35857j05467J82272M05504L04187m6584k57671j27567R5009
32162c08067J07702j0775k821J09383Q0137j16638k13557m8484K11947L17157
32152A25984K15586K4254j29027j59522n1751Q6263R2226n1091j65561j04247
32142a16886L8357M2597j33481k77847j94322L4017J52985P8945j1978K2891Q0270
32131b84452K7329k7025Q4238K25440R9641k36914l50469n0779K87604K53015
$$ plain form
32121 27628 3131 -125375 -122594 -62981 -151809 -352508 -426528 -278977 -68315 26567 6529
32110 6529 -7975 50701 122364 91293 -70626 -239855 -263779 -148583 -55175 -92409 -201826
32099 -201826 -285522 -351280 -455445 -573107 -614405 -538527 -391226 -259051 -223868 -306522 -401750
32088 -401750 -330590 -41072 273332 341150 108854 -182229 -238433 -21580 199874 129647
32078 129647 -216997 -500707 -432658 -104847 146773 161474 92149 126198 236128 276474
32068 276474 194988 50256 -88064 -162075 -117508 37890 204371 269688 183510 -49079
32058 -49079 -358270 -583563 -584173 -418645 -290548 -278017 -272959 -237577 -308086 -519879 -646664
32047 -646664 -512782 -287183 -222726 -245585 -95715 205801 350323 203401 -27807 -147350
$$ packed form
32121B7628k4497j28506K781N9613q8828k00699p4020J47551K10662R4882k0038
32110F529j4504N8676P1663l1071j61919j69229k3924J15196R3408l7234j09417
32099b01826q3696o5758j04165j17662m1298P5878J47301J32175L5183q2654r5228
32088d01750P1160K89518L14404O7818k32296k91083n6204K16853K21454p0227
32078A29647l46644k83710O8049L27811K51620J4701o9325L4049J09930M0346
32068B76474q1486j44732j38320p4011M4567J55398J66481O5317q6178k32589
32058d9079l09191k25293o10J65528J28097J2531N058L5382p0509k11793j26785
32047f46664J33882K25599O4457k2859J49870L01516J44522j46922k31208j19543
$$ plain form
32037 -147350 -219722 -361745 -513192 -549989 -459989 -291764 -76058 105157 130802 33999
32027 33999 26764 200364 347950 238949 -58759 -298570 -381351 -372305 -290327 -109053 75662
32016 75662 114199 44624 41655 90800 -47058 -447240 -822309 -879100 -697944 -543857 -435870
32005 -435870 -184063 186626 362676 181997 -108480 -197723 -115513 -82924 -108643 -10636
31995 -10636 210805 314732 187720 17028 -20179 -23725 -150928 -291182 -188136 171042
31985 171042 495691 536610 345519 156492 109734 134021 54401 -201020 -496104 -630851
31975 -630851 -595008 -569032 -627075 -600728 -370046 -128483 -133323 -293766 -282837 -32520 175861
31964 175861 162876 106284 223582 445166 576306 593670 585613 539868 397767 229451 155909
$$ packed form
32037a47350p2372j42023j51447l6797R0000J68225K15706J81215K5645r6803
32027C3999p235J73600J47586j09001k97708k39811q2781R046Q1978J81274J84715
32016G5662L8537o9575k969M9145j37858m00182l75069n6791J81156J54087J07987
32005d35870K51807L70689J76050j80679k90477q9243Q2210L2589k5719R8007
31995a0636K21441J03927j27012j70692l7207l546j27203j40254J03046L59178
31985A71042L24649M0919j91091j89027m6758K4287p9620k55421k95084j34747
31975f30851L5843K5976n8043K6347K30682K41563m840j60443J0929K50317K08381
31964A75861j2985n6592J17298K21584J31140J7364q057m5745j42101j68316p3542
$$ plain form
31953 155909 141855 40829 -168440 -331678 -304688 -93222 173455 336939 330495 279724
31943 279724 401307 710845 937726 853682 564753 309160 95969 -206568 -506119 -527125
31933 -527125 -246239 8976 2087 -116191 -89111 81921 221563 260068 246947 208181 161530
31922 161530 175848 254903 252639 63616 -187322 -307177 -299846 -294129 -297210 -231291 -147028 -156962
31910 -156962 -189387 -74543 117026 110479 -132858 -298689 -168266 83981 206180 219905
31900 219905 232938 150780 -114881 -329442 -194397 159658 311174 167531 71389 226864
31890 226864 396239 326404 143709 86329 102765 -1424 -195317 -291316 -269598 -254319 -235031
31879 -235031 -89688 136630 243336 187980 147261 215894 270651 214019 146385 179929 246327
$$ packed form
31953A55909j4054j01026k09269j63238K6990K11466K66677J63484o444n0771
31943B79724J21583L09538K26881q4044k88929k55593k13191l02537k99551k1006
31933e27125K80886K55215o889j18278K7080J71032J39642L8505j3121l8766m6651
31922A61530J4318P9055k264j89023k50938j19855P331N717l081O5919Q4263r934
31910a56962l2425J14844J91569o547k43337j65831J30423K52247J22199J3725
31900B19905J3033q2158k65661k14561J35045L54055J51516j43643r6142J55475
31890B26864J69375o9835j82695n7380J6436j04189j93893r5999K1718J5279J9288
31879b35031J45343K26318J06706n5356m0719O8633N4757n6632o7634L3544O6398
$$ plain form
31868 246327 216513 85986 -74715 -240944 -388523 -428650 -315393 -147820 -55319 -45603
31858 -45603 -63361 -118839 -235690 -334221 -300331 -137659 60629 247024 404320 445155 286842
31847 286842 18850 -160943 -194366 -197702 -224092 -168827 4906 111467 -34425 -333292
31837 -333292 -494385 -373513 -88326 170339 303093 290023 172614 89938 191682 431461
31827 431461 556812 411112 157414 66054 137765 116963 -104510 -283757 -141142 237985
31817 237985 473758 339317 2696 -206742 -172430 -65812 -96409 -262854 -375650 -304857
31807 -304857 -159474 -169161 -384416 -567801 -449663 -58018 284488 292689 -9011 -340126
31797 -340126 -425492 -205256 136920 325069 226388 -28203 -185705 -137037 1405 64694
$$ packed form
31868B46327k9814j30527j60701j66229j47579m0127J13257J67573R2501R716
31858d5603j7758n5478j16851r8531L3890J62672J98288J86395J57296M0835j58313
31847B86842k67992j79793l3423l336k6390N5265J73733J06561j45892k98867
31837c33292j61093J20872K85187K58665J32754j3070j17409q2676J01744K39779
31827D31461J25351j45700k53698r1360P1711k0802k21473j79247J42615L79127
31817B37985K35773j34441l36621k09438L4312J06618l0597j66445j12796P0793
31807c04857J45383r687k15255j83385J18138L91645L42506Q201l01700l31115
31797c40126q5366K20236L42176J88149r8681k54591j57502M8668J38442O3289
$$ plain form
31787 64694 22534 -36276 -28411 61596 192764 293369 302651 213634 51177 -185422 -493644
31776 -493644 -775669 -866822 -705784 -413382 -161695 -32885 -42699 -200697 -458349 -673784
31766 -673784 -740973 -722365 -761323 -886295 -982870 -938412 -742193 -471560 -253578 -202133 -301461
31755 -301461 -382034 -310065 -171329 -151359 -255710 -296886 -175849 -15920 55580 113697 292697
31744 292697 525522 590826 417225 200726 159598 261774 289858 145734 -19728 -21727
31734 -21727 102640 158408 80138 17200 91881 205233 191953 78104 38834 135756 249258
31723 249258 280127 268109 258291 189663 25006 -99828 -2533 277456 462144 343237 37401
31712 37401 -148800 -88967 24811 -50402 -297919 -497821 -524369 -430872 -262947 -1428
$$ packed form
31787F4694m2160n8810P865R0007J31168J00605R282q9017j62457k36599l08222
31776d93644k82025r1153J61038K92402K51687J28810r814j57998k57652k15435
31766f73784o7189J8608l8958j24972r6575M4458J96219K70633K17982N1445r9328
31755c01461q0573P1969J38736J9970j04351m1176J21037J59929P1500N8117J79000
31744B92697K32825O5304j73601k16499m1128J02176K8084j44124j65462j999
31734b1727J24367N5768p8270o2938P4681J13352j3280j13849l9270R6922J13502
31723B49258L0869j2018r818o8628j64657j24834R7295K79989J84688j18907l05836
31712C7401j86201N9833J13778p5213k47517j99902k6548R3497J67925K61519
$$ plain form
31702 -1428 248073 241842 -63385 -350742 -340455 -185885 -199855 -321684 -223887 93262 242663
31691 242663 78909 -36041 180314 445208 346876 -221 -142873 12551 121804 9535
31681 9535 -58457 170272 528192 666953 497949 205837 -40832 -207327 -294452 -293363 -237796
31670 -237796 -194623 -186422 -177915 -137486 -69546 9792 89473 145588 131432 14090 -167926
31659 -167926 -307688 -330740 -285052 -276177 -315618 -312482 -228411 -138200 -100303 -88301 -111737 -254389
31647 -254389 -478907 -553560 -357435 -129203 -178336 -433902 -546823 -400287 -222463 -172856
31637 -172856 -129281 16981 142738 126425 63977 78539 117071 108490 121737 171596 73509
31626 73509 -258968 -545366 -458722 -98741 153685 170528 145969 178450 140273 5193 -35475
$$ packed form
31702a428K49501o231l05227k87357J0287J54570j3970j21829R7797L17149J49401
31691B42663j63754j14950K16355K64894r8332l47097j42652J55424J09253j12269
31681I535o7992K28729L57920J38761j69004k92112k46669j66495q7125J089N5567
31670b37796M3173Q201Q507M0429O7940P9338P9681N6115j4156j17342j82016
31659a67926j39762k3052M5688Q875l9441L136Q4071R0211L7897J2002k3436j42652
31647b54389k24518p4653J96125K28232m9133k55566j12921J46536J77824M9607
31637a72856M3575J46262J25757j6313o2448J4562L8532q581J3247M9859r8087
31626G3509l32477k86398Q6644L59981K52426J6843k4559L2481l8177j35080m0668
$$ plain form
31615 -35475 100803 236779 254086 294435 457309 537550 309251 -96230 -357679 -408853
31605 -408853 -458733 -614731 -742815 -729346 -660406 -652338 -657415 -550195 -327425 -124976 -60924
31594 -60924 -121116 -199052 -218837 -198726 -182550 -137506 6826 202562 265815 93944 -168758
31583 -168758 -283927 -194576 -41197 63628 144615 243148 321513 338445 320443 297365 244223
31572 244223 147991 64949 42949 40981 2258 -32476 25747 158077 214867 81375 -175686
31561 -175686 -358151 -320195 -96439 131148 183950 25927 -223866 -415014 -507177 -587130
31551 -587130 -745226 -947589 -1049923 -945876 -690157 -458660 -387213 -461183 -558314 -574660
31541 -574660 -499632 -393960 -321563 -299055 -295866 -281540 -268684 -289029 -323178 -289374 -134380
$$ packed form
31615c5475J36278J35976J7307M0349J62874Q0241k28299m05481k61449n1174
31605d08853m9880j55998j28084J3469O8940Q068n077J07220K22770K02449O4052
31594f0924o0192p7936j9785K0111J6176M5044J44332J95736O3253j71871k62702
31583a68758j15169Q9351J53379J04825Q0987R8533P8365J6932j8002k3078n3142
31572B44223r6232q3042k2000j968l8723l4734N8223J32330N6790j33492k57061
31561a75686j82465L7956K23756K27587N2802j58023k49793j91148r2163p9953
31551e87130j58096k02363j02334J04047K55719K31497P1447p3970r7131j6346
31541e74660P5028J05672P2397K2508L189J4326J2856k0345l4149L3804J54994
$$ plain form
31530 -134380 80633 222506 221666 146680 133304 242529 395768 460818 398181 287818 196268
31519 196268 82715 -93640 -240022 -245892 -213767 -378986 -728725 -899437 -619260 -110241
31509 -110241 162090 56216 -156785 -226868 -186594 -153576 -130493 -103271 -130358 -210262 -229971
31498 -229971 -161533 -136925 -198588 -166065 71574 311673 314535 172102 129366 158930 47352
31487 47352 -143474 -82710 291547 597034 533593 285865 180922 196040 92635 -131597
31477 -131597 -250187 -199791 -154429 -196318 -189302 -54185 59360 -6521 -188677 -308812 -282279
31466 -282279 -123416 127748 365769 424707 267953 86289 56184 81243 -38486 -232530
31456 -232530 -198235 145346 474299 459882 179675 -38475 -59419 -24457 -53005 -86235 -59454
$$ packed form
31530a34380K15013J41873q40p4986j3376J09225J53239O5050o2637j10363r1550
31519A96268j13553j76355j46382n870L2125j65219l49739j70712K80177N09019
31509a10241K72331j05874k13001p0083M0274L3018K3083K7222k7087p9904j9709
31498b29971O8438K4608o1663L2523K37639K40099K862j42433m2736K9564j11578
31487D7352j90826O0764L74257L05487o3441k47728j04943J5118j03405k24232
31477a31597j18590N0396M5362m1889P016J35117J13545o5881j82156j20135K6533
31466b82279J58863K51164K38021N8938j56754j81664l0105K5059j19729j94044
31456b32530L4295L43581L28953j4417k80207k18150k0944L4962k8548l3230K6781
$$ plain form
31445 -59454 -40808 -103690 -182814 -165860 -65316 -4426 -52296 -136854 -130519 -10159 76206
31434 76206 -47292 -329971 -465713 -244553 125951 242239 37059 -149946 -88817 37239
31424 37239 4509 -61190 43603 152904 -54972 -483014 -665736 -423943 -87465 35263
31414 35263 39722 97787 94034 -124309 -382170 -392107 -195754 -81198 -141481 -208494 -189941
31403 -189941 -191172 -285928 -406057 -494955 -565932 -576274 -438247 -193082 5117 103316 161907
31392 161907 149381 -32916 -274164 -281600 -13204 175567 5650 -327273 -458142 -369057
31382 -369057 -321814 -400252 -431642 -325060 -191977 -106103 -8126 86167 20687 -250002 -526438
31371 -526438 -593489 -448711 -222827 -20392 74686 -5620 -193156 -292062 -225070 -135577 -118933
$$ packed form
31445e9454J8646o2882p9124J6954J00544O0890m7870q4558O335J20360Q6365
31434G6206j23498k82679j35742K21160L70504J16288k05180j87005O1129J26056
31424C7239l2730o5699J04793J09301k07876m28042j82722K41793L36478J22728
31414C5263M459N8065l753k18343k57861r937J96353J14556o0283o7013J8553
31403a89941j231r4756j20129q8898p0977j0342J38027K45165J98199R8199N8591
31392A61907j2526j82297k41248p436K68396J88771j69917l32923j30869Q9085
31382c69057M7243p8438l1390J06582J33083Q5874R7977R4293o5480k70689k76436
31371e26438o7051J44778K25884K02435R5078q0306j87536r8906O6992Q9493J6644
$$ plain form
31360 -118933 -18015 315426 687909 751290 476321 189540 130832 206641 223776 141415
31350 141415 3190 -178308 -340716 -335854 -121169 126445 224171 213945 245038 316926 299734
31339 299734 161052 11243 -73179 -140293 -257142 -401984 -479984 -405312 -196576 -27412
31329 -27412 -99460 -382283 -570981 -424217 -61364 221614 337592 404446 427478 267630
31319 267630 -47280 -267270 -290814 -338954 -583426 -808651 -680618 -231936 161024 239554
31309 239554 98735 -22742 -9841 90730 166864 153911 133812 289950 660912 994307
31299 994307 994322 688056 388538 306232 368303 426614 445069 424855 336179 224510 220474 323583
31287 323583 322949 77099 -253409 -416501 -403040 -378281 -364411 -235194 -16166 67614 -74631
$$ packed form
31360a18933J00918L33441L72483O3381k74969k86781n8708P5809J7135q2361
31350A41415j38225j81498j62408M862K14685K47614R7726j0226L1093P1888j7192
31339B99734j38682j49809q4422o7114j16849j44842p8000P4672K08736J69164
31329b7412p2048k82823j88698J46764L62853K82978J15978O6854K3032j59848
31319B67630l14910k19990k3544m8140k44472k25225J28033M48682L92960P8530
31309B39554j40819j21477J2901J00571P6134j2953k0099J56138L70962L33395
31299I94307J5l06266k99518q2306O2071N8311J8455k0214q8676j11669m036J03109
31287C23583o34k45850l30508j63092J3461K4759J3870J29217K19028Q3780j42245
$$ plain form
31276 -74631 -230546 -183927 -21935 21869 -81589 -155249 -116298 -84274 -171215 -325221 -439650
31265 -439650 -495501 -521445 -498644 -379474 -147116 187981 581424 896767 942843 657704
31255 657704 204087 -189215 -421447 -489959 -372355 -83310 210196 304107 189206 23965
31245 23965 -118038 -301993 -512748 -585152 -447763 -264214 -200984 -196197 -114241 -10116 -45646
31234 -45646 -209615 -329088 -350493 -410892 -583858 -724802 -663786 -439375 -234245 -141629
31224 -141629 -99495 -35202 22896 12316 -44105 -55597 653 35174 -13173 -59075 6799
31213 6799 118691 105042 -38408 -121298 -69010 -72118 -285226 -537232 -548165 -339835 -202046
31202 -202046 -282878 -440230 -523595 -587724 -732485 -877790 -820683 -474741 -2355 280035
$$ packed form
31276g4631j55915M6619J61992M3804j03458p3660L8951L2024q6941j54006j14429
31265d39650n5851k5944K2801J19170K32358L35097L93443L15343M6076k85139
31255F57704m53617l93302k32232o8512J17604K89045K93506R3911j14901j65241
31245B3965j42003j83955k10755p2404J37389J83549O3230M787Q1956J04125l5530
31234d5646j63969j19473k1405o0399j72966j40944O1016K24411K05130R2616
31224a41629M2134O4293N8098j0580n6421j1492N6250L4521m8347m5902O5874
31213F799J11892j3649j43450q2890N2288l108k13108k52006j0933K08330J37789
31202b02046q0832j57352q3365o4129j44761j45305N7107L45942M72386K82390
$$ plain form
31192 280035 169057 -185726 -367092 -125183 322370 549573 418402 154592 -9922 -52645
31182 -52645 -36234 -8991 -65738 -282884 -532782 -574016 -390741 -228319 -227340 -262820 -231813
31171 -231813 -225257 -275069 -217525 -13456 65449 -166914 -463608 -500589 -381925 -434979 -643239
31160 -643239 -677895 -437914 -168181 -26906 97868 278445 395284 396376 401651 428958 311616
31149 311616 37856 -118424 -7307 117643 -17235 -251150 -215874 107452 362716 311661
31139 311661 85808 -67412 -64892 31686 129094 123892 -51812 -326274 -515243 -507352 -361937
31128 -361937 -205717 -111935 -96953 -138222 -155808 -66837 87139 149925 58549 -30965 78333
31117 78333 360736 583908 575974 375448 107669 -170129 -437233 -618344 -637053 -531232
$$ packed form
31192B80035j10978l54783j81366K41909M47553K27203j31171k63810j64514m2723
31182e2645J6411K7243n6747k17146k49898m1234J83275J62422R79l5480L1007
31171b31813O556m9812N7544K04069P8905k32363k96694l6981J18664n3054k08260
31160f43239l4656K39981K69733J41275J24774J80577J16839J092N275K7307j17342
31149C11616k73760j56280J11117J24950j34878k33915L5276L23326K55264n1055
31139C11661k25853j53220K520R6578R7408n202j75704k74462j88969P891J45415
31128c61937J56220R3782J4982m1269j7586Q8971J53976O2786r1376q9514J09298
31117G8333K82403K23172p934k00526k67779k77798k67104j81111j8709J05821
$$ plain form
31107 -531232 -414407 -322975 -193483 -7871 131581 120532 -20533 -188578 -310828 -359856
31097 -359856 -310082 -157862 34908 186065 282898 379805 502988 591368 546784 349386
31087 349386 135445 124361 390418 712217 759878 469544 114781 -57243 -118118 -261189
31077 -261189 -447538 -457893 -244197 -5165 107460 156183 232450 287868 251917 169556 93765
31066 93765 -47606 -330650 -647388 -790560 -711526 -566293 -496402 -480820 -441133 -386501 -374829
31055 -374829 -396258 -392896 -366168 -358247 -324420 -149055 156666 395536 425416 348228 312803
31044 312803 243476 -3936 -282778 -264096 59885 310840 280153 202546 263823 199885 -247560
31033 -247560 -759380 -803108 -423830 -164617 -234623 -277001 -39425 234547 273987 194421
$$ packed form
31107e31232J16825R1432J29492J85612J39452j1049j41065j68045j22250m9028
31097c59856M9774J52220J92770J51157R6833R6907J23183Q8380m4584j97398
31087C49386k13941j1084K66057L21799M7661k90334l54763j72024o0875j43071
31077b61189j86349j0355K13696K39032J12625M8723P6267N5418l5951q2361p5791
31066I3765j41371k83044l16738j43172P9034J45233O9891J5582L9687N4632J1672
31055c74829k1429L362K6728P921L3827J75365L05721K38870K9880p7188l5425
31044C12803o9327k47412k78842J8682L23981K50955l0687p7607O1277o3938m47445
31033b47560n11820m3728L79278K59213p0006m2378K37576K73972L9440p9566
$$ plain form
31023 194421 181938 139083 -48588 -198980 -113843 68000 116185 93507 164733 212921 18718
31012 18718 -300145 -402287 -217615 11887 148600 276304 402328 385171 227269 150199
31002 150199 280063 484108 600414 628111 621809 587156 542707 512700 424712 202006 -26445
30991 -26445 -37206 130987 193274 66813 19543 233378 497214 542312 441267 411392 415690
30980 415690 278153 86212 133804 461540 751627 744416 516360 262692 37396 -156538
30970 -156538 -219303 -92571 75546 104842 52484 103320 226678 183241 -80399 -288952
30960 -288952 -232487 -99849 -194291 -450098 -522757 -332859 -210180 -404685 -718964 -799353
30950 -799353 -598606 -338970 -144231 55929 297045 465391 446104 268917 89482 83375
$$ packed form
31023A94421j2483m2855j87671j50392Q5137J81843M8185k2678P1226M8188j94203
31012A8718l18863j02142J84672K29502J36713J27704J26024j7157j57902p7070
31002A50199J29864K04045J16306K7697o302l4653m4449l0007q7988k22706k28451
30991b6445j0761J68193O2287j26461m7270K13835K63836M5098j01045k9875M298
30980D15690j37537j91941M7592L27736K90087p211k28056k53668k25296j93934
30970a56538o2765J26732J68117K9296n2358N0836J23358m3437k63640k08553
30960b88952N6465J32638r4442k55807p2659J89898J22679j94505l14279q0389
30950g99353K00747K59636J94739K00160K41116J68346j9287j77187j79435o107
$$ plain form
30940 83375 310065 609211 709242 532859 302247 233349 255161 199121 132335 250120
30930 250120 503939 621895 514736 392919 406127 404884 190419 -169830 -424923 -451442
30920 -451442 -372242 -395429 -576386 -730394 -626981 -311070 -110856 -210115 -366857 -266075
30910 -266075 -2962 90332 -1787 17233 212145 296340 138775 -20304 -12425 -4405 -108452
30899 -108452 -110444 131892 361582 325155 204019 268932 364263 173557 -183105 -292484
30889 -292484 -110151 -13847 -180094 -332227 -205739 86391 291882 358754 397752 484823
30879 484823 595275 612235 397960 6743 -228526 -49385 323348 403613 57719 -372057
30869 -372057 -577915 -606555 -604907 -583009 -573956 -713888 -943664 -890462 -324877 421660 765588
$$ packed form
30940H3375K26690K99146J00031j76383k30612o8898K1812n6040o6786J17785
30930B50120K53819J17956j07159j21817J3208j243k14465l60249k55093k6519
30920d51442P9200k3187j80957j54008J03413L15911K00214r9259j56742J00782
30910b66075K63113R3294r2119J9020J94912Q4195j57565j59079P879Q020j04047
30899a08452j992K42336K29690l6427j21136O4913R5331j90706l56662j09379
30889b92484J82333R6304j66247j52133J26488K92130K05491O6872L8998Q7071
30879D84823J10452J6960k14275l91217k35269J79141L72733Q0265l45894m29776
30869c72057k05858k8640J648K1898R053j39932k29776N3202N65585P46537L43928
$$ plain form
30858 765588 524090 51134 -214163 -132340 168182 493923 694527 692585 506491 251199
$$ packed form
30858G65588k41498m72956k65297Q1823L00522L25741K00604j942j86094k55292
$$ [...]
##END NTUPLES=NMR SPECTRUM
##END=
