##TITLE=31Pdec_LY-TMF-3.24.R.t
 D2O, 24 sc
 27.2.2020
##JCAMPDX= 6.0         $$ Bruker NMR JCAMP-DX V2.0
##DATA TYPE= NMR SPECTRUM
##DATA CLASS= NTUPLES
##ORIGIN= UXNMR, Bruker Analytische Messtechnik GmbH
##OWNER= root
$$ XWIN-NMR		Version 3.5
$$ Thu Feb 27 14:49:43 2020 Russian Standard Time (UT+4h)  she@DPX200
##.OBSERVE FREQUENCY= 81.013821
##.OBSERVE NUCLEUS= ^31P
##.ACQUISITION MODE= SIMULTANEOUS
##.ACQUISITION SCHEME= undefined
##.AVERAGES= 24
##.DIGITISER RES= 17
##SPECTROMETER/DATA SYSTEM= spect
##.PULSE SEQUENCE= zgpg30
##.SOLVENT NAME= CDCl3
##.SHIFT REFERENCE= (INTERNAL, CDCl3, 0, 182.463)
##AUDIT TRAIL= $$ (NUMBER, WHEN, WHO, WHERE, WHAT)
$$ ##TITLE= Audit trail, XWIN-NMR		Version 3.5
$$ ##JCAMPDX= 5.01
$$ ##ORIGIN= Bruker BioSpin GmbH
$$ ##OWNER= she
$$ F:/spectra/data/she/nmr/P31/1/pdata/1/auditp.txt
$$ ##AUDIT TRAIL=  $$ (NUMBER, WHEN, WHO, WHERE, WHAT)
(   1,<2020-02-27 14:48:27.43 +0400>,<she>,<DPX200>,
      <created by zg, POWCHK disabled, PULCHK disabled
       configuration hash MD5:
       00 E9 B6 7A A2 85 ED C7 34 08 36 98 17 FE 4E 26
       data hash MD5: 32K
       3E FD 70 16 19 C8 C5 E0 6F 67 D8 01 5E 32 28 AA>)
(   2,<2020-02-27 14:48:29.89 +0400>,<she>,<DPX200>,
      <Start of raw data processing
       efp BC_mod = 2 LB = 1 FT_mod = 6 PKNL = 1 PHC0 = -1671.148 PHC1 = 769.2014 SI = 64K 
       data hash MD5: 64K
       0B E7 E5 36 C5 FB 85 A1 E3 B4 E1 EA AC BA 23 DB>)
(   3,<2020-02-27 14:48:56.93 +0400>,<she>,<DPX200>,
      <pk PHC0 = -31.93112 PHC1 = 79.59998 
       data hash MD5: 64K
       6E 98 63 AA B4 1A 26 CC DC 91 89 33 49 1E D2 D5>)
(   4,<2020-02-27 14:49:00.09 +0400>,<she>,<DPX200>,
      <abs ABSG = 5 
       data hash MD5: 64K
       3B 9D 53 F0 FF EF 0A FC C3 50 8B 34 A3 20 11 F9>)
(   5,<2020-02-27 14:49:14.39 +0400>,<she>,<DPX200>,
      <pk PHC0 = -4.203175 PHC1 = 0 
       data hash MD5: 64K
       A9 90 C4 DC 17 03 9C F3 DB 13 41 56 43 1C F4 AE>)
$$ ##END=
$$ 
$$ hash MD5
$$ B7 F3 30 30 C3 DC 3D BF 58 33 D8 5D 04 97 B9 B4
##$RELAX= 
##$RELAX= 
##$RELAX= 
##$RELAX= 
##$RELAX= 
##$RELAX= 
##$RELAX= 
##$RELAX= 
$$ Bruker specific parameters
$$ --------------------------
##$DU= <F:/spectra>
##$EXPNO= 1
##$NAME= <P31>
##$PROCNO= 1
##$TYPE= <nmr>
##$USER= <she>
##$AMP= (0..31)
100 100 100 100 100 100 100 100 100 100 100 100 100 100 100 100 100 100 
100 100 100 100 100 100 100 100 100 100 100 100 100 100 
##$AQSEQ= 0
##$AQ_mod= 1
##$AUNM= <au_zg>
##$AUTOPOS= <>
##$BF1= 81.014009
##$BF2= 200.13
##$BF3= 200.13
##$BF4= 200.13
##$BF5= 200.13
##$BF6= 200.13
##$BF7= 200.13
##$BF8= 200.13
##$BYTORDA= 1
##$CFDGTYP= 0
##$CFRGTYP= 5
##$CHEMSTR= <none>
##$CNST= (0..31)
1 1 145 1 1 1 1 1 1 1 1 1 1 1 1 1 1 1 1 1 1 1 1 1 1 1 1 1 1 1 1 1 
##$CPDPRG= <waltz16>
##$CPDPRG1= <>
##$CPDPRG2= <waltz16>
##$CPDPRG3= <>
##$CPDPRG4= <mlev>
##$CPDPRG5= <mlev>
##$CPDPRG6= <mlev>
##$CPDPRG7= <mlev>
##$CPDPRG8= <mlev>
##$CPDPRGB= <>
##$CPDPRGT= <>
##$D= (0..31)
$$ [...]
##$SUBNAM3= <"">
##$SUBNAM4= <"">
##$SUBNAM5= <"">
##$SUBNAM6= <"">
##$SUBNAM7= <"">
##$SUBNAM8= <"">
##$SUBNAM9= <"">
##$SW= 369.568048894756
##$SWIBOX= (0..15)
0 1 3 0 0 0 0 0 0 0 0 0 0 0 0 0 
##$SW_h= 29940.119760479
##$TD= 32768
##$TD0= 1
##$TE= 0
##$TE2= 300
##$TE3= 300
##$TEG= 300
##$TL= (0..7)
0 120 53 12 22 120 120 120 
##$TP= (0..7)
150 150 150 150 150 150 150 150 
##$TP07= 0
##$TPNAME0= <>
##$TPNAME1= <>
##$TPNAME2= <>
##$TPNAME3= <>
##$TPNAME4= <>
##$TPNAME5= <>
##$TPNAME6= <>
##$TPNAME7= <>
##$TPOAL= (0..7)
0.5 0.5 0.5 0.5 0.5 0.5 0.5 0.5 
##$TPOFFS= (0..7)
0 0 0 0 0 0 0 0 
##$TUNHIN= 0
##$TUNHOUT= 0
##$TUNXOUT= 0
##$USERA1= <user>
##$USERA2= <user>
##$USERA3= <user>
##$USERA4= <user>
##$USERA5= <user>
##$V9= 5
##$VALIST= <valist>
##$VCLIST= <CCCCCCCCCCCCCCC>
##$VD= 0
##$VDLIST= <DDDDDDDDDDDDDDD>
##$VPLIST= <PPPPPPPPPPPPPPP>
##$VTLIST= <TTTTTTTTTTTTTTT>
##$WBST= 1024
##$WBSW= 4
##$XGAIN= (0..3)
0 0 0 0 
##$XL= 0
##$YL= 0
##$YMAX_a= 14472
##$YMIN_a= -15253
##$ZGOPTNS= <>
##$ZL1= 120
##$ZL2= 120
##$ZL3= 120
##$ZL4= 120
##$ABSF1= 182.463
##$ABSF2= -187.1042
##$ABSG= 5
##$ABSL= 3
##$ALPHA= 0
##$AQORDER= 0
##$ASSFAC= 0
##$ASSFACI= 0
##$ASSFACX= 0
##$ASSWID= 0
##$AUNMP= <proc_1d>
##$AZFE= 0.1
##$AZFW= 0.5
##$BCFW= 0
##$BC_mod= 2
##$BYTORDP= 0
##$COROFFS= 0
##$CY= -3
##$DATMOD= 1
##$DC= 0
##$DFILT= <>
##$DTYPP= 0
##$F1P= 0
##$F2P= 0
##$FCOR= 1
##$FTSIZE= 65536
##$FT_mod= 6
##$GAMMA= 0
##$GB= 0
##$INTBC= 1
##$INTSCL= 5.30512e-09
##$ISEN= 30
##$LB= 1
##$LEV0= 0
##$LPBIN= 0
##$MAXI= 10000
##$MC2= 0
##$MEAN= 0
##$ME_mod= 0
##$MI= 50
##$NCOEF= 0
##$NC_proc= -4
##$NLEV= 6
##$NOISF1= 182.463
##$NOISF2= 159.3651
##$NSP= 0
##$NTH_PI= 0
##$NZP= 0
##$OFFSET= 182.463
##$PC= 4
##$PHC0= -1707.282
##$PHC1= 848.8014
##$PH_mod= 1
##$PKNL= yes
##$PPARMOD= 0
##$PSCAL= 0
##$PSIGN= 0
##$REVERSE= no
##$SF= 81.0140089999434
##$SI= 65536
##$SIGF1= 159.3651
##$SIGF2= -187.1042
##$SINO= 113.3802
##$SIOLD= 16384
##$SREGLST= <1H.CDCl3>
##$SSB= 0
##$STSI= 65536
##$STSR= 0
##$SW_p= 29940.119760479
##$SYMM= 0
##$S_DEV= 0
##$TDeff= 32768
##$TDoff= 0
##$TI= <>
##$TILT= no
##$TM1= 0
##$TM2= 0
##$TOPLEV= 0
##$USERP1= <user>
##$USERP2= <user>
##$USERP3= <user>
##$USERP4= <user>
##$USERP5= <user>
##$WDW= 1
##$XDIM= 65536
##$YMAX_p= 464784047
##$YMIN_p= -4971411
$$ End of Bruker specific parameters
$$ ---------------------------------
##NTUPLES= NMR SPECTRUM
##VAR_NAME=  FREQUENCY,     SPECTRUM/REAL,   SPECTRUM/IMAG
##SYMBOL=    X,             R,               I
##VAR_TYPE=  INDEPENDENT,   DEPENDENT,       DEPENDENT
##VAR_FORM=  AFFN,          ASDF,            ASDF
##VAR_DIM=   65536,         65536,           65536
##UNITS=     HZ,            ARBITRARY UNITS, ARBITRARY UNITS
##FACTOR=    0.456856943014862, 1,           1
##FIRST=     14782.0589164792, 0,            0
##LAST=      -15158.0608439998, 0,           0
##MIN=       -15158.0608439998, -4971411,    0
##MAX=       14782.0589164792, 464784047,    0
$$ Real data points
##PAGE= N=1
##DATA TABLE= (X++(R..R)), XYDATA
$$ [...]
##PAGE= N=2
##DATA TABLE= (X++(I..I)), XYDATA
36836D91537J1873p9036J5463J07994J6068j06334m7357Q7477N7427j14110j86763
36825B54239n8624J42146K56436K10877P056k37464l01196q6135J99526K45990
36815F32851J9808k03837j92173n682J34104J11479j6567j42989k06828j84195
36805e4029o8395J04510K49291K88652K03645K2791j84216k81349j40676J62235
36795C02459L28129J69667j04206j45673L6069J01693q6230k69601k26594q2192
36785B3521k1704R126R8638J38303N7707L6993J88707K69297N3751k20298j86563
36774D47478M3094N9424j58107k22352J772J94218J17588o3068j27816j09135
36764A83096j03377p8720j8862p751n1411l4693O6644J46184J75875K19373K29215
$$ y = [491537, 503410, 424374, 439837, 547831, 563899, 457565, 410208, 497685, 555112, 441002, 254239, 195615, 337761, 594197, 805074, 812130, 574666, 273470, 187335, 386861, 632851, 652659, 448822, 256649, 250967, 385071, 496550, 479983, 336994, 130166, -54029, -122424, -17914, 231377, 520029, 723674, 746465, 562249, 280900, 140224, 302459, 630588, 800255, 696049, 550376, 586445, 688138, 601908, 332307, 105713, 23521, 1817, 10943, 109581, 247884, 305591, 342584, 531291, 800588, 854339, 634041, 447478, 490572, 549996, 391889, 169537, 171309, 365527, 483115, 420047, 292231, 183096, 79719, 999, -17863, -25614, -77025, -111718, -45074, 101110, 276985, 496358, 725573]
36753G25573J03544n5434n0272M5439j7622j96590j94857j2024J0485j91992k37059
36742g0809N3457L12252K14961l0831j08237r1236j50749j36591J18795L80655
36732D91667L36284J02490r685j7687j25694k53778j64512O8275J53538O0920
36722F41818O460L9010K2338m5449o5679j06901k60612l30279q7720K41412K21597
36711B75995q7872j72393J41398M24389L14031n333j79638j55864o7969J8498
36701E05242M4524p4114k40368k11632O364R7112p6971k41856j59139K4186J05069
36690b21583J68762L10703L30268O7648k09041j61366O3435O6061j40495j61769
36680A12623J12166L25352K13569n0931k04870k51841l01219l12363j95583O698
$$ y = [725573, 829117, 773683, 723411, 768850, 751228, 554638, 359781, 347757, 358242, 166250, -70809, -17352, 294900, 509861, 479030, 370793, 279557, 128808, -7783, 111012, 491667, 827951, 930441, 920756, 903069, 777375, 523597, 359085, 427360, 580898, 641818, 648278, 687288, 709626, 664177, 598498, 491597, 230985, -99294, -187014, 54398, 275995, 188123, 15730, 157128, 581517, 895548, 890215, 710577, 554713, 486744, 505242, 549766, 475652, 235284, 23652, 30016, 127128, 50157, -191699, -350838, -326652, -221583, -52821, 257882, 588150, 655798, 446757, 285391, 348826, 414887, 274392, 112623, 224789, 550141, 763710, 712779, 507909, 256068, -45151, -357514, -553097, -546399]
36670e46399J94797L25863L45449J72364j25310l02394k24631m0871O6403J41082
36660F353K87382L89554K35773j33421m16791l96507j38163J44034K83269K33978
36650D95461Q6302P789O4164J25129N7473n0903j8072J31784J92799Q8713m7689
36639A132950j18946j67525j92430r1456J19977K40473J55324J273o2828p9332
36629I37480j51605k38623k35369j30733K7857J85460K12640m256k94318k88615
36619A9918M5626K50798K1297l00362k37411P7927J55638l1150m0632K48699M15641
36608F25989J85961j51445k21683n3003J29523K46147K68571J01393j94139l25942
36598F11372j61046M7441M2839o8380o2359L2839P2787Q0879J19392P2680j43470
$$ y = [-546399, -351602, -25739, 319710, 492074, 366764, 64370, -160261, -201132, -134729, 6353, 293735, 683289, 919062, 785641, 368850, -27657, -165820, -21786, 261483, 495461, 581763, 589552, 653716, 778845, 836318, 785415, 767343, 899127, 1091926, 1180639, 1132950, 1014004, 846479, 654049, 562593, 682570, 923043, 1078367, 1079640, 1016812, 937480, 785875, 547252, 311883, 181150, 209007, 394467, 607107, 602851, 308533, 19918, 65544, 316342, 337639, 37277, -200134, -122207, 33431, 2281, -38351, 210348, 625989, 811950, 660505, 438822, 385819, 515342, 761489, 1030060, 1131453, 937314, 611372, 450326, 497767, 540606, 472226, 409867, 442706, 515493, 596372, 715764, 788444, 644974]
36587F44974l15863j85821J40917L18827K13203k3234k25640l12280k02380P9866
36577A32569K80397J69672j09748k03237k4938J71003J85394Q7994J9625J2202
36567G20933M7795J03045R5351m5970k23979k45310p6384J06386J39903K8345
36557F50115j23949k12496j70197j5379J43683K26789K53353K32322J03436r7910
36547I89767j75287n1529M2851r9803k91051k11123N4919J16818j00392k30408
36537D4762m9093J83995J49812o0177j36153j0718J18591J12166J5803p9181j26457
36526A63350r3732K3404J49134J76730Q5002l8946r7865q3105o7839r4980q9419
36515C1734M8995K47319K73249M0537k11287j95258M1863J97756J26832l0770
$$ y = [644974, 329111, 143290, 284207, 603034, 816237, 793003, 567363, 255083, 52703, 132569, 412966, 582638, 472890, 269653, 244715, 415718, 601112, 689106, 708731, 720933, 768728, 871773, 967124, 921154, 697175, 451865, 375481, 481867, 621770, 650115, 526166, 313670, 143473, 128094, 271777, 498566, 751919, 984241, 1087677, 989767, 814480, 762951, 805802, 705999, 414948, 203825, 258744, 375562, 275170, 44762, -4331, 179664, 329476, 269299, 133146, 122428, 241019, 353185, 368988, 289807, 163350, 69618, 93022, 242156, 418886, 503888, 464942, 367077, 283972, 216133, 121153, 31734, 80729, 328048, 601297, 641834, 430547, 235289, 277152, 474908, 601740, 570970]
36505E70970j22666j61354j78762j15792L8862J62057J62916J08591P7257J6258
36495E58337j16655j87226n1748J59484J46501j25119l00178r7801K47248K58522
36485D91365r9297l23385q3382K77586K45207q7192j74578J17319L08001P2590
36475G44234k60656k46566L1875K01030J79884J34722P0831j07234k57041j41298
36465C49781J37902K31285O6155p0881j35J25424J17563m993j41231k39210k44610
36454C27050j24433J3434N485j38119k44917k07187n3414J41829K60330J66458
36444A46516p3384j50392O1335K27497K9958k73701k00394J89149L81717K16466
36434E54767M9813Q4112R4361m7649j15636K8N0078j02790k15261j26594o6507
$$ y = [570970, 448304, 286950, 108188, -7604, 31258, 193315, 356231, 464822, 542079, 558337, 441682, 254456, 202708, 362192, 508693, 383574, 83396, -14405, 232843, 491365, 392068, 68683, -14699, 262887, 508094, 420902, 246324, 363643, 671644, 744234, 483578, 237012, 268887, 469917, 649801, 784523, 855354, 748120, 491079, 349781, 487683, 718968, 785123, 714242, 714107, 839531, 957094, 952101, 810870, 571660, 327050, 202617, 216051, 221536, 83417, -161500, -368687, -422101, -280272, -19942, 146516, 73132, -77260, -15925, 211572, 241530, -32171, -232565, -43416, 338301, 554767, 604580, 688692, 783053, 735404, 619768, 619796, 669874, 567084, 351823, 225229, 158722]
36423A58722k05415k93014q2256K24300K98459J72816P5595L7198k2053m7195
36413C17157O959P136j08430j45381J5565J60398R4391k3077l57K5764r6817j60205
36401I3103M9400K90185K23451N616J0372J44741J6525l16680l83689j01599P2679
36390A04104p3530j55325J21831M26695L26887j8438j16219J19878K98151J47574
36380A181608j57309k96304j78128M7148J76857R3503j52075l27279k06082J34862
36370C16801L12769P8801l01107l12954J34945N41497M36723l7977l78139l63663
36360D27696j80591k4536P7697R1870l2026j63582r5979J16947K17982J49695
36350E85173P9044L0856j08572k13973k4721L03444K89217q1342k40826L4458
$$ y = [158722, -46693, -339707, -421963, -197663, 100796, 273612, 349207, 386405, 364352, 317157, 324116, 331252, 222822, 77441, 93006, 253404, 347795, 324718, 324361, 350125, 253308, 93103, 142503, 432688, 656139, 661755, 672127, 816868, 833393, 516713, 133024, 31425, 104104, 30574, -124751, -2920, 423775, 750662, 732224, 616005, 735883, 1034034, 1181608, 1024299, 727995, 549867, 597015, 773872, 867375, 715300, 388021, 181939, 316801, 629570, 708371, 407264, 94310, 229255, 770752, 1207475, 1169498, 791359, 427696, 247105, 222569, 300266, 392136, 360110, 196528, 100549, 217496, 435478, 585173, 664217, 695073, 586501, 372528, 347807, 651251, 940468, 859126, 618300, 652758]
36340F52758K18256o3460l58779j62557K01700J47406j77688k14827J2860L2115
36330B87784j59689j22847J56959K27112J2361o2233J14603J38581j27460k66463
36320A98708n1747J54745N2985j08319l3389J22755J12400L4258P0810J41180
36310F94386J18888O5658l705k22364m86881l92837J26777N19588L56313l7773
36300G38050j34388j0188o5652k35551j16291K54167L84036J17086j34569o6541
36290G30159J02576Q5677j8448J3639J22142J06750j6894p1284j5882L2038M136
36279A074609q1851k31773m26326m94319k53076J83280M32840K84539m3370k02214
36269B42339j26751J0352J19181K25815K61476J12497j09418j43881Q682N9689
$$ y = [652758, 871014, 807554, 448775, 286218, 487918, 635324, 457636, 242809, 255669, 287784, 128095, 5248, 162207, 389319, 401680, 339447, 454050, 592631, 465171, 198708, 146961, 301706, 354691, 246372, 212983, 335738, 448138, 482396, 553206, 694386, 813274, 878932, 875227, 652863, 165982, -226855, -100078, 419510, 775823, 738050, 603662, 593474, 527822, 292271, 175980, 430147, 814183, 931269, 796700, 730159, 832735, 918412, 899964, 913603, 1035745, 1142495, 1125601, 1054317, 1038435, 1070473, 1074609, 992758, 760985, 334659, -159660, -412736, -229456, 203384, 487923, 444553, 242339, 115588, 125940, 245121, 470936, 732412, 844909, 735491, 591610, 600292, 659981]
36259F59981q0279j26196Q2484K57075J22922j06370q9953O3727J9627j74723
36249F28295j92521l3550p870j30103n8072K75236M61578K28352j59442l15060
36239F96843k08949l0821J24695K24797J98781O3440m2283o6109q7385j02695
36229G70314l1000L0939j02580k98949j94237J87007L48274P0740k12743j01850
36219D65915J52406J20820r3361j13276K3083k0697k33540k70603o3301Q6200
36209E3646M6494L5628J70238K45967J20222k3981J1032J17098P3237j15309k59067
36198D75205k56444j64544n8838M7289J54744K29954K17440Q5701j24707k94187
36188C11613k94363r5321J80056L14846J69225j48913l29945j73895J64912L44065
$$ y = [659981, 579702, 453506, 535990, 793065, 915987, 809617, 719664, 783391, 803018, 628295, 435774, 402224, 394354, 264251, 206179, 481415, 942993, 1171345, 1011903, 696843, 487894, 457073, 581768, 806565, 1005346, 1068786, 1026503, 960394, 873009, 770314, 739314, 770253, 667673, 368724, 174487, 361494, 709768, 780508, 567765, 465915, 618321, 739141, 645780, 532504, 555587, 534890, 301350, 30747, -32554, 53646, 100140, 135768, 306006, 551973, 672195, 648214, 659246, 776344, 849581, 734272, 475205, 218761, 54217, -4621, 42668, 197412, 427366, 644806, 730507, 605800, 311613, 17250, -78071, 101985, 416831, 586056, 437143, 107198, -66697, 98215, 442280]
36178D42280K20923l7091j91133j31469J19268M05909M62195J68752j94704k18546
36168A046384O6966J89206r5090m45782m42907j46958R4256J43678Q6654m2637
36158D53770k09122k02307J18450M72384M16882k6143l37321j80463J66110K11398
36148H83638j14163m20319l70911o0549J52449R1101o1962m5190J25735K02852
36138C82681O5779j31724k05652j64974j09923n2410M6164J57232K15735K06337
36128D09245J46389M8494m6932p2607j0269R2749J81059J89866L7919k42170m26984
36117C06759l45243j45244q7245j21392K3279L36931M76856K92521M7019j6302
36107G67939O564m4815j17670j26261j21340j09942L541J47480R0150j21051j20630
$$ y = [442280, 663203, 626112, 434979, 303510, 422778, 828687, 1290882, 1459634, 1264930, 1046384, 1113350, 1302556, 1207466, 761684, 318777, 171819, 266075, 409753, 496407, 453770, 244648, 42341, 160791, 633175, 1050057, 1023914, 686593, 506130, 672240, 883638, 769475, 349156, -21755, -82304, 70145, 161246, 99284, 54094, 179829, 382681, 448460, 316736, 111084, -53890, -163813, -216223, -170059, -12827, 202908, 409245, 555634, 604128, 557196, 484589, 474320, 567069, 748128, 937994, 975913, 733743, 306759, -38484, -183728, -270973, -392365, -369086, -32155, 444701, 737222, 784241, 767939, 774503, 729688, 612018, 485757, 364417, 254475, 258016, 405496, 495646, 374595, 253965]
36096B53965J59260K73953k1705k91598p5351L57294M21306J03585j08256j2023
36086A060430J15371L2708j98954m15853m63916k06829K50869M96005L01105k528
36076I68408j5418J07591j3098k66662k39574K9959J08714o8146j15643Q2918
36066E79049J85402L1712r3180o608P9153J3461j9272Q8089J13943p5065k36024
36055F60660j43369N4645J21487Q1629N3587J2230n4674j6164J45569J93137j6084
36044A092653k56053k43780l7566J01449Q0025j1047j02744j53513p1001J55580
36034E54003L24037K18149r6059l27845l01688j21012R975L3388N7805J54622
36024E05375K09174O8039j84137k62104o4592J58366J57252K2786j6400L1914
$$ y = [253965, 413225, 687178, 665473, 373875, 298524, 655818, 1077124, 1180709, 1072453, 1060430, 1175801, 1208509, 1009555, 593702, 129786, -77043, 173826, 669831, 970936, 968408, 952990, 1060581, 1047483, 780821, 541247, 571206, 679920, 611774, 496131, 579049, 764451, 796163, 702983, 696375, 775528, 788989, 769717, 857806, 971749, 896684, 660660, 517291, 571936, 693423, 775052, 828639, 840869, 786195, 770031, 915600, 1108737, 1092653, 836600, 592820, 555254, 656703, 736728, 725681, 622937, 469424, 398423, 554003, 878040, 1096189, 1000130, 672285, 370597, 249585, 259560, 292948, 350753, 505375, 714549, 782588, 598451, 336347, 271755, 430121, 587373, 610159, 593759, 625673]
36014F25673L6j06657j18159J8888J89491K83293K49640Q7835o6070k5840J04886
36003A243016l8935m68355o17799j38546M44071M17753n8909k46550J1748J64284
35993G11778n0828k45261j30462O9817J45818K14353K92725J48934j88371l23684
35983F44819j31815L8788J6853P6854K99104K90193r8683l78546j87940J00380
35973F70007L3485j63111m1195K70287L17129P3208j17987j27926o7518O0448
35963I06827K55677K69931o2807m22609l93300r6266K4555r3331j19011P1956
35953C41622K53018K72532K10310J15085m6670j77531j15814P1907J45612L5756
35943A105827j12627k05159k62921k60160j38650L1209J01287L9554o5035j25561
$$ y = [625673, 625709, 519052, 400893, 419781, 609272, 892565, 1142205, 1230040, 1163970, 1138130, 1243016, 1204081, 735726, 117927, -20619, 423452, 841205, 782296, 535746, 547494, 711778, 660950, 415689, 285227, 355044, 500862, 715215, 1007940, 1156874, 968503, 644819, 513004, 551792, 568645, 645499, 944603, 1234796, 1136113, 757567, 569627, 670007, 703492, 540381, 499186, 769473, 1086602, 1159810, 1041823, 913897, 846379, 906827, 1162504, 1432435, 1369628, 947019, 553719, 457453, 482008, 388677, 269666, 341622, 594640, 867172, 1077482, 1192567, 1145897, 968366, 852552, 924459, 1070071, 1105827, 993200, 788041, 525120, 264960, 126310, 157519, 258806, 298360, 233325, 107764]
35933A07764p7700R5399K52101J88868l1292q5274J19978K55348R0736j09282
35923H06646k8820J49322M0199k98439m47009k48123L7606J54887J07102J1254
35913B84625l7465J3611R6228M8968j18185j54738M9277K34728J63919k076q846
35902E70046M8963n9111k45826k46085o2396R2338J68270K46923K66321J30747
35892I10190k0694L38R0584L5820r3921q1947K2899j96j34627j72174q7890k6824
35880D41558M10P7856J34055N7922m1408j2148L7614m5940j09142N8048K71554
35869H70379J89391j14178k56295j46172l4815k6739J0638Q3090N0079m1018k669
35858E81691J30697J67623J29969J62127J56156q1098l55945k83218O1232J94008
$$ y = [107764, 30064, 125463, 377564, 566432, 535140, 449866, 569844, 825192, 915928, 806646, 777826, 927148, 967347, 668908, 221899, -26224, 11382, 166269, 273371, 284625, 247160, 260771, 356999, 405967, 287782, 133044, 182321, 417049, 580968, 578892, 570046, 619009, 559898, 314072, 67987, 5591, 97929, 266199, 513122, 779443, 910190, 889496, 889834, 980418, 1016238, 922317, 840370, 863269, 863073, 728446, 556272, 468382, 441558, 441968, 519824, 653879, 711801, 670393, 658245, 695859, 649919, 540777, 598825, 870379, 1059770, 945592, 689297, 543125, 508310, 481571, 492209, 575299, 625378, 584360, 581691, 712388, 880011, 1009980, 1172107, 1328263, 1247165, 891220, 608002, 669234, 863242]
35848H63242l0702k26805j15428J05442J60423P0775j500L1268J87958L56955
35838A401628K60969j86906n77771m62368k0840J92701R0845Q2662K85518L29739
35828A396177N5427j88388j39769j1085n4846j72906j78259q8608J6102J18346
35818G52191J42618J5859j20433q5999o721r2886j72869M8694L59018K71663j41422
35807I69713l22907j56605r4028k66253k52236P2258K45639O8461k9429J76346
35797D10959K62362k2363k34514m3502J40467p3341l15944j27132K11757K08066
35787D16815K0405O7680K05817M8097k36998k06803M1460P9581m3519M9096K62549
35776G04180J54825j94351k15641J74520L59823n352m35944l47661J15711L58641
$$ y = [863242, 832540, 605735, 490307, 595749, 756172, 826947, 825447, 856715, 1044673, 1401628, 1662597, 1475691, 897920, 435552, 414712, 607413, 698258, 780920, 1066438, 1396177, 1451604, 1263216, 1123447, 1112362, 1057516, 884610, 706351, 617743, 633845, 752191, 894809, 910668, 790235, 704236, 697515, 604629, 431760, 480454, 839472, 1111135, 969713, 646806, 490201, 396173, 129920, -122316, -50058, 195581, 264042, 234613, 410959, 673321, 650958, 416444, 372942, 513409, 440068, 124124, -3008, 208749, 416815, 437220, 504900, 710717, 758814, 521816, 315013, 356473, 436054, 392535, 441631, 704180, 859005, 664654, 449013, 623533, 983356, 978004, 542060, 194399, 310110, 668751]
35766F68751J55999j57465k14196m9287M0860o5118j64546n9824J12029P6496
35756C43699j39091k52076j80897j02086l6191J92208M86745M56824O2034k04359
35746F26810n4270J42640q985k90199k74727K377K15064K65561K27875Q0440j19557
35735H13029j15126J24528K15172k4028j86411L8106K58421K5264l60343l47283
35725D41329o8634l4065j79324k8533L63338M47356J19037j40131r0006r80l0068
35714G99319R901J48297J31681o7623j64346r5713j17459k58156k09956R5389
35704B71334L05815K10205K6494k8162l0858o8105n7601M165j6371r1098l2730
35693D93088J27214J39489j8288r2778j4514J0900n2755J9818K43591K98599M6736
$$ y = [668751, 824750, 667285, 453089, 403802, 444662, 379544, 214998, 155174, 267203, 343699, 204608, -47468, -228365, -330451, -366642, -174434, 312311, 769135, 831169, 626810, 572540, 715180, 706195, 415996, 141269, 143646, 358710, 624271, 852146, 932586, 813029, 697903, 822431, 1037603, 1013575, 827164, 865270, 1123691, 1148955, 788612, 441329, 372695, 338630, 159306, 130773, 494111, 941467, 1060504, 920373, 830367, 829387, 799319, 809220, 957517, 1089198, 1021575, 857229, 761516, 644057, 385901, 175945, 271334, 577149, 787354, 813848, 785686, 754828, 686723, 629122, 633287, 616916, 525818, 493088, 620302, 759791, 741503, 648725, 634211, 645111, 592356, 612174, 855765, 1154364, 1201100]
35682A201100k21890k44964j40216j18258j53205j17469N025J66864L01759K77128
35672I55874M3941j75808j34744N0399Q3436j3295J1240J23251O4403j04750o2251
35661H41696J43767R7477k47798m23371k14584j497q3428k08157q6354J15644
35651f6605J50651J33075K37377L13591J67940o7782j73125j79861j92296j37010
35641A85955L3134J47136R1975K7065P8523Q8940p0137k04494j00180J08507J51831
35630E38255J7061j13280j41549p3139O2836J44878K1500k07264k16641P4472
35620A07129L30774K75451N9835l7474L625P5485J69646K29035N9335l24659n17114
35609D31068k09460L21749N26628K57473j38421l03447j98839j485J23218J34862
$$ y = [1201100, 979210, 734246, 594030, 475772, 322567, 205098, 210123, 376987, 678746, 955874, 999815, 824007, 689263, 739662, 823098, 809803, 821043, 944294, 1008697, 903947, 841696, 985463, 1082940, 835142, 411771, 197187, 195690, 112262, -95895, -182249, -66605, 84046, 217121, 454498, 768089, 936029, 868247, 695122, 515261, 322965, 185955, 219089, 366225, 458200, 485265, 563788, 652728, 582591, 378097, 277917, 386424, 538255, 555316, 442036, 300487, 227348, 290184, 435062, 456562, 249298, 32657, 107129, 437903, 713354, 773189, 735715, 739340, 814825, 984471, 1213506, 1272841, 948182, 431068, 221608, 543357, 1069985, 1327458, 1189037, 885590, 686751, 685266, 808484, 943346]
35599I43346R7175N5578k5505j34237j38610j3836R828k06279l86904k35013L3001
35588a456K8238r9936Q1016M19821L36940j15022k07488K37439M71523O2250l65332
35577H47993j94403J76733J05811k00062j78149M9668K214k00832q3605K63477
35567E88845L52653J82392J35344J66690p1410m10391l33373O0254J23276k32950
35557E61330l57275L0200L67807K03703j17944j26643M6115P6507P1911K63437
35547A019148M46156K60027j81036m14368k83603p4333k5875m6295K7881J38236
35537H65938J07551p1095j89576r0146J17266K02338J31173P4332R8718P1519
35527A318018o1165j46676j02113o0949q1586K754K24754K86538J9537k61585
$$ y = [943346, 1040521, 1096099, 1070594, 936357, 797747, 783911, 793739, 587460, 200556, -34457, -1456, 26782, -73154, 7862, 427683, 764623, 649601, 442113, 679552, 1151075, 1213325, 847993, 653590, 830323, 936134, 736072, 557923, 607591, 609805, 408973, 325368, 588845, 941498, 1123890, 1259234, 1425924, 1354514, 944123, 610750, 671004, 794280, 561330, 204055, 234255, 602062, 805765, 687821, 561178, 607293, 683800, 755711, 1019148, 1465304, 1725331, 1544295, 1129927, 846324, 771991, 746116, 699821, 727702, 865938, 973489, 902394, 712818, 622672, 739938, 942276, 1073449, 1147781, 1246499, 1318018, 1256853, 1110177, 1008064, 947115, 865529, 868283, 1093037, 1379575, 1399112, 1137527]
35517A137527k23209m0403m3401j22488O886J86933O2606k10229j55785J70244
35507G68681K02423j86745m31941j68044K31451L06655J78560J91635K97581K09668
35497A599924q5147l35556l96693l17028j70701j1392R8360J49690J87748J87191
35487I06396O8449j20452k14348j63593p3882O86R0608J36437L9460r7225o2754
35476E09782R6538J16815l2479q6338L7377P4061j08145k27784l0410K89262L80012
35465A018691K21857N1381k4356p5974j32662j48245j19934p3843N375J13303
35455H35593J75188J48352Q2763J4375q4123j89413k03850j09942j2060K6940
35445F83823M7423O0392K3410k0800K6813J19885J03063j2644m4344M3092P0169
$$ y = [1137527, 914318, 873915, 830514, 708026, 714912, 901845, 964451, 754222, 598437, 768681, 971104, 784359, 352418, 184374, 415825, 722480, 901040, 1092675, 1390256, 1599924, 1514777, 1179221, 782528, 465500, 294799, 283407, 381767, 531457, 719205, 906396, 974845, 854393, 640045, 476452, 402570, 403256, 493864, 630301, 669761, 572536, 509782, 606320, 723135, 690656, 604318, 641695, 715756, 607611, 379827, 349417, 638679, 1018691, 1240548, 1291929, 1267573, 1191599, 1058937, 910692, 790758, 716915, 722290, 835593, 1010781, 1159133, 1241896, 1256271, 1172148, 982735, 778885, 668943, 656883, 683823, 731246, 791638, 815048, 794248, 821061, 940946, 1044009, 1031365, 987021, 1030113, 1100282]
35434A100282k7916p7252J8490J04306N0390n2197j10263j77834k32897r2527
35424E02582K40851M22659K15327j33366k35662q9695K9456K8260J7446l203j34158
35413H60497k87590k34054K8648K20211J60650j630l0482Q6386J64018O9821j26466
35402I10009k19944p6339J97039L18426J36476j61822k40381j3397K37868J96404
35392A284339j02686l06898j78872J08356K07481N5418q9285o5868j6392o1983
35382H33610m6325J57466L10425J22184k32616l05438m0590J55791N4816r3551
35372I15772l2668R3532K5511j85661k70981j01544K08308M21983L21352r3073
35362A302531m77786m46773o8342J96103J26444m310N5319J40555L7562r6764
$$ y = [1100282, 1072366, 995114, 1013604, 1117910, 1168300, 1116103, 1005840, 828006, 595109, 502582, 743433, 1166092, 1381419, 1248053, 1012391, 922696, 952152, 980412, 997858, 994655, 860497, 572907, 338853, 367501, 587712, 748362, 746732, 716250, 802636, 966654, 1036475, 910009, 690065, 613726, 810765, 1129191, 1265667, 1103845, 863464, 850067, 1087935, 1284339, 1181653, 874755, 695883, 804239, 1011720, 1067138, 977853, 911985, 895593, 833610, 787285, 944751, 1255176, 1377360, 1144744, 839306, 798716, 954507, 1009323, 915772, 883104, 976636, 1002147, 816486, 545505, 443961, 652269, 1074252, 1395604, 1302531, 824745, 377972, 309630, 505733, 632177, 627867, 683186, 823741, 861303, 764539]
35352G64539k4947J21717O8812j07813j16933K6814K6824j71701k73064j10171
35342B04077J05719J39472O4235P2571J54809J59815O6113L508L0407M2366n7932
35331I85160j95931k07419n3240J25402J72521O8780r8732k27977k20394k0505
35321C27665K68409M05502K69239J6853j21344j05340k4198P9286J45088K5807
35311A286967k67427m05715j52382J93917J57621j88131l12240m8724J74736N4669
35301D93291j39639p7671J06235J22965K5375L8121J35367J35844M8834J1254
35291H99976P388o3808j38462o8171J04234J72261N1364j22140j72426p4274K7779
35280F23721j9574j55733j27452J32994K95335P1634k63847k06788J82534L29248
$$ y = [764539, 739592, 861309, 930121, 822308, 705375, 732189, 759013, 587312, 314248, 204077, 309796, 449268, 513503, 586074, 740883, 900698, 966811, 970319, 1000726, 1043092, 985160, 789229, 581810, 528570, 653972, 826493, 895273, 796541, 568564, 348170, 327665, 596074, 1001576, 1270815, 1287668, 1166324, 1060984, 1036786, 1116072, 1261160, 1286967, 1019540, 613825, 461443, 655360, 812981, 624850, 312610, 263886, 438622, 493291, 353652, 275981, 382216, 505181, 530556, 568677, 704044, 839888, 888722, 899976, 907364, 843556, 705094, 636923, 741157, 913418, 964782, 842642, 670216, 595942, 623721, 604147, 448414, 320962, 453956, 749291, 820925, 557078, 350290, 532824, 862072]
35270H62072M4569j89409k2383K40664K22662O0452K0186q042j83919k89543j12545
35259F44764Q8170j162j74169o6264J81471J73984m0653r6189L1888O1692j7750
35248G85782K5191J37888N8600j19919m2400K44324L04719N8523p7848O8350J27967
35237A571177j27925l40659j43449K30049L10810P7345j19535j30761j24060j89662
35227A013330j75600J0677J68201L6483l03233m37999j25890L30134M14407O8689
35217I99199k48212k23782p4651r0349j46585J3003K89132L99339L37468K79142
35207A533704J99981j2436k13126j85955n3450p1831j41618k000J91697M5517
35197A290483l33035l67811J05651N48047M92934J22990j56371k68240l14657
$$ y = [862072, 906641, 717232, 694849, 935513, 1158175, 1218627, 1238813, 1230771, 1046852, 757309, 644764, 732934, 731772, 557603, 491339, 672810, 846794, 806141, 709952, 741840, 803532, 785782, 810973, 948861, 1007461, 887542, 845142, 1089466, 1394185, 1452708, 1374860, 1443210, 1571177, 1443252, 1102593, 959144, 1189193, 1500003, 1577348, 1457813, 1327052, 1202992, 1013330, 837730, 848407, 1016608, 1053091, 749858, 311859, 185969, 516103, 930510, 999199, 750987, 527205, 452554, 362205, 215620, 228623, 517755, 917094, 1254562, 1533704, 1733685, 1721249, 1508123, 1322168, 1268718, 1196887, 1055269, 1053269, 1244966, 1290483, 957448, 589637, 695288, 1243335, 1736269, 1859259, 1702888, 1434648, 1119991]
35188A119991k65850j11770l0062j13605j63837l311K18365K59232J36489L3217
35178A078859J5355K3505Q079o4763k00634k76244j26979J78395L50551K57720
35168A243844P6138k8414j19774k59383l08216j53273O3428J39666Q9701N0591
35158G94308L9743j9487j15158j42149m6585J11171K13778J84488O7041j6044
35148A071106l5112r4936k14197k14121k081J97393J46453k0463k2464R1755O4042
35137I67375p7750o8978R0452J29966O837m2454K2239o636j03638P755K81846
35126A207014L01438j3323j93186K1624K44149J03298j54170j44932k100o6641
35116A303171k61117k70372j09200l2308m4651N3818K40455K82522J23593n4384
$$ y = [1119991, 854141, 742371, 712309, 598704, 434867, 431556, 649921, 909153, 1045642, 1078859, 1094214, 1117719, 1125798, 1061035, 860401, 584157, 457178, 635573, 986124, 1243844, 1319982, 1291568, 1171794, 912411, 604195, 450922, 514350, 654016, 743717, 794308, 834051, 814564, 699406, 557257, 510672, 621843, 835621, 1020109, 1087150, 1071106, 1035994, 941058, 726861, 512740, 510659, 708052, 854505, 834042, 811578, 903333, 967375, 889625, 820647, 911099, 1041065, 1047902, 1005448, 1027687, 1021051, 917413, 925168, 1207014, 1508452, 1495129, 1301943, 1323567, 1567716, 1671014, 1516844, 1371912, 1369812, 1303171, 1042054, 771682, 662482, 630174, 585523, 639341, 879796, 1162318, 1285911, 1231527]
35106A231527j05231k7413J02766J28527q4094l67352l29983O8235L34982J39302
35096A091266j50344l0279L41254M23854J59790j5562N7966O7719j51199l18742
35086A475723j93283M8032J08349k6668j56437j50077m6720J2762p4694k10759
35076G86228j48456J52578L67679K24893p6441j60509m1409j9359j11033l5391
35066I38780K24758L12426O8906j93144j74340q34O4263K7370L5615O9921K4224
35055A397945o2792q3432n8616o8959q5041l8286K5864K8860J6585P5615J54161
35044A301904J28266Q677p4446p7543q3638j26304j20879k5977M5047k9553j80626
35033G64928j98300J4236L06938M34303L05207M9877j38035j80086j32488p6842
$$ y = [1231527, 1126296, 1098883, 1201649, 1330176, 1246082, 878730, 548747, 616982, 951964, 1091266, 940922, 910643, 1251897, 1675751, 1835541, 1819979, 1877945, 1945664, 1794465, 1475723, 1282440, 1330472, 1438821, 1412153, 1255716, 1105639, 1058919, 1071681, 996987, 786228, 637772, 790350, 1158029, 1382922, 1306481, 1145972, 1104563, 1085204, 974171, 938780, 1163538, 1475964, 1544870, 1351726, 1177386, 1176552, 1240815, 1268185, 1303800, 1373721, 1397945, 1335153, 1251721, 1193105, 1124146, 1039105, 1000819, 1026683, 1055543, 1072128, 1147743, 1301904, 1430170, 1438847, 1364401, 1286858, 1203220, 1076916, 956037, 930060, 975107, 945554, 764928, 566628, 580864, 887802, 1322105, 1627312, 1677189, 1539154, 1359068, 1226580, 1149738]
35023A149738l6698j87J8009j6723q5462r7438O982J55677K03643Q9249j14847
35012A271943k84472l12481j42398J40830K85403J19627j64170j90027Q2253K72515
35002A079023J31143j09811j39049l4737l0733n7678R5667L18980K99265L8076
34992A590146j48395j23812n0716k7924J1199L6232n4491j29401M4865L28563
34982A476266L01964q3404l89012l43096j60857o0468O6440K76415L27096J08194
34972A519538p8952L751J30375K0890j70868j41632N2851J33454L9207q4276j62699
34961A261639j90984j29418k5775m0450j60082j39754P9884K08722Q4426l4591
34951I13617O9600J82353O2127j10628p6835K6618m6674j74679j10127M7599O1027
$$ y = [1149738, 1113040, 1112853, 1130862, 1114139, 1028677, 931239, 938221, 1093898, 1297541, 1386790, 1271943, 987471, 674990, 532592, 673422, 958825, 1078452, 914282, 724255, 806508, 1079023, 1210166, 1100355, 961306, 926569, 895836, 838158, 933825, 1252805, 1552070, 1590146, 1441751, 1317939, 1267223, 1239299, 1250498, 1286730, 1232239, 1102838, 1147703, 1476266, 1778230, 1694826, 1305814, 962718, 801861, 741393, 807833, 1084248, 1411344, 1519538, 1440586, 1444337, 1574712, 1595602, 1424734, 1283102, 1335953, 1469407, 1508614, 1424338, 1261639, 1070655, 941237, 915462, 875012, 714930, 575176, 655060, 863782, 948208, 913617, 983217, 1165570, 1227697, 1117069, 1040234, 1066852, 1020178, 845499, 735372, 782971, 843998]
34940H43998P589Q7086J91201J06909n2596o1507k1508j34451k42544q2773J84268
34929H25672K05428L3653j6228M5325k0002j28357J512K54766K34698n9145k26066
34918A151256j25062O404Q0419K34912L70869K08173j34780k10178J2575O6480
34908A661068k06129l77103j81505M5274j9475j60963p2914J14259J36103O8971
34898A007586J17955K04555J30819m2803j04496l7645j183o4397j50004j55351
34888I05036k0317K13229L54911K38995j9709j37501n3287K1748l2814j06232
34878A364059j22971j49812j57605J1470L07481L93916Q5103l55342n20681l07337
34868E48281N8502K93599K77359J26938Q1810J99064K31085j3019l07467k98274
$$ y = [843998, 851587, 938673, 1129874, 1236783, 1184187, 1122680, 1101172, 966721, 724177, 641404, 825672, 1031100, 1064753, 1048525, 1093850, 1073848, 945491, 947003, 1201769, 1436467, 1377322, 1151256, 1026194, 1032598, 1113017, 1347929, 1718798, 1926971, 1792191, 1582013, 1594588, 1661068, 1454939, 1077836, 896331, 941605, 922130, 761167, 688253, 802512, 938615, 1007586, 1125541, 1330096, 1460915, 1418112, 1313616, 1275971, 1274788, 1210391, 1060387, 905036, 884719, 1097948, 1452859, 1691854, 1672145, 1534644, 1481357, 1503105, 1470291, 1364059, 1241088, 1091276, 933671, 945141, 1252622, 1646538, 1731641, 1376299, 855618, 548281, 606783, 900382, 1177741, 1304679, 1386489, 1585553, 1816638, 1803619, 1496152, 1197878]
34858A197878n0224N4337q9181k10108j54357n8747J503J14218K05557M7303k87619
34847G70560l92794j11254K29978L26605K62079K03759J26351L9042J05941L02088
34837A862355L03079k5796l57674l84071k47516k06709j79459L0735K92602L11499
34827A399045R8851o3214n4587k2233p8038j37104q8164L7169J17785R4444K8198
34816A332152L845l116p5320j49496m0263K22335L06658N0476k13732j21400J49467
34805A461606J74470j7354l4876J70315K29833N321k09661k11098j28366o0927
34795A379263N5591J28476n3462l35501k57758K20262N41214L17762j59736m06261
34785A429850l19084n5185K56361M40000K86909j16851l89400l47802j81882m1755
$$ y = [1197878, 1147654, 1201991, 1112810, 902702, 748345, 689598, 691101, 805319, 1010876, 1058179, 770560, 377766, 266512, 496490, 823095, 1085174, 1288933, 1415284, 1454326, 1560267, 1862355, 2165434, 2139638, 1781964, 1397893, 1150377, 943668, 764209, 794944, 1087546, 1399045, 1497896, 1434682, 1380095, 1357862, 1279824, 1142720, 1054556, 1091725, 1209510, 1303954, 1332152, 1335997, 1332881, 1257561, 1108065, 1067802, 1290137, 1596795, 1647271, 1433539, 1312139, 1461606, 1636076, 1618722, 1583846, 1754161, 1983994, 1989315, 1779654, 1568556, 1440190, 1379263, 1434854, 1563330, 1509868, 1174367, 916609, 1136871, 1678085, 1995847, 1836111, 1429850, 1110766, 1055581, 1311942, 1751942, 2038851, 1922000, 1532600, 1184798, 1002916, 961161]
34775I61161J40834L17266K73301N9397j335J19863Q3925j74170k90027j47554
34765A342661j07141k98521l15848L5637L04719J33845j29593m0410K21832K37214
34755A384395K9400j16588j53960j61604q1973N9817N4235n6801R4083N06743
34745A557747O02555J25692l33340k34084P2561J2315k40848j69505J46562K37435
34735A777090O9514l7305n2188j37054j63118M0296K03696J1365k73812k11712
34725A226772M4725M3378j42520r0192J54858J60551r7360k15689q3720K5109
34715A025912M4077J70083L38511K41845q9412k60748j23793M3665L114j81848
34705A211406l34278k97432J3532L93873M00643l4229l41887r0488L26616L03179
$$ y = [961161, 1101995, 1419261, 1692562, 1751959, 1750624, 1870487, 1954412, 1780242, 1490215, 1342661, 1235520, 936999, 621151, 656788, 961507, 1095352, 965759, 925349, 1147181, 1384395, 1413795, 1297207, 1143247, 981643, 899670, 959487, 1013722, 956921, 1051004, 1557747, 2160302, 2285994, 1952654, 1718570, 1791131, 1803446, 1562598, 1393093, 1539655, 1777090, 1846604, 1809299, 1757111, 1620057, 1456939, 1497235, 1700931, 1712296, 1438484, 1226772, 1271497, 1314875, 1172355, 1082163, 1237021, 1397572, 1300212, 1084523, 1000803, 1025912, 1069989, 1240072, 1578583, 1820428, 1731016, 1470268, 1346475, 1390140, 1393254, 1211406, 877128, 579696, 593228, 987101, 1387744, 1353515, 1011628, 921140, 1247756, 1550935]
34695A550935k6993q6041J77338L05704J37706p6113k23684l64301l54154o1226
34685I79171K02656R1074j20485M9303M15780M06692M6809j21489M248J7653j51308
34674A820104j33481J14070K12651Q1721K3154N6953q8274l01621j83291J46182
34664A748168J40751j86526k22800J50481K98605o6753l70554j37198K65256K85316
34654A904746m626j91628j41443K6485J96823K33249M7629j62112j14983P2540
34644A866680N3663j23890j06658P9422P0104j10105p0369J50806Q2948k66508
34634A626093l11244R3275L37724P0980k45120j65435O3478P9019K2338J39519
34624A710627K92580K76011J75285R2793n5475k38971k57848j44921j29336j25733
$$ y = [1550935, 1523942, 1437901, 1615239, 1920943, 2058649, 1982536, 1758852, 1394551, 1040397, 979171, 1181827, 1272901, 1152416, 1201719, 1617499, 2024191, 2071000, 1949511, 1953759, 1971412, 1820104, 1686623, 1800693, 2013344, 2095065, 2118219, 2175172, 2086898, 1785277, 1601986, 1748168, 1888919, 1702393, 1479593, 1630074, 1928679, 1861926, 1491372, 1354174, 1619430, 1904746, 1900120, 1708492, 1567049, 1593534, 1790357, 2023606, 2071235, 1909123, 1794140, 1866680, 1920343, 1796453, 1689795, 1769217, 1839321, 1729216, 1658847, 1809653, 1892601, 1626093, 1314849, 1408124, 1745848, 1816828, 1571708, 1406273, 1469751, 1548770, 1571108, 1710627, 2003207, 2279218, 2454503, 2547296, 2491821, 2252850, 1995002, 1850081, 1720745, 1595012]
34614A595012J33098M05507J42909m88686o40113p8800M14160K83550m5951q5391
34604A635295o6898k58309l10365N7995M12226K96612j8725r3079m5779j41462
34594A467511k01369j7473J68363J49199J80446L98051M02010j3481l32852j48896
34584B051509R7081j04579m11161k57433J31019J80835k2336j1130J55934J08986
34574A918725k1448J42220L92202K01654l11886m90746j57557J87833J92844L5879
34564B089720m5150n3932j4079J04591K05706J55554J4028r8584k24108l80616
34554A753130l70303q5408K23231K91354K02079J19017j5490k01942j82431J06381
34544A839618K62054J6787k65717j43488K12911L54018K39043J10713n01j64731
$$ y = [1595012, 1728110, 2133617, 2276526, 1787840, 1147727, 1068927, 1483087, 1766637, 1720686, 1635295, 1568397, 1310088, 999723, 1057718, 1469944, 1766556, 1747831, 1654752, 1608973, 1467511, 1266142, 1248669, 1417032, 1566231, 1746677, 2144728, 2546738, 2533257, 2200405, 2051509, 2148590, 2044011, 1632850, 1375417, 1506436, 1687271, 1664935, 1653805, 1809739, 1918725, 1897277, 2039497, 2431699, 2633353, 2321467, 1830721, 1673164, 1860997, 2053841, 2089720, 2044570, 1990638, 1976559, 2081150, 2286856, 2442410, 2456438, 2357854, 2133746, 1753130, 1382827, 1297419, 1520650, 1812004, 2014083, 2133100, 2117610, 1915668, 1733237, 1839618, 2101672, 2118459, 1852742, 1709254, 1922165, 2276183, 2515226, 2625939, 2625438, 2460707]
34534B460707k31205p9003P2404R264j03846o0654J3178k3922k3192R1166Q3429
34523B208326j11224j56521N5000J04975j85699l19803K5679L59224J99337r8277
34513B081017k9572J57735J5033k31731j69065k6193j78989l30524n9997K92808
34503A520522K00481n5878Q7173L91914K67144r5806r2323J25460n0322m70077
34493A828288m42846m1J72748k9120n9433J58645J35267j35165r0463L26919N06606
34482B371405K18118r0225j57192j95706k23568Q983L21975K14572k11828k99426
34472A957108P8288L30347J77201P564M8986K2610j79653k58523j35911r0940
34462A957077j33923K9305L16066K99178m491j37349l4235n5970j76585p330L30911
$$ y = [2460707, 2229502, 2150499, 2222903, 2232167, 2128321, 2067667, 2080845, 2056923, 2033731, 2124897, 2208326, 2097102, 1940581, 1995581, 2100556, 1914857, 1595054, 1620733, 1979957, 2179294, 2081017, 2051445, 2209180, 2224213, 1992482, 1823417, 1797224, 1618235, 1287711, 1227714, 1520522, 1721003, 1665125, 1752298, 2144212, 2411356, 2315550, 2223227, 2348687, 2298365, 1828288, 1385442, 1385401, 1558149, 1529029, 1469596, 1628241, 1763508, 1628343, 1537880, 1864799, 2371405, 2589523, 2499298, 2342106, 2146400, 1922832, 1931815, 2253790, 2468362, 2256534, 1957108, 2035396, 2365743, 2542944, 2550508, 2599494, 2622104, 2442451, 2183928, 2048017, 1957077, 1823154, 1852459, 2168525, 2467703, 2463212, 2325863, 2291628, 2235658, 2059073, 2051743, 2382654]
34451B382654K85341j01956k04015N0413O0268k66785k94164J17168K54961j79619
34441B104266n01756k28550J39258Q0509r1382N3645K73764K06376L5596L3334
34431B105060L9675q1005n2481K54538M42269K32301m9545p0585l2727j85512
34421B601988l22198k01417n811K0778k5984r4K0146N519R0990K18595J34432
34410B536944j04941j41406M7704R6420n8619p0302J15929J32990r2187j95763
34400B266769r0814r0973j88420k861L91109M32241O6998j01539J09429J56006
34390B947945j72466l31001k6153K65016J86708M4945O9880R902j70434r2258
34380B732084J84956Q2555l65589l72275J84812L77051j75422n38749n1098N10074
$$ y = [2382654, 2667995, 2566039, 2362024, 2412437, 2472705, 2205920, 1911756, 2028924, 2283885, 2104266, 1602510, 1373960, 1513218, 1593727, 1502345, 1555990, 1829754, 2036130, 2071726, 2105060, 2144735, 2063730, 2011249, 2265787, 2708056, 2940357, 2890812, 2820227, 2787500, 2601988, 2279790, 2078373, 2072562, 2093340, 2067356, 2067262, 2087408, 2092927, 2183917, 2402512, 2536944, 2432003, 2290597, 2338301, 2434721, 2376102, 2305800, 2421729, 2554719, 2462532, 2266769, 2175955, 2084982, 1896562, 1893701, 2284810, 2717051, 2784049, 2682510, 2791939, 2947945, 2775479, 2444478, 2418325, 2683341, 2870049, 2914994, 2984874, 2994776, 2824342, 2732084, 2917040, 2999595, 2634006, 2261731, 2446543, 2823594, 2648172, 2109423, 2058325, 2568399]
34370B568399K71507k89632k83001J14085J90417k3356n1125O8122N5575O7258
34360B688249K59342K64666j21599l68805p7807K68916J79930J4944J65886K04594
34350C478316k34331n44256j46785L69038K05675k55734j84816K23511K16516
34341C127134j18743j54434L0368q4345l17422r6970L88733M78691K01830Q2151
34331C536993Q4703j68635m40078k36681J52835R0512k19148j09001K49009J38671
34321C079180k98792k37690L16716M64097m9298m30157j88576J94139K21941O2728
34311C134288j7405q9542j77445j22420N777k4277r1627R7844L67981K88879m0865
34300C331188j47289k3163n8534k25427j41405J12298P2519k14374k15918J30213
$$ y = [2568399, 2839906, 2550274, 2267273, 2381358, 2571775, 2548419, 2497294, 2565416, 2620991, 2688249, 2947591, 3212257, 3090658, 2721853, 2644046, 2912962, 3092892, 3107836, 3273722, 3478316, 3243985, 2699729, 2552944, 2921982, 3127657, 2871923, 2687107, 2910618, 3127134, 3008391, 2853957, 2884325, 2799980, 2482558, 2385588, 2774321, 3253012, 3454842, 3536993, 3621696, 3453061, 3012983, 2776302, 2929137, 3019649, 2800501, 2691500, 2940509, 3079180, 2780388, 2542698, 2859414, 3323511, 3274213, 2844056, 2655480, 2849619, 3071560, 3134288, 3116883, 3027341, 2849896, 2727476, 2733253, 2708976, 2617349, 2715193, 3083174, 3372053, 3331188, 3183899, 3160736, 3102202, 2876775, 2735370, 2847668, 2920187, 2705813, 2489895, 2620108]
34290B620108K92960O8480j35985n2458J08704J80208K62905L39136K37435L4832
34280C956325k3977J6587n6903j65822j13974l3825j06080r4645K11736L98780
34270C988202K606n90078o21516j20970K36335K26513J83116J78092j7988k57751
34260C206561j54876J66384K54528J51905K32489L73987J56168k42567k46426
34251C898153R8265J92963p7784k50375j71624j26340j28771O2306K83351J69102
34241C949246p1245N4286L65491K59989j87510l33924r9804p216j30360k2459
34231C776494K96433K89733q6176k81875j40767o5208j48853o4376J44870Q7942
34221C808217j30950k6466K99439K65414r8364j62631J53696K54553l6520k37689
$$ y = [2620108, 2913068, 2981548, 2845563, 2793105, 2901809, 3082017, 3344922, 3684058, 3921493, 3956325, 3932348, 3948935, 3892032, 3726210, 3612236, 3578411, 3472331, 3377686, 3589422, 3988202, 3990808, 3400730, 2779214, 2658244, 2894579, 3121092, 3304208, 3482300, 3464312, 3206561, 3051685, 3218069, 3472597, 3624502, 3856991, 4230978, 4387146, 4144579, 3898153, 3996418, 4189381, 4111597, 3861222, 3689598, 3563258, 3434487, 3496793, 3780144, 3949246, 3878001, 3932287, 4297778, 4557767, 4370257, 4036333, 3936529, 3929313, 3798953, 3776494, 4072927, 4362660, 4276484, 3994609, 3853842, 3788634, 3639781, 3575405, 3720275, 3808217, 3677267, 3650801, 3950240, 4215654, 4117290, 3954659, 4108355, 4362908, 4326388, 4088699]
34211D088699j57232j21559j81994l8819K01119J35891p3508O6304L61939K07396
34201D488236k07880j33614L45209L99055m3621k00350P0055M9830l67719l92083
34191D007118J60517M44828Q7575j92295N6863K81677P1647j24187K3175J17901
34181D934819n3996n9209K28162K30267k57137n72073k82746J48152K57543K29709
34171D803491K30227J8712l50626l49745Q6312L10721K4224k67304j78881J4985
34161D342116N3105P6237J22007K9586m4053J68418L55940O3522l32148j44878
34151D689852L30001K69791j57893j19474K57724J40289k94123j14846M64276
34142E465597L13629m43411m83772L01779N35150j44334m39036J92344O07162
$$ y = [4088699, 3931467, 3809908, 3627914, 3589095, 3790214, 3926105, 3852597, 3918901, 4280840, 4488236, 4280356, 4146742, 4491951, 4891006, 4847385, 4647035, 4717090, 4766920, 4399201, 4007118, 4167635, 4612463, 4700038, 4507743, 4564606, 4846283, 4917930, 4793743, 4816918, 4934819, 4880823, 4821614, 5049776, 5280043, 5022906, 4450833, 4168087, 4316239, 4573782, 4803491, 5033718, 5052430, 4701804, 4352059, 4438371, 4749092, 4773316, 4506012, 4327131, 4342116, 4395221, 4471458, 4593465, 4623051, 4578998, 4747416, 5103356, 5166878, 4834730, 4689852, 5019853, 5289644, 5131751, 5012277, 5270001, 5410290, 5116167, 5001321, 5465597, 5779226, 5335815, 4852043, 5153822, 5688972, 5544638, 5105602, 5297946, 5905108]
34133E905108J79804j43513J79030K64795l23436o27068j61821J45395j75836
34124E242458k38495K96793L94609k66331m19133M48221R45138K33091m38554
34115F197797m5675M02530q7334n96583j22787N11982K97672j10238J32911L65376
34105F945651j19485n15688p7747L32287p9597m32663Q9139N49260M6762m79131
34095F258788l8656M90598J11924l14684J75128O08574r1775q49681k58351Q16544
34085F908409P56698l1115j50310K23566R1736k24977P8192M22700l6423n51614
34075G486862j26929M76815J63455l60003o741M88473L6639n28611r245P03725
34065H324440K21796o35938l20937N38093L84008l15594j10544N54597K97959
$$ y = [5905108, 6084912, 5941399, 6120429, 6385224, 6061788, 5434720, 5272899, 5418294, 5242458, 5003963, 5300756, 5695365, 5429034, 5009901, 5458122, 6403260, 6636351, 6197797, 6152122, 6554652, 6467318, 5870735, 5747948, 6259930, 6557602, 6447364, 6580275, 6945651, 6826166, 6310478, 6232731, 6565018, 6485421, 6052758, 6141897, 6691157, 6737919, 6258788, 6220132, 6710730, 6822654, 6507970, 6683098, 7291672, 7199897, 6350216, 6091865, 6908409, 7665107, 7633992, 7483682, 7707248, 7798984, 7574007, 7652199, 8074899, 8038476, 7486862, 7359933, 7836748, 8000203, 7640200, 7633459, 8121932, 8158571, 7629960, 7620715, 8324440, 8546236, 7910298, 7589361, 8127454, 8511462, 8195868, 8085324, 8639921, 8937880]
34056H937880l96321j39978N60035K74408n02580k98215M48348K75543m05726
34047H753394j69794N39776K83328m63763k02548O15800M62104k56769m9617O41168
34037A0153079L36210m19524m4212Q66723N55814m68485l45154N60492M05533
34028A1600476n09345l62798N72852M83020l87841k52193O37251N15225l15741
34019A1980906q3299Q11976M90055n93671l61443Q45277Q51326j89714k18237
34010A3533176O04649L13819p39031m22642Q76018Q13769l82766l63299P21262
34001A4954955N97257m68481j24287J232553R88217n36239n28256Q86461Q94217
33992A7896397m42763l21894J128453R75152o32011n48725J189729J319915k40982
$$ y = [8937880, 8541559, 8401581, 8961616, 9236024, 8733444, 8435229, 8883577, 9159120, 8753394, 8583600, 9123376, 9406704, 8942941, 8740393, 9356193, 9818297, 9561528, 9511911, 10153079, 10489289, 10069765, 10025553, 10892276, 11448090, 10979605, 10634451, 11194943, 11600476, 11091131, 10728333, 11301185, 11784205, 11396364, 11144171, 11781422, 12296647, 11980906, 11897607, 12709583, 13199638, 12605967, 12244524, 13089801, 13941127, 13751413, 13533176, 14137825, 14451644, 13712613, 13289971, 14165989, 14979758, 14596992, 14233693, 14954955, 15552212, 15083731, 14959444, 16191997, 17180214, 16643975, 16115719, 17002180, 17896397, 17453634, 17131740, 18260193, 19235345, 18603334, 18054609, 19244338, 20564253, 20323271]
33983B0323271k04504J484643J384749n59914o48305J351746J602285l27020o15406
33974B3791545J206336J343014m84070k41183K170804K173892m99081p95190J948715
33965C0614782K476547j75100o39027K191032K744322j96945p62824K422631L188528
33956D1863946O9714l22853L580186M539695P13441R259M649327O063439J696146
33947F2862300R60686O751352Q478459K749835J760832R835873J2965408N646732
33939A12011477M084590J4846565J8152733O823196R421747L6393636L4576850
33932B36310794m6470887j57339047j85749844r9286666J0707022M9550320K6585651
33925a65692657Q212240J5212429J8856476P959791K631153R939608J2887913
$$ y = [20323271, 20118767, 21603410, 22988159, 22428245, 21779940, 23131686, 24733971, 24406951, 23791545, 24997881, 26340895, 25856825, 25615642, 27786446, 29960338, 29461257, 28666067, 30614782, 33091329, 32916229, 32277202, 34468234, 37212556, 37015611, 36252787, 38675418, 41863946, 41933660, 41610807, 45190993, 49730688, 50444129, 50453388, 55102715, 61166154, 62862300, 63822986, 70574338, 79052797, 81802632, 83563464, 93399337, 106364745, 112011477, 116096067, 130942632, 149095365, 155918561, 165340308, 201733944, 236310794, 189839907, 32500860, -153248984, -252535650, -241828628, -192278308, -165692657, -157480417, -142267988, -123411512, -115451721, -112820568, -102880960, -89993047]
33918h9993047N188911R90986N972103Q224874K752816q5088M169552O236586
33910e6542307J930687m51295K982942M725716J178912p16763K430189M082046
33902d0379873Q87838j011572J779616L547538Q03922j249849R21891K716199
33894c1984290P32271r37125Q59447K366473O46195q09956P35282J980746L67135
33885b6043822q91300P26282K142771P86318o11524L45612J218005L7561o27106
33876b2917203R83314J950252K39442j179445J58278J663477P11722o27550O2833
33867a8954880J039662K58956n46071M19203J268514K27063p07641L79820J535524
33858a5079850O57700n79977j13843O68312J4322o26208L34560J209381K17322
$$ y = [-89993047, -84804136, -83813150, -77841047, -69616173, -66863357, -66948445, -62778893, -56542307, -54611620, -55062915, -52079973, -47354257, -46175345, -46892108, -44461919, -40379873, -39492035, -40503607, -38723991, -35176453, -34372531, -35622380, -34700489, -31984290, -31252019, -32189144, -31329697, -28963224, -28317029, -29126985, -28391703, -26410957, -26043822, -26935122, -26208840, -24066069, -23279751, -23891275, -23545663, -22327658, -22290097, -22917203, -21933889, -19983637, -19744195, -20923640, -20765362, -19101885, -18390163, -19017713, -18954880, -17915218, -17656262, -18202333, -17783130, -16514616, -16287553, -16995194, -16615374, -15079850, -14422150, -15002127, -15115970, -14447658, -14433336, -15059544, -14724984, -13515603, -13298281]
33849a3298281r65143l06266Q32115M52984l68208R8350P96717J92871n38318
33840a3103179J05046Q55086J54495o93059k8966Q84215K90310o60709j73641
33831a2370402P27833K68368o01204q6630R56377O70747l37134l38019K59278
33822a0850786L4850n03746o3293P03700M34339k68416p3621M76096J92220k90152
33812a0208809J58777P44140K28907n41642j77448N70371K71002m01172j6974
33803i372848P70252M66366l73369k32457M72748L07040l71501k17723L83545
33794h167947Q6204p22818o10106K27761M78975K09823L97412O90555J07704p00266
33784h002703l63361O26207O84116p1358k22194K62749J94006l79819k97453L84718
$$ y = [-13298281, -14263424, -14569690, -13737575, -13284591, -13652799, -13554449, -12757732, -12564861, -13103179, -12998133, -12143047, -11988552, -12681611, -12710577, -11826362, -11536052, -12196761, -12370402, -11642569, -11374201, -11975405, -12062035, -11105658, -10434911, -10772045, -11110064, -10850786, -10815936, -11319682, -11382975, -10679275, -10244936, -10513352, -10586973, -10110877, -9918657, -10208809, -10050032, -9305892, -9076985, -9618627, -9796075, -9225704, -8954702, -9355874, -9372848, -8602596, -8136230, -8509599, -8742056, -8269308, -7962268, -8333769, -8551492, -8167947, -8081743, -8804561, -9414667, -9186906, -8707931, -8498108, -8100696, -7410141, -7302437, -8002703, -8366064, -7739857, -7055741, -7127099, -7349293, -7086544, -6892538, -7272357, -7569810, -7185092]
33774g185092M82951p1108k21744J56318K16420o5842J1647K68520P01m12911
33764f820140j16082M56369K92614k30638m2392N16587L25538l13449k35235L06426
33754e860402J17073n78691m99645K71443M70813K2748j3662L22415o729p94552
33744f549189p36069J50498M82436l908j27201M10941N50909Q219k14354J96050
33734e831668L53307L889l5167L73503L53332k11385l69507Q2825K49222r3383
33724e125032j45987J82862J7967o54507p27709K6298M85478J72625m3119K58094
33714e553030L10430j89723l97713O0191L69763Q4291j14733J59509K86915l2087
33704e016187j66668J33540K20789j00792j25526L05903L61988j91222m27080
$$ y = [-7185092, -6702141, -6773249, -6994993, -6838675, -6622255, -6688097, -6676450, -6407930, -6407229, -6820140, -6936222, -6479853, -6187239, -6417877, -6460269, -5943682, -5618144, -5931593, -6166828, -5860402, -5743329, -6322020, -6821665, -6550222, -6079409, -6056661, -6070323, -5747908, -5754637, -6549189, -7285258, -7134760, -6652324, -6656232, -6783433, -6372492, -5821583, -5813364, -6027718, -5831668, -5478361, -5474472, -5509639, -5136136, -4782804, -4994189, -5363696, -5280871, -5031649, -5125032, -5271019, -5088157, -5070190, -5724697, -6452406, -6426108, -5940630, -5768005, -5811124, -5553030, -5242600, -5432323, -5830036, -5769845, -5400082, -5315791, -5430524, -5271015, -4984100, -5016187, -5182855, -5049315, -4828526, -4929318, -5054844, -4748941, -4386953, -4578175, -5005255]
33695e005255O7466M08654K6060l49573q8827K69116J56438m8845K5746o158l35236
33684d880414l86015O6014L21664J1543j97527J34664L82947N1811k82573n1957
33674d829843K86137J52460j35017o7801J30090N3209j17497o3377R7271J99981
33664d294387L42728M25617J26686l58786l98327o824J01148j96591j72464L69657
33654d061543O18568J44865l55332k56141J08480K82544L76529M05217N014o52296
33644c384095p39638j19223K74525n4541l97923j75480J33661O7721L3687L29055
33634d032251M16124k7311l66216j13574K10252R1561q7669O5008J67905o7413
33624c743584j70924J24197K60365m5896j40868L26270N92920J00979m50720l21125
$$ y = [-5005255, -4937789, -4529135, -4503075, -4852648, -4941475, -4672359, -4515921, -4564766, -4539020, -4545178, -4880414, -5266429, -5200415, -4878751, -4867208, -5064735, -4930071, -4547124, -4495313, -4777886, -4829843, -4543706, -4391246, -4526263, -4594064, -4463974, -4410765, -4528262, -4591639, -4494368, -4294387, -3951659, -3526042, -3399356, -3758142, -4156469, -4163293, -4062145, -4258736, -4431200, -4061543, -3442975, -3298110, -3653442, -3909583, -3801103, -3518559, -3142030, -2736813, -2731799, -3384095, -4123733, -4242956, -3968431, -4022972, -4420895, -4596375, -4462714, -4394993, -4361306, -4032251, -3616127, -3643438, -4009654, -4123228, -3912976, -3821415, -3909084, -3844076, -3676171, -3743584, -3914508, -3790311, -3529946, -3575842, -3716710, -3390440, -2797520, -2696541, -3147261, -3468386]
33614c468386N0550K0055r9393J17384K17475j84496m50194l3315M00591J29177
33604c300552k96003r3556K98823J22348k31563l3062L00928j1293n43455l69379
33594d156764K37288L18277m4810l7408K65380J29515k76959j12744M92837N45293
33584b640095p6760m33145j60849O8130r0176j21945K16503L98344J26569j44849
33574b858273o0653R2732K2027j02941q5927j4133M6253J42503J65244o750j39107
33563b799025M3483K91636J66564k03642l26330j48665j5561Q991J07870J67887
33553b706792l5625k71295j63893R6428O2158j50202r7094J29712Q4124j52808
33543c205287j17600J27533J05556j24225l2915L47856L82327n8874l22258l6019
$$ y = [-3468386, -3417836, -3397781, -3497174, -3379790, -3162315, -3346811, -3797005, -3830320, -3429729, -3300552, -3596555, -3690111, -3391288, -3268940, -3500503, -3533565, -3232637, -3243930, -3787385, -4156764, -3919476, -3601199, -3646009, -3683417, -3418037, -3288522, -3565481, -3678225, -3185388, -2640095, -2716855, -3150000, -3310849, -3242719, -3332895, -3454840, -3238337, -2839993, -2713424, -2858273, -2918926, -2826194, -2804167, -2907108, -2993035, -3007168, -2960915, -2818412, -2653168, -2659918, -2799025, -2755542, -2463906, -2297342, -2500984, -2827314, -2975979, -2991540, -2982549, -2874679, -2706792, -2742417, -3013712, -3177605, -3081177, -3019019, -3169221, -3266315, -3136603, -3052479, -3205287, -3322887, -3195354, -3089798, -3214023, -3246938, -2899082, -2516755, -2575629, -2897887, -2933906]
33533b933906L30124K68294n9588k36501j92695r9350m5852l7542m1439M1543
33523c006912K16130K76628J14629m1369j3410k8918k85239m83222k94379L3726
33513c512336J03552O6114K61036M84115L24130m5101j49623m7082j16982k61999
33503b894176j24629J14765J0733k49256j07210L31257M39450J67264N5581J80814
33493b075407O3319l07757l45408O4532K95235L3261k50777j71794R875R39n8003
33482b741985l0385n2518j20194r156K10147J97616J7785J07663M25820L81095
33472a614112j64471n69664l92931l90J38812J08337J31248J08534l4965o9697
33462b359299R9419J75683k3241k39531k34610j38094r0820J0328J72977J73511
$$ y = [-2933906, -2603782, -2335488, -2395076, -2631577, -2824272, -2923622, -2969474, -3007016, -3048455, -3006912, -2790782, -2514154, -2399525, -2440894, -2454304, -2483222, -2768461, -3251683, -3546062, -3512336, -3408784, -3342670, -3081634, -2597519, -2273389, -2318490, -2468113, -2515195, -2632177, -2894176, -3018805, -2904040, -2893307, -3142563, -3249773, -2918516, -2479066, -2311802, -2256221, -2075407, -2012088, -2319845, -2665253, -2600721, -2305486, -2272225, -2523002, -2694796, -2684921, -2683982, -2741985, -2772370, -2824888, -2945082, -2954238, -2744091, -2546475, -2528690, -2421027, -1995207, -1614112, -1778583, -2348247, -2741178, -2741568, -2602756, -2494419, -2363171, -2254637, -2289602, -2359299, -2259880, -2084197, -2107438, -2346969, -2581579, -2719673, -2810493, -2800165, -2627188, -2453677]
33452b453677j003l5222J52018J98688q3179l42229k41942L0969J27062N4807
33442b593708L4227J01039J23274L1819j23829k11356r5740J42476J85716o4611
33432b470693k24359K800K69462J32894j28968M1204M41779L74298j35464l15887
33422b012934P3510L90493K43667M3532Q7736j567m46613p17437l55112K29395
33412b465330L67479O7670j86315j77903l1876J30679K22388J39731m4236j00775
33402b078488r917K3306j4667O0491J80318Q6632j07781k0920K68813K67035o1386
33391a406564k02324k4292J0562k19061k25201J12126K18840r8879j99057K18757
33381a815093M25377j15709p02919m65248K28057L98453k9587l31501k27064o2832
$$ y = [-2453677, -2454680, -2489902, -2337884, -2139196, -2222375, -2564604, -2806546, -2775577, -2648515, -2593708, -2559481, -2458442, -2335168, -2303349, -2427178, -2638534, -2734274, -2591798, -2406082, -2470693, -2695052, -2692252, -2422790, -2289896, -2418864, -2377660, -1935881, -1561583, -1697047, -2012934, -1939424, -1548931, -1305264, -1261732, -1173996, -1175563, -1622176, -2339613, -2694725, -2465330, -2097851, -2030181, -2216496, -2394399, -2426275, -2295596, -2073208, -1933477, -1977713, -2078488, -2088405, -2065099, -2079766, -2019275, -1838957, -1752325, -1860106, -1881026, -1612213, -1345178, -1406564, -1608888, -1633180, -1622618, -1841679, -2066880, -1954754, -1735914, -1834793, -2033850, -1815093, -1389716, -1505425, -2208344, -2673592, -2445535, -2047082, -2076669, -2408170, -2635234, -2698066]
33371b698066K4184K29183M60519L75716J3705k41205k79424k94363k82437o8046
33361b760234K37592L18279J58296K8991K9400L2871R117L6010Q3045R6696J66662
33350a563275L22886L57744J39277j22339k06329k11027k59236k03421K4472J20914
33340a600334j11579l26966j42791K14370K69469M4835p6166j8823j4644p7704
33330a840333q717J52064J47499m4982j73431j06395M0039J29157J15055P018
33320a583026r4029o0318L4519j6325j52879p2202K04140K48515n2488k17796
33310a761889M9159L39206K29008l7961q1302p9599l22449n27399k94789J24125
33300b363890K16774N2643L2993R7438o5624k66009p4008L25520L51812J4311
$$ y = [-2698066, -2673882, -2444699, -1984180, -1608464, -1594759, -1835964, -2115388, -2409751, -2692188, -2760234, -2522642, -2204363, -2046067, -2017076, -1987676, -1954805, -1945688, -1909678, -1826633, -1729937, -1563275, -1240389, -882645, -743368, -865707, -1072036, -1283063, -1542299, -1745720, -1721248, -1600334, -1711913, -2038879, -2181670, -1967300, -1697831, -1652996, -1729162, -1747985, -1762629, -1840333, -1849050, -1696986, -1549487, -1594469, -1767900, -1874295, -1834256, -1705099, -1590044, -1583026, -1677055, -1737373, -1702854, -1719179, -1872058, -1944260, -1740120, -1491605, -1544093, -1761889, -1712730, -1373524, -1144516, -1182477, -1263779, -1343378, -1665827, -2193226, -2488015, -2363890, -2147116, -2094473, -2061480, -1964042, -2029666, -2295675, -2369683, -2044163, -1692351, -1678040]
33290a678040j24692N3044P8064j89370k99949m5158J89269J42863Q7481K14136
33280a572352K12825j53067n27312m38074J6935L40457L01169J17152O0810J12003
33270a529454L5829k59101n06095l55751J11367L94165K36938l439Q9115L59047
33260a427379L61273M3568k59462l50203k85625j08293J42295K61506J06065j08004
33250a624259q4518R8001J59103R0626P5311P9291o1982k60774k77893j19252
33240a926346K1595J02958J81099J68429q924j78842j82036j53363k10945j48834
33230b335209J64359M00670K57235P274M6676K15953J57278J8457J30052K73846
33220f63409K4738l97563m09862n0365J18916q012k4805J12450J2882l04081l35368
$$ y = [-1678040, -1802732, -1749688, -1671624, -1860994, -2160943, -2206101, -2016832, -1873969, -1786488, -1572352, -1359527, -1512594, -2039906, -2477980, -2461045, -2120588, -1819419, -1702267, -1641457, -1529454, -1493625, -1752726, -2258821, -2614572, -2503205, -2109040, -1872102, -1875541, -1786426, -1427379, -1066106, -1022538, -1282000, -1632203, -1917828, -2026121, -1883826, -1622320, -1516255, -1624259, -1708777, -1610776, -1451673, -1361047, -1285736, -1206445, -1268427, -1529201, -1807094, -1926346, -1904751, -1801793, -1620694, -1452265, -1461189, -1640031, -1822067, -1975430, -2186375, -2335209, -2170850, -1770180, -1512945, -1505671, -1458995, -1243042, -1085764, -1067307, -937255, -663409, -638671, -1036234, -1446096, -1496461, -1377545, -1385557, -1410362, -1297912, -1285030, -1589111, -1924479]
33209a924479J0911K37564J24493J2303N8429k6408k90536l34364m3239J71048
33199b004278J18242J33098L57299M03604O3873k84717l23061k45409k40678j11106
33189b133133K27268M17558K21432p4749j50220q4856k3220R5267J97440J5936
33179a291277l28226k67016L17370P18905L88477k38134m05869q7075J78133J36501
33169h78211k1447j22918j61709j31733m8617M53K4892J22753J84176l3940l88367
33158a454668l70384J13466M75851K93464o4014o0826J83178J84841j12588l37715
33148a149395k80234o8318J05756J32012l363j38030n5936J65270J98485j6618
33138a110371j54402m7062O5397J5280j6089O5445L3395j70046j99107R8215L22379
$$ y = [-1924479, -1913568, -1676004, -1551511, -1539208, -1480779, -1507187, -1797723, -2132087, -2175326, -2004278, -1886036, -1752938, -1395639, -992035, -928162, -1212879, -1535940, -1781349, -2022027, -2133133, -1905865, -1488307, -1266875, -1341624, -1491844, -1576700, -1599920, -1504653, -1307213, -1291277, -1619503, -1886519, -1569149, -850244, -461767, -699901, -1105770, -1192845, -1014712, -878211, -899658, -1022576, -1184285, -1316018, -1364635, -1364182, -1339290, -1216537, -1032361, -1066301, -1454668, -1825052, -1711586, -1235735, -942271, -1006285, -1067111, -883933, -699092, -811680, -1149395, -1429629, -1497947, -1392191, -1260179, -1263542, -1401572, -1457508, -1292238, -1093753, -1110371, -1264773, -1311835, -1246438, -1231158, -1247247, -1181802, -1148407, -1318453, -1517560, -1419345, -1096966]
33127a096966J50019j29955j26602L1416L1026o0023k8850K8805m9911j12524
33117a363565J4422J49714Q5131k2672J9930O4313l3154n9392J26078K02336q5180
33106i02039l88243k79481L9500J17739J6586Q7622K65124K12107k6034j21728
33096i78847o6111r9464j79981p4925J33872J57276K422j07856j69652k74002
33086a657268k40154R9249M31026L44925K2423m6686J13864P0136j92883k31270
33076a286638N7206K48574J07227r4251j03719l7122o2439j60304k92886m29376
33066b053728l79017m866L99340L87328J9684k08729j02472N7094Q5267J19323
33056a680776J92359J10979r3040q0423K29622M45682K75334o3399k18513j66001
$$ y = [-1096966, -946947, -1076902, -1203504, -1172088, -1141062, -1201085, -1229935, -1201130, -1251041, -1363565, -1349143, -1199429, -1114298, -1136970, -1117040, -1052727, -1085881, -1145273, -1019195, -816859, -902039, -1290282, -1569763, -1530263, -1412524, -1395938, -1308316, -1043192, -831085, -857119, -978847, -1044958, -1144422, -1324403, -1399328, -1265456, -1108180, -1105758, -1213614, -1383266, -1657268, -1897422, -1798173, -1367147, -1022222, -999799, -1046485, -932621, -862485, -1055368, -1286638, -1229432, -980858, -873631, -967882, -1071601, -1108723, -1171162, -1331466, -1624352, -2053728, -2432745, -2437611, -2038271, -1650943, -1631259, -1839988, -1942460, -1885366, -1800099, -1680776, -1488417, -1377438, -1470478, -1550901, -1321279, -875597, -600263, -663662, -882175, -1048176]
33046a048176q2228k8027L3542R5351J21211O7880j20168l60964l60158K7585
33036a654152M40967L87853m9772k97456r8822J86662J86019p348j15498p9455
33026a101002O250Q5281J09918M4151j5042N3580J36214J0667k49128l23483j46807
33015a389401k552m0502p0986L4419J08196L4276r868J14699K21757R9435j24643
33004a025170j74178k7559J03695J03735N5668N4642P3414L3224o2551j06905
32994i71985k8210O8095M509j90117k65752j02958J03934J46553P9412K6403n4840
32983a184956j85343j84983K9311J93223P1976j28665q7865J09865J78508J37457
32973a051472J61139J30855j33608l56357j18427L79549M81540K8969m25797m30425
$$ y = [-1048176, -1130404, -1158431, -1124889, -1029538, -908327, -840447, -960615, -1321579, -1681737, -1654152, -1213185, -825332, -875104, -1172560, -1271382, -1084720, -898701, -906049, -1021547, -1101002, -1094752, -1009471, -899553, -855402, -870444, -816864, -680650, -669983, -919111, -1242594, -1389401, -1391953, -1432455, -1503441, -1469022, -1360826, -1326550, -1336418, -1221719, -999962, -900527, -1025170, -1199348, -1226907, -1123212, -1019477, -963809, -909167, -835753, -802529, -865080, -971985, -1000195, -932100, -927591, -1117708, -1383460, -1486418, -1382484, -1235931, -1156519, -1130116, -1184956, -1370299, -1555282, -1525971, -1332748, -1260772, -1389437, -1477302, -1367437, -1188929, -1051472, -890333, -759478, -893086, -1249443, -1367870, -988321, -506781, -477812, -903609, -1334034]
32963a334034j19715J93087L80711L38471k8778m88044n91060k60855J18602K72507
32953a519108K74749J84199n6210k76261j61589J89620L05545P4060r0976K6289
32943a049682J14543m6342j87320o2357J25780J19342R377k4368N727P9480K28508
32932f87312K65817n3956m60110l47361K51705N40083J26937l65960l14110j9823
32922a064090l8836j95543r813L48063L25706n7561k73911j57020l3785o2814
32912a219604n6586M6042O8867p113J1711J52157K13850J20003K0380K8967R6566
32901e24760J17907m799k90701n23442l83902O7731L27550J22854j68533j02920
32891a363015J62091K07392N5063K7053J23660P8044r9095j39367r945O9809M1652
$$ y = [-1334034, -1453749, -1260662, -879951, -541480, -570258, -1058302, -1649362, -1910217, -1791615, -1519108, -1244359, -1060160, -1116370, -1392631, -1554220, -1364600, -1059055, -984995, -1075971, -1049682, -935139, -981481, -1168801, -1231158, -1105378, -986036, -976659, -1001027, -995300, -915820, -687312, -421495, -475451, -935561, -1282922, -1031217, -491134, -364197, -730157, -1044267, -1064090, -1102926, -1298469, -1308282, -960219, -634513, -692074, -965985, -1123005, -1156790, -1219604, -1276190, -1230148, -1161281, -1168394, -1156683, -1004526, -790676, -670673, -650293, -621326, -524760, -406853, -411652, -702353, -1225795, -1609697, -1541966, -1214416, -1091562, -1260095, -1363015, -1200924, -993532, -938469, -911416, -787756, -709712, -808807, -948174, -958119, -888310, -846658]
32880h46658J7607l7344k03779k89350p4669K05379J26650k15024k84115P1467
32870a529836L93234L15106K2474j48857j58045j11852j7424J12173J64574J06378
32860h52075M9256L9263n936q3995p2515K1074K1474j11702j77108l5342J81448
32849a026158K66841J76373j2804k10405l03927k00396L1541J75988R7582j17885
32839a123250k69155k17219J7446K51305K75553Q2478j13567j57149j29785j41331
32829a524674j17700K0802J33646N3583j10164j12778O2908K19991K51635K03931
32819i18820J08558j7609p2963N534Q6128J8607j17886j52015r4500m8105K5380
32808a177691J82399K69063J18936j16098j43920L0083J45413R8033N777p0816
$$ y = [-846658, -829051, -866395, -1070174, -1359524, -1434193, -1228814, -1102164, -1317188, -1601303, -1529836, -1136602, -821496, -799022, -947879, -1105924, -1217776, -1235200, -1123027, -958453, -852075, -802819, -763556, -769492, -853487, -926002, -904928, -883454, -995156, -1172264, -1207606, -1026158, -759317, -582944, -595748, -806153, -1110080, -1310476, -1278935, -1102947, -1005365, -1123250, -1392405, -1609624, -1592178, -1340873, -1065320, -982842, -1096409, -1253558, -1383343, -1524674, -1642374, -1621572, -1487926, -1434343, -1544507, -1657285, -1594377, -1374386, -1122751, -918820, -810262, -827871, -900834, -895300, -809172, -790565, -908451, -1060466, -1154966, -1203071, -1177691, -995292, -726229, -607293, -723391, -867311, -837228, -691815, -593782, -588005, -658821]
32798f58821j63354k11297j47987j01370k01522k84689j33627R5206Q6979p6140
32788a796622l1041K32775L47443J99391Q1532J23271P9109j46160k50285n8819
32778a219406J31778L5099j59890j33599L8425N4811j01234j50792N8437L58867
32768a087504M67376K61681r4761k63328q1238J92794J68944j34146k97962j02929
32758i71073J79786K22143Q0045Q633O4971J14138P9823k082p7686r1104j0342
32747d02748P2911k03k16482l50731k48629j0909J70553K08450R8653j14784k79391
32736a073310k24074M44J40794Q2468n205M5031J49646J30471k3312j61805j48714
32725a087566K3734K00577J58842j19096l13244j23947K68891L79598O7972k78374
$$ y = [-658821, -822175, -1033472, -1181459, -1282829, -1484351, -1769040, -1902667, -1807461, -1720482, -1796622, -1827663, -1594888, -1247445, -1048054, -966522, -843251, -764142, -910302, -1160587, -1219406, -1087628, -1052529, -1212419, -1346018, -1307593, -1252782, -1354016, -1504808, -1446371, -1087504, -620128, -358447, -453208, -716536, -797774, -604980, -436036, -570182, -868144, -971073, -791287, -569144, -489099, -480466, -415495, -301357, -221534, -223616, -301302, -392406, -402748, -329837, -330040, -546522, -897253, -1145882, -1156791, -986238, -777788, -679135, -793919, -1073310, -1297384, -1296940, -1156146, -1073678, -1078883, -1033852, -884206, -753735, -777047, -938852, -1087566, -1063832, -863255, -704413, -823509, -1136753, -1260700, -991809, -612211, -544239, -822613]
32715h22613k79171P667K85137L73361K52299L93j91954j71024o0601j12983k79067
32704i98556k43548M0352K25105J16367l9046j0407N6769m023l5188J13244K33867
32693e45064J03492j08149j45944j18550k24402k75516J1134M10388M18985M2017
32683d31609j82383N212K54632K25859O7199K9649L729k12122m51092l81396n1861
32672a124183J39381K0880j36067o7186J02870J13913m769k9024M8665J5716j49070
32661a068874j88277k122J43618N5455l3731J37799L46354J82799k60182m63707
32651a150868k36280O3255J31805J06109J72281J95086J449k56774l00579j03592
32641a378108J35159K52859K14425R1144L4821J02435R1352j87313m75566l05077
$$ y = [-822613, -1101784, -1094117, -808980, -435619, -183320, -182927, -374881, -545905, -606506, -719489, -998556, -1242104, -1201752, -976647, -860280, -899326, -909733, -852964, -856987, -892175, -778931, -545064, -441572, -549721, -695665, -814215, -1038617, -1314133, -1302999, -892611, -473626, -431609, -613992, -608780, -354148, -128289, -61090, -31441, -27712, -239834, -690926, -1072322, -1124183, -984802, -963922, -1099989, -1167175, -1064305, -950392, -955161, -984185, -935520, -919804, -1068874, -1257151, -1259273, -1115655, -1060200, -1093931, -956132, -609778, -426979, -687161, -1150868, -1387148, -1323893, -1192088, -1085979, -913698, -718612, -717163, -973937, -1274516, -1378108, -1242949, -990090, -775665, -684521, -649700, -547265, -455913, -643226, -1118792, -1423869]
32631a423869K57268N74327L37474q46P677J22765n7978l42517k92599n682P9588
32620g44392m5039k1786J48021J00667j69589k33995J7724J54900n9262k64723
32610a117474j32646Q3332O319k21365j90393J12648L26921K90612J96800J91257
32600d53989J60718k160j82752k16291j12562M211O8180Q2005M1531l6545o5194
32589g12848J8105J33574J53983R8562Q4834Q7085m9856k85816l24052n7200J63387
32578f90242k148l25645l10399N0251K63966R8505j26761j24659m0986n3791k1484
32567a283393J55464K20313r03j80654L3416L78462L22834r9621l34331j48060
32557i36473R1946N6952r4630r1619o00m1589j83892j94043k315J79546J23482
$$ y = [-1423869, -1166601, -592274, -254800, -255646, -247969, -125204, -183182, -525699, -818298, -823980, -744392, -789431, -811217, -663196, -562529, -732118, -966113, -948389, -793489, -852751, -1117474, -1250120, -1166788, -1160469, -1381834, -1572227, -1459579, -1132658, -842046, -645246, -453989, -293271, -295431, -478183, -694474, -807036, -802825, -734645, -652640, -611109, -647654, -712848, -694743, -561169, -407186, -308624, -223790, -136705, -186561, -472377, -796429, -853629, -690242, -692390, -1018035, -1328434, -1278183, -1014217, -915712, -1042473, -1167132, -1208118, -1261909, -1283393, -1127929, -907616, -908519, -1089173, -1055757, -677295, -354461, -454082, -788413, -936473, -844527, -787575, -882205, -973824, -974424, -1016013, -1199905, -1393948, -1396263, -1216717, -1093235]
32546a093235j23107k65859j05197J91555K72482O2835j29544m5543J87026K87885
32536g60702K03484N8810r4514k45644k77962j11939R4856J24764J01j01059j25594
32525a235399j20128m1352J53614L20012K86010J23538J9368k4509j07598j67221
32515g93665r2817K205n6715j61142p9035J20359J70204P7106Q7438K04763J70663
32504c50636m0372j47800p5833r5792l02634l77501j13420J89561J58561r5653
32494a251519j80569o282J45652P0633r4529p9958J72675M12004L23849r1800
32484e79844m51325m05629n4398K23100K64440K10655J60151N1028r0433j00964
32474g73219L1622J02759J2261r1397p6099J082O5283J27571J47163M6458p1904
$$ y = [-1093235, -1216342, -1482201, -1587398, -1395843, -1123361, -1060526, -1190070, -1235613, -1048587, -760702, -557218, -498408, -592922, -838566, -1116528, -1228467, -1133611, -1008847, -1008746, -1109805, -1235399, -1355527, -1396879, -1243265, -923253, -637243, -513705, -494337, -518846, -626444, -793665, -886482, -884277, -940992, -1102134, -1181169, -1060810, -890606, -813500, -726062, -521299, -350636, -391008, -538808, -614641, -710433, -1013067, -1390568, -1503988, -1314427, -1155866, -1251519, -1432088, -1438370, -1292718, -1222085, -1316614, -1396572, -1223897, -811893, -488044, -579844, -1031169, -1436798, -1491196, -1268096, -1003656, -793001, -632850, -581822, -672255, -773219, -741597, -638838, -626577, -717974, -794073, -792991, -727708, -600137, -452974, -406516, -478420]
32463d78420j2782J31951L2787l17904m66489j42394K96933L62715J03113o4394
32453e54884Q875R4570J9070j29475k13784k10403j38103o163J36590K10708J72790
32442f10209L2981j38111k02700q0657Q3696M9706j57173k13877M9302L70637
32432h16405M03871J70256m2957j04555j28855k04108k46570j46581O5214K31526
32422h19164K18543O9283j6985O0378J24501l5734k90393k96153k0174J71308
32412h34590N3252j42966j36510k2979l4190j11624l1132J95234L41443L05130
32402d18932J66848j1671k01085k74666j14797J59334K77955J48576n2728j14336
32392d35502L196J63708J65031q4409m08267m82515k19824R3196J71575Q4751
$$ y = [-478420, -491202, -359251, -326464, -644368, -1110857, -1253251, -956318, -593603, -490490, -554884, -546009, -451439, -432369, -561844, -775628, -986031, -1124134, -1130297, -993707, -782999, -610209, -577228, -715339, -918039, -998696, -915000, -865294, -1022467, -1236344, -1187042, -816405, -412534, -242278, -285235, -389790, -518645, -722753, -969323, -1115904, -1050690, -819164, -600621, -531338, -548323, -487945, -363444, -399178, -689571, -985724, -1005898, -834590, -781338, -924304, -1060814, -1083793, -1117983, -1229607, -1260739, -1065505, -724062, -418932, -252084, -263755, -464840, -739506, -854303, -694969, -417014, -268438, -321166, -435502, -432306, -268598, -103567, -187976, -596243, -1078758, -1298582, -1205386, -1033811, -949060]
32382i49060M9634M2781r8603k83933k14216J42956M12375K78539r0476k48061
32372i58064k0120K92782K87683m3614k89451j31477K21929K79679q1510m34430
32362h76593l49283P6995L87226L17062J8775j80875j08287J21200K18698L9705
32352c35377j96854j53157J43255K85350M3957l09264l86838j59413J34574L18483
32342f15284L05943M1911l20458m05253p9098K66082K23946l0538n2457J33647
32332e31559R9646k29935m13478j83529J61262K44839J12282O016m1767j17493
32322h93716j54371m0493J31631J74295R0361M3962R1422J20448M2513r7639k05502
32311f97089k20115j14866Q4008K63557K93670J68590K4426k5909l1987j15486
$$ y = [-949060, -899426, -856645, -955248, -1239181, -1453397, -1310441, -898066, -619527, -710003, -958064, -978184, -685402, -397719, -441333, -730784, -862261, -640332, -360653, -442163, -876593, -1225876, -1148881, -761655, -444593, -425818, -606693, -714980, -593780, -375082, -335377, -532231, -685388, -542133, -256783, -212826, -522090, -908928, -1068341, -933767, -615284, -309341, -267430, -587888, -993141, -1072239, -806157, -582211, -612749, -665206, -531559, -431913, -661848, -1075326, -1258855, -1097593, -852754, -740472, -734456, -776223, -893716, -1048087, -1088580, -956949, -782654, -692293, -648331, -556909, -436461, -393948, -491587, -697089, -917204, -1032070, -948062, -684505, -390835, -222245, -197819, -223728, -255715, -371201]
32301c71201k59003k84078r0050J68265K42284Q9943r1357j12241K9343J89525
32291d88570J89502o5256m28980n41667k20823K20938L20534J04527L5695K74958
32281e99142M24065J88467j29977j26021P2495O4768j76824l47535l26815k38717
32271a195236j24640L6048Q8723r0024k38931j9650L75815M17554M5135k35452
32261i40658j45022J3670k2252k4211K40735N05647L92473R870k43263k69044
32251d82055k69067k82932j36145J59997L09788J33805j59714k28819j0112K23099
32241g42155J89806o3782k09356n4653J68826R8213k18170l31570k8832L21261
32231h70412K72271o3835j91346N9507L34709K94883M6876r7207o6333l0619p3121
$$ y = [-371201, -630204, -914282, -1004332, -836067, -593783, -503840, -595197, -707438, -678095, -488570, -299068, -364324, -793304, -1334971, -1555794, -1334856, -1014322, -909795, -874100, -599142, -175077, 13390, -116587, -242608, -170113, -105345, -282169, -629704, -956519, -1195236, -1319876, -1283828, -1195105, -1285129, -1524060, -1543710, -1167895, -750341, -705206, -940658, -1085680, -1072010, -1094262, -1118473, -877738, -372091, 20382, 30252, -213011, -482055, -751122, -1034054, -1170199, -1010202, -700414, -566609, -726323, -955142, -965254, -742155, -552349, -616131, -825487, -880140, -711314, -613101, -831271, -1162841, -1191673, -870412, -598141, -661976, -853322, -793815, -459106, -164223, -117347, -214554, -280887, -311506, -384627]
32220c84627q7047L205J04145J05265M3017J4953J3578l5359j12942j16194k3504
32209d75510P0644R8564P7064R672j20969k25568j50266O3423J41966m5981k36535
32198g93496j00777K70022M44983K02126k12416m11311k94392q3173j9226r9824
32188a097484j14747N7549K47679K07053j276m0108J99573L84088K08082j42497
32178i2088k65748j24253l4524j48561k66234j82690M1198K14409K32357J13073
32168e13061m3100j16568r2610p7075r8420k7170J57334K02572o4823l77861l35171
32157a385953L1253L22630L32816J92022R473k27679l89399k50100J07898L04143
32147i52896J89860L4532O2432J38790Q0303l0526m1976M412M360j3685O675J3339
$$ y = [-384627, -471674, -468469, -364324, -259059, -216042, -201089, -187511, -222870, -335812, -452006, -475510, -404866, -306302, -229238, -219566, -340535, -566103, -716369, -652946, -510980, -556961, -793496, -894273, -624251, -179268, 22858, -189558, -600869, -895261, -978434, -997660, -1097484, -1212231, -1154682, -907003, -699950, -701226, -741334, -541761, -157673, 50409, -92088, -357836, -482089, -516613, -665174, -931408, -1114098, -1072900, -858491, -626134, -513061, -556161, -672729, -765339, -842414, -940834, -968004, -810670, -608098, -672921, -1050782, -1385953, -1354700, -1032070, -699254, -507232, -497759, -725438, -1114837, -1364937, -1257039, -952896, -763036, -728504, -666072, -527282, -446979, -477505, -519481, -515069, -510709, -524394, -517719, -504380]
32135e04380n3568j63167k64242l00954j59715J70269M00475K26341j65725k49771
32125a064437R0141L68052K21066q7575j50333k4191j5155j42065j90971j21295
32115a116763p4644r2781j04448r3980o0208P0639K86687L87712K45287J6634
32105e35865r6002j21671j45547o8639J78924L65611K26095j09818k70876j55022
32095g32810J1604P2226R0338J09055N1136q4926j58170r1517J5911M3065m577
32084f78665m1477j2857N9487R1657J7340j10328j52900o0828O5175J21185J04631
32073e97580M1133n5315j08096l2362P6970O755k35756l57137j78865R9304J90135
32062a150814Q5312l0501n2513K2678J72812K82313J80528q4328k05629l5455
$$ y = [-504380, -557948, -721115, -985357, -1286311, -1446026, -1275757, -875282, -648941, -814666, -1064437, -974296, -606244, -385178, -472753, -623086, -647277, -662432, -804497, -995468, -1116763, -1191407, -1284188, -1388636, -1482616, -1542824, -1472185, -1185498, -797786, -552499, -535865, -631867, -753538, -899085, -967724, -788800, -423189, -197094, -306912, -577788, -732810, -721206, -648980, -558642, -449587, -398451, -483377, -641547, -733064, -717153, -674088, -678665, -720142, -732999, -673512, -581855, -564515, -674843, -827743, -888571, -823396, -702211, -597580, -556447, -611762, -719858, -752220, -675250, -668495, -904251, -1261388, -1440253, -1340949, -1150814, -1065502, -1096003, -1148516, -1125838, -953026, -670713, -490185, -574513, -780142, -815597]
32052h15597J71091J41397p339j0969R1212O2960j07560k08100j45392q049J49744
32041f86602L23836M04843K55278o7379l46681m35288l19410o4366J52512J07425
32031f75832j67362k98449l0794L64742M17512Q4001k46835l09401k14652j48513
32021a225583j04686J292J41853J99884J14090k3072j2587K23779M62106L92303
32011A69379N3389j75317j00363M1019J702j10178j00806m1619q3315j58842j45736
32000f50687j09226j24470q1009P9198J74420R6259L3311J01659P7259j63624
31990e66910k92220m4966K41130J16591k39919l19280r1501N7529K1876K4567
31980a093103J01654J08776J30480L17098M30488J46857k89031l33830Q398K46334
$$ y = [-815597, -644506, -503109, -510448, -521417, -430205, -367245, -474805, -682905, -828297, -836346, -686602, -362766, 42077, 297355, 229976, -116705, -551993, -871403, -935769, -783257, -675832, -843194, -1141643, -1172437, -807695, -390183, -306182, -553017, -862418, -1077070, -1225583, -1330269, -1328977, -1187124, -987240, -873150, -896222, -908809, -685030, -222924, 169379, 222768, 47451, -52912, -11893, -10191, -120369, -221175, -262794, -346109, -504951, -650687, -759913, -884383, -965392, -886194, -711774, -615515, -582204, -480545, -403286, -566910, -859130, -904096, -662966, -546375, -786294, -1105574, -1197075, -1139546, -1117670, -1093103, -991449, -882673, -752193, -435095, -4607, 142250, -146781, -480611, -472213, -225879]
31970b25879K30077K30629K42994k4539m24884m24849j7672J81696o1632k66047
31960e60106j33009o767j11538r1040K58209M80923J94455k50852l47251j64619
31950g31595l4756K4385R7388L6444j88418k31624O7684K91433Q8631k09704j41632
31939i31764J22899J38881m2556n8925P9537Q2973m3766p2616k7446p1774r0556
31928i15113J02710K97415J52572j79319k18522J04776L63492K73897l33j88654
31918b07079k00122p4424O4570N8213n4235j0425K23793K51309j50242n24000
31908f22642l31401J86809L32224q624k68888j25247J01562P0187j00155j51923
31898i18098o9740L8433J13441Q1288q4256j74586N5518M49023N50084K22899
$$ y = [-225879, 4198, 234827, 477821, 453282, 28398, -396451, -414123, -232427, -294059, -560106, -693115, -699882, -811420, -902460, -644251, -163328, 31127, -219725, -566976, -731595, -766351, -741966, -644578, -608134, -796552, -1028176, -960492, -669059, -580428, -790132, -931764, -808865, -669984, -712540, -771465, -691928, -608955, -652721, -725337, -752783, -824557, -915113, -812403, -514988, -362416, -541735, -760257, -655481, -291989, -18092, -18425, -207079, -407201, -481625, -417055, -358842, -413077, -423502, -199709, 51600, -98642, -622642, -954043, -767234, -435010, -443634, -712522, -837769, -736207, -666020, -766175, -918098, -987838, -949405, -835964, -754676, -838932, -1013518, -958000, -508977, 41107, 264006]
31888B64006j71044l02103k35147j43685o903K10289L40844K10441r2678l07830
31878b33810k84397r5177O4567O8864N54M1911J74819J58013o7882j91440M806
31867c59172K32966J16352j78820j85309J00230K07934l9956k61773j32799J74222
31857c26125L37669L00829J47948j01466l59732m01644j49369J60863K64610J65388
31847C8971L2698k9387j4710K8419J564j41985k79298k61241j49336j04865r2310
31836i71480L4969J92322J44524n7079q4050J47601L27316K41728O9053K6012
31826G0916M7309J708o8781j15591k08385l07392k08422P1432J68390q7980l07814
31815i44610p7580L66683M36286M8986k62555j32535J60623J67523q9351k17539
$$ y = [264006, 92962, -209141, -444288, -587973, -594876, -384587, -43743, 166698, 74020, -233810, -518207, -613384, -548817, -479953, -479399, -437488, -262669, -104656, -172538, -363978, -359172, -126206, -9854, -188674, -373983, -273753, -65819, -105775, -367548, -500347, -326125, 11544, 312373, 460321, 358855, -877, -402521, -551890, -391027, -126417, 38971, 71669, 42282, 27572, 55991, 57555, -84430, -363728, -624969, -774305, -879170, -971480, -936511, -744189, -599665, -656744, -740794, -593193, -265877, -24149, 44904, 70916, 118225, 119933, 51152, -64439, -272824, -580216, -788638, -717206, -548816, -636796, -944610, -1022190, -655507, -219221, -170235, -432790, -565325, -404702, -237179, -326530, -544069]
31805e44069n2220J47512J22044k3868m0520M8666J2905j47931j52943Q2161K43048
31794c05215J03125q5538O46K10205J79355m1464r9016J9434j9376k43483k61796
31783e43123O6059L50221K77737N3784k4993l2189j35875k14692j05434L7937
31773b70568j3680j74751k24651j86592k03078k03287l4389J97747K47994J12195
31763g53060o907m1282p9526j08309k1839J36096K06602J80811J81799J95538
31753a10077Q6119j03313j45070k098N5067j40389l36976j91491J98384L55314
31743c34530M9577l65148l97331n1258K24291J77464M0721P7194J47063j2808
31733d44765k91110l31737o9608K03797K80245K12414O0811j84141l80743k87728
$$ y = [-544069, -596289, -448777, -326733, -350601, -391121, -342455, -329550, -477481, -630424, -548263, -305215, -202090, -287628, -286982, -76777, 102578, 61114, -37902, -18468, -37844, -281327, -543123, -477064, -126843, 150894, 204678, 179685, 147496, 11621, -203071, -308505, -270568, -284248, -458999, -683650, -870242, -1073320, -1276607, -1310996, -1113249, -865255, -753060, -759967, -801249, -880775, -989084, -1010923, -874827, -668225, -487414, -305615, -110077, -23958, -127271, -272341, -274439, -219372, -359761, -696737, -888228, -689844, -334530, -284953, -650101, -1047432, -1098690, -874399, -696935, -656214, -579020, -431957, -444765, -735875, -1067612, -1137220, -933423, -653178, -440764, -379953, -564094, -944837, -1232565]
31723a232565N9782L31693L56697K93624K65126J62615n3918k04234k00352j86383
31713d07915k04530p0673K22843L47207J29007j43497j79426j10605j54451j91421
31703g63461l9860J42421J13470m3497j23678j56594k00180p3984K83233M82970
31693c79160K02477k25202k68593j5073O1025m7240N7158L46391L45649N52j58756
31682h0772R1980K89261P7333k21637k08263n4105r9735k19944r1319J86937K41872
31671h8392M3577q7701l6702m2380k44827m15097k79989P1249K70070J24475j21412
31660h07129p1172K91975N21237K83684j47439k48958M375J23264j44267m55410
31650f49840m20665j34591Q9610K03157L23200L80166K16421q2014k64573k57577
$$ y = [-1232565, -1172783, -841090, -484393, -190769, 74357, 236972, 183054, -21180, -221532, -407915, -612445, -683118, -460275, -113068, 15939, -127558, -306984, -417589, -572040, -763461, -803321, -660900, -547430, -590927, -714605, -871199, -1071379, -1145363, -862130, -379160, -176683, -401885, -670478, -685551, -624526, -671766, -614608, -268217, 77432, 77984, -80772, 11208, 300469, 377802, 156165, -52098, -106203, -205938, -425882, -517201, -330264, -88392, -44815, -132516, -169218, -211598, -456425, -871522, -1151511, -1080262, -810192, -685717, -807129, -878301, -586326, -65089, 218595, 71156, -177802, -173427, -50163, -194430, -649840, -1070505, -1205096, -1115486, -912329, -589129, -208963, 7458, -74556, -339129, -596706]
31640e96706j65776j9195J96669L22093J58180j67347k78823o9134J45859J09058
31630c65122r612P3058K77523K73066j7419k95427k95403j00938K8263j5019j38910
31619e85940k17435j77457q14K30691L44977K58015R5678J5943j7626j16687k01176
31608c71831j00273J04062J34258l3887j03223M4381J22453p3730k83387j85393
31598g46570R0281K16953K04366K58791K89853M4608l42811m39133j71389P3168
31588e21883P5316M5816J36712J59578r66j20599n1105k6146k36396m22327k51979
31577a213979J37170L41597K64635J35494Q4686M5805M820K3295M3339m5824j61730
31566c40692j13689O6494J35762J3884r1917r438J47721J57313j3289j90326k09148
$$ y = [-596706, -762482, -781677, -585008, -262915, -104735, -272082, -550905, -620039, -474180, -365122, -374734, -301676, -24153, 248913, 231494, -63933, -359336, -460274, -432011, -447030, -585940, -803375, -980832, -981646, -750955, -405978, -147963, -52285, -36342, -53968, -170655, -371831, -472104, -368042, -233784, -267671, -370894, -326513, -204060, -277790, -561177, -746570, -656289, -439336, -234970, 23821, 313674, 358282, 15471, -423662, -595051, -521883, -446567, -400751, -264039, -104461, -105427, -226026, -277131, -303277, -539673, -962000, -1213979, -1076809, -735212, -470577, -335083, -250397, -204592, -199772, -176477, -133138, -178962, -340692, -454381, -387887, -252125, -238241, -330158, -339596, -191875, -34562, -47851, -238177, -447325]
31555d47325p1201R0958J62701J47023J12058Q0396L8300J8765N1787M6295j07924
31544A21833l01799k82456l8714J21153Q533j60210j06218R6274J86336J23984
31534b31284N9227K4793n0959j12108m8450N0791K771j34746j18721Q5605K40352
31523b32729J96130O5209j2559m5900q1418j20453j81943k58804k19924J6536
31513h75855K37426J53966j29157k05784J6470J76362O3521m6472R6708K48094
31503b64721N9298l32670m95978l13681m1144J24404J88024J62818O4259L0724
31493h18667J37581J74150n6694l08812j72406K57123M53499K42015J1651J4144
31483f6416k1585k97550m62293j53972L31155M23148J15705r9624k6793L6469
$$ y = [-447325, -518526, -427568, -264867, -117844, -5786, 74610, 112910, 131675, 183462, 229757, 121833, -179966, -462422, -501136, -379983, -371450, -531660, -637878, -541604, -355268, -231284, -172057, -147264, -198223, -310331, -358781, -307990, -305219, -439965, -558686, -473081, -232729, -36599, 28610, 16051, -29849, -111267, -231720, -413663, -672467, -892391, -875855, -638429, -484463, -613620, -819404, -802934, -626572, -563051, -609523, -512815, -264721, -205423, -538093, -1034071, -1347752, -1388896, -1264492, -1076468, -913650, -849391, -818667, -681086, -506936, -563630, -872442, -1044848, -787725, -334226, -92211, -80560, -66416, -88001, -385551, -847844, -1001816, -670661, -247513, -131808, -231432, -258225, -221756]
31473b21756r4739j96140q7652M0213k0997j34055n9686J53003K65194J96050
31463a60565N8184n6272j36468j62488j14064l8135M759K7092O5028R3307O6707
31452c52915l885q0046j43402j64755j01453J7781Q4499M7103j6980j1872P3595
31441f52330K00488L09533K93742Q7580j75251k65427j77750j38791k07400j34391
31431h59997J94664M47577K78417j20786k63724o3987R6811j8485k02125j92969
31421g04604l5409R4034J49588J42161K6559j54130j92108J3743K34792J69245
31411b56129j40076l35539j89329J32007K88704J60509m7199p0882R2177J87285
31401a78472L0200k52022l81988k66604n5484R3717J62909J85695J60653R8099
$$ y = [-221756, -316495, -512635, -600287, -560074, -581071, -715126, -774812, -621809, -356615, -160565, -102381, -158653, -295121, -457609, -571673, -609808, -605049, -577957, -512929, -419622, -352915, -356800, -436846, -580248, -745003, -846456, -828675, -744176, -697073, -714053, -725925, -652330, -451842, -142309, 151433, 239013, 63762, -201665, -379415, -518206, -725606, -859997, -665333, -217756, 60661, -60125, -323849, -387836, -291025, -309510, -511635, -704604, -740013, -645979, -496391, -354230, -327671, -481801, -673909, -660166, -425374, -256129, -396205, -731744, -921073, -789066, -500362, -339853, -387052, -457934, -365757, -178472, -148272, -400294, -782282, -1048886, -1104370, -1010653, -847744, -662049, -501396, -403297]
31391d03297M1168m953p1788j27535q4018N6210J62397J37902L4627m0781n1282
31380c51350j2785O2307J40912J49685M6247j13451k13461j75187k7995Q9987
31370d05091M0047j47846k55292j11645J78769L41719K47723K7091j13055q9136
31360b86716L0911J08822N2202q4021j47305r1636l9317n5572r339J76682K89835
31349e5454R6715k47961l61599j67374M6289J07228J57624K89142L23479J34245
31339C22334q8915j19087l6319p1842k45886l65630l02271j10826O9149J25827
31329h23466N3871r333Q5511K83971L61920K23408K2461o8949n4121k292P7078
31318A50059J46670R2967j03996k77504k67382j07434N9466J44864J35464P5090
$$ y = [-403297, -362129, -367082, -438870, -566405, -650423, -594213, -431816, -293914, -259287, -300068, -351350, -364135, -301828, -160916, -11231, 35016, -78435, -291896, -467083, -495078, -405091, -365044, -512890, -768182, -879827, -701058, -359339, -111616, -84525, -197580, -286716, -255805, -146983, -94781, -178802, -326107, -417743, -457060, -512632, -521971, -345289, -55454, 41261, -206700, -568299, -735673, -689384, -582156, -424532, -135390, 188089, 322334, 233419, 114332, 78013, 6171, -239715, -605345, -907616, -1018442, -949293, -823466, -769595, -778928, -693417, -409446, -47526, 175882, 198343, 129394, 75273, 72981, 150059, 296729, 389696, 285700, 8196, -259186, -366620, -307154, -162290, -26826, 48264]
31308D8264P1097J79385K56660J00279k36297m67342m45689k86387r6363J36248
31298g40145L22200K69332L0407p1421O5887J34503o7162k65143j46602J27007
31288c41137J88034K2797r2378n8895j6665l6180n1722l6902r221N9931J48299
31277b24039J26322j4847n6132J14534K64256J63958l7991q1196j9636m6493q5374
31266A03362N9328K78215K73253K2921k15843l01290k85943j91676k1851R6663
31256a82861Q3457Q6495J95736J79763j15769l43410j20726K69548K26485k29869
31246D8849m89413k95687j5508Q2176J56298K67682J78877r3411j41349J34757
31236a66729K74682L5232j61667K9788K46143M7988k88294k35111P4308P5609
$$ y = [48264, 119361, 298746, 555406, 655685, 419388, -47954, -493643, -780030, -876393, -740145, -417945, -148613, -118206, -189627, -123740, 10763, -56399, -321542, -468144, -341137, -153103, -130306, -222684, -281579, -298244, -334424, -386146, -423048, -432269, -372338, -224039, -97717, -112564, -168696, -54162, 210094, 374052, 336061, 254865, 235229, 188736, 103362, 162690, 440905, 714158, 737079, 521236, 219946, -65997, -257673, -279524, -182861, -99404, -12909, 182827, 362590, 246821, -96589, -217315, 52233, 278718, 48849, -440564, -736251, -751759, -669583, -513285, -245603, -66726, -160137, -301486, -166729, 107953, 143185, -18482, 11306, 257449, 305437, 17143, -217968, -143660, -68051]
31226f8051k71915m34107j74426J35401J67727P6589J01710J57481O8793p3237
31216c14035o2007P6416J22618o928j49417j24328M2172J73402J72146J17682
31206D7721J17225J40151Q0951o1978j79779k04211j56084o7186K1213J3590j28736
31195c77123k53368j80073O936M7432q6052j11672J37796M38693M69692K18122
31185C10383n7093j59327j19047q2127j17886j28742K3467K57820K68880n8486
31175A37842l74522k81398P9941K21361M2240o6270Q8268J83898l7763l11281
31165c17684k78344m5365M6525l0507l9468P4760J34612O2091k1636j0904P3442
31154c52478J64130J89702Q4894j16304k58150k35657j18562k8496J1621L8835
$$ y = [-68051, -339966, -774073, -948499, -813098, -645371, -568782, -467072, -309591, -240798, -314035, -376042, -299626, -177008, -183936, -333353, -457681, -415509, -242107, -69961, 47721, 164946, 305097, 386048, 324070, 144291, -59920, -216004, -283190, -261977, -248387, -377123, -630491, -810564, -803628, -756196, -842248, -953920, -816124, -377431, 92261, 310383, 253290, 93963, -25084, -107211, -225097, -353839, -330372, -72552, 196328, 137842, -236680, -518078, -438137, -216776, -174536, -240806, -152538, 31360, -6403, -317684, -596028, -641393, -594868, -625375, -664843, -590083, -455471, -393380, -415016, -425920, -352478, -188348, 1354, 86248, -30056, -288206, -523863, -642425, -670921, -659300, -620465]
31144f20465O6410R3118R7197J6920j35294j87893l3643J33982P5393q7145p0195
31133f51615M3442m9601k30225n8726L85961M47923o4584m67830k49642J29850
31123g65047N3814k24233r5663L03328L33067n2742k71286r1402J02530N3222
31113f54412l3233J3248O4814M1099L0236L273j29481j73711J19323M76055L51707
31102A08918j65254l45855Q6849M95927K87113k43065m51220k80969j38426j41303
31092g87285m0477K20800L50011J61938j26725j77615M5049K32527R9947k45159
31082b66989l97484j79928Q1161L162k79596l13167j9654K08604J47374N1951
31072i64566J81074L86122M01112K45450R4667j4956j18309j54190q8017m0343
$$ y = [-620465, -554055, -460937, -363740, -346820, -482114, -670007, -703650, -569668, -494275, -581420, -651615, -608173, -657774, -887999, -946725, -560764, -112841, -177425, -645255, -894897, -765047, -711233, -935466, -1031129, -727801, -394734, -447476, -718762, -810164, -707634, -654412, -687645, -674397, -609583, -568484, -538248, -534975, -664456, -838167, -718844, -242789, 108918, -56336, -402191, -315342, 180585, 467698, 224633, -226587, -507556, -645982, -787285, -827762, -606962, -256951, -95013, -221738, -399353, -354304, -121777, -21830, -266989, -664473, -844401, -763240, -760078, -1039674, -1352841, -1372495, -1163891, -1016517, -964566, -783492, -397370, 3742, 249192, 343859, 328903, 210594, 56404, -31613, -71956]
31062g1956r9776j61073j19680n8541o4090l6014J11952K27067J35418l7035k0425
31051a94153J81710K78856J01405j82755l09693k33295j23263j23932j91007j73779
31041i69906k4964J28997J54198P7057J2484q857l1789n1270l0018L1k794K8698
31029g18133J66045K97019K29751j9379k18847k07547l0700J88226L39522L21001
31019C46958J29069o6828j16889r8630j38362j41764J6873J50925j5643l30666
31009b64957l48579j4051K33008J36939l4637k570J03998Q4924M0707J07741J42478
$$ y = [-71956, -171732, -332805, -452485, -511026, -575116, -611130, -499178, -272111, -136693, -173728, -194153, -12443, 266413, 367818, 185063, -124630, -357925, -481188, -605120, -796127, -969906, -994870, -865873, -711675, -634618, -622134, -630991, -662780, -714050, -744068, -744037, -746831, -718133, -552088, -255069, -25318, -44697, -263544, -471091, -501791, -313565, 25957, 346958, 476027, 409199, 292310, 193680, 55318, -86446, -69573, 81352, 65709, -264957, -613536, -627587, -394579, -257640, -292277, -294847, -190849, -105925, -65218, 42523, 185001]
$$ [...]
##END NTUPLES=NMR SPECTRUM
##END=
