##TITLE=31Pdec_LY-TMF-2.70.R
 D2O, 24 sc
 27.2.2020
##JCAMPDX= 6.0         $$ Bruker NMR JCAMP-DX V2.0
##DATA TYPE= NMR SPECTRUM
##DATA CLASS= NTUPLES
##ORIGIN= UXNMR, Bruker Analytische Messtechnik GmbH
##OWNER= root
$$ XWIN-NMR		Version 3.5
$$ Thu Feb 27 16:11:55 2020 Russian Standard Time (UT+4h)  she@DPX200
##.OBSERVE FREQUENCY= 81.013821
##.OBSERVE NUCLEUS= ^31P
##.ACQUISITION MODE= SIMULTANEOUS
##.ACQUISITION SCHEME= undefined
##.AVERAGES= 24
##.DIGITISER RES= 17
##SPECTROMETER/DATA SYSTEM= spect
##.PULSE SEQUENCE= zgpg30
##.SOLVENT NAME= CDCl3
##.SHIFT REFERENCE= (INTERNAL, CDCl3, 0, 182.463)
##AUDIT TRAIL= $$ (NUMBER, WHEN, WHO, WHERE, WHAT)
$$ ##TITLE= Audit trail, XWIN-NMR		Version 3.5
$$ ##JCAMPDX= 5.01
$$ ##ORIGIN= Bruker BioSpin GmbH
$$ ##OWNER= she
$$ F:/spectra/data/she/nmr/P31/1/pdata/1/auditp.txt
$$ ##AUDIT TRAIL=  $$ (NUMBER, WHEN, WHO, WHERE, WHAT)
(   1,<2020-02-27 16:10:41.87 +0400>,<she>,<DPX200>,
      <created by zg, POWCHK disabled, PULCHK disabled
       configuration hash MD5:
       00 E9 B6 7A A2 85 ED C7 34 08 36 98 17 FE 4E 26
       data hash MD5: 32K
       9E 17 BB 7D BB 8E 2F 36 D2 58 EC B6 88 E5 A5 1D>)
(   2,<2020-02-27 16:10:45.00 +0400>,<she>,<DPX200>,
      <Start of raw data processing
       efp BC_mod = 2 LB = 1 FT_mod = 6 PKNL = 1 PHC0 = -1531.174 PHC1 = 509.6013 SI = 64K 
       data hash MD5: 64K
       37 FF 1D 3F FD 78 BD C2 F7 BA B7 4C 8C 52 CA 37>)
(   3,<2020-02-27 16:11:01.95 +0400>,<she>,<DPX200>,
      <pk PHC0 = -1.234053 PHC1 = 0 
       data hash MD5: 64K
       76 89 FE 23 82 7E 0A 23 34 7F 47 70 74 6A CB 2F>)
(   4,<2020-02-27 16:11:07.81 +0400>,<she>,<DPX200>,
      <abs ABSG = 5 
       data hash MD5: 64K
       D5 D6 35 AB E7 53 5F 86 EB 64 02 05 03 75 AD DE>)
$$ ##END=
$$ 
$$ hash MD5
$$ C7 92 2D 62 DD DD 1E AE 5C D9 0A F3 86 FA 43 8A
##$RELAX= 
##$RELAX= 
##$RELAX= 
##$RELAX= 
##$RELAX= 
##$RELAX= 
##$RELAX= 
##$RELAX= 
$$ Bruker specific parameters
$$ --------------------------
##$DU= <F:/spectra>
##$EXPNO= 1
##$NAME= <P31>
##$PROCNO= 1
##$TYPE= <nmr>
##$USER= <she>
##$AMP= (0..31)
100 100 100 100 100 100 100 100 100 100 100 100 100 100 100 100 100 100 
100 100 100 100 100 100 100 100 100 100 100 100 100 100 
##$AQSEQ= 0
##$AQ_mod= 1
##$AUNM= <au_zg>
##$AUTOPOS= <>
##$BF1= 81.014009
##$BF2= 200.13
##$BF3= 200.13
##$BF4= 200.13
##$BF5= 200.13
##$BF6= 200.13
##$BF7= 200.13
##$BF8= 200.13
##$BYTORDA= 1
##$CFDGTYP= 0
##$CFRGTYP= 5
##$CHEMSTR= <none>
##$CNST= (0..31)
1 1 145 1 1 1 1 1 1 1 1 1 1 1 1 1 1 1 1 1 1 1 1 1 1 1 1 1 1 1 1 1 
##$CPDPRG= <waltz16>
##$CPDPRG1= <>
##$CPDPRG2= <waltz16>
##$CPDPRG3= <>
##$CPDPRG4= <mlev>
##$CPDPRG5= <mlev>
##$CPDPRG6= <mlev>
##$CPDPRG7= <mlev>
##$CPDPRG8= <mlev>
##$CPDPRGB= <>
##$CPDPRGT= <>
##$D= (0..31)
0 1 0 0 0 0 0 0 0 0 0 0.03 2e-05 3e-06 0 0 0 0 0 0 0 0 0 0 0 0 0 0 0 0 
0 0 
##$DATE= 1582805441
##$DBL= (0..7)
120 120 120 11 120 120 24 19 
##$DBP= (0..7)
150 150 150 150 150 150 150 150 
##$DBP07= 0
##$DBPNAM0= <>
##$DBPNAM1= <>
##$DBPNAM2= <>
$$ [...]
##$SUBNAM3= <"">
##$SUBNAM4= <"">
##$SUBNAM5= <"">
##$SUBNAM6= <"">
##$SUBNAM7= <"">
##$SUBNAM8= <"">
##$SUBNAM9= <"">
##$SW= 369.568048894756
##$SWIBOX= (0..15)
0 1 3 0 0 0 0 0 0 0 0 0 0 0 0 0 
##$SW_h= 29940.119760479
##$TD= 32768
##$TD0= 1
##$TE= 0
##$TE2= 300
##$TE3= 300
##$TEG= 300
##$TL= (0..7)
0 120 53 12 22 120 120 120 
##$TP= (0..7)
150 150 150 150 150 150 150 150 
##$TP07= 0
##$TPNAME0= <>
##$TPNAME1= <>
##$TPNAME2= <>
##$TPNAME3= <>
##$TPNAME4= <>
##$TPNAME5= <>
##$TPNAME6= <>
##$TPNAME7= <>
##$TPOAL= (0..7)
0.5 0.5 0.5 0.5 0.5 0.5 0.5 0.5 
##$TPOFFS= (0..7)
0 0 0 0 0 0 0 0 
##$TUNHIN= 0
##$TUNHOUT= 0
##$TUNXOUT= 0
##$USERA1= <user>
##$USERA2= <user>
##$USERA3= <user>
##$USERA4= <user>
##$USERA5= <user>
##$V9= 5
##$VALIST= <valist>
##$VCLIST= <CCCCCCCCCCCCCCC>
##$VD= 0
##$VDLIST= <DDDDDDDDDDDDDDD>
##$VPLIST= <PPPPPPPPPPPPPPP>
##$VTLIST= <TTTTTTTTTTTTTTT>
##$WBST= 1024
##$WBSW= 4
##$XGAIN= (0..3)
0 0 0 0 
##$XL= 0
##$YL= 0
##$YMAX_a= 49542
##$YMIN_a= -52723
##$ZGOPTNS= <>
##$ZL1= 120
##$ZL2= 120
##$ZL3= 120
##$ZL4= 120
##$ABSF1= 182.463
##$ABSF2= -187.1042
##$ABSG= 5
##$ABSL= 3
##$ALPHA= 0
##$AQORDER= 0
##$ASSFAC= 0
##$ASSFACI= 0
##$ASSFACX= 0
##$ASSWID= 0
##$AUNMP= <proc_1d>
##$AZFE= 0.1
##$AZFW= 0.5
##$BCFW= 0
##$BC_mod= 2
##$BYTORDP= 0
##$COROFFS= 0
##$CY= -3
##$DATMOD= 1
##$DC= 0
##$DFILT= <>
##$DTYPP= 0
##$F1P= 0
##$F2P= 0
##$FCOR= 1
##$FTSIZE= 65536
##$FT_mod= 6
##$GAMMA= 0
##$GB= 0
##$INTBC= 1
##$INTSCL= 5.30512e-09
##$ISEN= 30
##$LB= 1
##$LEV0= 0
##$LPBIN= 0
##$MAXI= 10000
##$MC2= 0
##$MEAN= 0
##$ME_mod= 0
##$MI= 50
##$NCOEF= 0
##$NC_proc= -2
##$NLEV= 6
##$NOISF1= 182.463
##$NOISF2= 159.3651
##$NSP= 0
##$NTH_PI= 0
##$NZP= 0
##$OFFSET= 182.463
##$PC= 4
##$PHC0= -1532.408
##$PHC1= 509.6013
##$PH_mod= 1
##$PKNL= yes
##$PPARMOD= 0
##$PSCAL= 0
##$PSIGN= 0
##$REVERSE= no
##$SF= 81.0140089999434
##$SI= 65536
##$SIGF1= 159.3651
##$SIGF2= -187.1042
##$SINO= 113.3802
##$SIOLD= 16384
##$SREGLST= <1H.CDCl3>
##$SSB= 0
##$STSI= 65536
##$STSR= 0
##$SW_p= 29940.119760479
##$SYMM= 0
##$S_DEV= 0
##$TDeff= 32768
##$TDoff= 0
##$TI= <>
##$TILT= no
##$TM1= 0
##$TM2= 0
##$TOPLEV= 0
##$USERP1= <user>
##$USERP2= <user>
##$USERP3= <user>
##$USERP4= <user>
##$USERP5= <user>
##$WDW= 1
##$XDIM= 65536
##$YMAX_p= 417292696
##$YMIN_p= -652577
$$ End of Bruker specific parameters
$$ ---------------------------------
##NTUPLES= NMR SPECTRUM
##VAR_NAME=  FREQUENCY,     SPECTRUM/REAL,   SPECTRUM/IMAG
##SYMBOL=    X,             R,               I
##VAR_TYPE=  INDEPENDENT,   DEPENDENT,       DEPENDENT
##VAR_FORM=  AFFN,          ASDF,            ASDF
##VAR_DIM=   65536,         65536,           65536
##UNITS=     HZ,            ARBITRARY UNITS, ARBITRARY UNITS
##FACTOR=    0.456856943014862, 1,           1
##FIRST=     14782.0589164792, 0,            0
##LAST=      -15158.0608439998, 0,           0
##MIN=       -15158.0608439998, -652577,     0
##MAX=       14782.0589164792, 417292696,    0
$$ Real data points
##PAGE= N=1
##DATA TABLE= (X++(R..R)), XYDATA
$$ [...]
##PAGE= N=2
##DATA TABLE= (X++(I..I)), XYDATA
39229 61087 144923 241188 280890 289926 313907 322452 281908 244539 260908 277604 234019 188672
39217 188672 224094 290591 284541 233520 253874 351423 414627 397882 366144 350875 304632 225163
39205 225163 192576 237864 283109 261805 210914 199729 241810 312265 382065 404044 332914
39194 332914 195110 87233 78190 149404 233909 271248 237252 175512 178018 267400 330389
39183 330389 258675 124532 96966 194366 258977 198091 109852 115191 190888 248019 273284
39172 273284 299750 311240 270245 197947 150169 142264 152840 170948 192125 196875 172869 134085
39160 134085 97048 75211 108282 235895 414079 521608 491751 386136 300934 255368 213938
39149 213938 160871 100830 33507 -21935 -18422 57778 156574 231014 286430 327593 321213 264874
39137 264874 230593 270117 328532 328094 293519 308285 376918 421992 407745 381519 386407 402774
39125 402774 387889 320532 206166 92589 74302 210793 427578 563094 538872 432450
39115 432450 361037 349050 344289 311755 256646 185116 104089 55263 91448 196868 269154
39104 269154 217591 67960 -61742 -88624 -37183 20642 56829 88650 120897 137086 139339
39093 139339 147112 153863 134953 107738 127077 195747 235862 194042 129214 137482 220228 292942
39081 292942 310054 308224 318966 310781 252238 178736 148429 162805 177668 172025 156016 122608
39069 122608 51471 -31591 -61990 -33393 -29325 -104500 -182027 -147380 -21771 52456 8942
39058 8942 -54178 -20623 93420 194328 246327 275704 291120 283932 277647 298287 316478 289994
39046 289994 238546 202044 157409 70068 264 41126 154610 195492 121826 56916 95566
39035 95566 167615 165149 102749 63126 64208 74175 95423 137040 151839 99092 38645 66908
39023 66908 175431 262950 283014 292657 342551 397896 403748 377372 389571 465509 534055 495925
39011 495925 348702 216542 212458 288762 297147 198268 110207 111705 114510 22139 -84702 -57149
38999 -57149 83085 165046 118870 61650 108433 222002 298222 299243 243660 146512 35665
38988 35665 -29729 -20098 20279 32799 13900 -7414 -20593 -27190 -21441 -8763 -5426 5655
38976 5655 67576 163842 202651 145376 94781 170708 328593 398720 308930 175864 141454
38965 141454 195934 224307 180440 135533 158155 219089 250911 256750 298891 382858 415887 322058
38953 322058 165690 99890 188871 333621 395848 350147 275095 231297 209454 189475 184602
38942 184602 203905 218569 201614 173925 176448 213926 257072 285044 293388 275535 236528 212877
38930 212877 227934 231688 150807 16254 -30918 90353 283077 391104 393373 395054 446588
38919 446588 474448 413347 315631 273157 290488 303030 290295 302059 370614 449506 463451
38908 463451 396915 308222 255311 229087 186134 140680 171868 305971 440254 454637 376963
38897 376963 351238 437174 533268 530822 455104 393156 355455 294328 215828 178881 188863 170231
38885 170231 65465 -83011 -168555 -121041 25897 156862 182256 137574 144290 252437 367585
38874 367585 371924 270218 159150 93050 55068 37979 66029 127570 159888 130416 86728
38863 86728 98357 175369 260152 283986 231403 161476 149102 188491 192097 123100 80849 179525
38851 179525 368317 467068 388591 236734 153985 152122 146630 99113 55868 68184 133872
38840 133872 220390 307421 390652 455978 467251 396672 272812 176422 166905 228903 312071
38829 312071 394471 467167 485013 398595 237171 104646 77664 140396 219313 246512 198280
38818 198280 117213 88439 145745 215253 209817 158523 162537 235418 289011 285307 287080 323389
38806 323389 324553 256186 205914 242437 280797 202677 44251 -57649 -59643 -25065 23570
38795 23570 121429 230080 236200 124979 34290 73680 185886 256049 272248 294127 329267
38784 329267 337871 324362 333389 370115 403282 438116 506932 583362 583923 478749 338390 241137
38772 241137 187749 143289 113716 129398 181281 227445 257300 307404 406135 526038 599693
38761 599693 579503 488860 412168 410461 445051 423773 334006 272443 305376 362264 341209 274187
38749 274187 286102 401687 503151 503196 457824 455678 482051 468185 416026 387828 398614 395454
38737 395454 338417 244435 150411 77705 36284 30443 54359 95345 133345 134469 77689 1285
38725 1285 -21075 24557 71283 81151 117018 242579 397432 451488 363578 215725 105382
38714 105382 72612 119690 221778 308854 306035 214388 107791 41793 9397 -10421 -10727 22873
38702 22873 84898 152639 196676 202373 205969 277613 424031 542498 534099 435182 362950 351566
38690 351566 329775 257016 187632 178129 210622 242229 267642 295118 305724 272764 200256 126379
38678 126379 99156 136052 190087 189535 140108 133515 204893 254049 193771 104231 117641 204489
38666 204489 224227 158857 127390 164965 161840 60024 -48945 -76426 -42531 22821 135950
38655 135950 253925 266200 171373 113909 157431 179043 99390 55026 190181 412493 527479
38644 527479 509777 463376 400246 252964 59557 -50989 -46210 -12266 -1929 4309 5208 -18053
38632 -18053 -21356 50920 149499 178432 148000 143964 172380 173378 164744 218370 302725 306171 222816
38619 222816 160870 155705 136569 101561 151678 296546 389349 334695 225869 195628 252547
38608 252547 341590 442014 514138 466959 291000 133272 126894 212755 234231 153286 70622
38597 70622 70738 142292 231382 296445 320146 317978 319072 309896 239630 116275 40427 89372
38585 89372 214129 307079 331268 329372 343885 385237 448579 508910 520897 465618 379956 313947
38573 313947 283916 280554 282568 253218 180816 133187 194720 326274 380291 300756 212874 247359
38561 247359 365648 443031 442710 407422 348529 259317 192122 206127 265161 290939 289857 318802
38549 318802 350330 296450 167010 83239 109865 176502 195393 165195 124671 88626 69472
38538 69472 88064 122833 113794 53975 13021 33663 70540 73282 63455 77102 93912 87562
38526 87562 92914 146969 198975 161744 41553 -53794 -37633 79942 233156 355137 390768
38515 390768 327650 239755 236677 326952 382589 294871 128205 49475 120544 239345 295511
38504 295511 299005 308656 309198 248086 159729 148616 235807 312211 284938 198071 152317 163645
38492 163645 173423 156410 132296 90487 1283 -86844 -56241 128988 350398 464981 451417
38481 451417 374684 269859 147174 69338 108785 220415 258922 160143 26430 -11340 55117
38470 55117 148222 218121 248451 213927 125313 72546 121539 197817 182695 104513 103225 200686
38458 200686 254063 181945 91746 101157 162555 175337 165000 216823 308334 348691 334821 332554
38446 332554 340447 308951 265414 277221 309261 268117 180939 169440 236532 252789 191306 194357
38434 194357 333296 473962 484328 421729 389939 353601 249272 162451 209468 314723 293980
38423 293980 131901 3249 16864 93910 121562 91692 53408 43499 99039 234662 371788
38412 371788 391143 297615 236423 294276 377263 354798 245463 172594 185039 213037 185611
38401 185611 115669 62555 62582 109943 174519 226224 256494 278761 300425 303073 264412 194667
38389 194667 138004 137417 201705 299958 381030 404827 368521 309759 279898 302318 351856 385597
38377 385597 400056 436466 508639 553786 503098 386579 301756 273931 226458 120079 37323
38366 37323 62644 146481 178581 155174 172551 267560 363408 385517 344893 283712 217856 168969
38354 168969 181028 252626 306535 284886 237074 252578 330888 384659 368170 335719 349961
38343 349961 387741 384049 338264 315711 345270 377357 368499 351234 369573 387374 332790 216767
38331 216767 130359 121198 145785 155281 151629 138243 98971 62288 100275 209796 276959 228858
38319 228858 145179 138271 191907 211890 175528 129215 92494 74313 129711 269717 358582
38308 358582 254737 37737 -67532 21 73667 35761 -21596 10114 68882 49420 -10046
38297 -10046 -7181 44931 55561 20462 24160 109525 245718 393480 510987 534976 454330
38286 454330 366060 357998 375024 314644 216570 215951 319595 383585 338107 283483 306466 341329
38274 341329 300159 222377 185623 161027 82425 -3643 9278 114305 197073 207992 209209
38263 209209 238101 240038 175492 96867 65229 65687 60455 63321 103964 168402 229238 291610
38251 291610 359096 399215 396082 392018 418096 428193 369175 275808 222468 218551 231726 273952
38239 273952 363427 429458 374884 233741 152344 198295 295530 365007 411386 438347 403683
38228 403683 317893 275834 320072 370834 359032 326496 321369 307818 273129 305084 436099
38217 436099 517052 403370 188859 82376 102695 79709 -59492 -193253 -211296 -143531
38207 -143531 -40831 109343 278378 352119 288280 210226 240560 321002 305946 187026 114782
38196 114782 197654 359720 430845 347491 226831 224995 344771 442507 433830 398413 416557
38185 416557 404304 245363 26131 -32306 124790 315297 377943 343962 302062 251709 181013
38174 181013 154647 205392 235103 145933 5167 -33990 66083 201261 267858 248481 185168
38163 185168 139092 151097 187207 162884 71805 27546 104005 201109 172770 42215 -31418
38152 -31418 15715 82375 83044 78050 160864 300832 383851 369984 325935 305493 278536 213072
38140 213072 163736 205268 302918 339086 282721 238959 283205 339818 311962 252366 282914
38129 282914 392161 450065 406146 333812 277464 200881 110303 83992 134984 177617 178803
38118 178803 206358 271174 271506 178771 131628 230433 364757 375202 280248 206110 184834 169483
38106 169483 176416 258430 381000 462958 503630 544499 548985 457705 332317 303356 384098
38095 384098 460823 460788 412694 349441 272120 212655 216075 247182 215819 108159 6409 -22993
38083 -22993 23786 138874 298149 411327 386950 261146 166302 161611 189323 205644 243980
38072 243980 314610 341868 262696 131812 78106 175493 368697 513059 509262 420550 407281
38061 407281 509407 576228 487734 351328 351381 475878 552902 519956 481962 504787 525955
38050 525955 500001 472811 462461 407543 292782 203227 194832 219324 226051 229133 228875 184100
38038 184100 115342 115889 197404 242602 183762 111746 122481 168186 166515 160257 243320 388904
38026 388904 472245 437770 350353 296378 302340 334778 332201 261669 177204 181488 298929 438451
38014 438451 511620 522747 508213 467595 410139 392932 443355 503741 514965 492606 459635
38003 459635 378944 236411 126564 153957 283118 377566 369229 312594 286201 310799 358946
37992 358946 389827 377172 338014 319590 334337 340373 310538 272615 247334 204189 129555 85092
37980 85092 133591 241116 311292 294602 223877 169565 186964 266133 313890 247416 127685
37969 127685 111268 227196 310167 234632 106329 99862 190755 203448 89187 252 76248
37958 76248 279564 468263 537641 471518 341950 278925 360631 512317 583023 532291 462546
37947 462546 455254 469712 440940 386775 352465 316488 233782 139756 129893 233162 364685
37936 364685 422375 392423 336222 299988 272496 228018 176174 151759 175186 241942 331436
37925 331436 399619 383233 255605 77599 -44369 -56167 12859 104061 175585 206928 209980
37914 209980 234157 310910 397318 428204 412456 406657 401435 327484 190575 103844 144197 254389
37902 254389 330126 334914 290622 226615 182709 198793 261136 313227 337021 353281 340761 262574
37890 262574 185102 231858 376560 434287 332229 233525 287750 410911 447472 408047 384027
37879 384027 354667 270508 226088 336512 509543 556999 488875 474314 533935 510925 366459
37868 366459 264184 294267 327912 244769 122063 79719 86674 46960 -38805 -118221 -193345
37857 -193345 -261099 -230848 -31839 245051 429690 472151 463405 474850 473346 408673 313244
37846 313244 274794 327904 396045 358889 190368 10068 -37971 56889 180679 245017 262452
37835 262452 272362 267996 225903 155389 91394 70872 118408 211219 265876 222392 142536 155517
37823 155517 296049 464502 558890 572317 541475 480081 403070 350517 340584 343538 334437 327069
37811 327069 330903 324475 299388 282559 286269 282303 255138 237443 260632 304839 326831 311933
37799 311933 279327 257919 264645 284369 275728 224995 180387 196511 263801 334172 385258 403104
37787 403104 342320 189751 42599 24156 127586 236327 290012 323571 346336 313004 242930
37776 242930 240168 337064 423302 395875 291709 207793 170805 153838 151533 167013 177239 171894
37764 171894 180469 212083 217312 155645 55367 -29587 -71304 -46966 67723 239502 368687
37753 368687 386280 319614 238570 192996 221073 340950 495585 578191 555446 501126 475820
37742 475820 452578 401922 362789 369853 385581 364453 316550 255844 165115 73238 81141 226860
37730 226860 392645 435407 361239 291745 300549 357039 394043 363149 255593 126008 64428
37719 64428 101773 180516 243631 287604 300161 241292 143835 133692 264759 417999 457849
37708 457849 410132 380519 372057 313029 218706 188169 249029 319435 330921 299125 265965 247438
37696 247438 247866 268209 293813 308437 307680 276463 194123 91289 43160 65127 83377 58119
37684 58119 52116 109353 160164 143250 132472 218934 337479 349670 252849 166129 140739 129897
37672 129897 130626 200137 313665 346999 243916 93101 109 -21615 2692 75959 192648
37661 192648 308220 392747 459974 507611 483692 355816 179258 59136 56919 145364 240883
37650 240883 277214 256092 219548 180965 124966 75990 94727 175974 227124 198519 157790
37639 157790 172318 203294 201521 222257 329350 451195 463269 373599 296785 271690 238028
37628 238028 182614 173186 229704 276106 250339 180406 133432 152757 240486 340205 361994 295093
37616 295093 254671 329314 431076 407810 263374 141919 123497 164372 214519 256348 244113
37605 244113 148828 55009 68932 141399 138112 76389 107218 244567 312795 223724 118722
37594 118722 144004 247378 305313 312542 327597 341898 320944 291718 286628 270910 212498 158344
37582 158344 166043 220870 278367 319005 313074 220325 81395 16221 67701 140549 159653 182452
37570 182452 270458 355607 343566 266568 219414 208798 180882 149223 178681 264374 325864
37559 325864 317086 271025 240948 247715 274316 282066 255724 244179 304816 395838 402389 299895
37547 299895 204417 213602 282143 309741 269128 187815 88561 14674 30407 124901 196975 203357
37535 203357 228853 330295 413902 373190 259035 195944 205950 235685 285220 376091 448997
37524 448997 433854 382886 399773 469824 496760 479027 501158 561710 565391 498768 459225 471194
37512 471194 423720 263929 124913 154658 298318 363539 268032 122828 69605 116561 168470
37501 168470 169875 162402 203197 279056 337088 369664 413033 468486 485903 437168 351079 261876
37489 261876 181012 133377 150165 199174 196780 126230 70017 85140 129450 161077 214489 303557
37477 303557 345606 286288 223123 283252 428799 506983 462676 379565 325384 279413 224834
37466 224834 203788 244672 307900 335554 309127 248160 194050 194231 260072 343898 389580 387052
37454 387052 347255 265218 159077 101840 142357 219842 228341 155011 93673 125606 231481
37443 231481 314870 289124 166522 74361 129240 278842 350134 285685 221715 267715 337065
37432 337065 310339 247510 275160 344513 293127 119308 7937 66283 193764 251105 224223
37421 224223 174193 137900 130684 162471 209623 234494 247915 285067 323063 308227 263588 271326
37409 271326 338797 381277 356243 316875 304621 282419 214304 132482 82562 63006 53876 57650
37397 57650 89199 163470 291884 443832 528090 480161 359495 289805 308523 342844 323670
37386 323670 252302 168090 121769 160037 260677 313400 250933 160029 161394 227636 249907
37375 249907 240653 302748 410152 407977 265825 153553 195667 302867 332436 283565 236043
37364 236043 205293 166943 149630 201916 308611 410211 472350 493696 485164 470435 466411
37353 466411 453199 410950 372585 368390 342999 229854 90046 50952 110113 140636 102340
37342 102340 92549 154294 194592 151177 90072 70146 56496 41011 98032 230988 311201
37331 311201 273306 230963 282875 341290 289594 189081 175999 245263 287215 269821 245337
37320 245337 232335 215381 210434 223418 205404 149639 154014 272180 384741 350272 213668
37309 213668 128953 141253 187096 247035 338493 400790 352380 244683 208655 260238 302930
37298 302930 312762 367475 481565 559490 545498 496087 467757 441497 396164 360931 353798 344096
37286 344096 310964 281215 288993 343214 432003 512714 522432 460280 424632 489224 577309 554986
37274 554986 424331 319485 322823 386211 427756 408578 320484 196307 127861 177932 283273
37263 283273 337616 342220 358366 347896 222268 45945 7607 145153 272318 251732 176660
37252 176660 178353 206714 149727 58442 79805 219710 337994 367558 388995 463031 517826
37241 517826 465962 348335 283319 310596 354482 336193 267686 218183 227952 289689 391545
37230 391545 524830 642314 665210 572785 455053 431407 527329 662209 742867 736885 672338
37219 672338 605311 579866 588848 582535 535533 480222 450138 428822 393755 369300 380982 391505
37207 391505 346712 263407 210401 220339 275487 353963 426861 440002 375355 307042 313634 355882
37195 355882 334789 254347 214465 240147 244957 199912 210760 348226 502318 515810 406971
37184 406971 341537 393084 442469 356398 189066 128154 257140 446589 512293 428425 324535
37173 324535 301021 331652 355568 376155 423309 484408 527364 542409 514391 409738 245909
37162 245909 119624 105257 171652 249125 314797 354911 325995 236806 187079 224711 247424
37151 247424 166798 84566 148846 299094 338453 232003 141115 156868 191225 169039 144909
37140 144909 163625 167477 127105 126156 221813 333629 362234 326090 300536 306245 331117 381027
37128 381027 437993 442810 383958 334544 348262 391503 420886 440957 440503 371271 246375 160017
37116 160017 149915 146071 119419 155601 287545 379613 307595 157072 99910 144163 155757
37105 155757 85240 23113 39532 100913 159282 218847 287862 337974 334801 269056 161729
37094 161729 70797 63801 141832 226903 268234 311772 409729 517171 549549 495177 398272
37083 398272 280912 163363 111010 162526 245367 261325 230249 247827 318978 342622 266784
37072 266784 159924 107386 115035 135867 128489 75095 -2889 -40113 10258 110715 187214
37061 187214 231262 292894 383371 456593 484876 480485 440345 348198 244856 215775 277732
37050 277732 346574 356983 355166 422230 546844 630343 603811 496945 392415 344010 348503
37039 348503 375658 400545 403794 367152 297045 239496 234586 261104 268284 254893 256462 256617 199667
37026 199667 116704 135507 298685 464999 487278 413741 395774 450553 455484 361467 268108
37015 268108 264012 315976 359082 389610 411049 378847 273228 166336 145312 206092 280348
37004 280348 332872 374324 403315 397547 358097 314917 284454 257087 232728 238277 292715 368811
36992 368811 406990 369737 276213 179466 115029 81534 66619 68407 80536 77911 41390 -11979
36980 -11979 -44495 -39355 -7670 43951 130967 263659 409058 496535 479428 395678 346083
36969 346083 390946 482500 526039 492094 429414 378357 325787 255559 194309 182508 228242
36958 228242 302595 358569 359474 320602 306723 341955 349358 255293 131059 122165 232010 301557
36946 301557 242698 164205 194652 298999 371469 410512 476559 543376 523316 409286 279606
36935 279606 182327 111671 75776 89342 114046 99120 71048 98366 179624 248171 273405
36924 273405 274994 254163 198678 142320 131556 147418 149766 176019 284633 410628 407050 254259
36912 254259 109514 104179 192142 250579 240938 207744 190950 208994 279965 395517 499607
36901 499607 537147 505990 439498 367006 310173 285477 289705 307797 341672 398327 447960 439958
36889 439958 372872 305783 284094 291624 290951 274346 256891 249381 254353 265643 262427 226974 176311
36876 176311 155983 194630 275870 354358 392796 391921 386785 396863 387683 321593 242317 246735
36864 246735 360247 509272 633926 739457 806064 761844 614164 497353 494341 511685
36854 511685 441237 341924 322872 343197 300326 244937 309827 459230 513503 425100 334864
36843 334864 330796 340766 309677 300436 348152 374296 327217 271083 259456 250645 223247 245564
36831 245564 346253 437383 453644 453194 490025 499729 415300 297267 241244 239283 234685 236161
36819 236161 273977 311312 302030 279949 296674 325424 318643 310033 365602 472353 560115 599413
36807 599413 602087 559906 457398 322267 206968 146350 167598 287901 457525 567366
36797 567366 568623 528769 521440 531130 521896 519044 547033 558971 512497 454879 449563 474686 477249
36784 477249 472913 504878 550144 549877 492763 399405 278605 170188 159299 253702 315541 231162
36772 231162 96541 103936 271793 420887 421187 340957 322475 404040 506228 536678 477541
36761 477541 398672 388802 453062 500754 461533 372712 309986 282018 254378 231982 243345 274080
36749 274080 288164 292312 315235 347993 366040 381528 410404 417143 358761 259553 181635 148105
36737 148105 150503 192612 260462 289959 243573 188995 219213 312670 351869 276493 155183
36726 155183 106251 186570 341595 436697 378695 239023 196864 316353 454827 454561 343972
36715 343972 263882 271761 323649 386682 454633 495990 493596 495597 529672 523132 421112 323746
36703 323746 367596 512122 589220 538317 445044 366581 281042 215287 256702 395475 491666
36692 491666 450173 321884 199760 125096 126203 230290 387849 486702 488208 461097 450317
36681 450317 417857 355452 344275 434965 557398 619116 619049 597671 545725 441439 329782
36670 329782 284208 306831 325716 289707 229591 217777 278724 351152 360122 325133 344736 448214
36658 448214 531942 503563 420732 395960 421448 404659 341781 323878 375809 415975 393847
36647 393847 358351 365204 407077 451323 463722 394920 237406 93254 81169 175069 242607
36636 242607 240923 250198 308296 354035 363846 401401 477115 489239 378300 236327 191212 264698
36624 264698 396404 523115 588953 566468 513393 522455 579549 568530 452716 343683 342535
36613 342535 418284 491908 531444 512441 402637 252494 188336 244429 310841 315336 331969
36602 331969 421942 496625 459370 378263 384774 477767 556430 586079 604999 611783 568802 496331
36590 496331 461165 480927 513296 524082 510319 483242 471971 504237 550360 544832 492258 469812
36578 469812 489670 466190 377133 338736 435017 582835 661933 669043 641078 551133 413494
36567 413494 365526 472366 554026 409578 144272 52898 205422 372721 376828 295207 260401
36556 260401 257894 225627 200344 243778 323813 375195 404254 440864 448908 380022 280633 257670
36544 257670 341461 440922 443358 332056 203153 174429 269038 388825 415176 327773 206485
36533 206485 138248 157090 252941 384773 490229 535366 557406 609843 666895 645269 536151
36522 536151 447722 469896 543080 526475 383611 232817 192288 232268 236645 179570 156662
36511 156662 228747 324199 351370 331562 335391 347654 308017 250338 270870 363396 419648 408135
36499 408135 413583 463341 460027 353837 248667 249645 320061 378346 420333 443184 369683 184557
36487 184557 47756 116092 316049 443363 435884 392975 366013 307313 229060 239332 367125
36476 367125 482954 466301 366609 328779 407890 514268 526296 427435 324152 320897 391882
36465 391882 426558 399375 402157 470765 491113 369722 207557 178922 290385 390123 392508
36454 392508 367458 403795 491697 562299 567236 500870 397112 311554 274482 275384 309644 387002
36442 387002 465442 458708 365426 302985 341228 397916 387303 364551 404391 443196 392551 320888
36430 320888 350720 442332 460366 403916 379855 385340 324287 228250 242904 370418 435989
36419 435989 365804 303671 371555 486237 512304 456162 405810 391109 400320 444501 519144
36408 519144 572345 575755 563132 556351 527737 472180 436316 440801 453253 465508 509780 571353
36396 571353 581394 530489 493573 504767 503799 449809 393725 384349 383919 332389 234582 143637
36384 143637 108560 153397 249073 305272 262462 186683 192469 286319 380659 440173 496557 534436
36372 534436 498761 415671 368787 352713 294841 226046 266541 421609 558454 615876 663391
36361 663391 715280 678290 550757 483786 551595 632434 615087 556924 531548 485625 370469
36350 370469 265430 242094 242347 213403 223838 316548 386887 348048 285073 299257 331996 300014
36338 300014 273574 341018 413270 361595 258762 274873 392551 431867 332017 218925 195824
36327 195824 232052 270216 303359 327568 326381 312741 308514 300266 284535 309756 393635 461577
36315 461577 459372 455129 522471 598712 584144 512498 485430 497288 470092 414835 409086 447645
36303 447645 459694 449396 480689 541722 557813 525412 509932 525231 528857 514351 499329 457217
36291 457217 374045 326236 375772 439055 401754 316281 327892 439961 515825 488874 408240
36280 408240 302861 178061 129412 262824 488024 581432 485836 371795 371882 437779 501805
36269 501805 584017 666435 648355 527165 459842 533481 622508 595092 521787 530689 567851
36258 567851 480863 290304 204417 346732 592296 722108 670978 567067 546200 581882
36248 581882 540652 389005 263336 288768 405814 465431 437188 407987 413572 408903 396104
36237 396104 436190 511123 511166 406745 316975 349590 464574 548218 543970 467780 366554 298688
36225 298688 295827 324776 340489 360864 412648 442824 404252 393438 536656 742744 764381
36214 764381 550680 344035 340064 433752 425715 320928 267870 318327 409533 505618 602615
36203 602615 643709 571019 437405 353878 346299 355876 351337 348553 344356 319032 290053 293009
36191 293009 325473 362627 397426 417855 393197 338295 332778 408270 477098 453669 388417 387329
36179 387329 448969 488100 485549 499952 545551 570532 558127 541935 506625 381467 173765
36168 173765 17960 29046 164745 293919 360513 412616 486558 535660 499891 400859 321600
36157 321600 305289 319540 323330 316444 299686 244500 154639 109872 174133 291514 357648 371510
36145 371510 414895 488861 492872 394579 301204 305920 368287 418654 482771 606419 731764
36134 731764 759695 693089 617629 570629 527557 497515 522808 575150 554301 430238 312702
36123 312702 324397 446875 544946 523728 412528 297345 224097 196848 229408 333309 454694
36112 454694 493599 424551 348079 373754 492554 617074 701528 748883 739158 648371 528278
36101 528278 473100 499468 538147 547354 552681 569609 570030 537079 479520 393916 292939 253956
36089 253956 331408 431469 405172 273093 210464 282582 359598 354304 372784 519979 702003
36078 702003 762317 709072 663151 658013 637404 603907 627029 712268 772425 739031 636423
36067 636423 547720 544356 623496 693403 671672 608353 621773 693511 661535 478613 327028
36056 327028 363937 489274 514770 449051 438045 503216 531017 481945 424992 376935 280378
36045 280378 150049 85595 118622 181804 244719 347268 479811 563054 577442 592602 640190
36034 640190 674328 682666 710469 740291 682154 539696 456010 513504 600681 575122 467882
36023 467882 416247 457027 502089 489069 448948 423152 401625 368575 351577 387861 463808
36012 463808 517246 504384 453958 438558 485233 535563 519252 451481 420021 478390 588024
36001 588024 670634 684936 643707 585904 548193 545828 565725 579743 565584 519230 465295 456423
35989 456423 528516 638830 684073 610467 477565 384113 366196 405926 495386 624028 725717
35978 725717 719614 617234 527526 528950 578877 578572 496317 390655 327949 319434 348445 418628
35966 418628 532263 638103 664901 623838 612438 675346 727184 681005 591680 576384 637832
35955 637832 678931 664006 641884 625292 582216 542803 568727 608523 541663 387142 296869
35944 296869 309045 300606 237830 254266 385237 459758 402921 412088 628190 844031 799120
35933 799120 597959 540169 649904 691519 595986 547032 633620 716536 697505 660795 669670
35922 669670 651341 574191 536969 584871 613821 552338 479098 469876 479205 464457 481866 562321
35910 562321 624919 612786 592550 620121 623775 527633 392380 326359 336467 362559 387364
35899 387364 423812 458302 486006 540272 615461 627061 526085 397684 370584 467359 599840
35888 599840 671526 641127 533673 430833 405176 436397 446273 429888 469516 588466 685629
35877 685629 672807 598587 569571 608565 652836 646107 580973 490538 436474 465422 551338 624068
35865 624068 663879 705087 738741 696660 560449 406569 309047 270854 279246 344927 447315
35854 447315 520831 538773 540281 543574 516353 466671 466285 531128 573217 538440 504329 558844
35842 558844 654272 674081 597491 508778 468654 454193 421177 370185 343775 381510 474066
35831 474066 556748 567495 512589 452256 429020 438104 451693 439840 395005 370754 445485 594472
35819 594472 666958 574940 433439 402008 459158 479153 470408 551769 713923 801833 753038
35808 753038 671098 630103 584271 517513 507305 574916 629796 628680 642311 705058 749622 750799
35796 750799 777106 834690 822130 714987 633914 649331 679462 662817 660426 695864 675578
35785 675578 580726 557428 681437 801551 765763 649354 602749 615831 598196 567622 591057
35774 591057 641390 664310 690190 745183 758229 686392 615761 607954 576818 458199 364068
35763 364068 410857 527751 596151 640678 710645 720447 606144 504540 564924 706367 774404
35752 774404 805909 901237 965105 852583 674983 663567 786450 797464 639647 508454
35742 508454 511356 546471 548561 589347 679299 708085 646578 601263 615067 609322 564985 563337
35730 563337 604623 587149 514604 520803 627158 675709 582922 476716 491202 585591 654243
35719 654243 672551 651090 573751 456178 357570 289623 226256 219462 356952 576569 686052
35708 686052 615750 497141 445752 432620 424899 471303 560936 569196 457503 382044 481433
35697 481433 673625 782861 770597 726014 707825 707008 712850 724077 727939 725142 737237 756166
35685 756166 738588 674649 605555 562386 554106 611438 750447 889925 910603 815528 734616
35674 734616 752607 824751 870312 851331 756850 615750 527180 568957 677858 731140 728725
35663 728725 765116 844973 883044 873622 886087 893350 795693 634937 585914 690822 793567
35652 793567 790433 752415 736993 683160 583123 560880 664598 753771 713964 629730 625656
35641 625656 678992 705655 697088 662922 573515 466304 470132 613056 743622 751633 718986
35630 718986 733990 720027 602295 495501 542001 672466 709419 628913 550985 535614 548673
35619 548673 580310 645814 700542 685110 634085 634845 702392 778695 822330 829329 809821 801282
35607 801282 846534 912176 908038 831669 791479 834419 871537 840434 806236 816096 798324 716798
35595 716798 681624 767942 853434 794463 659969 624943 708996 781155 769264 718636 681611
35584 681611 671178 689440 708699 675071 605528 600534 682990 732000 672226 607578 648039 728831
35572 728831 744297 741161 811187 893455 866801 765748 724399 757578 765319 712947 651537 597180
35560 597180 532647 489997 502189 523924 523824 580651 746648 898903 895314 806429 805361 880281
35548 880281 857316 688953 525492 490251 550786 629007 690988 708231 658285 583687 551158
35537 551158 554926 545956 522375 495204 419745 279935 186660 258316 444124 591698 644147
35526 644147 646673 617931 554513 508123 517438 519743 466388 447762 546009 650116 605177 470813
35514 470813 425574 477079 488501 443956 448787 492966 464691 400697 469963 673578 798669
35503 798669 729386 593383 540411 571866 646371 761634 867712 875793 809077 779081 782685
35492 782685 713548 601913 615784 763807 836292 742887 679582 820345 1041288 1113204 1011256
35481 1011256 874252 783375 731585 712438 708897 675225 624015 636972 715625 743992 678518
35470 678518 629520 653891 627752 465442 315893 361403 529432 596635 512649 433320 465404
35459 465404 555754 635109 713915 800294 842421 804130 725433 667000 636849 597198 520280
35448 520280 425905 370428 390804 460569 526511 584321 672759 789041 867149 861543 805226
35437 805226 762842 765131 803039 846937 862066 839740 810647 793465 754604 670286 594155 588820
35425 588820 621113 617487 602089 672260 836231 978983 1006757 941247 859095 813821 820511
35414 820511 847298 830790 763408 728245 769806 793918 709538 601027 607636 687430 683361 591043
35402 591043 555513 603939 600865 505910 460216 543386 639645 640967 611802 643746 692652 675623
35390 675623 618307 605315 669913 797063 942525 1006265 902395 702221 588668 626211
35380 626211 701795 726744 744923 789407 793234 718989 633312 578162 506583 414599 391452 465279
35368 465279 542329 569257 606393 673126 686312 631638 623817 704297 752609 699112 647608 675489
35356 675489 697231 655470 659676 781150 888656 861001 799249 841019 913622 873004 759611
35345 759611 708243 710821 677869 646217 712291 821871 832746 750858 718945 790894 877668
35334 877668 901053 863669 787155 701319 667500 708165 750957 730854 687465 675975 667173 633729
35322 633729 635626 703689 742067 679920 620606 692677 840172 912684 886455 845678 816402
35311 816402 769521 724369 705529 659438 549390 463564 493629 581191 620098 628254 678102
35300 678102 746987 783828 826776 897683 889366 740084 611629 681614 847783 870635 744617
35289 744617 679555 743700 778308 684063 566087 546869 616423 712559 798903 832503 787017
35278 787017 723083 715698 722970 656292 556406 552092 660141 775500 846317 906785 946057 902462
35266 902462 797635 737232 765694 833061 893941 926560 884600 757042 644906 650629 726640
35255 726640 758719 746359 760799 786152 762445 729046 753204 770260 680885 560419 571617
35244 571617 699457 776119 753546 749595 828225 929299 1015801 1099724 1124758 1020009 873624
35233 873624 854542 950978 983350 890915 805363 815766 858363 873881 884911 878588 793250 662194
35221 662194 603218 634572 662548 663142 698901 746953 706147 598880 569748 651150 721063 723828
35209 723828 736785 783877 784979 734168 729544 779123 774588 704436 690786 762927 799929 755440
35197 755440 731597 768538 776038 745910 808122 980502 1079550 996308 865257 839131 878014
35186 878014 885775 886648 934538 986742 986000 953559 919311 877358 860262 915708 974919 914303
35174 914303 781011 759368 870620 928767 856476 803176 859649 905150 859403 842050 933448
35163 933448 1006070 957190 894270 917563 928523 842746 792823 906669 1055254 1041578 902262
35152 902262 812096 811385 830353 873707 978218 1070810 1051833 953633 870550 813177 764328 777271
35140 777271 874411 946000 894264 791729 766718 819995 871286 891592 884580 845019 827417
35129 827417 920615 1060953 1038776 810047 620408 672657 852645 952042 974879 1020751 1041087
35118 1041087 952434 855599 892792 985668 954528 821849 767208 833944 894732 875190 824786
35107 824786 791508 781409 809387 864602 881701 851290 865125 947281 975038 894317 849869
35096 849869 938140 1007179 906522 762805 763732 827564 769289 663378 723127 901748 946183
35085 946183 822393 766045 887208 1019024 1020925 977453 1007890 1079162 1096493 1034364 919680
35074 919680 799968 746935 784675 830056 813753 808404 901776 1011803 994920 876825 794690
35063 794690 768621 725871 697735 776460 908178 943901 877910 828745 808271 730757 634480
35052 634480 655657 771247 803019 710047 653128 722103 813126 837140 850643 907541 960218
35041 960218 982447 1031261 1116016 1148528 1086525 1000555 953105 933732 942694 1007375 1088459 1102544
35029 1102544 1063507 1070858 1139095 1174412 1138752 1096689 1077607 1032939 959623 929868 960517
35018 960517 970690 901973 783876 672059 615164 663455 801722 906062 888542 839087 884758
35007 884758 968293 942639 837439 824871 934283 1008992 959768 867348 811546 782719 787687
34996 787687 864392 960040 960410 867914 799384 801280 824600 869162 968619 1044636 984784 869599
34984 869599 899983 1074779 1169014 1078994 960784 954756 989363 951561 859835 768775 671218
34973 671218 590865 619021 765613 902194 927591 877459 826426 801728 818526 874024 901458
34962 901458 865117 872976 1021836 1174427 1120225 934589 904309 1078260 1189685 1091639 964945
34951 964945 972342 995230 888634 756809 777613 933477 1092981 1206941 1273818 1260231 1194266
34940 1194266 1192106 1268487 1276540 1156594 1071906 1155191 1289390 1303620 1236167 1225633 1263967
34929 1263967 1239481 1140358 1053870 1020958 1018263 1033756 1066044 1103172 1162743 1276189 1392081
34918 1392081 1403462 1316191 1264509 1307525 1343884 1283876 1168593 1065247 988288 970351 1051515
34907 1051515 1153348 1141766 1061113 1101581 1274203 1350787 1222597 1077981 1088534 1149692
34897 1149692 1103359 1013664 1027718 1124063 1185268 1189006 1166993 1100973 1001072 956148 979268
34886 979268 951221 844673 837018 1049645 1333111 1470675 1451534 1392298 1336949 1290104 1301724
34875 1301724 1359474 1335076 1186634 1070011 1103329 1176316 1146662 1064479 1038503 1040439 1013325
34864 1013325 1015808 1083513 1104105 1007609 923426 971896 1066707 1105303 1170792 1338419 1468484
34853 1468484 1426377 1335946 1364400 1417248 1313960 1122144 1038553 1062421 1067365 1081374 1200333
34842 1200333 1320306 1263956 1109798 1095423 1235072 1323490 1290525 1261781 1274356 1218301 1084626
34831 1084626 1009994 1032493 1033803 968365 939887 1002820 1076133 1101914 1126137 1182353 1235630
34820 1235630 1264982 1277229 1240257 1126124 1003995 965694 986932 986567 978879 1030122 1111779
34809 1111779 1144117 1145430 1194908 1284536 1340184 1346148 1328352 1276334 1202499 1197807 1298982 1392032
34797 1392032 1382170 1350838 1396054 1443021 1389825 1315444 1340925 1396437 1341560 1218453 1166026
34786 1166026 1172288 1132894 1070454 1073417 1101834 1079623 1091028 1245682 1431307 1452997 1349675
34775 1349675 1318031 1382227 1396224 1325460 1272777 1264976 1255043 1287769 1422348 1549360 1533194
34764 1533194 1467460 1523959 1624400 1559071 1369545 1290544 1344532 1326553 1187044 1095958 1104681
34753 1104681 1073292 981876 998192 1164806 1309205 1340038 1359696 1410785 1383207 1260190 1200744
34742 1200744 1280222 1375824 1394424 1398856 1432870 1429973 1369115 1328705 1329548 1307182 1271920 1305037
34730 1305037 1378295 1377851 1314421 1299295 1318083 1260722 1169847 1205564 1356020 1442464 1425847
34719 1425847 1443518 1523644 1539075 1476602 1476206 1559665 1585866 1515403 1458370 1432325 1344340 1233467
34707 1233467 1242404 1326156 1291387 1149079 1108615 1194537 1212398 1133860 1145738 1254352 1235625
34696 1235625 1079095 1076662 1323505 1525160 1482211 1389579 1446264 1528996 1490514 1448504 1521505
34685 1521505 1575861 1491867 1407614 1447683 1473785 1359749 1260363 1340548 1469985 1457516 1378781
34674 1378781 1400170 1465358 1426799 1329453 1306635 1327388 1282018 1202771 1192167 1237716 1272181
34663 1272181 1309379 1376254 1430544 1460493 1521074 1579860 1515844 1367951 1359409 1553747 1725879
34652 1725879 1715155 1654960 1688014 1712393 1609366 1486248 1479795 1527379 1531586 1544935 1601816
34641 1601816 1582870 1439234 1333461 1366446 1393663 1308779 1261490 1371990 1481619 1440368
34631 1440368 1401808 1550590 1748562 1748575 1586074 1468476 1422234 1328383 1190314 1114084 1119862
34620 1119862 1174460 1292909 1435039 1456487 1336974 1279605 1404359 1542738 1529289 1477490
34610 1477490 1544300 1638844 1612384 1538885 1554109 1599377 1572480 1555641 1650683 1758973 1754784
34599 1754784 1702307 1688632 1641281 1525076 1494201 1617007 1688963 1568499 1448496 1522902
34589 1522902 1642098 1600686 1513497 1575110 1682316 1644345 1554152 1597745 1692538 1665356 1597658
34578 1597658 1645254 1709221 1640483 1573722 1689251 1836184 1772876 1596062 1545766 1574724 1515754
34567 1515754 1484271 1674775 1922009 1918107 1730015 1652359 1677475 1576833 1395574 1382733
34557 1382733 1506653 1515529 1423451 1466321 1616886 1617327 1477901 1475902 1647504 1729966 1640454
34546 1640454 1586891 1658873 1704637 1659855 1635120 1648979 1613641 1578277 1646545 1696663 1550652
34535 1550652 1359889 1417844 1646788 1707779 1580721 1569307 1736313 1813645 1710400 1645563
34525 1645563 1711574 1743500 1688178 1682813 1711590 1608807 1454898 1529550 1805733 1936808 1827848
34514 1827848 1768226 1893844 1971851 1857691 1734803 1740526 1749341 1684587 1675269 1758240 1779160
34503 1779160 1718185 1765359 1958503 2093979 2093967 2105787 2155307 2082832 1909347 1869462 1984349
34492 1984349 2004848 1873561 1818884 1885032 1824039 1600039 1538412 1778211 2010687 1983355
34482 1983355 1864406 1879578 1959091 1972034 1969551 1984582 1910206 1757075 1713613 1803201 1819619
34471 1819619 1727048 1744883 1903836 1932852 1748865 1632477 1728890 1803628 1704549 1635393 1732631
34460 1732631 1791562 1672239 1575777 1651732 1720802 1654461 1642424 1808079 1941392 1895301 1866866
34449 1866866 1996972 2075228 1946918 1830914 1909203 1974498 1831142 1687647 1782991 1949983
34439 1949983 1923580 1788205 1756935 1784394 1750827 1764134 1935060 2103901 2112475 2091540 2174244
34428 2174244 2207961 2071976 1987569 2160161 2386393 2379293 2231769 2195304 2238012 2190488 2114649
34417 2114649 2163988 2263568 2262747 2224800 2259435 2264746 2134785 2017573 2070228 2168282 2148602
34406 2148602 2115838 2208613 2293268 2205343 2074514 2089978 2152305 2077173 1949327 1961700 2079064
34395 2079064 2146952 2162771 2189492 2190629 2170718 2253551 2417615 2428601 2244271 2163894 2339914
34384 2339914 2501255 2434744 2351897 2452332 2522753 2353375 2169599 2223897 2317779 2185058
34374 2185058 2013239 2098029 2285015 2262302 2139402 2216046 2405808 2411238 2284449 2307639
34364 2307639 2468753 2528476 2468864 2438342 2402994 2273932 2211983 2381179 2572102 2495527
34354 2495527 2277431 2241180 2378207 2458104 2476324 2558199 2602005 2456693 2283205 2317826
34344 2317826 2457651 2485481 2487967 2629742 2758087 2684352 2601425 2739470 2873799 2699072
34334 2699072 2431275 2470088 2700987 2731470 2606190 2655304 2810415 2730760 2485201 2449645
34324 2449645 2606890 2596984 2416453 2427664 2680127 2834548 2780474 2752797 2809876 2749361 2576352
34313 2576352 2534576 2644424 2695545 2690279 2807217 2956382 2878046 2656010 2623797 2787815
34303 2787815 2847981 2753176 2725429 2777903 2729858 2651448 2762783 2943956 2890125 2698579 2737147
34292 2737147 2977201 3042215 2888986 2843183 2962795 2961879 2786808 2695526 2742974 2736891 2698862
34281 2698862 2814003 2951069 2812230 2526339 2494927 2689940 2729940 2605222 2654248 2849357
34271 2849357 2823185 2619643 2681821 3032609 3203124 3068819 3022562 3195127 3238396 3041462
34261 3041462 2944031 3055722 3060254 2885660 2878722 3111526 3199989 3028520 2976559 3191035 3302637
34250 3302637 3119238 2954324 3003909 3022108 2877441 2823364 2957527 3001569 2862217 2832731
34240 2832731 3015228 3124139 3062203 3092412 3254423 3240044 3035337 3031252 3297317 3417649
34230 3417649 3256859 3196803 3390694 3495946 3390913 3424780 3685133 3760731 3530364 3437837
34220 3437837 3659705 3759460 3527520 3402476 3652689 3877925 3757200 3585314 3630102 3647123
34210 3647123 3469828 3398690 3566384 3598505 3342237 3238998 3525332 3770321 3675710 3614696
34200 3614696 3867953 4043116 3810289 3533275 3594290 3734393 3634341 3524635 3651748 3750682
34190 3750682 3606324 3530547 3734551 3850794 3631914 3483234 3721561 3949166 3774512 3525789
34180 3525789 3617959 3820119 3790779 3746712 3953727 4130506 4003533 3888318 4083150 4258370
34170 4258370 4089839 3919008 4120579 4382501 4288974 4070076 4103137 4211100 4118381 4061387
34160 4061387 4287297 4488178 4379005 4280699 4491840 4671391 4497845 4325389 4507543 4702522
34150 4702522 4555584 4420702 4660144 4881978 4658794 4360424 4459122 4643182 4462998 4231334
34140 4231334 4406787 4685178 4594914 4412163 4586386 4834651 4720694 4561683 4824699 5180029
34130 5180029 5101334 4858910 4961547 5161468 4990756 4740683 4904379 5177204 5033994 4783332
34120 4783332 5005719 5438952 5472980 5275233 5372346 5586029 5446452 5203253 5364240 5682040
34110 5682040 5645160 5496554 5707125 5949233 5693813 5312396 5450118 5814092 5744691 5474418
34100 5474418 5623792 5961276 5895382 5691642 5940727 6323809 6197333 5891993 6096888 6470389
34090 6470389 6255429 5771692 5850920 6273546 6258262 6028279 6328138 6830725 6663713 6135175
34080 6135175 6248560 6826610 6845391 6370206 6391597 6920398 7027366 6668049 6694902 7108455
34070 7108455 7060842 6594193 6629911 7198914 7401447 7157182 7271851 7733487 7698773 7232900
34060 7232900 7285747 7847390 7920307 7441354 7408711 7937891 8035985 7530107 7385040 7835616
34050 7835616 8012850 7713639 7749917 8245942 8370185 8043934 8130956 8665008 8707554 8224857
34040 8224857 8242539 8866869 9060839 8668874 8703722 9309288 9447399 8965331 8935957 9550776
34030 9550776 9737334 9287152 9271200 9904625 10128046 9758761 9871346 10571340 10652745 9987854
34020 9987854 9932634 10777216 11167743 10693697 10616754 11332945 11601335 11069506 11037025 11864112
34010 11864112 12183784 11594029 11524880 12455500 12920126 12329505 12099314 12864446 13294044
34001 13294044 12843502 12903043 13962336 14460553 13784390 13547698 14500879 15086259 14525388
33992 14525388 14356594 15353893 15955551 15387537 15261154 16370075 17060345 16540655 16543940
33983 16543940 17856029 18586280 17850063 17658264 19054389 20007857 19383602 19238132 20759632
33974 20759632 21817239 21144511 20952982 22601278 23799363 23103537 22914896 24799818 26255203
33965 26255203 25581227 25385921 27520680 29285802 28692197 28557372 31022230 33136635 32607899
33956 32607899 32568189 35502898 38071095 37572421 37651676 41403420 45016863 45079719 45633087
33947 45633087 50410229 55050084 55514957 56805233 63688515 70732757 72574659 75498744
33939 75498744 85958955 96915586 100875596 106283699 122161724 138005138 143978296
33932 143978296 158881124 200201691 228834263 171708902 18953147 -140775314 -212337568
33925 -212337568 -194119703 -155326162 -139658400 -133901642 -118984853 -103667230 -99272923
33918 -99272923 -97233798 -87787674 -77678879 -75065215 -74289846 -68152451 -61232513 -59684205
33910 -59684205 -59450050 -54976753 -49797113 -48928605 -49208560 -45973096 -41970532 -41460997 -41944612
33901 -41944612 -39405063 -36040144 -35612539 -36217800 -34388175 -31796796 -31566401 -32070682 -30367929
33892 -30367929 -28014131 -27831827 -28380315 -26977134 -24979413 -24954214 -25608415 -24437215 -22617872
33883 -22617872 -22554493 -23167232 -22176991 -20635744 -20763149 -21535636 -20714144 -19175110 -19079974
33874 -19079974 -19676356 -18944100 -17617057 -17646489 -18311744 -17663300 -16332306 -16233276 -16860540
33865 -16860540 -16418658 -15354735 -15342093 -15939964 -15565309 -14665911 -14739058 -15272542 -14766404
33856 -14766404 -13761668 -13812323 -14431400 -14045251 -13050787 -12982129 -13508956 -13163844 -12256817
33847 -12256817 -12217212 -12757343 -12473468 -11612432 -11532366 -12024399 -11816262 -11155908 -11286573 -11894149
33837 -11894149 -11650378 -10805459 -10711259 -11214415 -11019532 -10242963 -10137832 -10622028 -10504150
33828 -10504150 -9874978 -9890796 -10424119 -10275945 -9531424 -9404965 -9892073 -9832459 -9200366 -9110019
33818 -9110019 -9597897 -9573401 -8970436 -8834168 -9239403 -9182248 -8597546 -8472502 -8871721 -8814471
33808 -8814471 -8225235 -8089035 -8531701 -8607825 -8146759 -7998654 -8291896 -8215721 -7694426 -7551636
33798 -7551636 -7858367 -7811023 -7385295 -7421849 -7930856 -7996949 -7519840 -7373492 -7678223 -7599354
33788 -7599354 -7049892 -6906191 -7296188 -7334907 -6829588 -6614373 -6899420 -6902129 -6441451 -6310877
33778 -6310877 -6714624 -6881220 -6589292 -6547699 -6893490 -6845839 -6261445 -6021802 -6423240 -6650311
33768 -6650311 -6315874 -6082509 -6268187 -6261145 -5846988 -5729070 -6166667 -6422943 -6133940 -5945032
33758 -5945032 -6224863 -6401797 -6148457 -6002598 -6234438 -6283601 -5893020 -5644025 -5804630 -5794017
33748 -5794017 -5353451 -5109189 -5392590 -5615753 -5403998 -5254159 -5481032 -5594446 -5325524
33739 -5325524 -5206677 -5514538 -5677915 -5365289 -5143519 -5412109 -5667114 -5475038 -5230856
33730 -5230856 -5302041 -5336448 -5058838 -4866946 -5016428 -5083785 -4832126 -4731456 -5031446 -5210073
33720 -5210073 -4947005 -4752294 -5004251 -5245269 -5076639 -4885184 -5017500 -5079402 -4742873 -4441449
33710 -4441449 -4571640 -4767365 -4637679 -4477349 -4591154 -4657538 -4414272 -4238182 -4398319 -4472787
33700 -4472787 -4155732 -3899395 -4090364 -4328382 -4205172 -4065090 -4284205 -4510687 -4356755
33691 -4356755 -4162561 -4324713 -4514508 -4315984 -4025626 -4068230 -4203659 -4055738 -3866436 -3989066
33681 -3989066 -4171913 -4069316 -3939937 -4121869 -4327231 -4172786 -3917458 -3965771 -4116306 -4001127
33671 -4001127 -3806804 -3867576 -3991056 -3867612 -3714033 -3846114 -4038892 -3958464 -3803829 -3889092
33661 -3889092 -4019126 -3899005 -3723733 -3754248 -3768754 -3543430 -3390145 -3586365 -3773656 -3582488
33651 -3582488 -3347166 -3504994 -3784556 -3721811 -3506279 -3559211 -3722528 -3640873 -3521107 -3716656
33641 -3716656 -3954349 -3786291 -3449139 -3455139 -3658931 -3562236 -3257049 -3225542 -3434790 -3455470
33631 -3455470 -3297539 -3331992 -3526268 -3517187 -3330342 -3314365 -3460794 -3452920 -3283856 -3205437 -3195773
33620 -3195773 -3075999 -2990912 -3171606 -3400728 -3319972 -3078247 -3063703 -3199085 -3138582 -2959650
33610 -2959650 -2995897 -3161567 -3114183 -2936878 -2989765 -3209778 -3217950 -3020592 -2965750 -3089546
33600 -3089546 -3115523 -3017893 -3001668 -3019706 -2876205 -2699157 -2755377 -2926787 -2918459 -2825348 -2927779
33589 -2927779 -3107194 -3062615 -2925831 -3035154 -3263038 -3211433 -2933145 -2817619 -2892021 -2875503
33579 -2875503 -2795784 -2900883 -3078066 -3011507 -2803398 -2793970 -2897214 -2784213 -2585727 -2696922
33569 -2696922 -2995981 -3003235 -2747205 -2713833 -2962034 -3050852 -2865037 -2765913 -2861033 -2842181 -2639876
33558 -2639876 -2562612 -2687899 -2747259 -2688648 -2735010 -2842140 -2733529 -2506942 -2549040 -2808195
33548 -2808195 -2830056 -2569439 -2467747 -2641285 -2704468 -2521688 -2429792 -2557719 -2612218 -2514518
33538 -2514518 -2573128 -2825804 -2873531 -2595596 -2396473 -2502145 -2614197 -2504309 -2372754 -2377112
33528 -2377112 -2361637 -2280887 -2346837 -2545353 -2553163 -2331732 -2244992 -2399456 -2455193 -2293671 -2253729
33517 -2253729 -2458390 -2533908 -2296978 -2118093 -2263946 -2445198 -2376870 -2257831 -2321904 -2406391
33507 -2406391 -2342650 -2319235 -2488206 -2634595 -2587897 -2554770 -2703726 -2813123 -2667025 -2433575
33497 -2433575 -2337388 -2308092 -2237017 -2227256 -2324050 -2354548 -2275987 -2308238 -2497445 -2556376 -2370023
33486 -2370023 -2227871 -2304652 -2360307 -2232100 -2164227 -2330268 -2471445 -2356903 -2189896 -2199048
33476 -2199048 -2218842 -2048871 -1869769 -1923121 -2090831 -2144181 -2123866 -2157579 -2183066 -2136858 -2131217
33465 -2131217 -2193500 -2142338 -1952118 -1887981 -2044490 -2137201 -2007120 -1919513 -2072871 -2230946
33455 -2230946 -2165681 -2055924 -2103994 -2158982 -2077794 -2056692 -2222703 -2294693 -2064436 -1836586
33445 -1836586 -1952333 -2224567 -2295778 -2229191 -2275619 -2348350 -2216625 -1984486 -1913176 -1964897
33435 -1964897 -1944820 -1901199 -1981486 -2080618 -2018231 -1884181 -1853690 -1859020 -1787101 -1778429 -1972931
33424 -1972931 -2184621 -2189283 -2108321 -2147660 -2199119 -2084150 -1953673 -2038082 -2213337 -2220933 -2117694
33413 -2117694 -2105276 -2114177 -1972597 -1803668 -1831978 -1954152 -1913571 -1757956 -1726057 -1819225 -1872802
33402 -1872802 -1912064 -2048898 -2157565 -2039363 -1794530 -1670575 -1666031 -1630353 -1606992 -1713731
33392 -1713731 -1830659 -1779987 -1677999 -1742601 -1894557 -1917328 -1861220 -1908389 -1988306 -1923114 -1811038
33381 -1811038 -1857003 -1954235 -1853555 -1634444 -1583152 -1694355 -1713517 -1601358 -1548778 -1591176
33371 -1591176 -1598271 -1586838 -1667127 -1748532 -1673556 -1565560 -1659854 -1868161 -1904668 -1772461 -1723367
33360 -1723367 -1797452 -1810554 -1750714 -1777035 -1856528 -1805103 -1667353 -1659591 -1753232 -1711875 -1537198
33349 -1537198 -1484022 -1618907 -1740372 -1758631 -1796172 -1887957 -1918636 -1873563 -1841427 -1786621 -1634052
33338 -1634052 -1527426 -1652732 -1857430 -1823553 -1583172 -1470665 -1584543 -1698899 -1705319 -1730686
33328 -1730686 -1790917 -1733097 -1574829 -1524297 -1608697 -1639080 -1584476 -1621360 -1769773 -1838271 -1774749
33317 -1774749 -1722489 -1696604 -1568293 -1404809 -1445324 -1680660 -1826611 -1779583 -1735758 -1794040
33307 -1794040 -1811624 -1733659 -1700845 -1735943 -1674065 -1500344 -1417746 -1486094 -1525368 -1465138 -1458439
33296 -1458439 -1561394 -1629177 -1615835 -1651103 -1741548 -1728086 -1615460 -1602152 -1706126 -1711906 -1570592
33285 -1570592 -1490806 -1543451 -1550551 -1469756 -1500617 -1675788 -1732351 -1552842 -1371221 -1368525 -1412528
33274 -1412528 -1375599 -1366429 -1451236 -1471130 -1345142 -1260851 -1362718 -1517886 -1568386 -1556135 -1544385
33263 -1544385 -1484301 -1400043 -1428191 -1541549 -1525540 -1353130 -1267595 -1364465 -1435168 -1376203 -1386791
33252 -1386791 -1568761 -1695792 -1611019 -1509612 -1573504 -1650146 -1566485 -1461300 -1516512 -1623390
33242 -1623390 -1602836 -1522629 -1523347 -1547625 -1501834 -1478343 -1567483 -1644531 -1575074 -1441047 -1357931
33231 -1357931 -1280202 -1188548 -1230824 -1451560 -1617363 -1550701 -1412745 -1416127 -1485932 -1459370 -1399526
33220 -1399526 -1439907 -1515113 -1511895 -1505529 -1594019 -1678888 -1652531 -1611807 -1644366 -1613399 -1419497
33209 -1419497 -1263101 -1348688 -1517996 -1491310 -1309406 -1215538 -1240293 -1233507 -1199383 -1269751 -1411183
33198 -1411183 -1464011 -1431456 -1456231 -1541569 -1547056 -1442510 -1345241 -1321633 -1338371 -1379542 -1444166
33187 -1444166 -1469846 -1409609 -1330549 -1307196 -1298329 -1253369 -1232812 -1288239 -1339993 -1312973 -1271718
33176 -1271718 -1287518 -1309383 -1298835 -1330918 -1416496 -1406289 -1243258 -1126007 -1225033 -1409013 -1458942
33165 -1458942 -1390113 -1349067 -1347483 -1316286 -1281209 -1277576 -1233811 -1131791 -1116807 -1248509 -1330477
33154 -1330477 -1212640 -1069265 -1123149 -1282302 -1330492 -1303128 -1367197 -1474391 -1453567 -1339980
33144 -1339980 -1307385 -1361651 -1384547 -1386122 -1433114 -1431477 -1277047 -1124838 -1195112 -1389689 -1422298
33133 -1422298 -1273488 -1188264 -1250094 -1286640 -1212940 -1162351 -1225009 -1311598 -1333994 -1314999 -1282135
33122 -1282135 -1229282 -1195212 -1221096 -1244840 -1186323 -1093520 -1055728 -1045360 -1005700 -998823 -1085503
33111 -1085503 -1164771 -1129165 -1065123 -1090185 -1121541 -1044054 -973241 -1075346 -1241103 -1237703 -1098019
33100 -1098019 -1052893 -1141177 -1193900 -1160322 -1144722 -1146570 -1063144 -942096 -950304 -1091535 -1210710
33089 -1210710 -1262142 -1320985 -1360548 -1286604 -1168417 -1166921 -1254094 -1266616 -1207886 -1224645 -1315392
33078 -1315392 -1343313 -1309523 -1326191 -1351139 -1253083 -1112914 -1136304 -1276258 -1276410 -1100053 -978953
33067 -978953 -1008537 -1036764 -1003843 -1047621 -1191343 -1254849 -1176986 -1124239 -1177023 -1197491 -1113877
33056 -1113877 -1056457 -1099881 -1134210 -1101504 -1109906 -1209008 -1291451 -1306868 -1332814 -1359547 -1266570
33045 -1266570 -1094796 -1065133 -1222831 -1336453 -1266293 -1161307 -1158695 -1159416 -1063502 -980789 -1026002
33034 -1026002 -1109584 -1104681 -1047636 -1023390 -1013560 -988252 -993311 -1034334 -1026367 -951187 -908088 -934430
33022 -934430 -945413 -916805 -943166 -1049584 -1134890 -1160429 -1197174 -1236040 -1170599 -1023640 -960024
33011 -960024 -1014837 -1049934 -1037585 -1117976 -1297134 -1373981 -1275882 -1183006 -1194148 -1158488 -993381
33000 -993381 -884643 -980728 -1138238 -1167651 -1107955 -1069455 -1021196 -926156 -883946 -947739 -986598
32989 -986598 -909232 -841038 -906243 -1016757 -1047347 -1041969 -1082147 -1125317 -1125670 -1137115 -1161542 -1094849
32977 -1094849 -954043 -928439 -1060474 -1128622 -1016184 -923618 -1007997 -1092843 -994373 -872990
32967 -872990 -956422 -1134744 -1158119 -1060983 -1054801 -1132177 -1110512 -983164 -918595 -964582 -1026025
32956 -1026025 -1088660 -1212179 -1341180 -1355398 -1274817 -1211120 -1162065 -1049323 -908225 -849516
32946 -849516 -880007 -929020 -987511 -1059854 -1064777 -958635 -868573 -925005 -1051376 -1096287 -1072037
32935 -1072037 -1073493 -1068682 -982307 -894889 -937263 -1057381 -1103210 -1072292 -1072603 -1099801 -1064913 -992914
32923 -992914 -988484 -1042058 -1056684 -1026922 -1017698 -1018072 -987308 -982380 -1061230 -1125975 -1048819 -891844
32911 -891844 -814073 -820865 -797274 -735242 -733648 -814909 -920505 -1040738 -1177244 -1237903 -1149688
32900 -1149688 -1016266 -984299 -1019724 -999869 -948553 -972075 -1028232 -980150 -838323 -740608 -727161
32889 -727161 -731879 -754443 -841968 -943471 -981354 -1018978 -1153597 -1297997 -1288614 -1161696 -1089425
32878 -1089425 -1081979 -1002049 -856565 -815425 -923028 -1030189 -1045277 -1033708 -1032186 -975712 -860356
32867 -860356 -792315 -822493 -887432 -941889 -998299 -1023058 -952029 -823214 -748727 -755039 -787759
32856 -787759 -845225 -951188 -1034430 -1010775 -947069 -961595 -1008306 -960765 -859675 -847495 -894792
32845 -894792 -844951 -718482 -707203 -846975 -956519 -940950 -902890 -898060 -832891 -685999 -599153
32834 -599153 -651590 -745158 -797431 -852327 -918714 -900321 -783453 -712368 -778792 -895770 -960418
32823 -960418 -980886 -970978 -889465 -763142 -706488 -742910 -764820 -732534 -736598 -797975 -803921 -731930
32811 -731930 -733919 -875388 -981464 -894795 -726645 -683052 -763367 -801652 -726556 -625188 -592449
32800 -592449 -637635 -717056 -779546 -800344 -808365 -843141 -878612 -858951 -805963 -792373 -809998 -785614
32788 -785614 -734512 -757103 -857181 -911506 -863703 -802661 -793510 -777152 -710117 -666851 -713895
32777 -713895 -796425 -836627 -843439 -838897 -769913 -597287 -421220 -425965 -694085 -1095914 -1365700
32766 -1365700 -1329526 -1096571 -961489 -1057212 -1200786 -1179326 -1054131 -1007501 -1014963 -922247 -776445
32755 -776445 -785479 -946178 -1005429 -851451 -678983 -675802 -783690 -876726 -957841 -1053161 -1096230
32744 -1096230 -1043355 -958901 -897057 -844338 -836461 -952216 -1124374 -1154499 -1003321 -870497 -890521
32733 -890521 -951809 -929331 -889579 -922312 -956535 -903398 -824418 -803523 -794012 -741307 -724947 -827936
32721 -827936 -974978 -1034049 -982489 -871147 -737780 -647583 -686187 -813509 -861903 -776920 -711477
32710 -711477 -779000 -875917 -870959 -809511 -792713 -805004 -805430 -846845 -957508 -1041011 -1039105 -1053416
32698 -1053416 -1151234 -1193613 -1035194 -774652 -621496 -610658 -629211 -642926 -710278 -820805
32688 -820805 -888440 -889298 -883200 -913577 -968767 -1012183 -999130 -917620 -838567 -837240 -855151 -774734
32676 -774734 -645442 -652428 -814212 -920469 -853428 -754612 -759685 -788323 -741924 -696031 -723659
32665 -723659 -724570 -620248 -540275 -616069 -749854 -787202 -766907 -797231 -828447 -760197 -653593
32654 -653593 -636132 -701944 -778081 -866483 -958808 -956947 -847078 -790314 -863886 -897631 -767013
32643 -767013 -643363 -711927 -844332 -832442 -760562 -827221 -954610 -922358 -777309 -757266 -877203
32632 -877203 -931253 -862756 -809144 -809012 -775786 -739612 -809830 -913352 -874046 -743136 -745094 -893037
32620 -893037 -967064 -894692 -843667 -892605 -908606 -822132 -751615 -774692 -815258 -826278 -861389
32609 -861389 -911182 -887275 -812488 -810938 -880645 -899709 -873705 -928782 -1035417 -1006711 -819049
32598 -819049 -669407 -654482 -657028 -617166 -641674 -751744 -789092 -685778 -583270 -575465 -576156
32587 -576156 -549007 -612065 -781719 -867533 -781448 -714162 -824559 -970333 -944700 -794880 -701972
32576 -701972 -698715 -704774 -713482 -753640 -769323 -709095 -646796 -664566 -701412 -654430 -547436 -473192
32564 -473192 -449119 -446518 -482005 -568865 -652788 -694295 -739627 -825023 -894848 -895112 -858940 -824406
32552 -824406 -766663 -687138 -661278 -712218 -744553 -694283 -640123 -672550 -755491 -817252 -879969
32541 -879969 -989046 -1094000 -1106960 -1024361 -910641 -817034 -773972 -792209 -818871 -773799 -678248
32530 -678248 -654752 -748644 -852988 -870737 -845302 -857367 -888764 -868887 -782937 -672599 -593343
32519 -593343 -602213 -707069 -811216 -808213 -739289 -734596 -797907 -809052 -757006 -778371 -906361
32508 -906361 -977206 -882847 -742378 -709868 -764939 -806739 -812720 -792409 -721563 -633865 -643778 -769074
32496 -769074 -865415 -841865 -794022 -810253 -808140 -705437 -600061 -616426 -704405 -756112 -796345
32485 -796345 -879610 -914672 -792179 -605846 -547862 -631826 -698404 -664141 -602066 -592924 -637568
32474 -637568 -707755 -771306 -783601 -743649 -722468 -757072 -778152 -730925 -691429 -755647 -883148
32463 -883148 -963977 -977785 -974265 -956058 -895126 -814493 -751867 -696295 -651031 -684932 -818597
32452 -818597 -936868 -928052 -838422 -775707 -737368 -660097 -565383 -517327 -494171 -438138 -382185
32441 -382185 -392029 -428188 -404849 -353107 -388869 -533794 -687299 -765003 -764379 -714760 -658974 -658176
32429 -658176 -720536 -754592 -685646 -584517 -583075 -687492 -768444 -722553 -572234 -426723 -398197
32418 -398197 -517729 -686057 -759634 -722733 -695747 -737700 -761205 -711777 -690530 -781216 -879222
32407 -879222 -839052 -697981 -602233 -585011 -568992 -532281 -523553 -548068 -566257 -573795 -577727 -540553
32395 -540553 -450747 -391044 -430985 -513037 -549793 -563752 -620212 -696118 -732644 -743952 -756768
32384 -756768 -723784 -622162 -552342 -602076 -693434 -705276 -665170 -672202 -713380 -717476 -713700 -765568
32372 -765568 -811731 -746744 -610161 -531044 -532637 -547628 -569613 -628384 -674585 -653328 -629192
32361 -629192 -670745 -687446 -570801 -422081 -423672 -540935 -583548 -528467 -537745 -655758 -728929
32350 -728929 -664407 -560491 -528486 -558040 -602513 -647346 -664267 -631428 -605030 -641285 -668247
32339 -668247 -579126 -418342 -315499 -278875 -233277 -212639 -306818 -453705 -509557 -506105 -604482
32328 -604482 -802404 -930993 -947100 -972374 -1017992 -939656 -724551 -562282 -545598 -542441 -460651
32317 -460651 -405372 -458691 -519377 -492019 -449152 -479815 -543781 -590406 -661574 -764489 -792859
32306 -792859 -684191 -524183 -409324 -339573 -311856 -364136 -458118 -482533 -443878 -482766 -630683
32295 -630683 -737502 -721666 -693124 -728650 -732141 -644380 -591747 -675163 -787665 -797689 -751909
32284 -751909 -740337 -718586 -632483 -574274 -636328 -731050 -729786 -673236 -674986 -712952 -684713 -591432
32272 -591432 -511772 -461505 -418066 -416270 -488248 -569517 -578139 -523818 -449602 -356803 -278509 -311890
32260 -311890 -465503 -592146 -596012 -583273 -668669 -762110 -719248 -595928 -560739 -628605 -671942
32249 -671942 -647798 -627809 -625205 -567284 -447424 -360694 -367318 -426917 -482485 -529255 -592857 -688319
32237 -688319 -786823 -804264 -684552 -515752 -460519 -528480 -548906 -440191 -350966 -414568 -517105
32226 -517105 -479473 -350446 -322682 -434985 -558460 -635748 -734180 -862918 -919644 -859605 -783827
32215 -783827 -806254 -912945 -987266 -932358 -766840 -621950 -610718 -686121 -701957 -633223 -617501
32204 -617501 -724696 -828915 -808734 -737038 -740091 -791656 -800054 -788965 -817795 -814665 -683239
32193 -683239 -517021 -509614 -674251 -830443 -861279 -820697 -784501 -750647 -709725 -689166 -702298
32182 -702298 -739345 -801578 -866869 -861941 -763239 -671514 -675767 -705255 -647439 -548484 -536745 -594789
32170 -594789 -589491 -512492 -502120 -604731 -688483 -646483 -541667 -484750 -481551 -470507 -432153
32159 -432153 -400489 -409451 -458435 -504964 -499379 -456608 -455250 -521230 -573164 -548881 -510968 -533324
32147 -533324 -560833 -505716 -420408 -430804 -535423 -614316 -614025 -583874 -547541 -485426 -441344 -499705
32135 -499705 -638467 -733170 -728123 -687918 -664086 -630260 -575481 -548398 -568921 -587044 -566146
32124 -566146 -532785 -515200 -495991 -450067 -384780 -334720 -345112 -436179 -550881 -587673 -532594
32113 -532594 -493210 -539589 -593178 -559676 -486568 -476925 -521289 -539065 -523595 -519804 -517322 -493666
32101 -493666 -500623 -571866 -611120 -523092 -393533 -374498 -444755 -462548 -415512 -426990 -529451
32090 -529451 -617986 -634294 -630136 -641959 -655744 -693289 -782955 -857548 -835314 -778773 -805535 -870109
32078 -870109 -823955 -673925 -576968 -582517 -593074 -587441 -654667 -773671 -791452 -684191 -623664
32067 -623664 -704339 -804228 -803419 -752937 -734949 -731358 -722444 -746062 -769387 -674840 -472429 -355686
32055 -355686 -434146 -568357 -589054 -531612 -524948 -578725 -613241 -596424 -536180 -431599 -329348
32044 -329348 -330886 -453451 -579375 -617276 -603798 -578940 -499488 -368955 -310530 -388531 -480327
32033 -480327 -458138 -390680 -421084 -530072 -572636 -502520 -423676 -434355 -521851 -606240 -620273
32022 -620273 -555078 -468360 -431368 -453666 -492599 -526028 -552845 -540401 -463676 -383718 -379061 -411074
32010 -411074 -382484 -317068 -329561 -415495 -443006 -379535 -350050 -424158 -517854 -563187 -606718
31999 -606718 -676680 -716228 -709620 -711215 -699719 -588020 -431238 -415846 -566213 -679980 -648052
31988 -648052 -609750 -674759 -729921 -670974 -594676 -589082 -558489 -449680 -428358 -603408 -780092
31977 -780092 -740866 -593006 -567233 -629894 -592355 -483929 -498488 -633544 -686402 -592573 -496955
31966 -496955 -482363 -470936 -420552 -408308 -480604 -582595 -653203 -658485 -557731 -380873 -293903
31955 -293903 -422344 -650998 -767250 -754584 -757630 -801225 -760701 -608824 -486295 -493467 -574402
31944 -574402 -635197 -642900 -599510 -540554 -545628 -631345 -676212 -587269 -478224 -512655 -632193
31933 -632193 -646234 -554618 -551066 -699030 -828984 -804292 -694974 -627397 -626138 -662843 -718012
31922 -718012 -743063 -686525 -592093 -552926 -557261 -510942 -418490 -393138 -468034 -545263 -562110 -571541
31910 -571541 -626736 -707565 -780958 -821742 -779408 -648191 -545617 -574330 -640479 -588581 -482818
31899 -482818 -529500 -722150 -820601 -732584 -651246 -707724 -740345 -575535 -330201 -229692 -270164
31888 -270164 -274133 -193842 -156028 -235769 -353543 -403472 -367139 -291147 -236317 -254368 -349953
31877 -349953 -458426 -502625 -473496 -431294 -434006 -479854 -516174 -504837 -477265 -494180 -543081
31866 -543081 -539884 -469775 -442447 -529949 -631450 -608589 -487291 -398090 -375347 -361154 -359919
31855 -359919 -422261 -499803 -487983 -409011 -386580 -441038 -482820 -509428 -610586 -747510 -735532
31844 -735532 -523310 -310608 -294880 -447151 -620891 -736496 -767907 -689024 -546250 -476283
31834 -476283 -547039 -661413 -693634 -635110 -542245 -436374 -326712 -248297 -214640 -206871 -246177
31823 -246177 -382285 -573525 -686155 -661232 -582201 -535976 -512286 -479082 -444124 -397142 -301110
31812 -301110 -182698 -124735 -142078 -181780 -255319 -417189 -590678 -599268 -431580 -294538 -319481
31801 -319481 -386384 -338525 -211026 -135110 -156976 -256572 -409677 -532922 -508122 -360378 -269558
31790 -269558 -313112 -359846 -318884 -304220 -412382 -524092 -503311 -429122 -435295 -463433 -386698
31779 -386698 -262844 -247210 -338514 -414505 -449484 -504286 -566583 -589384 -625739 -738262 -833831
31768 -833831 -776812 -613055 -494047 -436045 -356315 -296254 -380332 -569276 -678639 -654706 -624765
31757 -624765 -655091 -667199 -629511 -622786 -651967 -591414 -410364 -279628 -337856 -486823 -539371
31746 -539371 -468031 -390229 -382864 -424030 -472865 -509377 -514557 -483549 -452301 -464112 -512450 -542913
31734 -542913 -508193 -414390 -324105 -308135 -373361 -448277 -463933 -432090 -413307 -431623 -463609
31723 -463609 -492643 -523503 -549005 -545924 -506923 -450758 -405518 -395833 -426625 -464425 -462332 -418645
31711 -418645 -378831 -369843 -375598 -385200 -407858 -425168 -392136 -305447 -209409 -126788 -60455 -60156
31699 -60156 -174812 -324684 -357391 -269630 -224271 -288319 -324705 -245628 -196666 -328999 -529871
31688 -529871 -572307 -439818 -307484 -260620 -227922 -169797 -146136 -178942 -196449 -151157 -93837
31677 -93837 -104278 -208884 -359901 -452260 -405869 -281695 -245863 -357848 -486578 -510433 -481098
31666 -481098 -483898 -470813 -384090 -323552 -402894 -530976 -538085 -454857 -457436 -574395 -654519 -611790
31654 -611790 -512117 -422329 -349539 -322314 -359964 -374692 -281009 -185410 -274504 -518167 -683174
31643 -683174 -654196 -543703 -463108 -391778 -317863 -307170 -359543 -369913 -306029 -271494 -326026
31632 -326026 -389687 -389929 -365659 -365440 -372694 -382360 -423751 -469357 -455072 -416920 -454434 -532634 -499419
31619 -499419 -346727 -263739 -355594 -494709 -545088 -552411 -594746 -615145 -545310 -455327 -432445
31608 -432445 -426611 -361352 -296769 -331722 -420727 -436119 -363842 -306520 -321890 -369904 -404274 -427620
31596 -427620 -461536 -518585 -590280 -631810 -593656 -494094 -414906 -404331 -435899 -473703 -511573
31585 -511573 -537261 -533641 -526302 -551586 -575628 -535236 -454387 -412866 -405534 -361111 -301464 -332529
31573 -332529 -456665 -551106 -568169 -594043 -660193 -668609 -577826 -496682 -502232 -520776 -489400 -481584
31561 -481584 -554411 -610710 -543566 -403191 -300733 -257699 -264953 -368625 -560634 -691457 -643077
31550 -643077 -510539 -468971 -524836 -541622 -471259 -424696 -515150 -718276 -886998 -867070 -633200
31539 -633200 -337847 -174237 -181842 -257880 -339186 -441688 -527400 -511811 -438519 -455854 -559286
31528 -559286 -560277 -398275 -266985 -305740 -381702 -341552 -274820 -327271 -428807 -429045 -363610 -363913
31516 -363913 -418609 -439030 -454319 -527967 -581923 -521327 -439434 -475335 -555735 -511319 -375044
31505 -375044 -324438 -384911 -429331 -425245 -443597 -463330 -412951 -373023 -479174 -639382 -616479
31494 -616479 -403722 -250133 -274639 -319113 -251817 -164931 -171024 -222383 -245457 -271250 -325682
31483 -325682 -350678 -327471 -329532 -375285 -380678 -330111 -330851 -415072 -455325 -377877 -300312 -338783
31471 -338783 -422299 -430057 -390500 -402930 -455452 -460196 -406272 -355831 -333317 -321328 -331216 -390594
31459 -390594 -483931 -566807 -613057 -608589 -541782 -439566 -367839 -359274 -381417 -398364 -412936 -427854
31447 -427854 -421136 -381964 -323128 -251072 -175523 -139271 -170130 -218553 -226459 -238929 -342271 -501731
31435 -501731 -583405 -544528 -475255 -433879 -376033 -284437 -232840 -259647 -296088 -289456 -295937 -379385
31423 -379385 -503232 -589520 -614927 -596154 -546231 -485818 -437592 -391447 -341385 -344473 -440199
31412 -440199 -527495 -465523 -303393 -242923 -337471 -406639 -318475 -176915 -128224 -150523 -164327
31401 -164327 -200249 -302766 -388620 -363291 -285996 -263714 -262781 -185161 -65049 -23589 -70873
31390 -70873 -113436 -132408 -195793 -297911 -337446 -277727 -203616 -186834 -197702 -186150 -165820
31379 -165820 -177709 -228058 -291925 -340486 -354494 -341408 -332142 -332195 -303849 -237431 -199593 -247452
31367 -247452 -328840 -346763 -305337 -307894 -407755 -536411 -595820 -561417 -475741 -393245 -355394
31356 -355394 -378675 -438117 -484644 -497205 -502494 -533630 -587668 -638889 -681539 -735127 -799316 -825940
31344 -825940 -769771 -665197 -606519 -632082 -676006 -669237 -632959 -615959 -598573 -543901 -495412
31333 -495412 -514632 -553980 -517938 -435604 -426727 -484624 -454171 -279198 -117943 -121692 -226687
31322 -226687 -275343 -240614 -208975 -218375 -239010 -266395 -316381 -354676 -333259 -283232 -287112 -366506
31310 -366506 -463510 -522672 -535992 -521354 -505064 -511761 -535933 -542744 -518100 -482219 -438275 -363104
31298 -363104 -270685 -217516 -215728 -215039 -201535 -223116 -274603 -267323 -183637 -148761 -246279 -362561
31286 -362561 -344893 -240295 -230509 -367284 -514741 -547103 -477997 -383664 -307895 -270812 -288345
31275 -288345 -346952 -404367 -430248 -419069 -376881 -328124 -308917 -316080 -297414 -233282 -184511 -210410
31263 -210410 -282837 -331191 -325303 -266772 -160743 -56309 -46844 -155020 -279517 -332208 -358560
31252 -358560 -433006 -510322 -496479 -410214 -350997 -347014 -355490 -375921 -432790 -472352 -414528 -300636
31240 -300636 -256760 -306210 -347901 -333173 -329378 -372896 -387025 -309814 -206254 -180115 -235903
31229 -235903 -290511 -284830 -239173 -217489 -258026 -330510 -371919 -378976 -425027 -546263 -662988
31218 -662988 -678335 -606018 -520148 -429126 -304868 -201525 -220553 -360153 -508266 -586376 -598152
31207 -598152 -544351 -414771 -278353 -251581 -335961 -399069 -365095 -318152 -356317 -441658 -474716
31196 -474716 -443590 -412487 -409320 -407620 -398928 -412867 -464018 -526001 -568275 -589293 -595112 -558776
31184 -558776 -437384 -255881 -141086 -201660 -372903 -467152 -405695 -302546 -266445 -237525
31174 -237525 -123355 7476 14107 -97320 -195042 -224032 -235764 -242764 -205599 -161525 -204583
31163 -204583 -320407 -392082 -391875 -412013 -472182 -460340 -325733 -179279 -124359 -123021 -112079
31152 -112079 -119577 -167460 -179195 -99845 -11571 -12188 -59975 -62595 -56937 -165006 -392924 -592407
31140 -592407 -633976 -540446 -434228 -402805 -429703 -436901 -392240 -364074 -434979 -572665 -650832
31129 -650832 -604605 -495217 -410262 -382826 -427932 -557433 -709677 -756634 -648877 -485943
31119 -485943 -386989 -361776 -363250 -384409 -427004 -445055 -405900 -356727 -353361 -371361 -363633 -356801
31107 -356801 -404135 -479047 -503709 -463647 -413860 -383360 -350732 -316467 -331213 -428453 -562231
31096 -562231 -630100 -559482 -389250 -264727 -307285 -472054 -584855 -546089 -441044 -407839
31086 -407839 -456143 -482407 -425611 -331714 -270519 -249881 -227542 -177258 -126835 -130313 -198395 -268540
31074 -268540 -269696 -208138 -155365 -160558 -216021 -295189 -370164 -403042 -384084 -369315 -407171 -437984
31062 -437984 -358361 -189207 -77850 -110412 -219165 -303415 -340722 -341830 -303431 -262348 -297441
31051 -297441 -408933 -481620 -440528 -368667 -396065 -531507 -670188 -718189 -658124 -541208 -452617
31040 -452617 -434657 -429767 -368374 -305464 -354689 -482102 -519331 -420883 -336185 -351654 -345699 -221555
31028 -221555 -108027 -160200 -303019 -364825 -355096 -401662 -489409 -481834 -371502 -301107 -329790
31017 -329790 -358990 -313790 -243332 -210398 -212570 -242785 -313000 -388549 -397471 -331165 -258798 -233760
31005 -233760 -253988 -301377 -346261 -337294 -266985 -216332 -253777 -334998 -389662 -439810 -516811 -535628
30993 -535628 -407017 -223485 -160769 -222157 -261161 -246254 -303270 -465434 -574994 -506605 -337114
30982 -337114 -216036 -187289 -204501 -218451 -197383 -154122 -179047 -337727 -521594 -536190 -367572
30971 -367572 -216053 -222143 -309335 -353381 -344997 -303921 -195476 -47658 -7249 -142406 -304833
30960 -304833 -329674 -273577 -302814 -424575 -496060 -458111 -396245 -374633 -354894 -305187 -273827
30949 -273827 -308083 -374486 -403526 -371808 -311534 -262542 -232026 -195613 -138441 -89087 -90755 -145458
30937 -145458 -222334 -309429 -400729 -443672 -385974 -285579 -274956 -379341 -466809 -430389 -323123
30926 -323123 -244803 -192537 -118389 -54340 -65353 -127606 -162518 -159807 -166697 -181100 -155933 -95692
30914 -95692 -55031 -48370 -47865 -64869 -143596 -269539 -368593 -407771 -419328 -416020 -366737 -278153
30902 -278153 -218370 -223073 -249806 -266281 -312157 -412852 -491475 -448772 -306331 -192887 -188384
30891 -188384 -246995 -286823 -294096 -305296 -332361 -354629 -363992 -371286 -373543 -356062 -329660 -330546 -377654
30878 -377654 -459243 -557607 -646276 -669253 -586962 -455763 -389061 -406176 -394834 -276725 -135395
30867 -135395 -102267 -178669 -265972 -324038 -390280 -469226 -518183 -536265 -559848 -568426 -501307 -374855
30855 -374855 -275639 -224890 -160853 -72923 -31536 -52426 -58495 -28556 -56980 -191459 -329220
30844 -329220 -366802 -350309 -373723 -417893 -405834 -346549 -302818 -268501 -199423 -130360 -139730 -213192
30832 -213192 -254450 -231461 -212672 -248973 -305839 -328284 -303144 -243661 -172060 -127389 -138423
30821 -138423 -181750 -209677 -216404 -232806 -263613 -275635 -242445 -164605 -65031 -1745 -47037 -193416
30809 -193416 -315155 -301243 -204758 -176165 -261924 -363323 -395473 -382450 -367598 -331652 -259229
30798 -259229 -209405 -243766 -325105 -354179 -287632 -173316 -90448 -95339 -197173 -333628 -389948
30787 -389948 -306350 -167741 -125646 -215011 -307493 -279724 -172064 -121750 -177361 -260002 -298643
30776 -298643 -312941 -336773 -345345 -314580 -287227 -308794 -345534 -342978 -327506 -362564 -428705 -440747
30764 -440747 -374757 -287391 -216624 -161799 -157943 -250686 -377100 -395920 -282116 -174095 -167875
30753 -167875 -183363 -119236 -28447 -25380 -102561 -165024 -189856 -226359 -273968 -282471 -257313 -253747
30741 -253747 -273591 -270825 -256083 -290631 -366293 -391560 -323532 -229832 -189422 -204448 -240538 -285372
30729 -285372 -327089 -329595 -274464 -195095 -139214 -124937 -151171 -213796 -285853 -315274 -276430 -206350
30717 -206350 -162412 -157274 -162994 -171159 -211348 -292176 -353449 -323388 -225083 -171069 -218838 -282706
30705 -282706 -250048 -145141 -91296 -129677 -178747 -177819 -157890 -141896 -94978 -31491 -52170 -183449
30693 -183449 -281944 -216609 -72360 -43932 -173713 -325256 -392963 -405693 -417389 -417981 -389253
30682 -389253 -357282 -341561 -309441 -222487 -99454 -10820 -19426 -117167 -210050 -200011 -105365
30671 -105365 -54326 -125135 -249914 -323262 -335519 -327773 -287010 -186922 -82831 -56954 -99250
30660 -99250 -142750 -184484 -263045 -346494 -366350 -348084 -375938 -424963 -367430 -180604 -20729
30649 -20729 -28400 -156915 -261735 -289141 -306887 -388560 -524893 -639521 -669084 -627323 -574710
30638 -574710 -517703 -393433 -195180 -38935 -20773 -73515 -78459 -65065 -154668 -332093 -438888
30627 -438888 -410675 -364239 -401877 -468257 -466891 -402363 -335833 -295375 -296204 -361693 -458427 -489253
30615 -489253 -415626 -319235 -286037 -295920 -282896 -241566 -214708 -221817 -245943 -253721 -205339 -92801
30603 -92801 18898 47512 -2550 -59185 -102173 -175165 -276101 -340206 -347567 -340507 -318280 -237017
30591 -237017 -140552 -153279 -291904 -417421 -434219 -401059 -376091 -304206 -162018 -71290 -131874
30580 -131874 -252761 -288352 -249561 -239345 -262452 -250446 -214195 -222354 -271159 -312101 -365961
30569 -365961 -468978 -543104 -472393 -296048 -180176 -193600 -245772 -257381 -256582 -273936 -267552
30558 -267552 -210185 -157605 -169640 -226088 -267521 -269669 -241994 -197500 -156898 -147846 -170935 -188118
30546 -188118 -164294 -109260 -71517 -93386 -163608 -216324 -203842 -167995 -190831 -268937 -306759
30535 -306759 -259819 -201667 -197959 -198872 -135281 -50847 -41573 -112646 -193639 -260882 -344544 -434084
30523 -434084 -474141 -453577 -420618 -408989 -410621 -413264 -410348 -390069 -363243 -371331 -417905 -440426
30511 -440426 -410481 -399422 -462005 -521428 -480004 -389651 -381629 -459653 -502798 -462630 -414080 -399489
30499 -399489 -363696 -280591 -217694 -220391 -234581 -201960 -149900 -134998 -166237 -225182 -297196 -349740
30487 -349740 -347000 -317136 -336650 -417250 -477814 -461049 -407302 -376126 -365218 -350735 -342257 -347288
30475 -347288 -336271 -293690 -258424 -265128 -283307 -259866 -193549 -129125 -99635 -103682 -123923 -150689
30463 -150689 -197205 -283865 -383693 -409292 -309933 -167815 -128006 -230132 -375850 -464509 -484476
30452 -484476 -461441 -405150 -339778 -309478 -312592 -293991 -236722 -194490 -197524 -198869 -161772 -131189
30440 -131189 -159113 -216491 -243193 -240731 -254313 -298568 -355331 -411096 -446887 -428844 -363829 -329148
30428 -329148 -385893 -487767 -534920 -499523 -442282 -421088 -440735 -482890 -526767 -537220 -482846
30417 -482846 -377584 -271529 -198356 -161713 -164902 -209645 -263889 -279595 -259460 -263849 -324570
30406 -324570 -386134 -369627 -273771 -172409 -123601 -126504 -164990 -234632 -303096 -302094 -211686 -115316
30394 -115316 -108925 -179301 -239579 -263291 -295243 -334976 -317315 -237107 -187885 -221725 -263949 -235407
30382 -235407 -174270 -157276 -180174 -206869 -260842 -361687 -437950 -422290 -378339 -405375 -462791
30371 -462791 -428874 -302632 -200553 -170327 -158620 -154775 -202453 -258791 -215531 -96286 -61830
30360 -61830 -161832 -247647 -207540 -124386 -100988 -89671 -29523 -15255 -163912 -402746 -550799
30349 -550799 -554575 -497554 -425406 -315905 -201440 -170066 -226402 -267511 -224107 -139262 -88057
30338 -88057 -95006 -148673 -229709 -300061 -314404 -265495 -192096 -139279 -131829 -171579 -231553 -268032
30326 -268032 -264012 -242626 -224773 -211950 -223936 -288624 -361528 -334512 -187638 -58655 -76320
30315 -76320 -186424 -245066 -234998 -264986 -371813 -452684 -416855 -299463 -188414 -122462 -100870
30304 -100870 -120649 -157184 -164595 -141581 -151183 -229979 -318032 -332535 -285179 -265177 -306260 -329572
30292 -329572 -250726 -108416 -35423 -104061 -249802 -364639 -411940 -408099 -349838 -244743 -181003
30281 -181003 -252480 -402967 -458551 -357686 -242330 -252109 -328312 -324669 -237845 -198869 -265195
30270 -265195 -349377 -367161 -351144 -376248 -442001 -479485 -446462 -381158 -362867 -422588 -495618
30259 -495618 -486001 -386067 -295867 -304979 -397035 -495891 -553154 -551832 -483740 -382960 -331055 -361947
30247 -361947 -406291 -397701 -378786 -412514 -443525 -372570 -244264 -217138 -327320 -419808 -373512
30236 -373512 -277111 -288551 -401219 -462605 -392121 -272036 -214085 -226207 -251993 -276369 -321037
30225 -321037 -358391 -313238 -179383 -71172 -96329 -209022 -262045 -195309 -94118 -53596 -74125
30214 -74125 -124852 -220854 -366841 -485270 -482524 -361369 -209680 -103811 -71727 -114474 -201913
30203 -201913 -270475 -281296 -264632 -266733 -281017 -271408 -227685 -157850 -71278 -10812 -38968 -135312
30191 -135312 -180001 -118222 -66356 -148937 -295220 -331048 -233582 -147199 -155815 -191201 -190589 -200579
30179 -200579 -267180 -339788 -358052 -348649 -363989 -388591 -373201 -316900 -258776 -219242 -192520 -174656
30167 -174656 -171563 -196828 -265055 -355483 -391473 -314837 -186172 -144293 -241295 -375883 -422184
30156 -422184 -374213 -323162 -328619 -357796 -343202 -272601 -211351 -226885 -293183 -307165 -222264 -117401
30144 -117401 -86515 -111154 -116874 -111928 -166060 -266048 -305900 -242412 -166115 -182234 -293298 -427596
30132 -427596 -515043 -510510 -416470 -316796 -318579 -419060 -490989 -442393 -334325 -291910 -345753
30121 -345753 -414220 -411206 -322629 -195595 -95783 -71298 -125220 -209476 -252015 -208241 -111395
30110 -111395 -69081 -163520 -336154 -425013 -352873 -219778 -159153 -173051 -189073 -210337 -291828
30099 -291828 -406546 -462043 -441865 -417690 -424450 -433133 -443995 -488431 -530849 -490411 -382010
30088 -382010 -319085 -345542 -373904 -324771 -225237 -135499 -78197 -72924 -139513 -233303 -276468 -282189
30076 -282189 -340830 -453871 -500957 -415881 -280251 -194584 -169268 -187760 -252792 -313112 -272166
30065 -272166 -139436 -52307 -78445 -123319 -108128 -98606 -158888 -217449 -203232 -192455 -279225
30054 -279225 -399046 -424165 -356482 -292154 -266321 -262121 -303469 -404980 -487897 -472008 -396858
30043 -396858 -339358 -285188 -208070 -190954 -308433 -453701 -458691 -348627 -299704 -361208 -399973
30032 -399973 -331630 -234950 -195506 -181493 -133022 -65849 -33193 -60831 -146517 -256129 -320728
30021 -320728 -314870 -320788 -417565 -527758 -497786 -327525 -184365 -169446 -206608 -203575 -186162
30010 -186162 -200921 -205349 -157677 -133366 -236168 -425673 -534876 -467668 -311213 -224379 -250991
29999 -250991 -287084 -237372 -155858 -170444 -281938 -333636 -223421 -57032 -6425 -79019 -131981
29988 -131981 -81901 8081 42304 -5825 -114979 -250561 -353726 -363502 -283951 -195844 -183851
29977 -183851 -263696 -370919 -413493 -366736 -319595 -368146 -460631 -450910 -335424 -296761 -425725
29966 -425725 -545084 -454254 -232317 -116942 -162345 -217448 -200576 -186316 -219041 -237293 -218252
29955 -218252 -230205 -296059 -344383 -334973 -308975 -289403 -255528 -231769 -271889 -341430 -350637 -313241
29943 -313241 -326825 -388113 -391620 -327807 -301138 -318459 -256448 -100520 -15943 -90023 -192848
29932 -192848 -204800 -199507 -265414 -314534 -232436 -86067 -17500 -36471 -71438 -125147 -219092
29921 -219092 -270737 -194594 -66822 -34937 -108734 -178680 -196251 -202082 -217409 -237663 -294399
29910 -294399 -397120 -453449 -375162 -227237 -144795 -140823 -131341 -113532 -162368 -261011 -293168
29899 -293168 -226498 -169147 -210222 -313798 -399372 -429475 -396275 -315961 -255014 -270792 -313253
29888 -313253 -280811 -183419 -142103 -206077 -286899 -314028 -338042 -413485 -483998 -473207 -410836
29877 -410836 -368509 -324201 -201091 -24040 69450 664 -142319 -215091 -196823 -206127 -338582
29866 -338582 -532928 -631691 -560778 -406537 -300794 -268517 -229061 -129088 -21884 -1892 -94919
29855 -94919 -235526 -335458 -353565 -308993 -253836 -241360 -296466 -387939 -437031 -390426 -291841
29844 -291841 -241072 -266291 -287932 -241520 -174466 -159810 -174045 -153757 -129098 -178995 -267246
29833 -267246 -260093 -132492 -27739 -58432 -160936 -216355 -216759 -228235 -267405 -301973 -319101
29822 -319101 -320309 -296212 -263249 -269337 -311532 -317262 -264833 -243240 -319319 -422431 -444701 -385230
29810 -385230 -308514 -232494 -155209 -123376 -165904 -218579 -224995 -251208 -375497 -519412 -533896
29799 -533896 -423487 -336797 -343580 -367457 -348177 -325185 -326574 -306599 -248171 -221293 -276227 -354853
29787 -354853 -363541 -280075 -153371 -48701 -16694 -61889 -118522 -105619 -23783 43733 30261
29776 30261 -57092 -170581 -256624 -265425 -188524 -88192 -38983 -50867 -98765 -192215 -335515
29765 -335515 -446721 -419125 -265558 -112977 -49587 -59093 -100272 -153137 -179290 -139204 -73865
29754 -73865 -80373 -180687 -293480 -352488 -368419 -357964 -303337 -209045 -117492 -49884 -12332
29743 -12332 -58781 -233829 -440187 -499840 -392019 -294234 -320658 -360641 -278661 -144436 -120602
29732 -120602 -209873 -273162 -255231 -235747 -261410 -273096 -232841 -203230 -237700 -274924 -221891
29721 -221891 -103739 -52508 -140022 -276762 -311774 -208899 -78741 -38103 -94621 -195034
29711 -195034 -319731 -458926 -542562 -498504 -376784 -313568 -348378 -372693 -303821 -220499 -251842
29700 -251842 -389057 -491155 -460277 -347061 -276934 -308611 -379348 -385700 -311602 -248323 -265236
29689 -265236 -304462 -266473 -167595 -118802 -153264 -181697 -144887 -107361 -147183 -238163 -305501
29678 -305501 -331635 -342343 -341024 -317008 -276683 -219965 -133975 -50614 -47069 -134831 -212810 -199125
29666 -199125 -150788 -172627 -257897 -313909 -314802 -325610 -375686 -402781 -349637 -248448 -173513 -151776
29654 -151776 -153282 -146793 -135029 -137500 -155443 -166153 -155024 -138675 -138939 -147920 -148500 -158151 -209781
29641 -209781 -289339 -337171 -319747 -262244 -206636 -176556 -180809 -205400 -208158 -174965 -168622 -250128
29629 -250128 -360818 -374441 -272742 -167773 -129395 -104250 -50751 -37270 -126534 -254801 -316352
29618 -316352 -300512 -263262 -227367 -195452 -203616 -269522 -327729 -301520 -209810 -134110 -114331 -139726
29606 -139726 -197469 -259719 -267366 -203355 -145718 -176587 -274765 -362193 -407436 -411485 -350380 -225457
29594 -225457 -122466 -118560 -166367 -171087 -145158 -170928 -237348 -247889 -194550 -190765 -292944 -399957
29582 -399957 -390590 -285026 -206728 -227044 -298716 -325727 -268813 -182269 -147565 -174866 -202526
29571 -202526 -203072 -230141 -319400 -404642 -399412 -314678 -223112 -150432 -81696 -33256 -27199 -27047 5897
29558 5897 20545 -56856 -183604 -238598 -195578 -152700 -183255 -254814 -305772 -310271 -260182 -173378
29546 -173378 -123015 -163989 -230369 -210895 -127991 -119831 -226521 -324832 -317146 -259155 -239348 -248892
29534 -248892 -248841 -264906 -325855 -386336 -395573 -375343 -353556 -293782 -178412 -91809 -113287 -175273
29522 -175273 -144162 -23394 35661 -65898 -256253 -397671 -432535 -391145 -318697 -248898 -217461
29511 -217461 -243313 -291923 -295207 -227571 -141863 -105670 -117151 -122299 -110416 -134546 -215479 -288258
29499 -288258 -293688 -268444 -275105 -288815 -244330 -168232 -157809 -226787 -275723 -238972 -168721 -139974
29487 -139974 -156975 -195107 -256186 -328023 -352227 -290099 -179445 -85980 -39076 -42627 -94606
29476 -94606 -160290 -179049 -136805 -86456 -68471 -67005 -73129 -121325 -216927 -293632 -299988 -270866
29464 -270866 -256794 -242766 -203038 -175528 -197286 -213061 -146031 -36858 -14335 -126005 -283072
29453 -283072 -387376 -436643 -476223 -512374 -520576 -502312 -483597 -466401 -421058 -337927 -261538
29442 -261538 -246204 -282629 -304050 -281089 -270263 -326021 -398209 -385945 -283096 -190012 -166733
29431 -166733 -156814 -96205 -24040 -21503 -88615 -152097 -175179 -198171 -267957 -365782 -416233 -361359
29419 -361359 -230580 -126385 -112973 -134631 -96791 -16803 -12411 -123869 -239554 -248108 -184168
29408 -184168 -153710 -180449 -209651 -216829 -220134 -207958 -143757 -42444 30843 45055 27441 -76
29396 -76 -47660 -105909 -125575 -85269 -45381 -89891 -217205 -324454 -323266 -253459 -238192 -317823
29384 -317823 -385948 -335455 -212593 -143763 -147142 -131174 -74840 -75935 -180466 -289475 -306863
29373 -306863 -271980 -257438 -233844 -148211 -60927 -76891 -182696 -270592 -295081 -292840 -273080
29362 -273080 -212092 -150504 -169573 -251745 -279504 -208017 -136393 -159065 -237058 -281140 -291025 -331645
29350 -331645 -408040 -442455 -378669 -261752 -197503 -245766 -358197 -420194 -358947 -208860 -66519
29339 -66519 6129 19168 9369 -15244 -78488 -190537 -305109 -342290 -280800 -209153 -230151
29328 -230151 -316891 -338697 -252232 -178790 -232209 -347814 -373040 -278335 -175403 -146668 -159359
29317 -159359 -156711 -144205 -152977 -179145 -196727 -197401 -191408 -186817 -182495 -176470 -180067 -215373 -276578
29304 -276578 -308708 -279390 -265856 -380012 -578269 -653378 -491809 -247810 -155595 -234523 -299647
29293 -299647 -222493 -57419 72575 98769 18520 -111925 -193701 -182617 -162285 -232683 -346954
29282 -346954 -364715 -252877 -117018 -39022 -8468 -19828 -101199 -216825 -269430 -243636 -233986
29271 -233986 -290446 -351908 -375632 -405808 -452409 -430192 -304783 -187980 -188547 -260906 -301422
29260 -301422 -306324 -321311 -312198 -220172 -103179 -88298 -188794 -278067 -256249 -156633 -71262
29249 -71262 -41675 -48293 -62207 -81619 -128394 -207358 -270242 -254610 -171552 -107542 -113683 -144829
29237 -144829 -141347 -111646 -88191 -66517 -52508 -108941 -267862 -436588 -485268 -411265 -329759
29226 -329759 -308239 -297912 -240276 -162165 -132881 -177778 -261273 -322265 -314345 -245359 -186639 -209323
29214 -209323 -300957 -373290 -359010 -273421 -177883 -116838 -103663 -136667 -200485 -260150 -276517
29203 -276517 -237492 -171027 -118896 -93040 -66240 -14348 46585 83356 88479 69405 10868 -106003
29191 -106003 -249643 -350885 -375182 -340424 -268862 -180540 -131739 -177594 -273309 -295444 -202598
29180 -202598 -96285 -70807 -86524 -67115 -43616 -95911 -202147 -265755 -273081 -305049 -382362
29169 -382362 -410781 -321161 -178434 -96618 -101971 -132324 -132964 -103433 -71262 -60831 -79134 -105275
29157 -105275 -104377 -74226 -63760 -114451 -189091 -197661 -110368 -12866 -11876 -99948 -164811 -143118
29145 -143118 -107482 -157966 -271787 -330015 -278838 -191280 -157001 -172951 -171940 -118522 -46018
29134 -46018 -15395 -48210 -94141 -86849 -50757 -99066 -268058 -414594 -382022 -224829 -132098
29123 -132098 -147511 -134407 -38092 11756 -59362 -115979 -33860 76787 39472 -111502 -209138
29112 -209138 -226821 -269591 -334939 -296145 -136438 -8364 -12712 -75753 -101069 -101535 -114217 -113031
29100 -113031 -90624 -123403 -260693 -419984 -476828 -407899 -276992 -132616 3169 82043
29090 82043 53190 -56296 -143113 -131242 -51084 -937 -36163 -111238 -144892 -128175 -124752 -161407
29078 -161407 -187041 -175374 -189339 -270241 -333251 -278975 -163100 -133093 -215772 -291504 -277466
29067 -277466 -213153 -152876 -96897 -53489 -50640 -58427 -21337 4990 -106471 -325753 -434976
29056 -434976 -319923 -147136 -123333 -205656 -212301 -125643 -92432 -161050 -213162 -175964 -134612
29045 -134612 -175223 -247257 -263581 -245914 -277244 -355580 -382117 -292809 -145112 -55125 -72194
29034 -72194 -136542 -159122 -120900 -71794 -50211 -52921 -87091 -184849 -327069 -409343 -347660 -190326
29022 -190326 -68690 -57777 -135955 -251632 -357740 -392931 -311552 -156577 -49092 -74786
29012 -74786 -201566 -313230 -305369 -167981 -10878 20269 -89051 -168839 -65497 123575
29002 123575 148973 -22077 -87307 216399 717803 962294 739992 297594 -7235 -94984
28992 -94984 -110948 -129021 -91535 1927 37059 -38658 -121431 -109676 -55087 -63121 -117313 -112934
28980 -112934 -30324 33486 4781 -84239 -166323 -219773 -255865 -281222 -296279 -294511 -255615 -177330
28968 -177330 -111777 -122162 -202550 -289731 -351486 -403384 -437721 -409885 -316981 -224772 -187730
28957 -187730 -197672 -233968 -300985 -384490 -435565 -439463 -441077 -456126 -418696 -280973 -118164 -58456
28945 -58456 -126200 -216890 -225048 -153289 -92954 -121000 -213441 -257072 -170159 -11620 71249 8808
28933 8808 -129735 -245728 -304460 -293860 -183823 4634 157581 175497 83060 -26851 -107288
28922 -107288 -152199 -140522 -75368 -34741 -85869 -173732 -184464 -100834 -10094 23076 4719
28911 4719 -47050 -113863 -141964 -93751 -33803 -69957 -207241 -350812 -445401 -501996 -489611
28900 -489611 -341660 -109378 26084 -30833 -166687 -225696 -201902 -179918 -178611 -165810 -162301
28889 -162301 -208613 -260552 -230898 -124856 -36109 -9058 5491 48430 87133 73275 4535
28878 4535 -89361 -173371 -213717 -209275 -216742 -282924 -348655 -296368 -116475 50422 81042 12285
28866 12285 -39890 -44482 -59591 -108685 -143800 -132936 -108263 -108952 -133719 -169938 -217115 -256005
28854 -256005 -243375 -172137 -98024 -71299 -76857 -78036 -80923 -106188 -131183 -123489 -112887 -160499
28842 -160499 -259352 -333485 -344212 -331944 -335972 -336986 -305126 -244763 -161912 -51412 43273 27902
28830 27902 -117776 -267038 -281470 -190208 -149200 -231369 -341862 -355477 -264800 -158466 -103197
28819 -103197 -89455 -73253 -40832 -28902 -80830 -181821 -259571 -267657 -239896 -228775 -221376 -170440
28807 -170440 -88654 -43933 -59860 -86421 -84672 -81171 -113161 -169110 -212673 -225915 -203533 -144244
28795 -144244 -76685 -55730 -98296 -153222 -169491 -166540 -197754 -265686 -317797 -317382 -276438 -217926
28783 -217926 -148384 -85358 -76230 -148960 -249551 -271907 -177362 -59764 -47948 -148859 -241466
28772 -241466 -240729 -202518 -216924 -255215 -210338 -71583 35605 6688 -115527 -206204 -200693
28761 -200693 -138436 -102951 -147571 -251898 -332175 -323463 -260778 -239613 -289140 -339292 -330069 -286247
28749 -286247 -247771 -197869 -124651 -95726 -181969 -330364 -399402 -323819 -175391 -54746 7213
28738 7213 20695 -20997 -121582 -238338 -305218 -291679 -215247 -109960 -8969 49980 34762
28727 34762 -50008 -153225 -214605 -216140 -190533 -174359 -162173 -123313 -64045 -49988 -145780 -333747
28715 -333747 -505680 -545242 -427533 -244954 -129996 -140374 -220073 -277320 -283290 -272711 -268306
28704 -268306 -252402 -215331 -182100 -171935 -173454 -182445 -218986 -273605 -282684 -209082 -113658 -86417
28692 -86417 -128156 -166259 -175862 -207176 -280703 -334097 -315215 -269627 -278258 -340699 -379279 -348643
28680 -348643 -290022 -270245 -303891 -349720 -361118 -324472 -256931 -178065 -90277 3987 68081
28669 68081 40414 -101149 -299385 -466031 -558966 -587967 -563283 -484035 -377446 -300963 -285624
28658 -285624 -309895 -343704 -381666 -416477 -425305 -412323 -418022 -444188 -418083 -293526 -148296
28647 -148296 -100552 -150139 -192893 -185731 -192694 -244641 -261262 -174721 -50088 -4882 -58349 -130813
28635 -130813 -156415 -133466 -92870 -73927 -105234 -161235 -170533 -112957 -62582 -79223 -113451 -95861
$$ [...]
##END NTUPLES=NMR SPECTRUM
##END=
