##TITLE=31Pdec_LY-TMF-2.70.3
 D2O, 24 sc
 27.2.2020
##JCAMPDX= 6.0         $$ Bruker NMR JCAMP-DX V2.0
##DATA TYPE= NMR SPECTRUM
##DATA CLASS= NTUPLES
##ORIGIN= UXNMR, Bruker Analytische Messtechnik GmbH
##OWNER= root
$$ XWIN-NMR		Version 3.5
$$ Thu Feb 27 15:50:25 2020 Russian Standard Time (UT+4h)  she@DPX200
##.OBSERVE FREQUENCY= 81.013821
##.OBSERVE NUCLEUS= ^31P
##.ACQUISITION MODE= SIMULTANEOUS
##.ACQUISITION SCHEME= undefined
##.AVERAGES= 24
##.DIGITISER RES= 17
##SPECTROMETER/DATA SYSTEM= spect
##.PULSE SEQUENCE= zgpg30
##.SOLVENT NAME= CDCl3
##.SHIFT REFERENCE= (INTERNAL, CDCl3, 0, 182.463)
##AUDIT TRAIL= $$ (NUMBER, WHEN, WHO, WHERE, WHAT)
$$ ##TITLE= Audit trail, XWIN-NMR		Version 3.5
$$ ##JCAMPDX= 5.01
$$ ##ORIGIN= Bruker BioSpin GmbH
$$ ##OWNER= she
$$ F:/spectra/data/she/nmr/P31/1/pdata/1/auditp.txt
$$ ##AUDIT TRAIL=  $$ (NUMBER, WHEN, WHO, WHERE, WHAT)
(   1,<2020-02-27 15:49:15.28 +0400>,<she>,<DPX200>,
      <created by zg, POWCHK disabled, PULCHK disabled
       configuration hash MD5:
       00 E9 B6 7A A2 85 ED C7 34 08 36 98 17 FE 4E 26
       data hash MD5: 32K
       49 62 B1 69 1A 53 8F 64 A4 CC A9 BB 60 0E C2 BD>)
(   2,<2020-02-27 15:49:23.65 +0400>,<she>,<DPX200>,
      <Start of raw data processing
       efp BC_mod = 2 LB = 1 FT_mod = 6 PKNL = 1 PHC0 = -1662.718 PHC1 = 770.6014 SI = 64K 
       data hash MD5: 64K
       6B 88 10 17 8B 22 F6 04 39 8D 8F F4 5F 99 14 67>)
(   3,<2020-02-27 15:49:45.57 +0400>,<she>,<DPX200>,
      <pk PHC0 = -4.674254 PHC1 = 9.2 
       data hash MD5: 64K
       75 BA 5F 60 27 D7 96 1D F3 3D 4F 80 56 96 39 E8>)
(   4,<2020-02-27 15:49:48.70 +0400>,<she>,<DPX200>,
      <abs ABSG = 5 
       data hash MD5: 64K
       EC 60 14 75 E3 35 4A 75 C9 2C D3 96 3D 16 49 0F>)
$$ ##END=
$$ 
$$ hash MD5
$$ EB A9 EA 41 1A C0 F2 F2 B3 91 7E 4E 5D 73 4A 20
##$RELAX= 
##$RELAX= 
##$RELAX= 
##$RELAX= 
##$RELAX= 
##$RELAX= 
##$RELAX= 
##$RELAX= 
$$ Bruker specific parameters
$$ --------------------------
##$DU= <F:/spectra>
##$EXPNO= 1
##$NAME= <P31>
##$PROCNO= 1
##$TYPE= <nmr>
##$USER= <she>
##$AMP= (0..31)
100 100 100 100 100 100 100 100 100 100 100 100 100 100 100 100 100 100 
100 100 100 100 100 100 100 100 100 100 100 100 100 100 
##$AQSEQ= 0
##$AQ_mod= 1
##$AUNM= <au_zg>
##$AUTOPOS= <>
##$BF1= 81.014009
##$BF2= 200.13
##$BF3= 200.13
##$BF4= 200.13
##$BF5= 200.13
##$BF6= 200.13
##$BF7= 200.13
##$BF8= 200.13
##$BYTORDA= 1
##$CFDGTYP= 0
##$CFRGTYP= 5
##$CHEMSTR= <none>
##$CNST= (0..31)
1 1 145 1 1 1 1 1 1 1 1 1 1 1 1 1 1 1 1 1 1 1 1 1 1 1 1 1 1 1 1 1 
##$CPDPRG= <waltz16>
##$CPDPRG1= <>
##$CPDPRG2= <waltz16>
##$CPDPRG3= <>
##$CPDPRG4= <mlev>
##$CPDPRG5= <mlev>
##$CPDPRG6= <mlev>
##$CPDPRG7= <mlev>
##$CPDPRG8= <mlev>
##$CPDPRGB= <>
##$CPDPRGT= <>
##$D= (0..31)
0 1 0 0 0 0 0 0 0 0 0 0.03 2e-05 3e-06 0 0 0 0 0 0 0 0 0 0 0 0 0 0 0 0 
0 0 
##$DATE= 1582804154
##$DBL= (0..7)
120 120 120 11 120 120 24 19 
##$DBP= (0..7)
150 150 150 150 150 150 150 150 
##$DBP07= 0
##$DBPNAM0= <>
##$DBPNAM1= <>
##$DBPNAM2= <>
$$ [...]
##$SUBNAM3= <"">
##$SUBNAM4= <"">
##$SUBNAM5= <"">
##$SUBNAM6= <"">
##$SUBNAM7= <"">
##$SUBNAM8= <"">
##$SUBNAM9= <"">
##$SW= 369.568048894756
##$SWIBOX= (0..15)
0 1 3 0 0 0 0 0 0 0 0 0 0 0 0 0 
##$SW_h= 29940.119760479
##$TD= 32768
##$TD0= 1
##$TE= 0
##$TE2= 300
##$TE3= 300
##$TEG= 300
##$TL= (0..7)
0 120 53 12 22 120 120 120 
##$TP= (0..7)
150 150 150 150 150 150 150 150 
##$TP07= 0
##$TPNAME0= <>
##$TPNAME1= <>
##$TPNAME2= <>
##$TPNAME3= <>
##$TPNAME4= <>
##$TPNAME5= <>
##$TPNAME6= <>
##$TPNAME7= <>
##$TPOAL= (0..7)
0.5 0.5 0.5 0.5 0.5 0.5 0.5 0.5 
##$TPOFFS= (0..7)
0 0 0 0 0 0 0 0 
##$TUNHIN= 0
##$TUNHOUT= 0
##$TUNXOUT= 0
##$USERA1= <user>
##$USERA2= <user>
##$USERA3= <user>
##$USERA4= <user>
##$USERA5= <user>
##$V9= 5
##$VALIST= <valist>
##$VCLIST= <CCCCCCCCCCCCCCC>
##$VD= 0
##$VDLIST= <DDDDDDDDDDDDDDD>
##$VPLIST= <PPPPPPPPPPPPPPP>
##$VTLIST= <TTTTTTTTTTTTTTT>
##$WBST= 1024
##$WBSW= 4
##$XGAIN= (0..3)
0 0 0 0 
##$XL= 0
##$YL= 0
##$YMAX_a= 10445
##$YMIN_a= -9723
##$ZGOPTNS= <>
##$ZL1= 120
##$ZL2= 120
##$ZL3= 120
##$ZL4= 120
##$ABSF1= 182.463
##$ABSF2= -187.1042
##$ABSG= 5
##$ABSL= 3
##$ALPHA= 0
##$AQORDER= 0
##$ASSFAC= 0
##$ASSFACI= 0
##$ASSFACX= 0
##$ASSWID= 0
##$AUNMP= <proc_1d>
##$AZFE= 0.1
##$AZFW= 0.5
##$BCFW= 0
##$BC_mod= 2
##$BYTORDP= 0
##$COROFFS= 0
##$CY= -3
##$DATMOD= 1
##$DC= 0
##$DFILT= <>
##$DTYPP= 0
##$F1P= 0
##$F2P= 0
##$FCOR= 1
##$FTSIZE= 65536
##$FT_mod= 6
##$GAMMA= 0
##$GB= 0
##$INTBC= 1
##$INTSCL= 5.30512e-09
##$ISEN= 30
##$LB= 1
##$LEV0= 0
##$LPBIN= 0
##$MAXI= 10000
##$MC2= 0
##$MEAN= 0
##$ME_mod= 0
##$MI= 50
##$NCOEF= 0
##$NC_proc= -4
##$NLEV= 6
##$NOISF1= 182.463
##$NOISF2= 159.3651
##$NSP= 0
##$NTH_PI= 0
##$NZP= 0
##$OFFSET= 182.463
##$PC= 4
##$PHC0= -1667.392
##$PHC1= 779.8014
##$PH_mod= 1
##$PKNL= yes
##$PPARMOD= 0
##$PSCAL= 0
##$PSIGN= 0
##$REVERSE= no
##$SF= 81.0140089999434
##$SI= 65536
##$SIGF1= 159.3651
##$SIGF2= -187.1042
##$SINO= 113.3802
##$SIOLD= 16384
##$SREGLST= <1H.CDCl3>
##$SSB= 0
##$STSI= 65536
##$STSR= 0
##$SW_p= 29940.119760479
##$SYMM= 0
##$S_DEV= 0
##$TDeff= 32768
##$TDoff= 0
##$TI= <>
##$TILT= no
##$TM1= 0
##$TM2= 0
##$TOPLEV= 0
##$USERP1= <user>
##$USERP2= <user>
##$USERP3= <user>
##$USERP4= <user>
##$USERP5= <user>
##$WDW= 1
##$XDIM= 65536
##$YMAX_p= 271367523
##$YMIN_p= -6021052
$$ End of Bruker specific parameters
$$ ---------------------------------
##NTUPLES= NMR SPECTRUM
##VAR_NAME=  FREQUENCY,     SPECTRUM/REAL,   SPECTRUM/IMAG
##SYMBOL=    X,             R,               I
##VAR_TYPE=  INDEPENDENT,   DEPENDENT,       DEPENDENT
##VAR_FORM=  AFFN,          ASDF,            ASDF
##VAR_DIM=   65536,         65536,           65536
##UNITS=     HZ,            ARBITRARY UNITS, ARBITRARY UNITS
##FACTOR=    0.456856943014862, 1,           1
##FIRST=     14782.0589164792, 0,            0
##LAST=      -15158.0608439998, 0,           0
##MIN=       -15158.0608439998, -6021052,    0
##MAX=       14782.0589164792, 271367523,    0
$$ Real data points
##PAGE= N=1
##DATA TABLE= (X++(R..R)), XYDATA
$$ [...]
##PAGE= N=2
##DATA TABLE= (X++(I..I)), XYDATA
36862D77233j68984k62295M3999L13238K33231j4865j13901k9672O5372O3492
36852F06848j5541q8584o4871M6934Q9684m2308j99432j64082J0348Q6726L3671
36841B99393M2511J47607J45131k9765j47892n1530Q3626L3705j33035k01878
36831A87873j41206p6641m1334L4745J30192J21592j8532j62011k01652j68211
36821c35185j12972J1777K32786L86231K61513n3214j86109J4497J99503L041
36811D21868l61496l82557o2293N8727k02672l01859J77643P67424P19713P5744
36801I10242m29549l89718j03811M1342L6863Q046m4160r3250k0272J42950J75433
36790B34116L289j66117j55688l9388M3350P8960R6675R0318R3765J54334J96128
$$ y = [477233, 308249, 45954, 89953, 403191, 636422, 621557, 507656, 477984, 543356, 606848, 591307, 502723, 437852, 484786, 574470, 532162, 332730, 168648, 178996, 265722, 299393, 341904, 489511, 634642, 604877, 456985, 405455, 489081, 522786, 389751, 187873, 46667, -29974, -71308, -36563, 93629, 215221, 196689, 34678, -166974, -335185, -448157, -436380, -203594, 182637, 444150, 390936, 204827, 219324, 418827, 421868, 60372, -322185, -384478, -325751, -528423, -830282, -652639, 114785, 834498, 910242, 480693, 90975, -12836, 28506, 65369, 73415, 29255, -63995, -84267, 58683, 234116, 237405, 71288, -84400, -123788, -80438, -1478, 95197, 185515, 279280, 433614, 629742]
36779F29742J00440p1493j48399j23505j12537p5816J06981L01088K17978j14599
36769G09880l56886l83738m01910m61240l12377P6342L23947K13354L9477Q9405
36759d63746J85395R0659k2811P4437J93824O6247j30234p2417J13318Q4390p0304
36748D8758J3210K64404K24502j70009m16394j91063K17265L95431L11738J41517
36738H39359m1817j82968j62732j5114L3217q3822j47428m7231J0343r9584j37933
36727c5710Q5992L07072J77952j63447l03371j82212q4812q4931K7171K41740
36717a4556K40497m0669k01065K0542K99019K06799j40440k99338j60824J0133
36707g9902P6879J43783K03455J10959m0141M8708L40764L81904j9582m23368
$$ y = [629742, 730182, 658689, 510290, 386785, 274248, 198432, 305413, 606501, 824479, 709880, 352994, -30744, -432654, -893894, -1206271, -1129929, -805982, -592628, -553151, -463746, -278351, -187692, -210503, -136066, 57758, 124005, -6229, -78646, 34672, 119062, 48758, 61968, 326372, 550874, 380865, -35529, -226592, -9327, 386104, 697842, 839359, 797542, 614574, 451842, 436728, 469945, 386123, 238695, 191464, 201807, 102223, -35710, 50282, 357354, 535306, 371859, 68488, -113724, -198536, -283467, -256296, -14556, 225941, 185272, -15793, 4749, 303768, 510567, 370127, 70789, -90035, -79902, -3023, 140760, 344215, 455174, 415033, 463741, 804505, 1186409, 1166827, 743459]
36697G43459l77259o9256K8865r8899j01006O4239N6427k26857m18138k06535
36687f04960K35329N06497M32268J53858n4644l521K08944K23882j33529n02401
36677D61723m01859L6250J81249j68847m49842j62659L77725M95275P2629l84933
36667E6711m52298j82865J28813K66874J80726j2790r8559K1333K13261L12200
36657D33406L26175L13318K07536l8591k62680k69131j17161k3857m9540q5205
36647D34270q7598j05606j10154j9648J06153R7137p8067k55193k89448j92364
36637e00518m3937R5531J60592R1508p3347j84729j15264J02494K81850K50146
36627F4326M2646j15650q7069L512L234K2543K30911M35854K52333k46253m70521
$$ y = [743459, 366200, 296944, 325809, 226910, 125904, 190143, 246570, 19713, -398425, -604960, -369631, 136866, 569134, 722992, 668348, 664827, 873771, 1097653, 964124, 461723, 59864, 96114, 277363, 108516, -341326, -503985, -126260, 369015, 441644, 56711, -395587, -578452, -449639, -182765, -2039, -14829, -113388, -92055, 121206, 433406, 759581, 1072899, 1280435, 1241844, 979164, 710033, 592872, 569015, 519475, 434270, 346672, 241066, 130912, 111264, 217417, 314554, 236487, -18706, -308154, -500518, -544455, -448924, -288332, -196824, -270171, -454900, -570164, -467670, -185820, 64326, 106972, -8678, -95747, -92235, -89001, -66458, 164453, 600307, 852640, 606387, 135866]
36616A35866j15040L63365L69492l9790l48779l22468j49096k769J14793J50258
36606A55832k299k49194l27567j28969J92308M11570L83027R2474k62854l68998
36596a04670j56683P9810J07604P6591J72283K25717L5751j68593n1319K20402
36586D36893K03996q0735j90243j7693N1901j62332l24542j59104J13958J68801
36576D0900N0767J6272J47302L24426M00303K86091L4298j38939j14293r4600
36566I52527k82824m35836j67514L43343M74970P2661l05566k34688J4166L2087
36556D63326r1593n9901Q8702J24638M2335j8667m5943n6421M6334K47048K89242
36545A029100M3964k25787k40486j08426p9105j34360j27345j05608j73496k16969
$$ y = [135866, 20826, 384191, 753683, 713893, 365114, 42646, -106450, -109219, 5574, 155832, 153533, -95661, -423228, -552197, -359889, 51681, 434708, 527182, 264328, -104670, -261353, -181543, -73939, 2652, 174935, 400652, 436403, 267810, 216491, 436893, 640889, 560154, 369911, 352218, 404119, 241787, -82755, -241859, -127901, 40900, 91667, 107939, 255241, 579667, 979970, 1266061, 1300359, 1161420, 1047127, 952527, 669703, 233867, 66353, 409696, 884666, 957327, 651761, 417073, 431239, 463326, 371733, 311832, 400534, 525172, 567507, 548840, 502897, 446476, 492810, 739858, 1029100, 1073064, 847277, 606791, 498365, 419260, 284900, 157555, 51947, -121549, -338518]
36535c38518p9305J39316K33148J88695R3280n6664k06480j36276J99346M48288
36525D84830L04246l1384j64750p8716k3948m2216m643L6098m5249j14206J7647
36514C37709J65054K101l49756m41042j80728P1629J19979J50163K51168K09756
36504C36033l4116j61811L5213K78489J98094j34864l40815k36160K6585K17626
36494A84274K39837J41585N2801P0518J42683J22521l1540j91431k16919r3060
36484D21269R7326K47397K71055J63401J7510p7659j17015j14642o7382n2181
36474G89079j90231l88275l33268L9699L04971R6004k92217k73910J49996L67748
36464B69596M6998m17476m98694j87779J63258L35888L37286K20028M9828o5964
$$ y = [-338518, -417823, -278507, -45359, 143336, 236616, 179952, -26528, -162804, 36542, 484830, 789076, 757692, 592942, 514226, 490278, 448062, 443419, 479517, 434268, 320062, 337709, 502763, 504864, 155108, -285934, -466662, -395033, -275054, -124891, 126277, 336033, 301917, 140106, 175319, 453808, 651902, 517038, 176223, -59937, -33352, 184274, 424111, 565696, 618497, 689015, 831698, 954219, 922679, 731248, 514329, 421269, 518595, 765992, 1037047, 1200448, 1217958, 1140299, 1023284, 908642, 841260, 789079, 598848, 210573, -122695, -82996, 221975, 317979, 25762, -248148, -98152, 269596, 316594, -100882, -599576, -787355, -624097, -288209, 49077, 269105, 318933, 252969]
36454B52969p6095k7195M8504J50460J96354R2133n2611j4298J88156K81748J49420
36443A189545k8438j21185k09925k76126j01565K91205M54364R7857m26467n90038
36433B79227m01896k45663j91509K9521M18567N94186L87439J11666N2137N8301
36423A091976j00967k80753j93872Q2917J96206M7867r8271p1871m2966j81227
36413D49039l26736k29442L0649J28457l2129j77060n7402K08702L10886J41545
36403D46509j21577k70642k77279k40709k09101j06343J44476M37675N15880K74440
36393E93329l9776r5860Q1729J41755r7335l91565l96612o6700L58433N84378
36383F71776M07476j34516o35721o05895o6284L85490L23641L9902M6212K91736
$$ y = [252969, 176874, 149679, 198183, 348643, 544997, 637130, 584519, 570221, 758377, 1040125, 1189545, 1161107, 1039922, 829997, 553871, 452306, 743511, 1197875, 1295732, 869265, 279227, -122669, -368332, -559841, -530320, -111753, 482433, 869872, 981538, 1033675, 1091976, 991009, 710256, 516384, 599301, 795507, 843374, 745103, 673232, 630266, 449039, 122303, -107139, -76490, 51967, 19838, -157222, -214624, -5922, 304964, 446509, 324932, 54290, -222989, -463698, -672799, -779142, -634666, -196991, 318889, 593329, 553553, 457693, 539422, 681177, 583842, 192277, -204335, -271035, 87398, 671776, 1079252, 944736, 309015, -296880, -363164, 22326, 345967, 385869, 432081, 723817]
36373G23817K94529q2362m34426l98257o4590K40283L00575J02392j77157k56252
36363B48552l5551K24302K13764j5423j82054j96216j56295n7534J32766K15474
36353C91785k897k74007j71209K20096L69329J11437j23045k2652J63917J17409
36343G80163p3794j90616k49288l10885k62433o5097P3308K5066m0019J2595M0890
36332b60110m4878m4487J52806K68396N2356k64919k94959n0789J66274K58614
36322f1696L52997M51920M06175J90357m9204j86899j92280r7644j9346p7441
36312G16939j87548j23247J09609K16036O6349r2550o5436k0730j26467k00701
36302B92254l7648K00451K50205J58870J06439O1207n8451j24962m3655l991j41185
$$ y = [723817, 1018346, 935984, 501558, 103301, 38711, 278994, 579569, 681961, 504804, 248552, 213001, 437303, 651067, 635644, 453590, 257374, 101079, 43545, 176311, 391785, 388888, 114881, -56328, 163768, 533097, 644534, 521489, 498837, 662754, 780163, 706369, 515753, 266465, -44420, -306853, -371950, -298642, -273576, -313595, -301000, -260110, -304988, -349475, -196669, 71727, 124083, -140836, -435795, -486584, -320310, -61696, 291301, 743221, 1149396, 1339753, 1290549, 1103650, 911370, 813726, 794380, 716939, 529391, 406144, 515753, 731789, 798138, 705588, 640152, 619422, 492955, 292254, 254606, 455057, 705262, 864132, 970571, 1031778, 973327, 848365, 804710, 800719, 659534]
36291F59534k20694m7922R7097j04532l99273l10222R2207L16186K23645J31041
36281D37067J89385J89900M943k25298l67061l82624j94132J66999L68986J48068
36271C36233k36957l43683j99240j37618j50053K6404K92106K99058J27207J71459
36261A84916L59486K09997k53847m13673o2246K50390J46547l6725J1978J1505
36251D08328k72396m64542k12130J52196J57080m7448o3224K2691r3596k49988
36241f63029o9181L04293L61872L8508k17892j62333j8852m274m2592k2405L2260
36230d63625J10510K26289K55963O0921k06748k12551R9442M02233L92139J02749
36220G67322k03547k81173n4917K91898M12742J61471j82816k37242J749K04799
$$ y = [659534, 438840, 390918, 488015, 383483, -15790, -326012, -233805, 82381, 306026, 437067, 626452, 816352, 821295, 595997, 228936, -153688, -347820, -180821, 188165, 336233, 99276, -244407, -443647, -581265, -731318, -704914, -412808, -113750, 13457, 184916, 544402, 754399, 500552, 86879, 24633, 275023, 421570, 384845, 396823, 408328, 135932, -328610, -540740, -388544, -231464, -278912, -342136, -319445, -413041, -663029, -732210, -427917, -66045, -27537, -245429, -407762, -426614, -430888, -473480, -495885, -463625, -353115, -126826, 129137, 190058, -16690, -229241, -129799, 272434, 664573, 767322, 563775, 282602, 227685, 519583, 932325, 1093796, 910980, 673738, 675487, 880286]
36210H80286J72976M860j70026l44825m71090l90206n7694L09598M31046K43629
36200F08554p3286k98463l46606k76322j66312k1067J73651L46322L79160K45937
36190E71568L0889j65392k52595j57843M5466J04594j03745l18472k25438L9900
36180d31068Q7993p4320n7365K01962K82760J1257j92618K53K96561L11265J69848
36169F06528J40294R4658j46209l13380j20534J24743k0222l18474k02696K22207
36159F6915K89385j32226m04632j16712L57721N13452L53646J34595l2300q0887
36149I48957O2454K06496N09m67516o23238k17550K53976K65176o840m2973K40169
36138F19620M76416M01343P0490l05665m66944k35085J98369L33627j3436l90519
$$ y = [880286, 1053262, 1058122, 888096, 543271, 72181, -318025, -375719, -66121, 364925, 608554, 535268, 236805, -109801, -386123, -552435, -573502, -399851, -53529, 325631, 571568, 602457, 437065, 184470, 26627, 72093, 176687, 72942, -245530, -470968, -431068, -343075, -417395, -474760, -272798, 9962, 21219, -171399, -171146, 125415, 436680, 606528, 746822, 841480, 695271, 381891, 261357, 386100, 365878, 47404, -155292, 66915, 356300, 224074, -180558, -297270, 60451, 573903, 927549, 1062144, 1029844, 948957, 1011411, 1217907, 1218416, 750900, 127662, -89888, 164088, 429264, 422424, 379451, 619620, 1096036, 1497379, 1567869, 1262204, 795260, 560175, 758544, 1092171, 1078735, 688216]
36128F88216l27734j7340L5793j69626j80838J12893K75818K5535l18250l09653
36118a85186J6261K66633K20549k254j84449k15546j09518K2806N0818j2639J6201
36107a16324K25512L87925K13818j88039l67108j46288R5631j4536k46396j11973
36097b67778L20892M57777P2482l38610l09929l9222P2276Q5098K60355M59807
36087G73148L52740J9766j89563k44251l22275k75072J35422N48230L22369l83009
36077G37505o51139j59143L11500R9774l65746l77652n7887N3155J876K08282
36067a99475N58054N21537O1075l06839l31519k59123k28213o9872J85606J94105
36057A25336j08565k87484l3421L68136M42421J24607k60503m12814k82631l2986
$$ y = [688216, 360482, 343142, 378935, 209309, 28471, 141364, 417182, 442717, 124467, -185186, -168925, 97708, 318257, 316003, 131554, -83992, -193510, -170704, -119886, -132525, -116324, 109188, 497113, 710931, 522892, 155784, 9496, 105127, 90591, -155805, -267778, 53114, 510891, 583373, 244763, -65166, -104388, -32112, 52986, 313341, 773148, 1125888, 1145654, 956091, 711840, 389565, 114493, 249915, 798145, 1120514, 737505, 86366, -72777, 238723, 338497, -27249, -404901, -462788, -409633, -407757, -199475, 358579, 880116, 941191, 634352, 302833, 43710, -184503, -254375, -68769, 125336, 16771, -270713, -304134, 64002, 506423, 631030, 370527, -42287, -324918, -357904]
36047c57904J12946R0162O7390J83760K94033J87025l8540j01348K5430J21438
36037E84392J19194J49976K02692J03764j29045k59479k01986r4528n00J00473
36027E74953M9721l06082o48858m48076J89757M97300J09835l93479l45474J12843
36017f07560M04898L50676J52414r4879l68935m59311k35332K6917L6917p072
36007h01267K15524M97065L81169l9959k10166K5883K22962P8426j53187j42783
35997G3667N5415K04572J93331Q901k76175m01379j47636K50977L06832j0217
35987B58288j86226N3287L22646J98731j46822k83382j63658m8699k5952J7654
35977d133R4450J27796J54949K26417K13850j13k43921k49986m3029J25729J45152
$$ y = [-357904, -244958, -154796, -87406, 96354, 390387, 577412, 538872, 437524, 462954, 584392, 703586, 853562, 1056254, 1160018, 1030973, 771494, 569508, 474980, 474480, 574953, 624674, 318592, -330266, -778342, -588585, -91285, 18550, -374929, -720403, -607560, -202662, 148014, 300428, 205549, -163386, -622697, -858029, -831112, -794195, -801267, -585743, -88678, 292491, 252532, 42366, 68249, 291211, 369637, 216450, 73667, 129082, 333654, 526985, 535886, 259711, -141668, -289304, -38327, 268505, 258288, 72062, 125349, 447995, 646726, 499904, 216522, 52864, 4165, -21787, -4133, 90317, 218113, 373062, 599479, 813329, 813216, 569295, 319309, 276280, 402009, 547161]
35966E47161Q2453m5958k41960l36669j64287R7305J01057j20559j29455K72711
35956F1799O79230N73771K330m81900m74684j30516J02989L1632j15963o8241
35946A80447Q3287M0789j89328k47759Q905K26705J06697p0800J02154M02986
35936F44083K39517l64275o61836k46252L35132L74312k5886k32648m7265J38102
35926A52984M9186j11294r2458J6455J3644o2504l4694R1662J25878o016j24513
35915A8330l1160K08633L30122K08981J2184n3387j7434l0913p3662L032J65918
35904G40644J86325J834j45362n8243J26603J62251M0913o6326r9603j38205j97647
35893E53184j82128m0514J40559K01318L4386k86481m83235l15413J00679L80144
$$ y = [547161, 629614, 583656, 341696, 5027, -159260, -61955, 39102, -81457, -210912, 61799, 741029, 1314800, 1317130, 835230, 360546, 230030, 333019, 364651, 248688, 180447, 263734, 304523, 115195, -132564, -123659, 103046, 209743, 138943, 241097, 644083, 883600, 519325, -142511, -388763, -53631, 320681, 294795, 62147, 14882, 152984, 202170, 90876, -1582, 14873, 28517, -33987, -68681, 22981, 148859, 142843, 18330, -12830, 195803, 525925, 734906, 747090, 693703, 676269, 645356, 571694, 574726, 740644, 926969, 928803, 783441, 725198, 851801, 1014052, 1054965, 988639, 889036, 750831, 553184, 371056, 330542, 471101, 672419, 706805, 420324, -62911, -378324, -277645, 102499]
35883A02499L50283K29153K04703J15283j95688m56277k86649J71632L69580J10675
35873G15194j97190j65685M4982L7832k24093m06035k83995N664K02277K27899
35863d3150J87156J62283J28934P9990J10314K65869L77683K31027r1453k51704
35853A156949j22905J4955r3473k72307j92084R8580K25421K5510k47157k76316
35843C17173l7874K27219K52633k1551l38646l28985M1238L63892L11076O8768
35833H54943j9939k0520k00943m17335k46048K66555N40627K95649n2855o1514
35823I38620J22187J17997p8976k10385k12790k07711k11468j68943j41350j88420
35813b41239j87809k2022J74537J98660J02769J00582K31514L31321K68889M2565
$$ y = [102499, 452782, 681935, 886638, 1001921, 806233, 349956, 63307, 234939, 604519, 715194, 518004, 352319, 397301, 435133, 211040, -194995, -478990, -473326, -271049, -43150, 144006, 306289, 435223, 515213, 625527, 891396, 1269079, 1500106, 1408653, 1156949, 1034044, 1048999, 955526, 683219, 491135, 589715, 815136, 840646, 593489, 317173, 279299, 506518, 759151, 737600, 398954, 69969, 111207, 475099, 786175, 854943, 835004, 814484, 613541, 196206, -49842, 216713, 757340, 1052989, 1000134, 938620, 1060807, 1178804, 1099828, 889443, 676653, 468942, 257474, 88531, -52819, -241239, -429048, -451070, -276533, -77873, 24896, 125478, 356992, 688313, 957202, 999767]
35803I99767k63273m61128l39887M3095K87983J00471k94715m25310j69666J62419
35793c60244K87909K30367J36944M6540p8885k13059k34623m3679K65073L99291
35783D35634J90874j05637q4128K14808L06579j3638l29833k36765N8791J38425
35773E75110N6771J48591L60149L09444n0013l27651k85807r6403M5253J55038
35763H90482K20834J09977j50150l11638k51865j14619k4357N7807J14636J8165
35753E59272j88163k47358p2508R5020O1434l9784j0119J06648J64483J64850
35743E93775J78491J72433Q4086n0110j61883k28764k08329n4186J25761J18330
35733E69604q3467k11226q8642J16944J51230J0188j29308j61932q3339R4090
$$ y = [999767, 736494, 275366, -64521, -21426, 266557, 367028, 72313, -352997, -522663, -360244, -72335, 158032, 294976, 341516, 262631, 49572, -185051, -228730, 36343, 435634, 626508, 520871, 436743, 651551, 958130, 944492, 614659, 377894, 436685, 575110, 631881, 780472, 1140621, 1450065, 1400052, 1072401, 786594, 690191, 735444, 890482, 1111316, 1221293, 1071143, 759505, 507640, 393021, 368664, 426471, 541107, 559272, 371109, 123751, 51243, 146263, 207697, 167913, 157794, 264442, 428925, 593775, 772266, 944699, 1028785, 978675, 816792, 588028, 379699, 325513, 451274, 569604, 486137, 274911, 186269, 303213, 454443, 464631, 335323, 173391, 90052, 184142]
35723A84142K94041L51227J81969q8388k61611k53756j05852O0941O3300j90071
35713B35942m93269m90787j26465K57934L80403L42814L44021L18851J14667j46276
35703G37835j76385N8215K63856J75115j55831m27274l75791l5199K63503K36579
35693E64623j1861j45111p0293q761o3812n4269Q8855J18214r7741k66674j14538
35682f1368J46294J67473M6274J13307L00864K29539j06214k43897M7192L94477
35672A033941L47336l1069l18039k84326r1078k3504j60256k91291j55448K05647
35662B31913M22707K50469p2485j26702J10735K60729R0194k16642l69395k94470
35652B87053q4307J38618K27695R7300j11965j45891J1074R0424p7970l38056
$$ y = [184142, 478183, 829410, 1011379, 922991, 661380, 407624, 301772, 362713, 426013, 235942, -257327, -748114, -874579, -616645, -236242, 106572, 450593, 769444, 884111, 737835, 561450, 619665, 883521, 1058636, 902805, 475531, 99740, 64541, 328044, 564623, 552762, 407651, 337358, 328597, 264785, 210516, 299371, 417585, 319844, 53170, -61368, 84926, 252399, 298673, 411980, 712844, 942383, 836169, 592272, 639464, 1033941, 1381277, 1350208, 1032169, 747843, 656765, 633261, 473005, 181714, 26266, 231913, 654620, 905089, 832604, 705902, 816637, 1077366, 1167560, 950918, 581523, 287053, 202746, 341364, 569059, 666359, 554394, 408503, 419577, 510001, 432031, 93975]
35642I3975m52542l81453k14574j4567J52124J92239J14139M3350K6403k0881
35632d61787r5527m3915J64625L09877K29041O6651L6220J11573J63875K27981
35622G08614L60332L66764J4283n07422o79476l08788J81676K85925M4671p9899
35612C86680J34873L95242L34038K4445j41435j4195J21650r40k19225k03768
35602H17365Q418O2382j47195l02910j69686N1918Q9905L5562J06027J84656l046
35591G33396l40772l82258k0889K97020K02322q0678j10827J09543J80948p9068
35581E08737l88841m07178j50366Q5668P4547j49389l50592k86438P3551M80635
35571e09666O36627N04454K81715P2594k03690m92378m60218N3033O03465N48996
$$ y = [93975, -358567, -740020, -954594, -969161, -817037, -624798, -510659, -467309, -440906, -461787, -557314, -601229, -436604, -126727, 102314, 168965, 205185, 316758, 480633, 708614, 1068946, 1435710, 1449993, 942571, 263095, -45693, 135983, 421908, 466579, 386680, 521553, 916795, 1250833, 1275278, 1133843, 1119648, 1241298, 1240358, 1021133, 817365, 825783, 888165, 740970, 438060, 268374, 320292, 410197, 445759, 551786, 736442, 733396, 392624, 10366, -10523, 286497, 488819, 408141, 297314, 406857, 587805, 508737, 119896, -287282, -437648, -351980, -277433, -426822, -777414, -1063852, -990301, -509666, 126961, 631415, 913130, 985724, 782034, 289656, -170562, -117529, 485936, 1034932]
35561A034932j00822o17306m76363r060J31687j19502k51520K0804L90841M54928
35551D58619K17871n3912k14831k65128j83354K3633K02660K13262J56548K30131
35541G85499L73926L03321m4612l36185k71725j3367N0945j23268j94236J6548
35531E46846K40724J93283K3265M2200J65557J4258m32925o92609m32105O3077
35521b68429L11530K56947J72287J50935N4472j30829k47077k58645k68119k31553
35511d58481M248L23904L60021L8280k12363k4063L78158M83406J81172j44974
35501I29308j58760M2301J19664q2532l75953m47544k14104P7654J64352J11363
35491A65749J72371L35173K93288k8534k30193K1526M22488L59740k46696p72615
$$ y = [1034932, 934110, 316804, -159559, -168619, -36932, -156434, -407954, -387150, 3691, 458619, 676490, 622578, 407747, 142619, -40735, -17102, 185558, 398820, 555368, 785499, 1159425, 1462746, 1418134, 1081949, 810224, 796857, 847802, 724534, 530298, 546846, 787570, 980853, 1004118, 1046318, 1211875, 1226133, 793208, 100599, -331506, -268429, 43101, 300048, 472335, 623270, 677742, 546913, 299836, 41191, -226928, -458481, -454233, -130329, 229692, 267972, 55609, 31546, 409704, 893110, 1074282, 929308, 770548, 812849, 932513, 849981, 474028, 26484, -187620, -109966, 54386, 165749, 338120, 673293, 966581, 938047, 707854, 729380, 1151868, 1511608, 1264912, 492297]
35481D92297o40525J21M80661L67291j32629m79225l95919q4460J27373J97315
35471f7700K78985L33941J41186k55010m41098j78662K16480L06622J22643M562
35461D61949L2490J799j27982j67051p3331j6037k2520P0532K37647K05749q9102
35450E14143l23744k44237o417J26767J49470J61334J08775p1126k44072k54879
35440h3986j57312p7990k2644J3670l7280j01805O5701M46761N88388K14463k65361
35429E82605k89049M3530K00138R1211J04733L08150K85954q8359l52573k04780
35419F81560P382q0128k15782j3468L13412K64564j10658k57118N5744M39991
35409A085499M71018J64691k05637m33662m18954j63019J41356K15687N541k43653
$$ y = [492297, -148228, -148107, 332554, 699845, 567216, 87991, -307928, -392388, -265015, -67700, 211285, 545226, 686412, 431402, -9696, -188358, 28122, 334744, 457387, 461949, 494439, 496238, 368256, 201205, 127874, 111837, 89317, 159849, 397496, 603245, 514143, 190399, -53838, -60255, 66512, 215982, 377316, 486091, 414965, 170893, -83986, -241298, -319288, -341932, -328262, -365542, -467347, -401646, 45115, 633503, 847966, 582605, 293556, 337086, 537224, 628435, 733168, 1041318, 1327272, 1238913, 886340, 681560, 688942, 608814, 393032, 379564, 692976, 957540, 846882, 589764, 645508, 1085499, 1556517, 1721208, 1515571, 1081909, 662955, 499936, 641292, 856979, 862520, 618867]
35399F18867k74885p2750J73922K40930L1813k88164l81145j29221J45906P7600
35389A42873k12928k63373Q0160M64702N03017J64612l21417o61079n84662q5866
35379g73961L83264L29756r2015k22908J53752M91914L37371j1218p5740L3703
35369E53918n5966k44766j63294R4617Q3640k10045l07436r771L14944L39634
35359C95475J89219Q6384K1066m0236m103R2897L2418j85362k43824k2722J62251
35348D83463R5099N3465L04983N43224K97682k91140o03119l84326q570J32596
35338F23357Q6606O8151P4449k1130j89764k57509j25156J15250K41918Q5728
35328G01900k56623m30752k01689K02412L30410J03034r0910J5476J72065M1070
$$ y = [618867, 343982, 271232, 445154, 686084, 717897, 429733, 48588, -80633, 65273, 142873, -70055, -333428, -253268, 211434, 714451, 879063, 557646, -103433, -688095, -773961, -390697, -60941, -152956, -375864, -222112, 269802, 607173, 595955, 520215, 553918, 497952, 253186, 89892, 184509, 268149, 58104, -249332, -259103, 55841, 395475, 584694, 671078, 692144, 651908, 647805, 740702, 773120, 587758, 343934, 321212, 483463, 578562, 632027, 937010, 1480234, 1777916, 1486776, 883657, 499331, 490761, 623357, 709963, 778114, 852563, 831433, 641669, 384160, 259004, 374254, 616172, 701900, 445277, 14525, -187164, 15248, 345658, 448692, 357782, 373258, 545323, 586393]
35318E86393k09162j15191L35865N84973K61958k72846m20169j46322O5161l3021
35308F37639j65779o9208R3438P1419l5240O313J25815J02697K3782J71101M69945
35297A431922M76198K6698m61182n23594j99939J45065K95291K56149P2031j68103
35287A350536k89040k35421k03588l45992m71979l03239O9981K83830K17732J14113
35277A86933J49740J85632O8531o0724L3911K99002M16092K04849j45404l01274
35267A037288j68740K1517N98k33434m31438l69669n8693K88194M31586K88374
35257H05583J7900j11026k3204O1557m9095k05280j43358N5223N8773j51534j95770
35246A19769R0268L28812J49459k35844l42545r6451J46555J48913K1301n1718
$$ y = [586393, 377231, 262040, 597905, 1182878, 1444836, 1171990, 751821, 605499, 670660, 637639, 471860, 402652, 496090, 567509, 532269, 538582, 664397, 767094, 790876, 961977, 1431922, 1908120, 1934818, 1473636, 950042, 750103, 895168, 1190459, 1446608, 1518639, 1350536, 1061496, 826075, 622487, 276495, -195484, -498723, -428742, -144912, 72820, 186933, 336673, 522305, 590836, 530112, 564023, 863025, 1279117, 1483966, 1338562, 1037288, 868548, 890065, 890663, 657229, 225791, -143878, -202571, 85623, 517209, 805583, 823483, 712457, 689253, 750810, 701715, 496435, 353077, 408300, 467073, 315539, 119769, 210037, 538849, 688308, 452464, 109919, 13468, 160023, 308936, 330237, 278519]
35236B78519k2376Q1041J93286J96495N2413q5422o3912L2930K2168q5834j28969
35225D70339m3333J16607K95866L80039J79902k64517n29948k86380K02598M08274
35215I29447K44964N3123j5731j14383k24998r4595K54636M25572K17614j08381
35205A567268k83211l41847l33998j62866Q1071O8281k22837l37082l9318K43971
35195B39432Q4809k27901j35748K96356M90988K27595j34120k74268k66830k50888
35185D9425j72519K239J32263J21261Q0269J37231K33688K17790N1452j34200
35175G18899j53082L9991K29505J25035k40431m52987k32919J42079J85340j15604
35165B45826k73852J5774M55337N32780J54613k70541l25348l9897J86599Q3120
$$ y = [278519, 256143, 337184, 530470, 726965, 779378, 693956, 630044, 662974, 685142, 599308, 470339, 427006, 543613, 839479, 1219518, 1399420, 1134903, 604955, 318575, 521173, 929447, 1174411, 1227534, 1211803, 1097420, 872422, 777827, 1032463, 1458035, 1675649, 1567268, 1284057, 942210, 608212, 445346, 526417, 594698, 371861, 34779, -4539, 239432, 324241, 96340, -39408, 256948, 747936, 975531, 841411, 567143, 300313, 49425, -123094, -120855, 11408, 132669, 212938, 350169, 583857, 801647, 853099, 718899, 565817, 605808, 835313, 960348, 719917, 266930, 34011, 176090, 361430, 245826, -28026, -12252, 443085, 975865, 1130478, 859937, 534589, 494692, 681291, 764411]
35155G64411j78089k49177q3483O7099Q7145J24639K25838J92591k7319j52208
35145G71447k6293N9147j53206l75063j72215L32115O18604M98880K11085r7304
35135A667197m52854o65405m35300O5595K73692N6745p3764J91984M30553J65447
35125A223890l59661n56333l46401j42457j25316l6928K89215N94824N38518J44604
35115A223955k33091l04067j13327N8322L2117p9030p3610K0460k920j78238k89696
35104F0875j98670l8364K0031J0336N6608J60842K20889J57801l1049k36852k66421
35093h3974o9222J10444M6738p8369M9930K82380J86083j52927j45791K84446
35083D29738M22401q3308m98433j10428N50028M89827j52706l44359J60209M84826
$$ y = [764411, 586322, 337145, 253662, 320761, 407906, 532545, 758383, 950974, 923655, 771447, 745154, 804301, 651095, 276032, 103817, 435932, 1054536, 1553416, 1764501, 1667197, 1214343, 548938, 113638, 179233, 452925, 509670, 435906, 627890, 1058443, 1223890, 864229, 307896, -38505, -180962, -306278, -343206, -53991, 540833, 1079351, 1223955, 990864, 686797, 573470, 631792, 663909, 584879, 511269, 531729, 528809, 350571, 60875, -137795, -176159, -156128, -145792, -89184, 71658, 292547, 450348, 419299, 182447, -83974, -153196, -42752, 3986, -74383, -24453, 257927, 444010, 291083, 145292, 429738, 852139, 768831, 270398, 159970, 709998, 1199825, 1047119, 702760, 862969, 1347795]
35073A347795J21527l12402k10241N9436p4535l81037l13185J3495P3420j57453
35063A66820k42066m9548J50006K46933L61480M10132J69000k19992l38050j45865
35053E08850m8275j99073k45168L6722L09726J89477j56572k69550m2159K23746
35043C07724K75259J38688m5279j76817j96499j00424L3047J21375J51955J21172
35033F30201r049k01190k85919j42354J27139L11153L16830J87030k0414k35653
35023F77774l31552k36621o4453R031l1505p6274r7789j38549j19317R9720M13602
35012A04067M75719J50079k36974k89854m1731J60208J52900P2772K8754k9139
35002E46801p8885J8809K09687J90746j20547l27842p4208L72698M33328K7218
$$ y = [1347795, 1469322, 1156920, 946679, 1006115, 931580, 550543, 237358, 250853, 324273, 166820, -75246, -124794, 25212, 272145, 633625, 1043757, 1212757, 992765, 654715, 508850, 460575, 261502, 16334, 53056, 362782, 552259, 395687, 126137, 83978, 307724, 582983, 721671, 676392, 499575, 303076, 202652, 235699, 357074, 509029, 630201, 621152, 419962, 134043, -8311, 118828, 429981, 746811, 933841, 913427, 677774, 346222, 109601, 45148, 54179, 22674, -53600, -151389, -289938, -409255, -309535, 104067, 579786, 729865, 492891, 203037, 161306, 321514, 474414, 547186, 575940, 546801, 467916, 486725, 696412, 887158, 766611, 438769, 364561, 737259, 1170587, 1197805]
34992A197805l37865l04209p7366K1337K2580R2975J64193Q4945n8141p4106P022
34981G39170J5265n1056n4178J9131N6905K6102k2406p2255q7556J8136J56270
34970G43528K2915m12833o23604j77932M99121N88732M0772l63920j82395J44055
34960B78439J45700M2927J78493L13038P1770l06627k96572P3525K99614J88660
34950I88967K0344o836K0932O2637J81457K60040R4116k01401k91982j53274q1985
34939H93015j46045q1383J70072K84277Q9356j45085j69172j23096j95473k55374
34929C21092j23921O0734O6039m4134m0192Q9901J60434J04748M1945O9505J51489
34918H57640J81951P4275j46610l06851k58224r7395l0518k9482J01221K89432
$$ y = [1197805, 859940, 555731, 478365, 499702, 522282, 615257, 779450, 864395, 806254, 732148, 739170, 754435, 703379, 649201, 668332, 725237, 751339, 728933, 656678, 569122, 587258, 743528, 766443, 353610, -269994, -447926, 51195, 639927, 680699, 316779, 134384, 278439, 424139, 467066, 645559, 958597, 1030367, 723740, 427168, 500693, 800307, 988967, 1009311, 1002475, 1023407, 1086044, 1267501, 1527541, 1621657, 1420256, 1128274, 975000, 893015, 746970, 665587, 835659, 1119936, 1209292, 1064207, 895035, 771939, 576466, 321092, 197171, 257905, 323944, 279810, 239618, 329519, 489953, 594701, 636646, 706151, 857640, 1039591, 1113866, 967256, 660405, 402181, 304786, 274268, 244786, 346007, 635439]
34908F35439K01801j76411l72234j03136K42513J72756j58411k24236M3565K05090
34898D66736M6694j29467m7669J21145Q6538q8502q9180J88350M73313M34333
34888A462291P7718k28570j70340J17302K06966n7430l54938l37967p2693J35345
34878G77684J55239N3889j15939k87550k79005j1030K63441K35357k1247j74043
34868E96796j34678j14152j99454k25198j14698j2669K1163J32942L40538L78098
34858F68688J00471j88747r9751K72828M34730J44392k72934l64782j29159L8335
34848F04071p5639k13752o1341K43328K85867M537j98032n8144J72070J59096
34838H62061j285k1020N9493j9676k22916k26791N4686L18763L12867J18504p8847
$$ y = [635439, 837240, 660829, 288595, 185459, 427972, 600728, 442317, 218081, 261646, 466736, 513430, 383963, 336294, 457439, 543977, 455475, 366295, 554645, 1027958, 1462291, 1540009, 1311439, 1141099, 1258401, 1465367, 1407937, 1052999, 715032, 642339, 777684, 932923, 986812, 870873, 583323, 304318, 293288, 556729, 792086, 770839, 596796, 462118, 347966, 148512, -76686, -191384, -204053, -182890, -49948, 290590, 668688, 769159, 580412, 480661, 753489, 1188219, 1332611, 1059677, 694895, 565736, 604071, 528432, 314680, 253339, 496667, 782534, 787071, 589039, 530895, 702965, 862061, 860776, 839756, 899249, 879573, 656657, 429866, 484552, 803315, 1116182, 1234686, 1155839]
34827A155839k17094k56914j26763Q8337J28143j03731l44411k83174L2292K47525
34817C20049J20899k01417l34083o2622M00570O31068M79249K06895P0613j7386
34807A613835k23954m05502l03500j3355J01235n7724k09041j38268N3128J96369
34797F13223K65407K65950J68350K3157o9199j27286k07780j91490N4768L30401
34787A125501K81357m3348k08730m5327J30792Q4338J5737J26622K29670R2908
34777A789520j46999k36139k11563k41361k67491j24036J38327L18552L31008
34768A349818J93927p9321l58652l60218M146L96098M31656J57912r8413k09382
34758A427571k88945l71748l51953k02619j1571J66699K92382K44233k8675l06322
$$ y = [1155839, 938745, 681831, 555068, 643405, 771548, 667817, 323406, 40232, 72524, 320049, 440948, 239531, -94552, -157174, 243396, 874464, 1353713, 1560608, 1631221, 1613835, 1389881, 984379, 680879, 667524, 768759, 711035, 501994, 363726, 416854, 613223, 878630, 1144580, 1312930, 1336087, 1266888, 1139602, 931822, 740332, 795100, 1125501, 1406858, 1363510, 1154780, 1109453, 1240245, 1324583, 1340320, 1466942, 1696612, 1789520, 1642521, 1406382, 1194819, 953458, 685967, 561931, 700258, 1018810, 1349818, 1543745, 1464424, 1105772, 745554, 749700, 1145798, 1577454, 1735366, 1636953, 1427571, 1138626, 766878, 414925, 212306, 200735, 367434, 659816, 904049, 875374, 569052]
34748E69052k87177J3006K43276J32489k03705l95211j94221K61931N45492L78472
34738A063404j6345j58297P3937K90825J44760k11590l79176k13943J04901L26361
34728A024837K80329l7890l74409l98908j25140P7538L0788n643J59241K62598
34718H93341N1809j98513q6368K34791K73584k9188k50870j67803p907J4895r725
34707G18046L9833J08109J35146J58571J60817N8164j04297j73276j27664p7140
34697H96309l2265P4057J56832O2292j11610q8132J43939K59474N9521k62302
34687A158115m15812l36626j15454J59349L65307L51365J15687j53311k88224
34678H40396k64264r2330K08951M79876M81532K08843m1506n2706K1723q2711
$$ y = [569052, 281875, 294881, 538157, 670646, 466941, 71730, -122491, 139440, 684932, 1063404, 1047059, 888762, 962699, 1253524, 1398284, 1186694, 807518, 593575, 698476, 1024837, 1305166, 1267276, 892867, 493959, 368819, 446357, 477145, 471502, 630743, 893341, 945150, 746637, 660269, 895060, 1168644, 1139456, 888586, 720783, 712876, 727771, 718046, 757879, 865988, 1001134, 1159705, 1320522, 1378686, 1274389, 1101113, 973449, 896309, 864044, 938101, 1094933, 1157225, 1045615, 957483, 1101422, 1360896, 1420417, 1158115, 742303, 405677, 290223, 449572, 814879, 1166244, 1281931, 1128620, 840396, 576132, 483802, 692753, 1172629, 1654161, 1863004, 1821498, 1768792, 1790515, 1707804]
34668A707804l12376l48059p7184J98270J42315j53886k91773j31476J5726j12742
34658F36619l00849k08986M6051Q4779o7322k1708K52373L32134J06920J3358
34648H73369K23908K49371j96452n50385k39778L42817M40441J12631k9J81448
34638A437341J50131j82357l37298j52579K245j3329Q1997K86329J99597j78001
34628A294076l00761r339J43906j43265l70324j02014K87015K89118R7192J31184
34618A316788K11891q8433n80074o41954j48908L74431M92942K86943M4468r0898
34608A177196j32651j63367k35004k36475j970L31041L39363r2763m85188l73179
34598A27003M1447K10551K0122j45968k6344K12077K92883J68709m760o4490O608
$$ y = [1707804, 1395428, 1047369, 970185, 1168455, 1310770, 1156884, 865111, 733635, 749361, 636619, 335770, 126784, 172835, 257614, 190292, 168584, 420957, 753091, 860011, 873369, 1097277, 1346648, 1150196, 599811, 360033, 702850, 1143291, 1255922, 1255893, 1437341, 1587472, 1405115, 1067817, 915238, 917483, 904154, 986151, 1272480, 1472077, 1294076, 993315, 983976, 1127882, 984617, 614293, 512279, 799294, 1088412, 1185604, 1316788, 1528679, 1440246, 860172, 218218, 69310, 443741, 936683, 1223626, 1268094, 1177196, 1044545, 881178, 646174, 409699, 407729, 738770, 1078133, 985370, 500182, 127003, 168450, 379001, 399123, 253155, 226811, 438888, 731771, 900480, 895720, 831230, 837838]
34587H37838M8435r0160l03722l27524j21950P3330J38390K22838L60697K87122
34577A125294j04156m26262k63330K23777M84884K65235j63508l82072k30119
34568E29743J06185K90099J90360N2685J40597K62725J7602m78471o04817j47261
34558C59447L21302K77625j5410k1446K30589L14073J21897p7862j23814p9279
34548A307122r529K9032n0879j53580r215L37326M12854L7759k65968n4735K84061
34537A864248J64070j96372j42007K93282M36058P7547k52016j80210L4630P5035
34527B174265L708n5472j63267l05357l16039k02653j56828j65562k7162J94505
34517I80138K01576K5442N1559L43175M54413J34812k57872l26737j96940j83173
$$ y = [837838, 886273, 796113, 492391, 164867, 42917, 116247, 254637, 477475, 838172, 1125294, 1021138, 594876, 331546, 555323, 1040207, 1305442, 1141934, 759862, 529743, 635928, 926027, 1116387, 1169072, 1309669, 1572394, 1589996, 1111525, 506708, 359447, 680749, 958374, 942964, 921518, 1152107, 1466180, 1588077, 1510215, 1386401, 1307122, 1297593, 1326625, 1275746, 1122166, 1112951, 1450277, 1863131, 1900890, 1634922, 1580187, 1864248, 2028318, 1831946, 1689939, 1983221, 2419279, 2496826, 2244810, 2064600, 2099230, 2174265, 2177973, 2122501, 1959234, 1653877, 1337838, 1135185, 978357, 812795, 785633, 980138, 1181714, 1207156, 1258715, 1601890, 2056303, 2191115, 1933243, 1606506, 1409566, 1226393]
34507A226393k42192j23969J52814L16721K33606M4314l4521P7271K48274K36448
34497B135159l2665l16272l44660j98118j61240k67078k88924j54088k2235N7980
34487D07859K04952L66582L05198K6288j35646n048J81728J67899K5295n4524
34477A490583n2535l7638k1041m2185j81946l61347l46129p9811J94561K62322
34467H24834J88009J33002J18272P7069j8678j57873k73302k21364M0778K92029
34457A002776K89990J22427L8233O562j81497m14219l24791Q5146L60441K71205
34447A256273J20196J74243K35606N7334k06304k90421k38756j99035p9574K29050
34437A058612N02251M23222O0118k14471k12927q6073l7946r9486j64312j11531
$$ y = [1226393, 984201, 860232, 1013046, 1329767, 1563373, 1607687, 1573166, 1650437, 1898711, 2135159, 2102494, 1786222, 1441562, 1243444, 1082204, 815126, 526202, 372114, 349879, 407859, 612811, 979393, 1284591, 1310879, 1175233, 1170185, 1351913, 1519812, 1545107, 1490583, 1438048, 1400410, 1379369, 1337184, 1155238, 793891, 447762, 367951, 562512, 824834, 1012843, 1145845, 1264117, 1341186, 1322508, 1164635, 891333, 669969, 710747, 1002776, 1292766, 1415193, 1453426, 1459988, 1278491, 864272, 539481, 624627, 985068, 1256273, 1376469, 1550712, 1786318, 1843652, 1637348, 1346927, 1108171, 909136, 829562, 1058612, 1560863, 1984085, 2044203, 1829732, 1616805, 1530732, 1492786, 1393300, 1228988, 1117457]
34427A117457P4779K45675K38761J18639J00350J94476J65396n7127j90072p981
34417B000353K79230K96719J0087k72091l20495k03001j03412q2497n6787M4265
34407A592371J42716Q9735r5448j87504p1583M8454l8863j75753o1392K39893
34397A482626L66103K06378K0741j0257N456l0880n7566q0148k02309l36048k38567
34386A125529M2308J27393j20495l28135j32285L14320N72637M32774L5690l12831
34376A756905l32967j194L20695K36011j43820l05990n4619K37986K26600N9537
34366A999144L5849J25129R8472q5348k64193l03693j94046k8784N9344O2261
34356A504135J40774L24958L33333O074k81754j06739K73606K71896n9970j26213
$$ y = [1117457, 1192236, 1437911, 1676672, 1795311, 1895661, 2090137, 2255533, 2198406, 2008334, 2000353, 2279583, 2576302, 2586389, 2314298, 1993803, 1790802, 1687390, 1604893, 1548106, 1592371, 1735087, 1824822, 1729374, 1541870, 1470287, 1518741, 1479878, 1304125, 1242733, 1482626, 1848729, 2055107, 2075848, 2065591, 2071047, 2040167, 1982601, 1902453, 1700144, 1364096, 1125529, 1167837, 1295230, 1174735, 846600, 714315, 1028635, 1601272, 2034046, 2069736, 1756905, 1423938, 1422744, 1743439, 1979450, 1835630, 1529640, 1475021, 1713007, 1939607, 1999144, 2034993, 2160122, 2258594, 2173246, 1909053, 1605360, 1411314, 1382530, 1441874, 1504135, 1644909, 1969867, 2303200, 2309274, 2027520, 1920781, 2194387, 2466283, 2406313, 2280100]
34346B280100J57209K11396j59187m04087j99612J8824j08059k54800j13064J3200
34336A441920j39533k14066Q6044L49587J59158j16398M7730L93219L37344k1758
34326B323247j48089j9469m5384k28235j72523J52488L40261K14242r96j37868
34316B277674k11660j57919P4514K42818P6435k53848l49217j66016P452L6900
34306A577133K2304J1017k6963o4550j18425k70336l77291j22701L85816N53846
34296A569850J92517q9466J36978L74771P6877l45177k16231K13680K24761j11648
34286B026912j42225J51871J93507o0975p5632J89631J76764k01487l65561j24014
34276A768791l41k44485l81886r3872K18869J49840q2926j18383k3615p520o718
$$ y = [2280100, 2437309, 2648705, 2489518, 2085431, 1885819, 1904643, 1796584, 1541784, 1428720, 1441920, 1302387, 1088321, 1174365, 1523952, 1683110, 1566712, 1614442, 2007661, 2345005, 2323247, 2175158, 2155689, 2110305, 1882070, 1709547, 1862035, 2202296, 2416538, 2415542, 2277674, 2066014, 1908095, 1982609, 2225427, 2301862, 2048014, 1698797, 1532781, 1540233, 1577133, 1599437, 1610454, 1583491, 1518941, 1400516, 1130180, 752889, 630188, 1016004, 1569850, 1762367, 1672901, 1809879, 2184650, 2261527, 1916350, 1700119, 1913799, 2138560, 2026912, 1884687, 2036558, 2230065, 2169090, 2093458, 2283089, 2459853, 2258366, 1892805, 1768791, 1768450, 1523965, 1142079, 1048207, 1267076, 1416916, 1333990, 1215607, 1191992, 1184472, 1177754]
34265A177754J09934K63583L23318K61435O5889j90324k23077J14025M32362K59547
34255B594446j95864l15691m1765R9219o2910j13915J25831K84548J38401l6343
34245B475957k8448P196J2950J69415L63735J63971m03612o72003k57033L78336
34235B210464O04392L79529L2853k31165l12412j28499J71558K65763J13121j8475
34225C087129n8665j98435l69798k21396K35616N15655L77195J19239o376j19666
34215C360498k71758k59427q8249n3694j57864l0551L58458N22188K36039j14188
34205C501452k18066k53836l47586k68052J8806J30679m4300p4604K23397L64879
34195C032769J1503m01834l56112k7326J35626J33601J98457K57224J18008j19159
$$ y = [1177754, 1287688, 1551271, 1874589, 2136024, 2201913, 2011589, 1788512, 1902537, 2334899, 2594446, 2398582, 2082891, 2041126, 2140345, 2077435, 1963520, 2089351, 2373899, 2512300, 2475957, 2447509, 2454705, 2467655, 2637070, 3000805, 3164776, 2761164, 2089161, 1832128, 2210464, 2814856, 3194385, 3227238, 2996073, 2683661, 2555162, 2726720, 2992483, 3105604, 3087129, 3028464, 2830029, 2460231, 2238835, 2474451, 2990106, 3367301, 3486540, 3480164, 3360498, 3088740, 2829313, 2741064, 2687370, 2529506, 2498955, 2857413, 3379601, 3615640, 3501452, 3283386, 3029550, 2681964, 2413912, 2432718, 2563397, 2519097, 2444493, 2667890, 3032769, 3044272, 2642438, 2286326, 2259000, 2394626, 2528227, 2726684, 2983908, 3101916, 2982757]
34185B982757k45093k52746j73238N7977L24975L21859N4093q8211K7174N7435
34175C066982j60375k86445q6944J80113K70168K90936K73536J4310l66117l63049
34165B833115O9773K90808k7809l54585j94804J52997K34498J69023J94870J14860
34155C482746k15701m16785j91341J09704Q5823n9662m658P3401p7447k36533
34145B549547j44078j4854r2992j56228L5511K60052K65324K01002J99727O4983
34135C167994k16418k50244N6386K09192j9640j58056Q8209K94794J64842R4920
34125C431979L21409L61044m5320l07795k6566K32591j4497k56262J5356L06739
34115D018678Q2259j78231P5157L41956K8278l34509o1901L08986l4540n93590
$$ y = [2982757, 2737664, 2484918, 2311680, 2369657, 2694632, 3016491, 3070584, 2982373, 3009547, 3066982, 2906607, 2620162, 2533218, 2713331, 2983499, 3274435, 3547971, 3562281, 3196164, 2833115, 2902888, 3193696, 3165887, 2811302, 2616498, 2769495, 3003993, 3173016, 3367886, 3482746, 3267045, 2850260, 2658919, 2768623, 2854446, 2794784, 2790126, 2863527, 2786080, 2549547, 2405469, 2390615, 2297623, 2141395, 2176906, 2436958, 2702282, 2903284, 3103011, 3167994, 2951576, 2701332, 2757718, 2966910, 2947270, 2789214, 2877423, 3172217, 3337059, 3431979, 3753388, 4114432, 4069112, 3761317, 3734751, 3967342, 3952845, 3696583, 3711939, 4018678, 4100937, 3922706, 3997863, 4339819, 4368097, 4033588, 3971687, 4280673, 4246133, 3652543]
34105C652543l70138L40477M81335Q2420L8533L85492L44875j08365k21885P2041
34095D697328Q2432k65546l08211P4596K84658J37521K5048j4564k55552m06845
34085D050865M2490O84290O12532o8268l78333p1735J40691j3975l3764J98200
34075E162993J60552k17904l63046j32161j9096j48300j08559J09747N8662k02557
34065D300331j31281K38940L02395k113j17422N8895P6249q1784K6988L39701
34055E010899L56252J29670J22303J91666j27496m84199j33436O12092P10792
34046F388543J26032j72003O4311R8712k35226k26564K52531M30311O3220j79597
34036F610270k3023M1068r6231L0680L17634J24134l74255k88303L42014M83808
$$ y = [3652543, 3282405, 3622882, 4104217, 4186637, 4225170, 4610662, 4955537, 4847172, 4625287, 4697328, 4779760, 4514214, 4206003, 4280599, 4565257, 4702778, 4727826, 4713262, 4457710, 4050865, 4093355, 4777645, 5390177, 5321909, 4943576, 4871841, 5012532, 4998557, 4964793, 5162993, 5323545, 5105641, 4742595, 4610434, 4591338, 4443038, 4334479, 4444226, 4502888, 4300331, 4169050, 4407990, 4710385, 4708272, 4590850, 4649745, 4725994, 4644210, 4671198, 5010899, 5367151, 5496821, 5619124, 5810790, 5683294, 5199095, 5065659, 5677751, 6388543, 6514575, 6342572, 6406883, 6505595, 6270369, 6043805, 6296336, 6726647, 6789867, 6610270, 6587247, 6628315, 6532084, 6562764, 6880398, 7004532, 6630277, 6341974, 6683988, 7167796]
34026G167796p7575l74748M109L28353K15301K09135M91329M69454M2152j18272
34016H357034J29078J78273k3411R6864L80439Q0794n15879l14191N82499Q73534
34006I825034K78044j03298J18659J08510l09855k54648L50440N07841J13068
33997A0633795J63630O77132N44907k04759k71244M25787N11861j83816k68148
33988A2029145M59144N67631j46805j90304O17288O41891l10561l84758P83845
33979A4066516J204571K58992j30815P21412R01971k55132o57171N34499J144499
33970A7789342J12343m46500O42546J351267N17703J43975J247964J616940K80435
33961B3256015j72452J446613K276357P87360q9817J391881K256172P18630O2220
$$ y = [7167796, 7090221, 6715473, 6719582, 7047935, 7263236, 7472371, 7963700, 8433154, 8475306, 8357034, 8486112, 8664385, 8640974, 8737838, 9118277, 9199071, 8683192, 8369001, 8951500, 9825034, 10103078, 9999780, 10118439, 10226949, 9917094, 9662446, 10012886, 10520727, 10633795, 10797425, 11474557, 12019464, 11814705, 11543461, 11969248, 12481109, 12297293, 12029145, 12488289, 13055920, 12909115, 12718811, 13336099, 13977990, 13667429, 13282671, 14066516, 15271087, 15530079, 15399264, 16120676, 17022647, 16767515, 16110344, 16644843, 17789342, 17901685, 17455185, 18097731, 19448998, 19966701, 20110676, 21358640, 22975580, 23256015, 23083563, 24530176, 26806533, 27593893, 27504076, 28895957, 31152129, 31870759, 31932979]
33952C1932979K259282L627795J783478O54455K981088M583114K526007J620904
33944E1969102N229462P661759M772476L198832P941432J0892081O316867O294525
33936A04276536J9170809K1781186j6255330p9147618j08453723p3322665j0685042
33929a42635847K3083654J8195071O043038O192790R246064N828673K623787N249697
33921f6173073P333930M113276J210223L001968M734411K465422L16832J905992
33913d1091019L606931J999550J95920J364335K798922J559354o816P87341J868838
33904b6916644Q39784k98692P62574K120914J388121Q8783M30303J188402N20767
33895a9875688l28856L32509J239603P09381j30695K58233Q16284K18693l34277
$$ y = [31932979, 34192261, 37820056, 39603534, 40257989, 43239077, 47822191, 50348198, 51969102, 57198564, 64860323, 69632799, 72831631, 80773063, 91665144, 97982011, 104276536, 123447345, 145228531, 128973201, 49825583, -58628140, -131950805, -142635847, -119552193, -101357122, -95314084, -89121294, -79875230, -74046557, -71422770, -66173073, -58839143, -54725867, -53515644, -50513676, -45779265, -43313843, -42997011, -41091019, -37484088, -35484538, -35288618, -33924283, -31125361, -29566007, -29572823, -28785482, -26916644, -26076860, -26375552, -25612978, -23492064, -22103943, -22015160, -21584857, -20396455, -19875688, -20204544, -19872035, -18632432, -17923051, -18053746, -17795513, -16979229, -16760536, -17094813]
33886a7094813M49536J201669M50294m36460K35881J257482P42931m28752l58339
33877a3980571M68453M29172j28435J40381Q05757N63217j85714j46450M37205
33868a1596985M50661R3857K66268O43340L67783j77724j37005J47083m5211k58972
33858a0246905J71121O00170K18911k91613K7879N66246K77050l21967j19187
33849i118295N15283M88228L3227J34932N64399L38453l60611m80609N5517L90365
33839g439111K87920K08839J75565j04352l41072j06967K38164J77038M1315K86502
33829f576159M34787o4369o11684l64249K90310M40953J83620J53426J89545j77849
33819f101669n21004j82960L88707L38347q3690n1303L03992K57918q2780r2639
$$ y = [-17094813, -16645277, -15443608, -14993314, -15429774, -15193893, -13936411, -13193480, -13622232, -13980571, -13512118, -13082946, -13211381, -13071000, -12265243, -11702026, -11887740, -12034190, -11596985, -11146324, -11052467, -10786199, -10142859, -9775076, -9952800, -10089805, -9942722, -9987933, -10246905, -10075784, -9475614, -9256703, -9548316, -9520437, -8954191, -8677141, -8999108, -9118295, -8603012, -8114784, -8081557, -7946625, -7382226, -7043773, -7404384, -7884993, -7829476, -7439111, -7151191, -6942352, -6766787, -6871139, -7212211, -7319178, -7081014, -6903976, -6862661, -6576159, -6141372, -6205741, -6817425, -7181674, -6891364, -6450411, -6266791, -6113365, -5923820, -6101669, -6622673, -6805633, -6416926, -6078579, -6162269, -6213572, -5909580, -5651662, -5734442, -5827081]
33809e827081P4036j39530m30097j19611M64517M49628o4945k60557m6156L3826
33799e865970J331K57965N19995K32080k61721k18131J78726K40819R9784K79074
33789d536048M21562q1607o38981k57871N56096M46150m52538o59780J61018P33645
33779d308354M08947M0194J84375J71592l76375o59846j41566M38329L29293m5516
33769c958927Q293K97997K81894K2214j10167j02178j05831p1553J3453k4400
33759c749205j86109k42575j61273r6531L5323L68118N65292K31908k50377j68143
33749c653572L09658L43191j47504l48610Q099J97692j91544n67954l92890J1728
33739d431706J85442K19785K63716J21667j90483k17498J47728L28193l5118m75633
$$ y = [-5827081, -5753045, -5892575, -6322672, -6442283, -5977766, -5528138, -5593083, -5853640, -5899796, -5865970, -5864639, -5606674, -5086679, -4854599, -5116320, -5334451, -5155725, -4914906, -4815122, -4536048, -4114486, -4196093, -4835074, -5092945, -4536849, -4090699, -4543237, -5203017, -5041999, -4308354, -3899407, -3859213, -3674838, -3503246, -3879621, -4539467, -4681033, -4242704, -3913411, -3958927, -3950634, -3652637, -3370743, -3348529, -3458696, -3560874, -3666705, -3738258, -3724805, -3749205, -3935314, -4177889, -4339162, -4435693, -4400370, -4032252, -3466960, -3235052, -3485429, -3653572, -3343914, -3000723, -3148227, -3496837, -3488738, -3291046, -3482590, -4050544, -4443434, -4431706, -4246264, -4026479, -3762763, -3641096, -3831579, -4049077, -3901349, -3573156, -3608274, -4083907]
33729d083907m34098k8938L01174L93332K62531o2817l10798j04556M06821O00840
33719c060416K90472r584M5718J32380p6226l54650l79071k12783l7942J24135
33709c537967K00026N2500j52763p7719J76010J49470j85506l43067j27783J36080
33699c710719K67459M03569M26849K6387n24806n21478L1853L28269O8633r8941
33689c302925J91359L74193O0416j97261O5107L17386k8314n26068m27914P1707
33679c402314K21247o9726k51574j08487N7619P4051R0449J92258K90758L26650
33669b579069K68421O1076j93634k47729q5265K4960J627O0894K09113J45354
33659b334252j33933k19598k8027r433k99612l65139O8077M32680K22246j65132
$$ y = [-4083907, -4518005, -4546943, -4245769, -3852437, -3589906, -3652723, -3963521, -4068077, -3661256, -3060416, -2769944, -2779528, -2733810, -2601430, -2677656, -3032306, -3411377, -3624160, -3662102, -3537967, -3337941, -3285441, -3438204, -3515923, -3339913, -3190443, -3375949, -3719016, -3846799, -3710719, -3443260, -3039691, -2612842, -2586455, -3111261, -3632739, -3600886, -3272617, -3203984, -3302925, -3111566, -2737373, -2676957, -2874218, -2809111, -2491725, -2520039, -3046107, -3474021, -3402314, -3181067, -3250793, -3502367, -3610854, -3553235, -3479184, -3388735, -3196477, -2905719, -2579069, -2310648, -2249572, -2443206, -2690935, -2776200, -2751240, -2749613, -2688719, -2479606, -2334252, -2468185, -2687783, -2715810, -2725243, -3024855, -3389994, -3321917, -2889237, -2666991, -2832123]
33649b832123j23852J78270K05990j9998j11120n5951r4736j39018M1784K82993
33639b667761K54134L0421p3476l9714n6286j02522n2714J7329n389m0353m5029
33628b781360j48983k81596j09514L29055M58945N2816k95034r6881K25066J08825
33618b538661j50656K9178M18275L42245j41929l43940p8951J37804J5356j51005
33608b462284j01442M6757J64843K87595L51824K06056p5411k48414k46462j71227
33598b248165n3193P8968P8725n7655n8636J74468L13018J52107M022J00650Q8032
33587a427659l00886n67892j95645L47830K32537l89686o09002j82490K26323
33578b866570K27044J72265L07901L36688J01047m8520J08168K68494J61879k5824
$$ y = [-2832123, -2955975, -2777705, -2571715, -2591713, -2702833, -2758784, -2853520, -2992538, -2950754, -2667761, -2413627, -2383206, -2456682, -2496396, -2552682, -2655204, -2707918, -2690589, -2695978, -2736331, -2781360, -2930343, -3211939, -3321453, -2992398, -2533453, -2480637, -2775671, -2872552, -2647486, -2538661, -2689317, -2660139, -2241864, -1899619, -2041548, -2385488, -2464439, -2326635, -2311279, -2462284, -2563726, -2516969, -2352126, -2064531, -1712707, -1506651, -1582062, -1830476, -2076938, -2248165, -2301358, -2222390, -2143665, -2201320, -2259956, -2085488, -1772470, -1620363, -1616341, -1515691, -1427659, -1728545, -2296437, -2492082, -2144252, -1911715, -2301401, -2910403, -3092893, -2866570, -2639526, -2467261, -2159360, -1822672, -1721625, -1770145, -1661977, -1393483, -1231604, -1257428]
33568a257428o1080l4077p1148q6212l6888o2765j93816k55059j77588p5400L6575
33557b274886K25299L23933Q7318k79321k49289K22644N15108J95801l52338m66271
33547b052002p8855K55032Q6898l98882o02808k04470M16432N96397K20060j65430
33537a927628j59893k067j0549l8996R1614J19382j40255k82123Q352K38530r7654
33526b201287m54940n948Q32622Q62092J1888n15222j73973J73253j30782m47893
33516b050190q5943M45817L32670j94146l43355k4480K66887L80062M76555M11109
33506c85014k9079m98102m69470q4905P0342r4856j52138K2069R8019j6110r74
33495a540218K35208L34917J07882j26413o2707J23775J17631l7470r1473m0137
$$ y = [-1257428, -1318508, -1352585, -1423733, -1509945, -1546833, -1609598, -1803414, -2058473, -2236061, -2311461, -2274886, -2049587, -1725654, -1638336, -1917657, -2166946, -1944302, -1429194, -1233393, -1585731, -2052002, -2130857, -1875825, -1788927, -2187809, -2790617, -2995087, -2578655, -1982258, -1762198, -1927628, -2087521, -2089588, -2100137, -2139133, -2047519, -1928137, -2068392, -2350515, -2342163, -2103633, -2201287, -2656227, -2662175, -1829553, -967461, -955573, -1470795, -1644768, -1471515, -1602297, -2050190, -2136133, -1690316, -1357646, -1551792, -1895147, -1919627, -1652740, -1272678, -796123, -385014, -414093, -912195, -1381665, -1466570, -1396228, -1491084, -1643222, -1621153, -1523134, -1539244, -1540218, -1305010, -970093, -862211, -988624, -1051331, -927556, -809925, -847395, -938868, -979005]
33485i79005r6550k75571l06900m0512K67477K48855p5261k96399j58828J12684
33475a600010J62688o905j25958q9705j0714P1662J92519K10844n1376l85585
33465a632540l40350P8894K86270o3544n22871m72437Q593L30354K75202K06385
33455a846044L85985N34193K75278k56864n49457l63304O059J62402Q2025J946
33445a567781O964r467m5547K3702J36022O5976j38936j24960J79904L43023P1016
33434a060084l13996l92336k48555j31520P1955M67776O38251J88204m58940n59507
33424a798752j63191N4483o2837m7343J84414J63081j66198k44997P7119K28738
33414a775483k9139j28235K62171N68646K86088j44404j17081J32470N5563k12511
$$ y = [-979005, -1075555, -1351126, -1658026, -1698538, -1431061, -1182206, -1257467, -1553866, -1712694, -1600010, -1437322, -1444227, -1570185, -1659890, -1670604, -1598942, -1406423, -1195579, -1246955, -1632540, -1972890, -1893996, -1607726, -1671270, -2194141, -2666578, -2657985, -2327631, -2052429, -1846044, -1460059, -925866, -650588, -907452, -1456909, -1820213, -1814154, -1651752, -1569727, -1567781, -1560817, -1570284, -1615831, -1592129, -1456107, -1390131, -1529067, -1654027, -1474123, -1131100, -1060084, -1374080, -1766416, -2014971, -2146491, -2074536, -1606760, -968509, -780305, -1239245, -1798752, -1961943, -1907460, -1970297, -2017640, -1833226, -1670145, -1836343, -2081340, -2004221, -1775483, -1804622, -1932857, -1670686, -1102040, -815952, -960356, -1077437, -944967, -889404, -1101915]
33404a101915j84751M3124p218l11458l99730j53831J04624K23199L32090M18931
33394a036935L18632R3938k1774k4635j00151k42671k57549p8271J90528M28326
33384g30562M76839J83654k82415m40563j20887K27548J80640n6095q3094J8951
33374f25984n1786j95317j07897J12148J13013r7353j97504j02333m894K2569
33364a135338M8102K7674p8726j06575K7912P9504r3953j63235J27158L84969
33354h82508J32509l56822m47485j22240J26193J67544K40624K60630n2800m41741
33344a376096l59608O0976J66256o4262J9963M79415N22188j35556o44397l27108
33334a658229K56501K62931j26525j75680J39494K21160n8958k02975K1994K47952
$$ y = [-1101915, -1286666, -1243542, -1250760, -1562218, -1961948, -2115779, -2011155, -1787956, -1455866, -1036935, -718303, -624365, -646139, -670774, -770925, -1013596, -1271145, -1349416, -1158888, -730562, -253723, -70069, -352484, -793047, -913934, -686386, -505746, -561841, -644935, -625984, -677770, -873087, -980984, -868836, -755823, -853176, -1050680, -1153013, -1157907, -1135338, -1087236, -1059562, -1138288, -1244863, -1216951, -1137447, -1231400, -1394635, -1267477, -882508, -749999, -1106821, -1554306, -1676546, -1550353, -1382809, -1142185, -881555, -934355, -1376096, -1735704, -1674728, -1508472, -1572734, -1552771, -1073356, -551168, -686724, -1331121, -1658229, -1401728, -1138797, -1265322, -1441002, -1301508, -1080348, -1139306, -1342281, -1320287, -1072335]
33324a072335J62859m5000p5930L6306P2945r355n4528M2051J74374J38237j01734
33313g32110l14674k63139j1086J68182J41941k658j60766k52623j37845J98350
33303a366428M20822J91264k57356l31652O8776L90078K65552O075j1583N9862
33293e64590n1760j67395L58K40280J30278k35395l53074r9798R5695n4271k76131
33282a335803j90618J30377L01701J54676q7508j28522M4371J67310L6738k19903
33272a127181k88489p4377J67142J68682j2449j15721l9135P4037O9899m3304
33262a220896j62464k03882j15461J14731L81304M66778K54002o6977j51051O9060
33252f34856K51075R5990k13946k85685j15606m8730j54696j13283J46498K05890
$$ y = [-1072335, -909476, -954476, -1030406, -994100, -921155, -930510, -985038, -942987, -768613, -630376, -732110, -1046784, -1309923, -1321009, -1152827, -1010886, -1013544, -1174310, -1426933, -1564778, -1366428, -945606, -754342, -1011698, -1343350, -1274574, -884496, -618944, -612869, -624452, -564590, -616350, -783745, -783387, -543107, -412829, -648224, -1001298, -1101096, -1005401, -1059672, -1335803, -1526421, -1396044, -1094343, -939667, -1027175, -1155697, -1111326, -944016, -907278, -1127181, -1415670, -1490047, -1322905, -1154223, -1166672, -1282393, -1321528, -1247491, -1177592, -1220896, -1383360, -1587242, -1702703, -1587972, -1206668, -739890, -485888, -552865, -703916, -634856, -383781, -287791, -501737, -787422, -903028, -951758, -1106454, -1219737, -1073239, -867349]
33242h67349j39827m17478j76447K40690K05154j93709l01858O8308M18004L80537
33232g83975J52531J2741n4939j19419j36018j44521k37303k74760n3266K33293
33222a405636J98301m8776L88L78866N10401J46053k17650j66857J488j10221
33212g13643l09808k23821L9479J40942R1754J11528J73973J24765K7380J6510
33202e20941K0935n1082r6612p4024j68081l92776l82412M7255M72857M22613
33192g22268N7895j38093o3209O2623J76185L00435K39905j39161n10657m64652
33182a200997j23572P7852N0908K0320K2024n8243j07708K9337J36835o4022l24921
33171a542187j65171L32964O08281M48743J59199n0922k38262l04656o1196K38037
$$ y = [-867349, -1007176, -1424654, -1601101, -1360411, -1155257, -1348966, -1650824, -1582516, -1164512, -783975, -631444, -618703, -673642, -793061, -929079, -1073600, -1310903, -1585663, -1638929, -1405636, -1207335, -1256111, -1255723, -876857, -366456, -220403, -438053, -604910, -603422, -713643, -1023451, -1247272, -1207793, -1066851, -975097, -863569, -689596, -564831, -537451, -520941, -500006, -551088, -647700, -721724, -889805, -1282581, -1664993, -1617738, -1144881, -722268, -664373, -802466, -865675, -803052, -626867, -326432, -86527, -225688, -736345, -1200997, -1324569, -1246717, -1195809, -1175489, -1153465, -1211708, -1319416, -1290079, -1153244, -1217266, -1542187, -1707358, -1374394, -766113, -317370, -158171, -209093, -447355, -752011, -813207, -575170]
33161e75170R4749l83739n01412k5066M42392L99272J13826J6405L0232n9121
33151d47632r6661P8366J87908m1508l26341k47049L9481N4773k01758k60076
33141a260497N5412L67409L20763K0870k22476k91754k53713j51094L7210K88601
33131a089269M75790M39780J66749j14852j33151Q5837K14681L9720k69246m10111
33121e94072l16386j36509J0582Q7134N4166p7084j76144j35367k5328L1647O7023
33110a210338J74289K70260J59039j46242l51992k21734J24889L47137K69300
33101e85392M6746n6922J0199N9605n0248j96791j56333O6709K17088J21984q6345
33090f09700j65134q2437k2488j07127k42332k74510j96492j10382m1516P7410
$$ y = [-575170, -480421, -864160, -1365572, -1390638, -948246, -548974, -435148, -418743, -388511, -447632, -544293, -465927, -278019, -319527, -645868, -892917, -853436, -798663, -1000421, -1260497, -1205085, -837676, -516913, -496043, -718519, -1010273, -1263986, -1415080, -1377870, -1089269, -613479, -173699, -6950, -121802, -254953, -169116, 45565, 85285, -183961, -594072, -910458, -1046967, -1036385, -949251, -895085, -972169, -1148313, -1283680, -1309008, -1277361, -1210338, -1036049, -765789, -606750, -752992, -1104984, -1326718, -1201829, -854692, -585392, -538646, -595568, -585369, -525764, -576012, -772803, -929136, -862427, -645339, -523355, -609700, -774834, -857271, -879759, -986886, -1229218, -1503728, -1700220, -1810602, -1852118, -1774708]
33080a774708K21282K27225M1285j21900m6550J48238J75798L5207l067J17073
33070i80117J23159q7977k04568R051K99523L14063J25158M111p8428k86119m43323
33059a205467k44973J40846K17836o6244k16702K5878L00483K26492n0104j78568
33049a050523j09373J2737J60667L23581L37177J26600p1349l0590Q2981k8070
33039b46162k72990k74122K8323K23628j63l88084m23666J270M28898L80325q8386
33028f31129m92099m96047k08784Q9099K63495K80553J03813j54066j92632R4983
33018a342814L74281K95227j002j35945q3326r1192j56865p4367P4394K9346p0365
33007a182628J53609N19139L61352l59209p61224k83575M33618M88347K491k27496
$$ y = [-1774708, -1553426, -1326201, -1284916, -1406816, -1453366, -1305128, -1129330, -1094123, -1097190, -980117, -856958, -944935, -1149503, -1140452, -840929, -526866, -401708, -397597, -476025, -762144, -1205467, -1450440, -1309594, -1091758, -1158002, -1374704, -1348826, -1048343, -821851, -871955, -1050523, -1159896, -1147159, -986492, -662911, -325734, -199134, -270483, -301073, -218092, -246162, -519152, -793274, -764951, -541323, -541486, -929570, -1353236, -1351966, -923068, -542743, -631129, -1123228, -1619275, -1828059, -1738960, -1475465, -1194912, -1091099, -1245165, -1437797, -1342814, -968533, -673306, -674308, -810253, -893579, -984771, -1141636, -1216003, -1141609, -1112263, -1182628, -1029019, -509880, -148528, -507737, -1268961, -1552536, -1118918, -630571, -628080, -855576]
32997h55576Q470J91362K9955j73188j38127J0659Q4077Q2833J0127j77829l46545
32986a273782k59817L6305K22667J68241P6185J01141J32385O6411J1833P2450
32976f45981J44625R0640l3793o9530Q011N0974o6933k56613k64969L508K73152
32965g66909K06079q4409j42479J25752K61653o786k81670j50143R5279l6238
32955g79871l26634j71865L35872M50895l9887m60030l15213l070n4605k74958
32945a639366j70856J95290L51507J71008l8039p1675k0251K1261P2152J18830
32935a010139J25005J49743K30267K29211L1193j99574k06213j0177J45269J52259
32925c63156R5372J9227r4626j51573j4628K31630L18744J31746j67979l56679
$$ y = [-855576, -847106, -655744, -625789, -798977, -937104, -926445, -842368, -759535, -749408, -927237, -1273782, -1533599, -1497294, -1274627, -1106386, -1030201, -929060, -796675, -730264, -718431, -645981, -501356, -410716, -444509, -514039, -506028, -455054, -521987, -778600, -1043569, -1040061, -766909, -560830, -645239, -787718, -661966, -400313, -407099, -688769, -838912, -743633, -779871, -1106505, -1278370, -942498, -491603, -531490, -991520, -1306733, -1309803, -1364408, -1639366, -1810222, -1614932, -1263425, -1092417, -1130456, -1202131, -1222382, -1201121, -1128969, -1010139, -885134, -735391, -505124, -275913, -244720, -444294, -650507, -660684, -515415, -363156, -267784, -248557, -343183, -494756, -509384, -277754, 40990, 172736, 4757, -351922]
32915c51922l17626m4578L05778M09282R3391l37918l89744l0050K51880J33821
32905b77686j27168j55018q432J6699r7359j25208k0354N1938N2990J00811J60442
32894d28345M7360j93752k48518q196K17392J52912m7231r4611j3927M114l153
32883f15955J11696K19493O0088k49944k82840M6932L00169J55935j22984j20157
32873d97567J23560K33294N1358k27426l62746k68603J346K60484K84352Q9507
32863c12441j9204J16074K13538j4702l22689k34580J95561L93846Q8678l20217
32853b16136l76223j64811m9906j04658j12076K4414J54590J24580l5523j58321
32843i14070r5469J20598K46023P7421k37525l18464m7874K57810K91962J60998
$$ y = [-351922, -669548, -714126, -408348, 934, 94325, -243593, -633337, -663387, -411507, -277686, -404854, -559872, -568304, -551605, -648964, -774172, -794526, -742588, -689598, -588787, -428345, -380985, -574737, -823255, -831451, -614059, -461147, -508378, -602989, -616916, -612802, -615955, -504259, -284766, -224678, -474622, -757462, -710530, -410361, -254426, -377410, -497567, -374007, -140713, -89355, -316781, -679527, -948130, -946784, -686300, -401948, -312441, -331645, -215571, -2033, -16735, -339424, -574004, -378443, 15403, 104081, -216136, -592359, -757170, -807076, -911734, -1023810, -999396, -844806, -720226, -755749, -914070, -1009539, -888941, -642918, -565497, -803022, -1121486, -1169360, -911550, -619588, -458590]
32833d58590J53722K76301K65158o37l17714m03606k02111O4650J06882j19704
32823f35649l06176j29798K82078M48583J80112j49617j60621p99r308j00015
32813e81210O3750L94072M01051m2264m38348l67584n3391N5140n5350p7291M8011
32802f53414P7102p5060j78025m2612K20858L72704K87009j4211l80292n43329
32792i29270l22636R3922K75442P9099j43133m4879K01353J65826j75889l85004
32782a185169j91099J42253K25550O0554o8379n0741l3758j02113j15674Q0956
32772a237620M26123O70093N73912J03855m76025p42932m93030L999K54517P2876
32762h44232k52622l49505j71567N5247J62548J75093J73730J65035J10282L955
$$ y = [-458590, -304868, -28567, 236591, 235954, -81760, -485366, -687477, -622827, -515945, -635649, -941825, -1071623, -789545, -340962, -160850, -310467, -471088, -471887, -481195, -581210, -517460, -123388, 277663, 235399, -202949, -570533, -623924, -568784, -624134, -701425, -653414, -576312, -651372, -829397, -872009, -651151, -278447, 8562, -5649, -385941, -929270, -1251906, -1157984, -882542, -803443, -946576, -991455, -790102, -624276, -800165, -1185169, -1376268, -1234015, -1008465, -947911, -1016290, -1067031, -1100789, -1202902, -1318576, -1237620, -811497, -141404, 432508, 536363, 60338, -682594, -1175624, -1171625, -917108, -844232, -1096854, -1446359, -1617926, -1562679, -1400131, -1225038, -1051308, -886273, -775991, -772036]
32752g72036j12465j78911j38425L3719K78511M41240L80167J32237q9243j46453
32742a71659j64488l12610m37272j83501M15731P65086L96341l56362p21137m45945
32732a215816j1834J17568M1829O7410J80072J62994J1444q3475o1152l9442p9674
32721i10076j09388o2931M6512J62322J83944J6115k50777l21551m3348L15687
32711i73491L56403P2499j53311q1002J01986R8439j05776k90112k94218j25910
32701a394493J36114M03508N58973M87627J83930j85304l71186k64621m5271j9576
32691e10299k42718m02528k09870J80771L41845J46908o2622L1757K80067K87832
32681a58857l2953l48576l34363n3019J65258J29784j8724k3374J48344K54832
$$ y = [-772036, -884501, -1063412, -1201837, -1168118, -889607, -448367, -68200, 64037, -25206, -171659, -336147, -648757, -1086029, -1269530, -853799, -88713, 307628, -48734, -769871, -1215816, -1227650, -1110082, -1068253, -1000843, -820771, -657777, -646333, -729808, -790960, -830402, -910076, -1019464, -1082395, -1035883, -873561, -689617, -673502, -924279, -1245830, -1289178, -973491, -617088, -544589, -697900, -778902, -676916, -578477, -684253, -974365, -1268583, -1394493, -1258379, -854871, -295898, 191729, 375659, 190355, -180831, -445452, -490723, -510299, -753017, -1155545, -1365415, -1184644, -842799, -695891, -758513, -726756, -446689, -158857, -191810, -540386, -874749, -927768, -762510, -632726, -651450, -674824, -526480, -271648]
32671b71648R3066k17275l66182k45547o5718l3885o8374K7208K04292J98096
32661g45967o1721k70318j15042K82028M63445J74397l41457o29006m91004r8714
32651a833359K60701M15635L38472J07228j17003j84802r7479Q117M4181N9248
32641i99061J05512J32681R7157O7336R3080O3719j25753l17580k25212J42563
32631i65558M13208L15120K1270j33409j14623j33188k25641j96895j2005O1632
32621i70089j30706l07540j02696L74752O18792L66854r1049l17569k27592m9720
32611h36563M6978R8731J82553K71414K66464R8236j87485m02431l47022m5701
32601h54826K25972K44792Q7931l3386p7454j30070j49536r998K03928K18696
$$ y = [-271648, -178582, -395857, -762039, -1007586, -1073304, -1107189, -1175563, -1148355, -944063, -745967, -807688, -1078006, -1193048, -911020, -447575, -273178, -614635, -1243641, -1734645, -1833359, -1572658, -1157023, -818551, -711323, -828326, -1013128, -1110607, -1102490, -1058309, -999061, -893549, -760868, -663711, -596375, -503295, -439576, -565329, -882909, -1108121, -965558, -552350, -237230, -215960, -349369, -463992, -597180, -822821, -1019716, -1031721, -970089, -1100795, -1408335, -1511031, -1136279, -517487, -150633, -241682, -559251, -786843, -836563, -789585, -690854, -508301, -236887, 29577, 127813, -59672, -462103, -809125, -854826, -628854, -384062, -296131, -329517, -406971, -537041, -686577, -696575, -492647, -273951]
32591b73951k4626k26448j32808J11385J96696Q5034j2566q521m1908j98043l34516
32580h60272k69138j0384K83963M83483N30293L84619O2073k70975l71645j80152
32570b18135O4299Q5958p6567j31680L3747J74729N1971k03897k90419j68196
32560f78190m5806j863Q1814K07400J97102K8216o3099M2851J41578O2743j9011
32549d6265J09585K87407J90568j52334l76639k87218o6848L8444k247q8741j49433
32538e43721j54409j19623j29932k19221k34675m004L53431N03995L48129J59838
32528d0192J57322J65941o7664l87822l71184M8955M02377K69173j65894l78813
32518c67801k16089l8058j22599k50884r5858K26319L29253J55232Q298L301q3267
$$ y = [-273951, -298577, -525025, -657833, -546448, -349752, -264718, -277284, -285805, -327713, -525756, -860272, -1129410, -1139794, -855831, -372348, 157945, 542564, 604637, 333662, -37983, -218135, -153836, -67878, -144445, -276125, -242378, -67649, -15678, -219575, -509994, -678190, -723996, -725859, -644045, -436645, -239543, -211327, -274426, -231575, -89997, -27254, -46265, 63320, 350727, 541295, 388961, 12322, -274896, -341744, -303300, -305547, -394288, -543721, -698130, -817753, -947685, -1166906, -1401581, -1405585, -1052154, -548159, -200030, -40192, 117130, 283071, 215407, -172415, -543599, -494644, -92267, 176906, 11012, -367801, -583890, -621948, -744547, -995431, -1091289, -864970, -535717, -380485, -372187, -368886, -452153]
32507d52153k98755k98026R1546M71204M11071R5460r387R0756J5093k49637k78378
32496d11206N8859L26789J83035j30704k15102q4230j8247j03883k14626k68372
32486h77687k46723j02857J23061K32852J24886j8194o46Q4515O1112J6552J38097
32475d65032L03482J84512k30959n33053l95532L7544L66337L69634J46219m2581
32465b59429o477J95903K87726Q2935k53411l92007k55792o1270L9646J09864
32455e12312J71227P8416j99695m01809k84467M2239K78274K93776J40450j29523
32445e23424m03043m08603j0397M58471N09404J59699p8629N5140K26980R6628
32435H2226j31332p5012J83049K36558K728j92548j57918p2812j08879j60576
$$ y = [-452153, -750908, -1048934, -957388, -486184, -75113, 20347, 10960, 101716, 116809, -132828, -411206, -352347, -25558, 157477, 26773, -188329, -272559, -290806, -394689, -609315, -877687, -1124410, -1227267, -1104206, -871354, -746468, -764662, -765308, -680793, -619681, -603129, -465032, -161550, 22962, -207997, -741050, -1136582, -1099038, -732701, -363067, -216848, -259429, -265906, -70003, 217723, 300658, 47247, -344760, -600552, -661822, -622176, -512312, -341085, -262669, -462364, -864173, -1148640, -1106401, -828127, -534351, -393901, -523424, -926467, -1335070, -1345467, -886996, -377592, -217893, -296522, -241382, -14402, 82226, -49106, -124118, 58931, 295489, 298217, 105669, -52249, -125061, -233940, -394516]
32425c94516j01266l5576j03392k16777j86471l299J66626K04826J37615M8050
32415d84180k2278q9423j68725j97978p8437J50927K86916K35886J84654K95635
32405A12997L72508J41458k28927k95319k6946J24986o1383k69775k37698j77819
32395e45918l02480l67556j03378K48135K87704Q9163Q997P0112J5497j62918
32385g62642k20573j06721P205P1827J44165J35985j7627p5167J70528M13438
32375b39582K29051j67352j75548K12201L68617M8000k46999j23397J24724J03753
32365A33468p8625j52141j43023j45557o5834Q0610M1417j86664k02681J16378
32355f02652K69128r2154n06907l71202J30465L54665J70365j0792K0353R0427
$$ y = [-394516, -495782, -531358, -634750, -851527, -1037998, -1041297, -874671, -669845, -532230, -484180, -506458, -595881, -764606, -962584, -1041021, -890094, -603178, -367292, -182638, 112997, 485505, 626963, 398036, 102717, 75771, 200757, 139374, -130401, -368099, -545918, -848398, -1215954, -1319332, -1071197, -783493, -694330, -685333, -615221, -599724, -762642, -983215, -1089936, -1082731, -1010904, -866739, -730754, -748381, -823548, -653020, -239582, -10531, -177883, -353431, -141230, 227387, 275387, 28388, -95009, 29715, 133468, 54843, -97298, -240321, -385878, -451712, -371102, -329685, -516349, -719030, -602652, -333524, -425678, -932585, -1303787, -1173322, -818657, -648292, -659084, -638731, -548304]
32345e48304R8532J14451R4189l2840q9127Q3836K17674k5276m14604m25506o6339
32334i93314J58019P9366L1048J30214O2126k35150l07146P6316M47714L09110
32324b41697j26696k84344l8241K31335K30808M3739j03771r8781K4961J48703
32314b13984J73026J15947M9102m3873j97312k87315j59424O8282J11632l5323
32304d19242q4256M1559N4657j77920l38385j50973J49454J84586K6770L7000
32294f76750K53793L49721J71286m1715m4690Q4560J27691M9589N0O7436J39409
32283D80380L6619k24606l69066j74535J73343K31690j24015m88667m49966j28400
32273a037223M2860o0447j53244k1462K07177L29533L31908K65493Q6018j95828
$$ y = [-548304, -449772, -335321, -241132, -273972, -363099, -279263, -61589, -86865, -501469, -926975, -993314, -835295, -755929, -724881, -594667, -532541, -767691, -1074837, -998521, -550807, -241697, -368393, -652737, -690978, -459643, -228835, -185096, -288867, -387648, -362687, -213984, -40958, 74989, 124091, 80218, -117094, -404409, -563833, -495551, -383919, -419242, -503498, -461939, -407282, -585202, -923587, -1074560, -925106, -740520, -713750, -676750, -422957, -73236, 98050, 56335, 11645, 96205, 223896, 273485, 273535, 340971, 480380, 516999, 292393, -76673, -251208, -77865, 153825, 29810, -458857, -908823, -1037223, -994363, -1054810, -1208054, -1229516, -1022339, -692806, -360898, -95405, -9387, -205215]
32263b05215l62753k16696J09942K82687J92183M6719J1695r469j15120j49342
32253d15369N4892L10421K64154o4002k53151q2401J49681R7237j11694j20020
32243a70252P1141J21439q6048k55500j35105J14036J64791k9365k07553j57439
32233e69855L9309J37268L8159r9057q9906J4916L4955k3715J1867J25071P8720
32222c02268j36068j68223J29275L51765J31664k35793k43765j460j393k00194
32212f76460n6385M61063O49080J21372n63945p13829m03109j24128O092J64578
32202a135671K88855J88175l694R77J36574J08681o0690o7606J23770K04298L5775
32191a80556j40592j02896N6915J40917R7336k8369j84099k69391j81944J7209
$$ y = [-205215, -567968, -784664, -674722, -392035, -199852, -153133, -141438, -150907, -266027, -415369, -360477, -50056, 214098, 150096, -103055, -185456, -35775, 61462, -50232, -170252, -99111, 22328, -63720, -319220, -454325, -340289, -175498, -204863, -412416, -569855, -530546, -393278, -355119, -454176, -544082, -529166, -494211, -517926, -506059, -380988, -302268, -438336, -606559, -477284, -125519, 6145, -229648, -473413, -474873, -476266, -676460, -732845, -271782, 377298, 498670, -65275, -779104, -1182213, -1306341, -1300249, -1135671, -846816, -658641, -662335, -661358, -524784, -416103, -476793, -544399, -420629, -216331, -180556, -321148, -424044, -367129, -226212, -128876, -157245, -341344, -610735, -792679, -775470]
32181g75470J26762N1250q8639j24750k6920R4633J09895J4663j6657J73341M39286
32170b2606M37860J24984j08925j1908J04531j34080m79135l74930J33409L81201
32160E0401O7331k92095j54461K62584L78530J17632r7459q0467j09114l49600
32150b06718m86476j92996K82237L64482m5306l74576j45918L38808M03705m9480
32140a12238m21850k94591K8704Q9776k5807L3798K02451J19060j83887k73063
32130h37647l1332J49426M0935n7175J15650L01970J85863l4275L735J55274j2927
32119b0503m33810n34412j00039L64267L56571M7707q5511K7189J06544Q8012
32109a83985J55294K53806N6877m50098p65120n02185P2169M22708M23468L22951
$$ y = [-775470, -648708, -597458, -686097, -810847, -837767, -743134, -633239, -618576, -635233, -461892, -22606, 415254, 540238, 431313, 419405, 523936, 389856, -89279, -464209, -330800, 50401, 117732, -174363, -328824, -66240, 312290, 429922, 332463, 251996, 142882, -206718, -693194, -886190, -603953, -239471, -284777, -659353, -805271, -466463, -62758, -112238, -534088, -828679, -799975, -710199, -736006, -702208, -499757, -380697, -564584, -837647, -868979, -719553, -678618, -735793, -620143, -318173, -132310, -166585, -162850, -7576, -20503, -454313, -988725, -1088764, -724497, -367926, -320219, -405730, -378541, -271997, -183985, -28691, 225115, 281992, -168106, -933226, -1435411, -1363242, -940534, -517066, -194115]
32099a94115K34639P3095r9497r8917P717l4612j93389j63025O5576J24852p2734
32088c50410j10481K02471L88288M9106l76910k19159L51240N48555J66474j76073
32078D73101n8468J62068N4371j86813j53984O4735O0774k17860m00053k56155
32068d58284Q193P6960p0497j76577m8911J94006K59585N7892j64735j58153q522
32057d89043L7031k2014K2077J81227K22797O9186n9938n271J09292J33130J03380
32046C01854O2785o8960k62261k73691o370K39156J36188k00967l83737k75006
32036g31009r1167l6442p1926n1254P9859K33566K46589M2335k15353k40310K0396
32025h14716K86736L07042J55352L0271n1092j50995j77631k8493J39638P4116
$$ y = [-194115, 40524, 113619, 14122, -84795, -77078, -111690, -305079, -468104, -402528, -277676, -350410, -460891, -258420, 129868, 178974, -197936, -417095, -65855, 482700, 649174, 473101, 414633, 576701, 631072, 444259, 290275, 355010, 415784, 197924, -202129, -458284, -450091, -373131, -443628, -620205, -669116, -475110, -215525, -157633, -322368, -480521, -489043, -452012, -474026, -451949, -270722, -47925, 21261, -38677, -43948, 65344, 198474, 301854, 364639, 295679, 33418, -240273, -246643, -7487, 128701, -72266, -456003, -731009, -822176, -858618, -930544, -981798, -901939, -668373, -421784, -379449, -594802, -835112, -814716, -527980, -220938, -65586, -35315, -86407, -237402, -415033, -443526, -303888, -229772]
32015b29772j83485l36168k36842J68K65391N32834O50522L92159j41949m65924
32005B46934k76407J16478J80920j31832l55197j65159K04171L13698R5801j12659
31995A16748m2412J98760L17519J79774j15826l83382m53081k38674J30946L16672
31985B7044J10382k46569l04989J1964L09718K68074K1941j37808j76071k04569
31975c20883j89152n8066N3136j7649j32580l7978J85408K13454R909j20666o5901
31964d80968o9119k03299j20305L60720P75003N60550j25219n98586n56304l20506
31954g78033j97927r9448Q0513J78385J02607P5819K32183K97834L1976k82982
31944c59073k13992J47799L37363K24198R3327P1819j3093j69598j59128K846
$$ y = [-229772, -413257, -749425, -986267, -986099, -720708, -187874, 462648, 854807, 712858, 246934, -29473, 87005, 267925, 136093, -219104, -384263, -180092, 133606, 229407, 116748, 74336, 273096, 590615, 770389, 654563, 271181, -181900, -420574, -289628, 27044, 137426, -109143, -414132, -402168, -92450, 175624, 197565, 59757, -116314, -320883, -510035, -568101, -514965, -532614, -665194, -703172, -517764, -304310, -294401, -415067, -480968, -550087, -753386, -873691, -512971, 262032, 822582, 697363, 98777, -457527, -778033, -975960, -1075408, -994895, -816510, -713903, -638084, -405901, -108067, -76091, -359073, -573065, -425266, -87903, 136295, 229622, 301441, 288348, 118750, -40378, -37532]
31934c7532j9468k62102k96110N1964L34956J99999l1092M8523K24804J02091
31924C16033j52128j41738J885r5314k63252p1767K62313J25308l66866m27681
31914h13207Q0448L46126m9390m25350j55012L18207L09011L2262R2972L56329
31904I2396K37028j86251k59712J34105L89481J65880j58181j81744k8281K8579
31894B33300P056L4151O8475K7914m5767r3164j15135q5468J2173N4063p9789
31883A7809k42128j72348Q1084J85464R486k02110k08662p0353K3892J3771l3029
31872e97124k8840O0218J34310J4736k66912l61555l0285M38150N46856K49440
31862A58994m6789q5848q451K645l9914q4592j16115n2007J34511K18749M09k80665
$$ y = [-37532, -57000, -319102, -615212, -563248, -228292, -28293, -59385, -10862, 213942, 316033, 163905, 22167, 24052, -71262, -334514, -406281, -143968, -18660, -385526, -813207, -732759, -386633, -436023, -861373, -1016385, -698178, -389167, -356905, -263933, 92396, 329424, 143173, -116539, 17566, 407047, 572927, 414746, 233002, 204721, 233300, 240356, 274507, 342982, 370896, 325129, 231965, 116830, 31362, 43535, 97598, 17809, -224319, -396667, -315583, -130119, -120633, -322743, -531405, -601758, -577866, -564095, -597124, -625964, -565746, -431436, -416700, -683612, -1045167, -1075452, -637302, -90446, 158994, 112205, 26357, 17906, 20551, -19363, -103955, -220070, -272077, -137566, 81183, 81592, -199073]
31850a99073k34214J4171k7400l66296m30622J743L93143K80097l8005o3769J17231
31839e52994J23804j0219L5237K34830K36996o0458l67373m05490j61369J93452
31829g33584L94081K26840j73175l40009n5615K93257K44773p0917j75743K6787
31819c63305K02545J62076M6392k1137o1919l7491J02605J85405L815k80153l15218
31808c76385j22059m0392j19198o2580J45324J16313k40267m25981r1141L82587
31798h33779M36246J20520j00530o6518P036O54N36K2255l848l1945o7l4261k29111
31785g12812l46709j20053K40867K89380M3169m6996J42641K15760l8355k82015
31775f15123k20852n6201j3019J02645M29181N65013J39291m35335m35771R8349
$$ y = [-199073, -433287, -419116, -446516, -812812, -1243434, -1241691, -848548, -568451, -606456, -670225, -552994, -429190, -439409, -404172, -169342, 67654, 7196, -360177, -765667, -927036, -733584, -339503, -112663, -285838, -625847, -681462, -388205, -143432, -214349, -390092, -363305, -160760, 1316, 47708, 26571, -35348, -72839, 29766, 215171, 218986, -61167, -376385, -498444, -538836, -658034, -720614, -575290, -458977, -699244, -1125225, -1216366, -833779, -397533, -277013, -377543, -444061, -437025, -436371, -435835, -413580, -417428, -449373, -449440, -483701, -712812, -1059521, -1179574, -938707, -649327, -606158, -653154, -510513, -294753, -333108, -615123, -835975, -892176, -905195, -802550, -373369, 191644, 330935, -104400, -540171, -441822]
31765d41822M30496K27794q1798j34952j33538k79595l24810n9458K30921K16669
31755c50093N4777M6907R1494o3276k70109j83939J22234K21720j2563k30606
31745e73454j25295J88732L88288L16603Q9817n1707n219M7467j08962l13789
31735a47519j80687K36247L58176o1035m48655k26045L00789M33415J32141r3595
31725C03232j07351k07800l79595k62239J11741K87034J69759J23118J93156J4854
31715B45909l51418l23496J79123M49905J31798j83546r006J92754j08339n09315
31705b85631l79307J5664M566k93233k21861K18064L93760J66566O8366K92596
31695b0450L60035j3045m34774m88440k79279p2351J11754K75628K52845J3568
$$ y = [-441822, -11326, 216468, 134670, -282, -133820, -413415, -738225, -797683, -566762, -350093, -295316, -248409, -156915, -220191, -490300, -674239, -552005, -330285, -342848, -573454, -698749, -510017, -121729, 194874, 284691, 232984, 227765, 275232, 166270, -147519, -328206, -91959, 266217, 205182, -243473, -469518, -168729, 264686, 396827, 303232, 195881, -11919, -391514, -653753, -542012, -254978, -85219, 37899, 231055, 245909, -105509, -429005, -249882, 200023, 331821, 148275, 139269, 332023, 223684, -285631, -664938, -649274, -644708, -937941, -1159802, -941738, -547978, -381412, -313046, -20450, 339585, 326540, -108234, -596674, -875953, -948304, -836550, -560922, -308077, -294509]
31685b94509j69652r6383Q4019J38591N2382o3983j41060j30366k4411N8547J4557
31674e72268l7076P5513K52177K59801J31778Q6441J06593n518j90722j92479
31664h5760n8261j04180l20196l12846K6420K93789K17277O0657J20216K40737
31654G7853J53271n0185j19205o3357n5894j14546j37254r3431J0498J76672K85749
31643G0171J52432j46984k67424p2290J65900K05864J55790J50597O9076j46706
31633C36426k30988n510K32432J19131k01410l06223j23423N6235O3810l3834
31623i3354j99017m18352n01089k63633J05064K18453M1236o9311R8921L52087
31613g28995M32442L32680J73419J3074j05195j10246k0140L6334m321n9768n0207
$$ y = [-294509, -464161, -560544, -476525, -337934, -285552, -349535, -490595, -620961, -645372, -586825, -572268, -609344, -533831, -281654, -21853, 109925, 196366, 302959, 297441, 106719, -85760, -144021, -248201, -568397, -881243, -854823, -561034, -343757, -283100, -162884, 77853, 231124, 180939, 61734, -1623, -57517, -172063, -309317, -402748, -392250, -215578, 70171, 222603, 75619, -191805, -264095, -98195, 107669, 263459, 414056, 483132, 336426, 105438, 99928, 332360, 451491, 250081, -56142, -179565, -123330, -59520, -93354, -292371, -710723, -1211812, -1475445, -1370381, -1151928, -1110692, -1180003, -1081082, -728995, -296553, 36127, 209546, 222620, 117425, 7179, -12961, 23373, 19052, -40716, -90923]
31602i0923j3349k2250q0829j35518j24756k2471J01517J10137k0184j12968r920
31591d21514J91917K71859J87125N8620q3562k96702m71166l61506K6101L20671
31581e78157K37300l0479q0646J40875K96621J56671j00472j77487o1079L4134
31571a62719K2268L8241J76076L27625L48939K36300N0181j92682m34577n18476
31561a08824l68433j29673J7874P6811J05890K7149k00845l43121j35283K76848
31551g81607M64499K86134K2353p7518n8776k0221N4775J28766Q2421m0737o2448
31540b359j9453j30545l19861k04695K53741N40587L18907n4276j12687J1940
31530B81299p0937k83864k35363Q4190K92791K21815N6743p9165k31095l19756
$$ y = [-90923, -104272, -126522, -207351, -342869, -467625, -490096, -388579, -278442, -298626, -411594, -421514, -229597, 42262, 229387, 288007, 204445, -92257, -563423, -924929, -898828, -578157, -340857, -371336, -451982, -311107, -14486, 142185, 41713, -135774, -196853, -162719, -140451, -102210, 73866, 401491, 750430, 986730, 1036911, 844229, 409652, -108824, -477257, -606930, -589056, -512245, -406355, -379206, -580051, -923172, -1058455, -781607, -317108, -30974, -8621, -86139, -144915, -165136, -110361, 18405, 100826, 60089, -2359, -21812, -152357, -472218, -676913, -423172, 117415, 436322, 382046, 269359, 281299, 210362, -73502, -308865, -224675, 68116, 289931, 346674, 267509, 36414, -283342]
31520b83342j85986L8014J6092k60234m05525k05287R7867K06627J44292P3916
31510g63566J3848p1799q6628R1645L91187N62833M16029K3565l00188k92175
31500a5249n0896O8398o8764j99766r6213P5605O0628n2178k0015J16880J48562
31489c3008J02954J55944K41561J54576l4374q1428k9292j26095l22421l25371
31479b96954j55740j36188k65847j61480K27730M13701J46216j24967N9157M37530
31469A43158M33060p115m13952m55659k07089J11660L14123K43687r4258m15303
31459c47688m04090o8963L01063M66425L83443J25718j63025l04251k31817o9766
31449c12951K9144N0838N2621M0294O709j3966k1236p2585j54474j43318K3505
$$ y = [-283342, -469328, -431314, -415222, -675456, -1080981, -1286268, -1188401, -981774, -837482, -763566, -749718, -821517, -908145, -816500, -425313, 137520, 553549, 577114, 276926, -15249, -66145, 2253, -66511, -266277, -362490, -286885, -226257, -278435, -298450, -181570, -33008, 69946, 225890, 467451, 622027, 587653, 506225, 476933, 350838, 28417, -296954, -452694, -588882, -854729, -1016209, -788479, -374778, -228562, -353529, -294372, 143158, 576218, 569103, 155151, -300508, -507597, -395937, -81814, 161873, 67615, -347688, -751778, -820741, -519678, -53253, 330190, 455908, 292883, -11368, -243185, -312951, -283807, -232969, -180348, -140054, -133345, -147311, -168547, -241132, -395606, -538924, -515419]
31438e15419K38275L43036K65929K9343k46472l61879k32575m4127j0286l4615
31428e68790J01833K72471J29271k69110m16472j03230K50846K52456R2918J20538
31418a37269K41192J62593n2537j25205o0833q1136j80221j54303o073N1316k7688
31407c70164n8156N3100J78292J75543M4716j03185j14601P4942K82941K33746
31397C97174k0591j03898R1094J65136j45488m64170l37673K1454R5034p5887
31387c77815j1857L27203M45511J37913j99653k33886j27049j03105p2375M4110
31377a71003L8920k09113m07560k33919J68396L83895K75335P4382k214o749j24259
31366b13889l88286n65126l71582J26435M53807K60144j84757l09623q31L04486
$$ y = [-515419, -277144, 65892, 331821, 361164, 114692, -247187, -479762, -523889, -534175, -568790, -466957, -194486, -65215, -334325, -750797, -854027, -603181, -350725, -257807, -137269, 103923, 266516, 213979, 88774, 27941, -53195, -233416, -387719, -393792, -342476, -370164, -428320, -375220, -196928, -21385, 23331, -79854, -194455, -119513, 163428, 397174, 376583, 272685, 363779, 528915, 383427, -80743, -418416, -396962, -301928, -377815, -389672, -62469, 383042, 520955, 321302, 87416, -39633, -142738, -215113, -171003, -132083, -341196, -748756, -982675, -814279, -430384, -155049, -80667, -82881, -89630, -213889, -602175, -1167301, -1538883, -1412448, -958641, -698497, -883254, -1192877, -1193708, -889222]
31356h89222K97307J67329J62844J66630k5748k74109k52063P7992L89980L65314
31346A86254J3494l45626l76649p0153K27870K34120Q8012Q6879J73539M2448
31336B60188k69958l47828o2028J75219N6321j29131J3364L23774L35392j3695
31326C41618l28970l31108j19579J00717K37552K43829J00648q0907j30554k8904
31316D342Q5433J08174M0188r3892k43641k75662q5901K13270L54342K08550o0777
31305B54426j75267l5645J81419K23420N5072j09852j14444p7181j60012k47051
31295b05115j17286J33733J87544K6670k2452J41582K04940J48j73538p7174L3008
31284A32060j16967k77006r2529K27788K23744l3705q2546J01204O9073k63010
$$ y = [-889222, -591915, -424586, -261742, -95112, -120860, -394969, -647032, -569040, -179060, 186254, 199748, -145878, -522527, -592680, -364810, -130690, -42678, 44201, 217740, 260188, -9770, -357598, -419626, -244407, -188086, -317217, -303853, 19921, 355313, 341618, 12648, -318460, -438039, -337322, -99770, 144059, 244707, 163800, 33246, 4342, 89775, 197949, 238137, 144245, -99396, -375058, -460959, -247689, 106653, 315203, 254426, 79159, 43514, 224933, 448353, 503425, 393573, 279129, 201948, 41936, -205115, -322401, -188668, -1124, 25546, 3094, 144676, 349616, 349764, 176226, 99052, 132060, 15093, -261913, -354442, -126654, 97090, 63385, -19161, 82043, 151116, -111894]
31274a11894m01859r9151K09013J08452j43802r2614J69588K13059K373p9575
31264b26410J16372K68868R1661k35404l10891l7331K60264K31230p7070k77123
31254a95834j38271J01891O8626k08094l41523j63583O9327J37743J80379L39619
31244a49720M07542J65805j54723j75471o635j09687n18690o92026l10123K16505
31234a327223L42295J55203J41492L80780M59615J82315j01699o4839O9033j13845
31224A23127n18978n88906o4180O02934P48561K58796l33810m70101j45900J58514
31214b29943N6163l19939m95643k16471K60742M70716K51268j32640l23527k17216
31204h96490J5853J43119P1386r4929j68103p5687Q0634J94883K92620L98882
$$ y = [-111894, -513753, -612904, -403891, -295439, -439241, -531855, -362267, -149208, -146835, -226410, -110038, 158830, 250491, 15087, -295804, -333135, -72871, 158359, 81289, -195834, -334105, -232214, -163588, -371682, -713205, -876788, -807461, -669718, -489339, -149720, 257822, 423627, 268904, 93433, 86798, -22889, -541579, -1233605, -1543728, -1327223, -984928, -829725, -688233, -307453, 152162, 334477, 232778, 167939, 236972, 123127, -395851, -984757, -1048937, -446003, 302558, 561354, 227544, -242557, -388457, -229943, -173780, -493719, -989362, -1205833, -945091, -474375, -223107, -355747, -679274, -896490, -880637, -737518, -666132, -761061, -929164, -1004851, -924217, -729334, -436714, -37832]
31194c7832L87654J58256j09878j32920N5106J34641m371j13421m2670o269j71607
31183A16689l03936j52014O0719m9729l59984l55293P8932M33456K87875j21882
31173c65167k82110q7882J25356J00081o1740j19625k188J59448K10094J25382
31163a98351R669l0587R618N7319M6810m3780j85723k79145j97901O8920L56261
31152c86890M69001L58363J20520j07822k11448j56991n2069l4324n7318M7287
31142a1691K36871K34207k7932k23899j23955K7986n6524j93264o5614J62732
31132d1083J07097j29103j13382J16792Q9320k17482k48911J58590L98710N6386
31122A76934l90815l26601Q0174K74163K06629J99949K30996K2785l03545l09521
$$ y = [-37832, 349822, 508078, 398200, 265280, 320386, 455027, 450656, 337235, 294565, 288296, 116689, -187247, -339261, -278542, -328271, -688255, -1043548, -964616, -531160, -243285, -365167, -647277, -735159, -609803, -509722, -571462, -691087, -693275, -533827, -323733, -198351, -188682, -219269, -209651, -152332, -105522, -149302, -335025, -614170, -812071, -743151, -386890, 82111, 440474, 560994, 453172, 241724, 84733, 32664, -1660, -58978, -11691, 225180, 459387, 431455, 207556, 83601, 111587, 55063, -138201, -203815, -41083, 66014, -63089, -176471, -59679, 29641, -187841, -436752, -278162, 120548, 176934, -213881, -540482, -460308, -186145, 20484, 220433, 451429, 474214, 170669, -138852]
31112a38852M6581L14691K12615n2426j63417m1956J92366L13028R0851m01229
31102C72252o99084m76644m656K64962L35605M28582L81899o7728n69238m91515
31092e25565L1560J92811k13869m30447M7170O64984P00030L00778O3893P9985
31082I11330J9105j89115l48460m21400m57735l26723K2962K81585K11274R5048
31072b02129K67749M80509K99355j06098k16401l9618l8104k44504j89146K11741
31062B23354M09190Q0931l75561m90275l38420k07273j09240L5144J14198O4515
31052e93437P5583K47980L42655J63186j00849k01150k04970k37140j63140J02123
31042e69159K65083P3734j72946l7614K95702K38127k59111n54818k44543K70934
$$ y = [-138852, -92271, 222420, 435035, 382609, 219192, 177236, 369602, 682630, 773481, 372252, -326832, -803476, -808132, -543170, -207565, 221017, 602916, 535188, -34050, -525565, -494005, -301194, -515063, -945510, -898340, -233356, 466674, 767452, 831345, 911330, 930435, 741320, 392860, -28540, -486275, -812998, -790036, -508451, -297177, -202129, 65620, 546129, 845484, 739386, 522985, 483367, 445263, 200759, 11613, 223354, 632544, 713475, 337914, -152361, -490781, -698054, -807294, -772150, -657952, -593437, -517854, -269874, 72781, 235967, 135118, -66032, -271002, -508142, -671282, -569159, -304076, -230342, -403288, -440902, -145200, 92927, -166184, -721002, -965545, -694611]
31032f94611M00845J51754m1397r128K2314r0901j68120k6341J97498K18384L70
31021c9333j92690j52267J8535Q7547J1864p6637j24203j83699k09906p6020J52061
31010g84748K18665P1414j1840J35936K72705J50880k5792R0210L82742L91177
31000H91349K314l81657m24893k47793j19362p5844j9573M0776L8398j6652r3512
30989d06449k06615l24616l41035k19894m9128J01042K27803K79371J91457Q8016
30979f60048J97733M65600N10774J47313k88956l61051r2685J35737J08090o6052
30969I6455k04966k12657m9040K17054L67087K60870N9101Q767P3891K7684j44286
$$ y = [-694611, -293766, -142012, -183409, -192537, -170223, -261124, -429244, -455585, -258087, -39703, -39333, -232023, -384290, -365755, -278208, -266344, -342981, -467184, -650883, -860789, -936809, -784748, -566083, -494669, -506509, -370573, -97868, 53012, 27220, 117430, 500172, 891349, 893663, 512006, 87113, -160680, -280042, -355886, -375459, -334683, -296285, -312937, -406449, -613064, -937680, -1278715, -1498609, -1547737, -1446695, -1218892, -939521, -748064, -660048, -462315, 3285, 514059, 661372, 372416, 11365, -81320, 54417, 162507, 96455, -108511, -321168, -370208, -153154, 213933, 474803, 533904, 542671, 616562, 644246, 499960]
$$ [...]
##END NTUPLES=NMR SPECTRUM
##END=
