##TITLE=31Pdec_LY-TMF-2.5.R.t
 D2O, 24 sc
 27.2.2020
##JCAMPDX= 6.0         $$ Bruker NMR JCAMP-DX V2.0
##DATA TYPE= NMR SPECTRUM
##DATA CLASS= NTUPLES
##ORIGIN= UXNMR, Bruker Analytische Messtechnik GmbH
##OWNER= root
$$ XWIN-NMR		Version 3.5
$$ Thu Feb 27 14:10:06 2020 Russian Standard Time (UT+4h)  she@DPX200
##.OBSERVE FREQUENCY= 81.013821
##.OBSERVE NUCLEUS= ^31P
##.ACQUISITION MODE= SIMULTANEOUS
##.ACQUISITION SCHEME= undefined
##.AVERAGES= 24
##.DIGITISER RES= 17
##SPECTROMETER/DATA SYSTEM= spect
##.PULSE SEQUENCE= zgpg30
##.SOLVENT NAME= CDCl3
##.SHIFT REFERENCE= (INTERNAL, CDCl3, 0, 182.463)
##AUDIT TRAIL= $$ (NUMBER, WHEN, WHO, WHERE, WHAT)
$$ ##TITLE= Audit trail, XWIN-NMR		Version 3.5
$$ ##JCAMPDX= 5.01
$$ ##ORIGIN= Bruker BioSpin GmbH
$$ ##OWNER= she
$$ F:/spectra/data/she/nmr/P31/1/pdata/1/auditp.txt
$$ ##AUDIT TRAIL=  $$ (NUMBER, WHEN, WHO, WHERE, WHAT)
(   1,<2020-02-27 14:08:52.09 +0400>,<she>,<DPX200>,
      <created by zg, POWCHK disabled, PULCHK disabled
       configuration hash MD5:
       00 E9 B6 7A A2 85 ED C7 34 08 36 98 17 FE 4E 26
       data hash MD5: 32K
       03 24 7E FF 63 AA 74 4F 20 BD 74 5E 63 58 4A C5>)
(   2,<2020-02-27 14:08:54.75 +0400>,<she>,<DPX200>,
      <Start of raw data processing
       efp BC_mod = 2 LB = 1 FT_mod = 6 PKNL = 1 PHC0 = -1518.905 PHC1 = 111.4013 SI = 64K 
       data hash MD5: 64K
       F1 2E A9 0F E3 BA 86 A9 40 22 DE 18 A3 65 20 07>)
(   3,<2020-02-27 14:09:26.42 +0400>,<she>,<DPX200>,
      <pk PHC0 = -16.40746 PHC1 = 35.8 
       data hash MD5: 64K
       CC 10 15 27 BF 28 76 8F 84 26 4F 92 50 56 DF 13>)
(   4,<2020-02-27 14:09:29.43 +0400>,<she>,<DPX200>,
      <abs ABSG = 5 
       data hash MD5: 64K
       E0 60 4D 03 A6 89 59 3C 92 CE 65 9B 47 EB 5B 8B>)
$$ ##END=
$$ 
$$ hash MD5
$$ 73 50 D3 94 41 2F 16 C3 B8 62 3B 08 4A 3B 4E 3B
##$RELAX= 
##$RELAX= 
##$RELAX= 
##$RELAX= 
##$RELAX= 
##$RELAX= 
##$RELAX= 
##$RELAX= 
$$ Bruker specific parameters
$$ --------------------------
##$DU= <F:/spectra>
##$EXPNO= 1
##$NAME= <P31>
##$PROCNO= 1
##$TYPE= <nmr>
##$USER= <she>
##$AMP= (0..31)
100 100 100 100 100 100 100 100 100 100 100 100 100 100 100 100 100 100 
100 100 100 100 100 100 100 100 100 100 100 100 100 100 
##$AQSEQ= 0
##$AQ_mod= 1
##$AUNM= <au_zg>
##$AUTOPOS= <>
##$BF1= 81.014009
##$BF2= 200.13
##$BF3= 200.13
##$BF4= 200.13
##$BF5= 200.13
##$BF6= 200.13
##$BF7= 200.13
##$BF8= 200.13
##$BYTORDA= 1
##$CFDGTYP= 0
##$CFRGTYP= 5
##$CHEMSTR= <none>
##$CNST= (0..31)
1 1 145 1 1 1 1 1 1 1 1 1 1 1 1 1 1 1 1 1 1 1 1 1 1 1 1 1 1 1 1 1 
##$CPDPRG= <waltz16>
##$CPDPRG1= <>
##$CPDPRG2= <waltz16>
##$CPDPRG3= <>
##$CPDPRG4= <mlev>
##$CPDPRG5= <mlev>
##$CPDPRG6= <mlev>
##$CPDPRG7= <mlev>
##$CPDPRG8= <mlev>
##$CPDPRGB= <>
##$CPDPRGT= <>
##$D= (0..31)
0 1 0 0 0 0 0 0 0 0 0 0.03 2e-05 3e-06 0 0 0 0 0 0 0 0 0 0 0 0 0 0 0 0 
0 0 
##$DATE= 1582798131
##$DBL= (0..7)
120 120 120 11 120 120 24 19 
##$DBP= (0..7)
150 150 150 150 150 150 150 150 
##$DBP07= 0
##$DBPNAM0= <>
##$DBPNAM1= <>
##$DBPNAM2= <>
$$ [...]
##$SUBNAM3= <"">
##$SUBNAM4= <"">
##$SUBNAM5= <"">
##$SUBNAM6= <"">
##$SUBNAM7= <"">
##$SUBNAM8= <"">
##$SUBNAM9= <"">
##$SW= 369.568048894756
##$SWIBOX= (0..15)
0 1 3 0 0 0 0 0 0 0 0 0 0 0 0 0 
##$SW_h= 29940.119760479
##$TD= 32768
##$TD0= 1
##$TE= 0
##$TE2= 300
##$TE3= 300
##$TEG= 300
##$TL= (0..7)
0 120 53 12 22 120 120 120 
##$TP= (0..7)
150 150 150 150 150 150 150 150 
##$TP07= 0
##$TPNAME0= <>
##$TPNAME1= <>
##$TPNAME2= <>
##$TPNAME3= <>
##$TPNAME4= <>
##$TPNAME5= <>
##$TPNAME6= <>
##$TPNAME7= <>
##$TPOAL= (0..7)
0.5 0.5 0.5 0.5 0.5 0.5 0.5 0.5 
##$TPOFFS= (0..7)
0 0 0 0 0 0 0 0 
##$TUNHIN= 0
##$TUNHOUT= 0
##$TUNXOUT= 0
##$USERA1= <user>
##$USERA2= <user>
##$USERA3= <user>
##$USERA4= <user>
##$USERA5= <user>
##$V9= 5
##$VALIST= <valist>
##$VCLIST= <CCCCCCCCCCCCCCC>
##$VD= 0
##$VDLIST= <DDDDDDDDDDDDDDD>
##$VPLIST= <PPPPPPPPPPPPPPP>
##$VTLIST= <TTTTTTTTTTTTTTT>
##$WBST= 1024
##$WBSW= 4
##$XGAIN= (0..3)
0 0 0 0 
##$XL= 0
##$YL= 0
##$YMAX_a= 2859
##$YMIN_a= -1496
##$ZGOPTNS= <>
##$ZL1= 120
##$ZL2= 120
##$ZL3= 120
##$ZL4= 120
##$ABSF1= 182.463
##$ABSF2= -187.1042
##$ABSG= 5
##$ABSL= 3
##$ALPHA= 0
##$AQORDER= 0
##$ASSFAC= 0
##$ASSFACI= 0
##$ASSFACX= 0
##$ASSWID= 0
##$AUNMP= <proc_1d>
##$AZFE= 0.1
##$AZFW= 0.5
##$BCFW= 0
##$BC_mod= 2
##$BYTORDP= 0
##$COROFFS= 0
##$CY= -3
##$DATMOD= 1
##$DC= 0
##$DFILT= <>
##$DTYPP= 0
##$F1P= 0
##$F2P= 0
##$FCOR= 1
##$FTSIZE= 65536
##$FT_mod= 6
##$GAMMA= 0
##$GB= 0
##$INTBC= 1
##$INTSCL= 5.30512e-09
##$ISEN= 30
##$LB= 1
##$LEV0= 0
##$LPBIN= 0
##$MAXI= 10000
##$MC2= 0
##$MEAN= 0
##$ME_mod= 0
##$MI= 50
##$NCOEF= 0
##$NC_proc= -7
##$NLEV= 6
##$NOISF1= 182.463
##$NOISF2= 159.3651
##$NSP= 0
##$NTH_PI= 0
##$NZP= 0
##$OFFSET= 182.463
##$PC= 4
##$PHC0= -1535.312
##$PHC1= 147.2013
##$PH_mod= 1
##$PKNL= yes
##$PPARMOD= 0
##$PSCAL= 0
##$PSIGN= 0
##$REVERSE= no
##$SF= 81.0140089999434
##$SI= 65536
##$SIGF1= 159.3651
##$SIGF2= -187.1042
##$SINO= 113.3802
##$SIOLD= 16384
##$SREGLST= <1H.CDCl3>
##$SSB= 0
##$STSI= 65536
##$STSR= 0
##$SW_p= 29940.119760479
##$SYMM= 0
##$S_DEV= 0
##$TDeff= 32768
##$TDoff= 0
##$TI= <>
##$TILT= no
##$TM1= 0
##$TM2= 0
##$TOPLEV= 0
##$USERP1= <user>
##$USERP2= <user>
##$USERP3= <user>
##$USERP4= <user>
##$USERP5= <user>
##$WDW= 1
##$XDIM= 65536
##$YMAX_p= 314307596
##$YMIN_p= -8087940
$$ End of Bruker specific parameters
$$ ---------------------------------
##NTUPLES= NMR SPECTRUM
##VAR_NAME=  FREQUENCY,     SPECTRUM/REAL,   SPECTRUM/IMAG
##SYMBOL=    X,             R,               I
##VAR_TYPE=  INDEPENDENT,   DEPENDENT,       DEPENDENT
##VAR_FORM=  AFFN,          ASDF,            ASDF
##VAR_DIM=   65536,         65536,           65536
##UNITS=     HZ,            ARBITRARY UNITS, ARBITRARY UNITS
##FACTOR=    0.456856943014862, 1,           1
##FIRST=     14782.0589164792, 0,            0
##LAST=      -15158.0608439998, 0,           0
##MIN=       -15158.0608439998, -8087940,    0
##MAX=       14782.0589164792, 314307596,    0
$$ Real data points
##PAGE= N=1
##DATA TABLE= (X++(R..R)), XYDATA
$$ [...]
##PAGE= N=2
##DATA TABLE= (X++(I..I)), XYDATA
$$ plain form
36808 -1269745 -666746 259978 731447 580686 248377 -6476 -253798 -336086 114094 980552
36798 980552 1597612 1592136 1323752 1279450 1430655 1418698 1075088 556650 181790 248918
36788 248918 797867 1466982 1799904 1743920 1623455 1615718 1553037 1306995 1045046 944359
36778 944359 895206 680738 304291 -20993 -130025 -58030 20509 -17216 -75401 77709
36768 77709 489229 904242 1096592 1153539 1224573 1168601 768966 183059 -187276 -224082
36758 -224082 -130011 21403 358167 818010 1125228 1236590 1368162 1475796 1219797 656726
36748 656726 425002 869001 1445516 1471810 1065030 774292 616224 201123 -327492 -295812
36738 -295812 418531 1029125 900369 399316 259016 534927 722639 630346 544003 597436
$$ packed form
36808a269745O02999R26724M71469j50761l32309k54853k47322q2288M50180Q66458
36798I80552O17060n476k68384m4302J51205j1957l43610n18438l74860O7128
36788B48918N48949O69115L32922n5984j20465p737o2681k46042k61949j00687
36778I44359m9153k14468l76447l25284j09032P1995P8539l7725n8185J53110
36768G7709M11520M15013J92350N6947P1034n5972l99635n85907l70335l6806
36758b24082R4071J51414L36764M59843L07218J11362J31572J07634k55999n63071
36748F56726k31724M43999N76515K6294m06780k90738j58068m15101n28615L1680
36738b95812P14343O10594j28756n01053j40300K75911J87712r2293q6343N3433
$$ plain form
36728 597436 526921 172505 -168729 -82767 478242 1165088 1530531 1336517 757405 287333
36718 287333 227217 276932 -76491 -765859 -1129253 -800508 -198319 102939 94696 98217 166603
36707 166603 157839 140991 248463 307240 121298 -7826 409719 1262990 1903176 2006594
36697 2006594 1827158 1557121 1075387 501201 342093 747015 1161895 1140695 1032270 1401777
36687 1401777 2153989 2710897 2750997 2310525 1449418 332695 -568889 -866496 -715957
36678 -715957 -505075 -302460 -46428 17349 -318957 -653482 -421513 183470 430176 174082
36668 174082 25881 295613 526744 344903 58102 -2052 -118783 -616888 -1104017 -924159
36658 -924159 -151709 456041 460552 218983 279769 642801 796216 367121 -391644 -817672
$$ packed form
36728E97436p0515l54416l41234Q5962N61009O86846L65443j94014n79112m70072
36718B87333o0116M9715l53423o89368l63394L28745O02189L01258q243L521O8386
36707A66603q764j6848J07472N8777j85942j29124M17545Q53271O40186J03418
36697B006594j79436k70037m81734n74186j59108M04922M14880k1200j08425L69507
36687A401777P52212N56908M0100m40472q61107j116723r01584k97607J50539
36678g15957K10882K02615K56032O3777l36306l34525K31969O04983K46706k56094
36668A74082j48201K69732K31131j81841k86801o0154j16731m98105m87129J79858
36658i24159P72450O07750M511k41569O0786L63032J53415m29095p58765m26028
$$ plain form
36648 -817672 -566386 -13363 230023 80110 -45105 59487 145694 57916 30799 223639
36638 223639 408210 422055 508192 819634 979942 621541 45213 -206585 -195527 -395356
36628 -395356 -799568 -899192 -563116 -270602 -316637 -415179 -358207 -473349 -999796 -1485205
36618 -1485205 -1353791 -786110 -459709 -547564 -547166 -124912 415360 686336 769242 875439
36608 875439 792917 162401 -764067 -1135317 -490316 559433 972184 517641 30309 313607
36598 313607 1079018 1282212 434851 -766762 -1257015 -790530 -52682 290912 285199 329935
36588 329935 476040 422363 113182 -51900 251966 788929 1033442 796013 343742 -35533
36578 -35533 -319306 -564448 -690749 -601904 -379978 -210289 -189976 -308302 -506689 -635217
$$ packed form
36648h17672K51286N53023K43386j49913j25215J04592Q6207q7778k7117J92840
36638B23639J84571J3845Q6137L11442J60308l58401n76328k51798J1058j99829
36628c95356m04212r9624L36076K92514m6035r8542N6972j15142n26447m85409
36618a485205J31414N67681L26401q7855L98M22254N40272K70976Q2906J06197
36608H75439q2522o30516r26468l71250O45001J049749M12751m54543m87332K83298
36598C13607P65411K03194q47361j201613m90253M66485P37848L43594n713M4736
36588C29935J46105n3677l09181j65082L03866N36963K44513k37429m52271l79275
36578c5533k83773k45142j26301Q8845K21926J69689K0313j18326j98387j28528
$$ plain form
36568 -635217 -482566 -53340 273981 138010 -261498 -326654 111983 447363 59302 -777009
36558 -777009 -1135211 -567128 380749 871212 663466 118731 -366656 -609914 -499782 7933
36548 7933 722712 1293217 1503733 1374324 1030278 649638 448908 478993 501072 314105
36538 314105 96703 95197 109586 -217998 -658386 -583310 -30697 125062 -567828 -1363423
36528 -1363423 -1354513 -745321 -408997 -585318 -792325 -763408 -633378 -310623 462549 1366282
36518 1366282 1651064 1220774 823719 919040 1068965 774730 227097 -174099 -412863 -529769
36508 -529769 -323957 105433 126780 -495858 -995840 -646299 81307 246115 -66282 22014
36498 22014 634496 922089 500898 67929 220156 560473 524501 358069 565631 898339
$$ packed form
36568f35217J52651M29226L27321j35971l99508o5156M38637L35380l88061q36311
36558g77009l58202N68083R47877M90463k07746n44735m85387k43258J10132N07715
36548G933P14779N70505K10516j29409l44046l80640k00730L0085K2079j86967
36538C14105k17402j506J4389l27584m40388P5076N52613J55759o92890p95595
36528a363423Q910O09192L36324j76321k07007K8917J30030L22755P73172R03733
36518A366282K84782m30290l97055R5321J49925k94235n47633m01196k38764j16906
36508e29769K05812M29390K1347o22638m99982L49541P27606J64808l12397Q8296
36498B2014O12482K87593m21191m32969J52227L40317l5972j66432K07562L32708
$$ plain form
36488 898339 693808 4546 -360911 60127 839201 1341571 1471555 1503073 1523463 1375229
36478 1375229 1008433 603408 329822 149616 -90094 -447502 -802996 -939628 -705294
36469 -705294 -176188 306962 368722 -22595 -452994 -459226 -757 582322 1020313 1315669
36459 1315669 1512161 1546327 1425727 1294318 1172806 883661 413766 79826 82004 163731
36449 163731 49360 -34873 273168 751422 772050 180236 -519769 -916132 -1102670 -1178925
36439 -1178925 -871035 -15484 925842 1242185 735990 -133209 -732022 -721292 -244099 171240
36429 171240 93410 -266346 -230677 452955 1208055 1371159 1016013 688985 624620 670831
36419 670831 747111 834692 659479 -10413 -785959 -1013045 -775843 -849670 -1413086 -1541534
$$ packed form
36488H98339k04531o89262l65457M21038P79074N02370J29984L1518K0390j48234
36478A375229l66796m05025k73586j80206k39710l57408l55494j36632K34334
36469g05294N29106M83150O1760l91317m30399o232M58469N83079M37991K95356
36459A315669J96492L4166j20600j31409j21512k89145m69895l33940K178Q1727
36449A63731j14371q4233L08041M78254K0628n91814p00005l96363j86538p6255
36439a178925L07890Q55551R41326L16343n06195q69199n98813J0730M77193M15339
36429A71240p7830l59756L5669O83632P55100J63104l55146l27028o4365M6211
36419F70831P6280Q7581j75213o69892p75546k27086K37202p3827n63416j28448
$$ plain form
36409 -1541534 -523151 883418 1253974 305465 -846472 -1192602 -874986 -563683 -435983
36400 -435983 -191530 290443 763584 963857 847370 555749 353490 491583 913556 1189286
36390 1189286 969455 432972 41402 -86156 -244967 -575936 -780461 -585622 -216244
36381 -216244 -97142 -212830 -112373 409416 955307 1052268 831967 869546 1360393 1782922
36371 1782922 1548827 754272 6572 -363557 -546101 -696771 -576283 -17781 542206
36362 542206 436870 -349287 -1030982 -888426 -81092 554673 424929 -238446 -704220 -555202
36352 -555202 -81444 163646 63501 -12297 177430 399227 355651 156235 121468 316190
36342 316190 553170 695871 676473 390395 -95158 -398031 -274678 -65483 -244281 -665807
$$ packed form
36409a541534J018383J406569L70556r48509j151937l46130L17616L11303J27700
36400d35983K44453M81973M73141K00273j16487k91621k02259J38093M21973K75730
36390A189286k19831n36483l91570j27558j58811l30969k04525J94839L69378
36381b16244J19102j15688J00457N21789N45891R6961k20301L7579M90847M22529
36371A782922k34095p94555p47700l70129j82544j50670J20488N58502N59987
36362E42206j05336p86157o81695J42556Q07334O35765j29744o63375m65774J49018
36352e55202M73758K45090j00145p5798J89727K21797m3576j99416l4767J94722
36342C16190K36980J42701j9398k86078m85553l02873J23353K09195j78798m21526
$$ plain form
36332 -665807 -802800 -647001 -724580 -1166605 -1455078 -1288394 -1031422 -999602 -927298 -552960
36322 -552960 -160828 -58682 -8931 309501 710521 889450 970600 1107937 978144 344648
36312 344648 -234602 -20354 813177 1435531 1545806 1556038 1703135 1755509 1596973 1367697
36302 1367697 998026 329580 -254912 -100290 681218 1197232 1010824 650272 622227 667880
36292 667880 393644 -20614 -198603 -113112 144046 605375 1061806 1029717 519331 247392
36282 247392 571239 801194 207386 -811958 -1296414 -1041929 -588457 -234565 89534
36273 89534 181481 -285689 -970575 -1046980 -320646 532880 990892 1255791 1583986 1725749
36263 1725749 1427204 966372 740048 684935 532248 344552 362847 521200 558592 518685
$$ packed form
36332f65807j36993J55799p7579m42025k88473J66684K56972L1820P2304L74338
36322e52960L92132J02146M9751L18432M01020J78929Q1150J37337j29793o33496
36312C44648n79250K14248Q33531O22354J10275J0232J47097N2374j58536k29276
36302A367697l69671o68446n84492J54622P81508N16014j86408l60552k8045M5653
36292F67880k74236m14258j77989Q5491K57158M61329M56431l2089n10386k71939
36282B47392L23847K29955n93808j019344m84456K54485M53472L53892L24099
36273H9534R1947m67170o84886p6405P26334Q53526M58012K64899L28195J41763
36263A725749k98545m60832k26324n5113j52687j87696J8295J58353L7392l9907
$$ plain form
36253 518685 698693 1071224 1166007 717915 151464 126228 698953 1229005 1156766 625616
36243 625616 195578 155479 356387 577213 726518 710639 443802 63217 -156077 -186486
36233 -186486 -259828 -407574 -330827 109773 612032 854211 885370 873183 810411 748358 943243
36222 943243 1390082 1562366 1088038 400071 189719 440595 582183 429189 307146 289862
36212 289862 5849 -670225 -1338868 -1683909 -1826608 -1854885 -1535518 -828984 -240606 -236943
36202 -236943 -606475 -793688 -650974 -474384 -439807 -399492 -220520 -4135 94184 42574
36192 42574 -149353 -522503 -1040707 -1437462 -1362685 -775013 -93576 211084 155809 159502
36182 159502 402391 594878 544169 574157 997264 1424745 1128246 66034 -912794 -1008578
$$ packed form
36253E18685J80008L72531R4783m48092n66451k5236N72725N30052p2239n31150
36243F25616m30038m0099K00908K20826J49305j5879k66837l80585k19294l0409
36233a86486p3342j47746P6747M40600N02259K42179L1159j2187o2772o2053J94885
36222I43243M46839J72284m74328o87967k10352K50876J41588j52994j22043j7284
36212B89862k84013o76074o68643l45041j42699k8277L19367P06534N88378L663
36202b36943l69532j87213J42714J76590L4577M0315J78972K16385R8319n1610
36192D2574j91927l73150n18204l96755P4777N87672O81437L04660n5275L693
36182A59502K42889J92487n0709K9988M23107M27481k96499j062212r78828r5784
$$ plain form
36172 -1008578 -314654 379529 416364 -151058 -653091 -486127 213219 739337 767374 769878
36162 769878 1199752 1719582 1789356 1608902 1714662 1926677 1628084 983685 833398 1261871
36152 1261871 1363740 766773 308529 629496 1089157 860564 266168 108421 334109
36143 334109 363893 254803 472290 810805 617744 -12165 -278156 51364 327209 119011
36133 119011 -223159 -336183 -407585 -649939 -845159 -770986 -587713 -479271 -323027 3925
36123 3925 350073 552097 644294 641021 469834 276763 407290 892097 1320739 1411464 1323048
36112 1323048 1200566 837359 102146 -638971 -893380 -649420 -349824 -397958 -833787 -1304251
36102 -1304251 -1258909 -445951 672275 1294279 1175557 811097 632338 479556 75943
$$ packed form
36172a008578O93924O94183L6835n67422n02033J66964O99346N26118K8037K504
36162G69878M29874N19830O9774j80454J05760K12015k98593o44399j50287M28473
36152A261871J01869n96967m58244L20967M59661k28593n94396j57747K25688
36143C34109K9784j09090K17487L38515j93061o29909k65991L29520K75845k08198
36133A19011l42170j13024p1402k42354j95220P4173J83273J08442J56244L26952
36123C925L46148K02024R2197l273j71187j93071J30527M84807M28642R0725q8416
36112A323048j22482l63207p35213p41117k54409K43960K99596m8134m35829m70464
36102a304251M5342Q12958J118226O22004j18722l64460j78759j52782m03613
$$ plain form
36093 75943 -458502 -884468 -1198132 -1355873 -1087390 -416791 51271 -108499 -450136 -299902
36083 -299902 216273 438517 231918 48573 37276 -133511 -500273 -590990 -200463 242452
36073 242452 344131 242632 170882 60443 -87062 48873 538305 801788 307361 -599175
36063 -599175 -1072942 -819104 -290344 55100 200163 267828 241400 149515 218073 619938
36053 619938 1190046 1512679 1277830 587329 -33398 -42588 552642 1133431 1130336 636325
36043 636325 182213 62984 162760 304230 386940 226375 -311548 -950289 -1196801 -1033842
36033 -1033842 -999461 -1356329 -1615703 -1262154 -591909 -308563 -477451 -473439 18308 518708
36023 518708 480534 49924 -229448 -173274 -20851 109828 396180 878214 1200838 1012045
$$ packed form
36093G5943n34445m25966l13664j57741K68483O70599M68062j59770l41637J50234
36083b99902N16175K22244k06599j83345j1297j70787l66762r0717L90527M42915
36073B42452J01679j01499p1750j10439j47505J35935M89432K63483m94427r06536
36063e99175m73767K53838N28760L45444J45063O7665k6428r1885O8558M01865
36053F19938N70108L22633k34849o90501o20727r190N95230N80789l095m94011
36043F36325m54112j19229R9776J41470Q2710j60565n37923o38741k46512J62959
36033a033842L4381l56868k59374L53549O70245K83346j68888M012M91747N00400
36023E18708l8174m30610k79372N6174J52423J30679K86352M82034L22624j88793
$$ plain form
36013 1012045 455791 30221 -13744 78674 -23537 -263885 -305284 -23663 322331 444716
36003 444716 362145 289785 343399 483713 642403 750783 719099 541020 361927 290164
35993 290164 196527 -121206 -606646 -964299 -1000569 -764235 -369452 86896 404218 339829
35983 339829 -80967 -505135 -632179 -510577 -364840 -304908 -325471 -409989 -476038 -373334
35973 -373334 -102442 118106 192383 396633 1023305 1850655 2252747 1886092 1079415 469182
35963 469182 347122 420131 196250 -387133 -784443 -453581 386799 935639 858876 749955
35953 749955 1207804 1835353 1738908 860839 136952 237438 771838 1006457 837924 642586
35943 642586 540856 314680 -107134 -524551 -797747 -978648 -1114098 -1167474 -1129864 -1007280
$$ packed form
36013A012045n56254m25570m3965R2418j02211k40348m1399K81621L45994J22385
36003D44716q2571p2360N3614J40314J58690J08380l1684j78079j79093p1763
35993B90164r3637l17733m85440l57653l6270K36334L94783M56348L17322o4389
35983C39829m20796m24168j27044J21602J45737N9932k0563q4518o6049J02704
35973c73334K70892K20548P4277K04250O26672Q27350M02092l66655q06677o10233
35963D69182j22060P3009k23881n83383l97310L30862Q40380N48840p6763j08921
35953G49955M57849O27549r6445q78069p23887J00486N34400K34619j68533j95338
35943F42586j01730k26176m21814m17417k73196j80901j35450n3376L7610J22584
$$ plain form
35933 -1007280 -736135 -320274 -957 -35340 -299476 -369659 -76743 239105 165866 -226231
35923 -226231 -431667 -82385 636281 1169346 1143088 682360 181807 -142801 -364414 -563519
35913 -563519 -647833 -535341 -351663 -299431 -413886 -559036 -597406 -486807 -301159 -216733
35903 -216733 -345528 -519650 -432609 -95775 93963 -78678 -291263 -187376 17789 -148450
35893 -148450 -642234 -906020 -618168 -12624 555529 927191 983266 657049 249424 275736
35883 275736 777712 1190575 1130264 898377 904005 1000758 818152 422311 160060 61100
35873 61100 -110919 -335231 -342036 -107663 84577 93813 76357 177399 376038 622680 841703
35862 841703 864589 683793 662070 1065540 1466645 1137751 84762 -839191 -983640 -558977
$$ packed form
35933a007280K71145M15861L19317l4383k64136p0183K92916L15848p3239l92097
35923b26231k05436L49282P18666N33065k6258m60728n00553l24608k21613j99105
35913e63519q4314J12492J83678N2232j14455j45150l8370J10599J85648Q4426
35903b16733j28795j74122Q7041L36834J89738j72641k12585J03887K05165j66239
35893a48450m93784k63786K87852O05544N68153L71662N6075l26217m07625K6312
35883B75736N01976M12863o0311k31887N628R6753j82606l95841k62251r8960
35873F1100j72019k24312o805K34373J92240R236j7456J01042J98639K46642K19023
35862H41703K2886j80796k1723M03470M01105l28894j052989r23953j44449M24663
$$ plain form
35852 -558977 -70150 362190 791606 1033695 920658 693600 742230 1114266 1540984 1744249
35842 1744249 1530242 901073 308114 390040 1121149 1652005 1437822 1056077 1277321 1753385
35832 1753385 1501729 491774 -240997 -139212 191627 156120 114539 578808 1183263 1215723
35822 1215723 737697 407605 422109 373309 88490 -93627 11925 95641 -96998 -337984
35812 -337984 -315621 -115521 -8658 -13002 27598 92251 9616 -244576 -524998 -727043 -776123
35801 -776123 -475108 306071 1232953 1635765 1241711 550729 243789 399356 580388 535153
35791 535153 406803 288270 46224 -270424 -288456 138446 584927 615429 411161 419909
35781 419909 603083 546502 224308 78351 252185 278768 -223877 -942476 -1252561 -949314
$$ packed form
35852e58977M88827M32340M29416K42089j13037k27058M8630L72036M26718K03265
35842A744249k14007o29169n92959Q1926P31109N30856k14183l81745K21244M76064
35832A753385k51656j009955p32771J01785L30839l5507m1581M64269O04455L2460
35822A215723m78026l30092J4504m8800k84819j82117J05552Q3716j92639k40986
35812c37984K2363K00100J06863m344M0600O4653q2635k54192k80422k02045m9080
35801g76123L01015P81179R26882M02812l94054o90982l06940J55567J81032m5235
35791E35153j28350j18533k42046l16648j8032M26902M46481L0502k04268Q748
35781D19909J83174n6581l22194j45957J73834K6583n02645p18599l10085L03247
$$ plain form
35771 -949314 -326598 263880 659134 822928 787398 627977 390185 122602 15538 296687
35761 296687 867702 1253761 1095526 542160 6137 -298398 -392938 -290882 18418 395853
35751 395853 577089 410350 16802 -253005 -52329 604105 1211453 1253080 870596 749280
35741 749280 1185712 1608659 1314815 417243 -300316 -326631 126891 546185 668622 612370
35731 612370 669038 974516 1283252 1173252 575716 -92733 -461920 -594549 -628086 -398547
35721 -398547 168313 602590 408585 -101048 -120675 471315 872689 483672 -278949 -619693
35711 -619693 -383509 -11850 245811 582699 1122169 1556968 1483257 938888 425464 372404
35701 372404 676653 869151 694817 368529 233551 369967 642136 918631 1077059 998341
$$ packed form
35771i49314O22716N90478L95254J63794l5530j59421k37792k67583j07064K81149
35761B96687N71015L86059j58235n53366n36023l04535r4540J02056L09300L77435
35751C95853J81236j66739l93548k69807K00676O56434O07348M1627l82484j21316
35741G49280M36432M22947k93844q97572p17559k6315M53522M19294J22437n6252
35731F12370N6668L05478L08736j10000n97536o68449l69187j32629l3537K29539
35721c98547N66860M34277j94005n09633j9627N91990M01374l89017p62621l40744
35711f19693K36184L71659K57661L36888N39470M34799p3711n44369n13424n3060
35701C72404L04249J92498j74334l26288j34978J36416K72169K76495J58428p8718
$$ plain form
35691 998341 776752 749606 1075871 1471739 1625580 1650405 1785059 1872009 1575849 975538
35681 975538 471967 205572 39663 15922 271166 552740 440315 86901 78236 430940
35671 430940 440564 -206102 -867622 -910265 -601504 -505484 -526867 -224507 286278 461436
35661 461436 197814 -72703 -123649 -191670 -411620 -457205 70440 1132918 2223184 2725656
35651 2725656 2390936 1628165 1188705 1338479 1518357 1108654 332946 6004 503014
35642 503014 1417850 2195622 2626333 2665639 2282290 1713261 1460508 1696806 1927915 1591104
35632 1591104 845561 418748 693933 1268774 1497299 1204596 698948 286534 56971
35623 56971 72804 420757 956047 1279992 1204823 1049196 1193450 1480387 1405877 868842
$$ packed form
35691I98341k21589k7146L26265L95868J53841K4825J34654Q6950k96160o00311
35681I75538n03571k66395j65909k3741K55244K81574j12425l53414q665L52704
35671D30940R624o46666o61520m2643L08761R6020k1383L02360N10785J75158
35661D61436k63622k70517n0946o8021k19950m5585N27645J062478J090266N02472
35651B725656l34720p62771m39460J49774J79878m09703p75708l26942M97010
35642E03014R14836P77772M30711L9306l83349n69029k52753K36298K31109l36811
35632A591104p45543m26813K75185N74841K28525k92703n05648m12414k29563
35623E6971J5833L47953N35290L23945p5169j55627J44254K86937p4510n37035
$$ plain form
35613 868842 369004 385083 854631 1367393 1599310 1435359 932677 352307 49838 150549
35603 150549 403937 430310 47878 -593498 -1054137 -881626 -93464 710081 1001337 946975
35593 946975 986107 995037 510851 -273946 -539085 -46840 458258 419796 296535 696901
35583 696901 1331574 1477656 1012727 358314 -194372 -486673 -241353 495764 1009626 742458
35573 742458 195256 264508 904952 1232342 820929 125321 -322423 -392419 -78249 508193
35563 508193 850966 469227 -309443 -695788 -553334 -426256 -480839 -312936 86758 157696
35553 157696 -143018 -44173 770762 1487208 1374845 889070 796653 865449 357804 -569599
35543 -569599 -943879 -381757 412786 678730 486244 363670 485606 547203 269496 -215467
$$ packed form
35613H68842m99838J6079M69548N12762K31917j63951n02682n80370l02469J00711
35603A50549K53388K6373l82432o41376m60639J72511P88162Q03545K91256n4362
35593I46975L9132Q930m84186p84797k65139M92245N05098l8462j23261M00366
35583F96901O34673J46082m64929o54413n52686k92301K45320P37117N13862k67168
35573G42458n47202O9252O40444L27390m11413o95608m47744o9996L14170N86442
35563E08193L42773l81739p78670l86345J42454J27078n4583J67903L99694P0938
35553A57696l00714R8845Q14935P16446j12363m85775r2417O8796n07645r27403
35543e69599l74280N62122P94543K65944j92486j22574J21936O1597k77707m84963
$$ plain form
35533 -215467 -525903 -510502 -425600 -507448 -530237 -116391 579880 939038 689832 206174
35523 206174 -128462 -353503 -523528 -418770 -27278 176298 -89298 -343032 19217 805755
35513 805755 1290754 1189096 831783 512890 225825 22775 100311 419553 643910 587341
35503 587341 432319 407082 505791 630248 786594 1001193 1165030 1097060 771215 446204
35493 446204 489011 962248 1443418 1443808 974818 444851 32339 -440076 -938309 -1026986
35483 -1026986 -530708 36263 92822 -265623 -544779 -591567 -590176 -514333 -108503 599491
35473 599491 1186389 1295327 942471 368292 -174118 -500909 -583524 -551528 -500607 -395590
35463 -395590 -238642 -114366 42770 401000 756815 521847 -451164 -1409167 -1553834 -1053873
$$ packed form
35533b15467l10436J5401Q4902q1848k2789M13846O96271L59158k49206m83658
35523B06174l34636k25041j70025J04758L91492K03576k65596k53734L62249P86538
35513H05755M84999j01658l57313l18893k87065k03050P7536L19242K24357n6569
35503E87341j55022k5237R8709J24457J56346K14599J63837o7970l25845l25011
35493D46204M2807M73237M81170L90m68990n29967m12512m72415m98233q8677
35483a026986M96278N66971N6559l58445k79156m6788J391P5843M05830P07994
35473E99491N86898J08938l52856n74179n42410l26791q2615L1996N0921J05017
35463c95590J56948J24276J57136L58230L55815k34968r73011r58003j44667M99961
$$ plain form
35453 -1053873 -644120 -467754 -22732 792141 1313681 1010177 209807 -348186 -343091 -3074
35443 -3074 358223 692858 1150452 1732497 2064923 1717390 846681 214159 308053 761343
35433 761343 978722 969771 1054958 1101080 760059 273431 238053 589171 624719 166179 -95010
35422 -95010 330621 1036477 1442796 1547006 1537088 1297297 849091 746443 1358551 2099654
35412 2099654 2054078 1203876 419195 280294 464915 364213 -152742 -729352 -953072 -654534
35402 -654534 4912 625263 888894 866342 904722 1182080 1477030 1429618 965955 402415
35392 402415 120231 171174 281360 258139 236988 394703 591589 575336 447696 557523
35382 557523 884596 912269 312452 -520519 -884725 -580266 -74261 95541 -90514 -179587
$$ packed form
35453a053873M09753J76366M45022Q14873N21540l03504q00370n57993N095L40017
35443c074L61297L34635M57594N82045L32426l47533q70709o32522R3894M53290
35433G61343K17379q951Q5187M6122l41021m86628l5378L51118L5548m58540k61189
35422i5010M25631P05856M06319J04210r918k39791m48206j02648O12108P41103
35412B099654m5576q50202p84681j38901J84621j00702n16955n76610k23720K98538
35402f54534O59446O20351K63631k2552L8380K77358K94950m7412m63663n63540
35392D02415k82184N0943J10186k3221k1151J57715J96886j6253j27640J09827
35382E57523L27073K7673n99817q32971l64206L04459N06005J69802j86055q9073
$$ plain form
35372 -179587 174447 759415 1068523 1023865 1140030 1735214 2289522 2055304 1135162 365597
35362 365597 144453 32561 -312907 -494184 -80916 562057 706031 220817 -394920 -740116
35352 -740116 -785735 -557126 -43721 554489 893532 902022 868825 1034591 1295625 1387463
35342 1387463 1213491 911940 677528 589714 622237 781222 1118726 1534754 1725189 1538185
35332 1538185 1256920 1232637 1336651 1162189 711316 392073 303968 99244 -288980 -400165
35322 -400165 -40979 275012 147687 19806 488171 1289106 1648718 1400183 1075776 1007021
35312 1007021 983874 808177 615571 569709 671279 900268 1163625 1146984 650666 34661
35302 34661 -125954 196569 534201 701527 973916 1441515 1762927 1725991 1538032 1356361
$$ packed form
35372a79587L54034N84968L09108m4658J16165N95184N54308k34218r20142p69565
35362C65597k21144j11892l45468j81277M13268O42973J43974m85214o15737l45196
35352g40116m5619K28609N13405N98210L39043Q490l3197J65766K61034R1838
35342A387463j73972l01551k34412q7814L2523J58985L37504M16028J90435j87004
35332A538185k81265k4283J04014j74462m50873l19243q8105k04724l88224j11185
35322d00165L59186L15991j27325j27881M68365Q00935L59612k48535l24407o8755
35312A007021k3147j75697j92606m5862J01570K28989K63357j6641m96318o16005
35302C4661j60615L22523L37632J67326K72389M67599L21412l6936j87959j81671
$$ plain form
35292 1356361 1015746 468122 42641 -23925 68567 91932 172064 455483 736752 757983
35282 757983 587762 372442 10929 -537595 -896663 -701106 -233464 -143941 -555229 -886164
35272 -886164 -646927 -47141 345126 298115 78138 34634 183845 214041 -139326 -760469
35262 -760469 -1246407 -1312229 -988113 -426674 259899 877533 1128268 949579 704775 764556
35252 764556 1018538 1095221 969387 974108 1186787 1196863 672662 -108697 -534655 -330360
35242 -330360 204246 514491 221900 -605762 -1426588 -1587269 -937997 -37922 429731 371959
35232 371959 212816 219802 247917 165373 134147 284060 440828 451927 509827 799177 1034562
35221 1034562 802582 282969 129977 557814 1012127 962058 628269 612782 1068476 1563604
$$ packed form
35292A356361l40615n47624m25481o6566R2492K3365Q0132K83419K81269K1231
35282G57983j70221k15320l61513n48524l59068J95557M67642Q9523m11288l30935
35272h86164K39237N99786L92267m7011k19977m3504J49211L0196l53367o21143
35262g60469m85938o5822L24116N61439O86573O17634K50735j78689k44804N9781
35252G64556K53982P6683j25834M721K12679J0076n24201p81359m25958K04295
35242c30360N34606L10245k92591q27662q20826j60681O49272R00075M67653n7772
35232C71959j59143O986K8115q2544l1226J49913J56768J1099N7900K89350K35385
35221A034562k31980n19613j52992M27837M54313n0069l33789j5487M55694M95128
$$ plain form
35211 1563604 1620870 1124242 321184 -335641 -473806 -162918 130148 151457 222506 696718
35201 696718 1270581 1287842 657538 373 -157629 96470 424002 649845 647318 282254
35191 282254 -215570 -226316 491957 1294729 1390671 912276 719590 1192663 1791864 1927223
35181 1927223 1693228 1441989 1134092 613707 187428 292139 702965 743016 361395 321349
35171 321349 1023276 1785544 1820913 1401997 1324060 1553251 1330313 572696 179747 628304
35161 628304 1142674 855454 138034 21279 685725 1317647 1305922 847652 371153 39190
35151 39190 -28004 374610 1137305 1680079 1507122 757704 49425 -105253 308519 815146
35141 815146 816376 134274 -781635 -1312029 -1263670 -862839 -341198 169670 483687 502883
$$ packed form
35211A563604N7266m96628q03058o56825j38165L10888K93066K1309P1049M74212
35201F96718N73863J7261o30304o57165j58002K54099L27532K25843k527l65064
35191B82254m97824j0746P18273Q02772R5942m78395j92686M73073N99201J35359
35181A927223k33995k51239l07897n20385m26279J04711M10826M0051l81621m0046
35171C21349P01927P62268L5369m18916p7937K29191k22938p57617l92949M48557
35161F28304N14370k87220p17420j16755O64446O31922j1725m58270m76499l31963
35151C9190o7194M02614P62695N42774j72957p49418p08279j54678M13772N06627
35141H15146J230o82102r15909n30394M8359M00831N21641N10868L14017J9196
$$ plain form
35131 502883 457993 618738 823487 736551 529300 758716 1478616 2024635 1908944 1460342
35121 1460342 1289760 1492419 1667237 1440868 750498 -121570 -641413 -474004 28403
35112 28403 162959 -197504 -511900 -542637 -737133 -1268319 -1414726 -566347 684485 1256124
35102 1256124 1051590 909097 1284996 1831399 2223917 2536653 2664060 2197538 1207349
35093 1207349 482165 568831 1062240 1250174 1042177 822655 721010 526586 163447 -196826
35083 -196826 -453833 -661775 -784929 -650811 -219566 277580 555993 559895 480822 523379
35073 523379 689554 829654 889882 989377 1195523 1401114 1581571 1959307 2600636 3012496
35063 3012496 2605359 1569760 817203 901541 1418180 1667410 1482571 1111861 706950
$$ packed form
35131E02883m4890J60745K04749q6936k07251K29416P19900N46019j15691m48602
35121A460342j70582K02659J74818k26369o90370q72068n19843J67409N02407
35112B8403J34556l60463l14396l0737j94496n31186j46407Q48379J250832N71639
35102A256124k04534j42493L75899N46403L92518L12736J27407m66522r90189
35093A207349p25184Q6666M93409J87934k07997k19522j01645j94424l63139l60273
35083a96826k57007k07942j23154J34118M31245M97146K78413L902p9073M2557
35073E23379J66175J40100O0228R9495K06146K05591J80457L77736O41329M11860
35063C012496m07137j035599p52557Q4338N16639K49230j84839l70710m04911
$$ plain form
35054 706950 372156 408546 972681 1630557 1757600 1349425 984654 984869 1074362 948303
35044 948303 721035 628563 665434 737973 856302 939587 741205 265719 -2863 346306
35034 346306 1036589 1415035 1282105 1028935 972726 957638 715606 286029 -96368 -284967
35024 -284967 -216489 167049 781489 1323793 1539387 1500837 1471464 1555793 1615069 1474637
35014 1474637 1114896 719234 589864 885073 1361142 1560911 1385988 1246733 1438218
35005 1438218 1656818 1510773 1263017 1496055 2095508 2230108 1545665 783563 815757 1518476
34995 1518476 2102005 2232258 2233495 2327414 2299764 2000491 1659758 1509388 1462768 1383141
34985 1383141 1371713 1549696 1766599 1767203 1532075 1273490 1179566 1283625 1488559 1626217
$$ packed form
35054G06950l34794L6390N64135O57876J27043m08175l64771K15Q9493j26059
35044I48303k27268r2472L6871P2539J18329Q3285j98382m75486k68582L49169
35034C46306O90283L78446j32930k53170n6209j5088k42032m29577l82397j88599
35024b84967O8478L83538O14440N42304K15594l8550k9373Q4329N9276j40432
35014A474637l59741l95662j29370K95209M76069J99769j74923j39255J91485
35005A438218K18600j46045k47756K33038N99453J34600o84443p62102L2194P02719
34995A518476N83529J30253J237R3919k7650k99273l40733j50370m6620p9627
34985A383141j1428J77983K16903O04k35128k58585r3924J04059K04934J37658
$$ plain form
34975 1626217 1606650 1573487 1741921 2002419 1923125 1322070 620101 389160 723536 1302734
34965 1302734 1872505 2315474 2405626 1960746 1246262 796310 746596 725959 494221 258617
34955 258617 211276 227753 272453 597504 1149502 1285864 667752 26017 279013 1128551
34945 1128551 1417783 860359 452392 913152 1646857 1790317 1520011 1569005 1967397 2095346
34935 2095346 1733020 1298334 1143454 1257266 1577914 1977387 2011174 1348348 447116 127980
34925 127980 425393 574979 259259 66511 410935 802454 720787 529987 819293 1334543
34915 1334543 1374768 976982 881123 1368359 1885191 1936024 1709012 1584312 1533209 1327120
34905 1327120 1014585 881206 1096755 1581627 2087653 2320877 2155875 1793567 1515347
$$ packed form
34975A626217j9567l3163J68434K60498p9294o01055p01969k30941L34376N79198
34965A302734N69771M42969R0152m44880p14484m49952m9714k0637k31738k35604
34955B58617m7341J6477M4700L25051N51998J36362o18112o41735K52996Q49538
34945A128551K89232n57424m07967M60760P33705J43460k70306M8994L98392J27949
34935B095346l62326m34686j54880J13812L20648L99473L3787o62826r01232l19136
34925A27980K97413J49586l15720j92748L44424L91519q1667j90800K89306N15250
34915A334543M0225l97786r5859M87236N16832N0833k27012j24700n1103k06089
34905A327120l12535j33379K15549M84872N06026K33224j65002l62308k78220
$$ plain form
34896 1515347 1265538 783274 227067 244376 1105401 2097013 2268075 1660006 1258103 1620679
34886 1620679 2082149 1688941 581883 -116433 243992 1063617 1407130 1227578 1188323
34877 1188323 1503989 1619042 1167653 666216 821864 1489491 1856854 1574990 1160130
34868 1160130 1146971 1327350 1165452 648737 265125 245628 318804 299226 447559 951050
34858 951050 1393551 1185206 376658 -380953 -627185 -413111 121789 920025 1621587 1641207
34848 1641207 1010853 614571 1058929 1743840 1704876 1041797 705354 1010536 1267377 1014954
34838 1014954 751488 1056708 1694532 2109364 2288787 2540103 2749676 2484238 1722081
34829 1722081 985943 716006 822119 899991 717649 475308 623244 1325743 2133196 2429915
$$ packed form
34896A515347k49809m82264n56207J7309Q61025R91612J71062o08069m01903L62576
34886A620679M61470l93208j107058o98316L60425Q19625L43513j79552l9255
34877A188323L15666J15053m51389n01437J55648O67627L67363k81864m14860
34868A160130j3159J80379j61898n16715l83612j9497P3176j9578J48333N03491
34858I51050M42501k08345q08548p57611k46232K14074N34900P98236P01562J9620
34848A641207o30354l96282M44358O84911l8964o63079l36443L05182K56841k52423
34838A014954k63466L05220O37824M14832J79423K51316K09573k65438p62157
34829A722081p36138k69937J06113P7872j82342k42341J47936P02499Q07453K96719
$$ plain form
34819 2429915 2206042 2021701 2124847 2061378 1414206 524282 96711 325950 741889 780885
34809 780885 301085 -304186 -393067 267710 1056775 1087660 350593 -220196 -790 575716
34799 575716 825263 733568 602004 374176 -50244 -296028 2505 527427 726674 627559
34789 627559 576926 509411 183161 -140046 -16075 365737 427900 123433 -103480 -131126
34779 -131126 -201661 -270168 -60991 311616 510982 660470 1099165 1584006 1577430 1235738
34769 1235738 1202162 1470752 1440961 1096806 1033456 1201203 831715 -64316 -351863 514856
34759 514856 1540155 1661382 1207879 1076813 1291428 1293178 1027926 817102 599287 146952
34749 146952 -292947 -316579 -43084 163661 364311 824082 1383247 1612747 1387297 872308
$$ packed form
34819B429915k23873j84341J03146o3469o47172q89924m27571K29239M15939L8996
34809G80885m79800o05271q8881O60777P89065L0885p37067n70789K19406N76506
34799E75716K49547r1695j31564k27828m24420k45784K98533N24922J99247r9115
34789F27559n0633o7515l26250l23207J23971L81812O2163l04467k26913k7646
34779a31126p0535o8507K09177L72607J99366J49488M38695M84841o576l41692
34769A235738l3576K68590k9791l44155o3350J67747l69488q96031k87547Q66719
34759E14856J025299J21227m53503j31066K14615J750k65252k10824k17815m52335
34749A46952m39899k3632K73495K06745K00650M59771N59165K29500k25450n14989
$$ plain form
34739 872308 242265 -195605 -14488 733912 1360021 1435199 1364297 1575221 1738339 1446591
34729 1446591 1081868 1183395 1426923 1132663 451832 147622 435393 899957 1341955
34720 1341955 1816208 2003239 1484905 603337 170169 322259 490281 477622 682223 1187460
34710 1187460 1527578 1522738 1522199 1619324 1418540 828642 345330 269441 317517 250166 211570
34699 211570 216158 17027 -243335 1552 786272 1373373 1380044 1380701 1853007 2270772 1967564
34688 1967564 1307360 1156304 1567710 1839271 1687533 1543869 1670148 1705418 1306900 741882
34678 741882 554483 892476 1377382 1547396 1322385 1038451 1030329 1241678 1373583 1339449
34668 1339449 1291730 1197809 776542 13750 -612034 -664546 -247586 248184 626413 889804
$$ packed form
34739H72308o30043m37870J81117P48400O26109P5178p0902K10924J63118k91748
34729A446591l64723J01527K43528k94260o80831l04210K87771M64564M41998
34720A341955M74253J87031n18334q81568m33168J52090J68022j2659K04601N05237
34710A187460L40118m840n39R7125k00784n89898m83312p5889M8076o7351l8596
34699B11570M588j99131k60362K44887P84720N87101O671O57M72306M17765l03208
34688A967564o60204j51056M11406K71561j51738j43664J26279L5270l98518n65018
34678G41882j87399L37993M84906J70014k25011k83934q122K11349J31905l4134
34668A339449m7719r3921m21267p62792o25784n2512M16960M95770L78229K63391
$$ plain form
34658 889804 1058703 1261157 1722447 2343666 2553200 1958447 944491 229203 -6529
34649 -6529 -110705 -221557 -77068 394009 803356 846586 754072 921545 1325560 1607091
34639 1607091 1624837 1628461 1858938 2208123 2394244 2339778 2210619 2125980 2012070 1783006
34629 1783006 1493526 1207513 876499 523481 420531 837289 1639357 2351296 2623547
34620 2623547 2466507 2072516 1654274 1460359 1666152 2140156 2501392 2483843 2105932 1504689
34610 1504689 841051 370823 308332 543682 773462 972608 1388035 1949407 2128265 1690826
34600 1690826 1214645 1391023 2020016 2219836 1622067 883402 863769 1649004 2600965 3116319
34590 3116319 3061005 2610962 2017564 1581903 1569049 1929730 2224860 2044899 1472695 936587
$$ packed form
34658H89804J68899K02454M61290O21219K09534n94753j013956p15288k35732
34649f529j04176j10852J44489M71077M09347M3230r2514J67473M04015K81531
34639A607091J7746L624K30477L49185J86121n4466j29159q4639j13910k29064
34629A783006k89480k86013l31014l53018j02950M16758Q02068P11939K72251
34620B623547j57040l93991m18242j93915K05793M74004L61236j7549l77911o01243
34610A504689o63638m70228o2491K35350K29780J99146M15427N61372J78858m37439
34600A690826m76181J76378O28993J99820n97769p38665j9633P85235R51961N15354
34590C116319n5314m50043n93398m35661j2854L60681K95130j79961n72204n36108
$$ plain form
34580 936587 642438 429897 230151 301595 786537 1334297 1502836 1345792 1246779 1314108
34570 1314108 1331745 1224381 1148884 1139333 1072676 991155 1015376 907848 263860 -689677 -1045736
34559 -1045736 -334837 744813 1177370 900374 701443 1015818 1415778 1375678 1053334
34550 1053334 1020366 1449870 1875922 1751985 1076789 400097 269859 736788 1378974 1724343
34540 1724343 1624113 1310080 1159807 1339955 1631399 1702540 1580405 1644792 2044208 2379776
34530 2379776 2212246 1664279 1214923 1083523 1163866 1385939 1715187 1924423 1842902 1748531
34520 1748531 2003336 2367183 2277631 1826906 1769915 2383614 3000618 3001223 2658357 2573643
34510 2573643 2789562 2934670 2829038 2476981 1844380 1132124 909106 1428638 2106926
$$ packed form
34580I36587k94149k12541j99746P1444M84942N47760J68539j57044r9013O7329
34570A314108J7637j07364p5497r551o6657q1521K4221j07528o43988r53537l56059
34559a045736P10899J079650M32557k76996j98931L14375L99960m0100l22344
34550A053334l2968M29504M26052j23937o75196o76692j30238M66929O42186L45369
34540A724343j00230l14033j50273J80148K91444P1141j22135O4387L99416L35568
34530B379776j67530n47967m49356j31400Q0343K22073L29248K09236q1521r4371
34520A748531K54805L63847q9552m50725n6991O13699O17004O05l42866q4714
34510B573643K15919J45108j05632l52057o32601p12256k23018N19532O78288
$$ plain form
34501 2106926 2251046 2059100 2267295 2952667 3374032 3045967 2364676 1986621 2038697 2162538
34491 2162538 2029830 1621450 1196762 1100538 1442904 1926679 2141209 2008813 1762266 1541005
34481 1541005 1271003 950716 790156 970294 1413848 1840174 1947129 1589713 950763
34472 950763 500421 586256 1050865 1416474 1439191 1304655 1278707 1376661 1457555 1488948 1588573
34461 1588573 1843468 2163249 2331714 2208491 1869164 1509834 1230978 988919 743830
34452 743830 544064 461578 562870 929227 1537927 2120414 2349847 2225998 2080582 2152017
34442 2152017 2370851 2606070 2825848 2889844 2510731 1686882 948337 865142 1413040 2071709
34432 2071709 2463586 2633467 2713391 2592643 2103232 1457097 1257261 1854622 2751386 2995838
$$ packed form
34501B106926J44120j91946K08195O85372M21365l28065o81291l78055N2076J23841
34491B162538j32708m08380m24688r6224L42366M83775K14530j32396k46547k21261
34481A541005k70002l20287j60560J80138M43554M26326J06955l57416o38950
34472I50763m50342Q5835M64609L65609K2717j34536k5948R7954Q0894L1393R9625
34461A588573K54895L19781J68465j23223l39327l59330k78856k42059k45089
34452G43830j99766q2486J01292L66357O08700N82487K29433j23849j45416P1435
34442B152017K18834K35219K19778O3996l79113q23849p38545q3195N47898O58669
34432B071709L91877J69881P9924j20748m89411o46135j99836N97361Q96764K44452
$$ plain form
34422 2995838 2326034 1548007 1459611 1812348 1902303 1820552 2235717 3029162 3196405 2396431
34412 2396431 1615002 1701572 2073963 1698206 776443 490278 1289230 2332005 2672812
34403 2672812 2290376 1762192 1457671 1341664 1290779 1329225 1560453 1924679 2104313 1827154
34393 1827154 1243770 772964 597628 632770 927537 1577626 2203214 2188608 1664001 1535736
34383 1535736 2162805 2737381 2534774 2068085 2235215 2885660 3142398 2802530 2503603
34374 2503603 2647084 2967839 3113634 2958160 2407512 1541402 863784 800469 1073017 1182568
34364 1182568 1284121 1795360 2318627 1943790 724952 -103533 273943 1216604 1620283
34355 1620283 1321617 1003609 1139956 1572888 1947588 2125420 2158979 2101129 1946257 1752782
$$ packed form
34422B995838o69804p78027q8396L52737Q9955q1751M15165P93445J67243p99974
34412B396431p81429Q6570L72391l75757r21763k86165P98952J042775L40807
34403B672812l82436n28184l04521j16007n0885L8446K31228L64226J79634k77159
34393A827154n83384m70806j75336L5142K94767O50089O25588j4606n24607j28265
34383A535736O27069N74576k02607m66689J67130O50445K56738l39868k98927
34374B503603J43481L20755J45795j55474n50648q66110o77618o3315K72548J09551
34364A182568J01553N11239N23267l74837j218838q28485L77476R42661M03679
34355A620283k98666l18008J36347M32932L74700J77832L3559n7850j54872j93475
$$ plain form
34345 1752782 1738603 2071363 2545753 2738487 2565524 2352246 2259454 2114983 1977827 2228788
34335 2228788 2764136 2833299 2215953 1784961 2143713 2487472 1855328 846460 795063 1657364
34325 1657364 2150683 1846166 1644978 2042497 2359064 2108777 1860818 2138671 2492107
34316 2492107 2309501 1742353 1253405 958300 912972 1357501 2159250 2626662 2364341 1799456
34306 1799456 1500527 1526064 1744278 2146459 2477972 2217722 1377589 764760 1012263 1814240
34296 1814240 2455163 2615872 2390046 2039301 1984144 2467291 2993733 2727117 1673883
34287 1673883 793785 685301 914074 961297 1026706 1427632 1923883 2144623 2084567 1789903
34277 1789903 1213143 729660 1022088 2020569 2765788 2809957 2882146 3554273 4150411 3811204
$$ packed form
34345A752782j4179L32760M74390J92734j72963k13278r2792j44471j37156K50961
34335B228788N35348O9163o17346m30992L58752L43759o32144j008868n1397Q62301
34325A657364M93319l04517k01188L97519L16567k50287k47959K77853L53436
34316B492107j82606n67148m88948k95105m5328M44529Q01749M67412k62321n64885
34306A799456k98929K5537K18214M02181L31513k60250q40133o12829K47503Q01977
34296A814240O40923J60709k25826l50745n5157M83147N26442k66616j053234
34287A673883q80098j08484K28773M7223O5409M00926M96251K20740o0056k94664
34277A789903n76760m83483K92428R98481P45219M4169P2189O72127N96138l39207
$$ plain form
34267 3811204 2903032 2450211 2688570 3021552 2993256 2567817 1837161 1108818 884429 1181450
34257 1181450 1353315 1110174 1087240 1759306 2487010 2454495 1923549 1640238 1552044 1138549
34247 1138549 601143 636499 1228431 1663763 1667701 1630997 1729611 1640103 1220013 830706
34237 830706 876054 1427383 2245772 2849083 2792564 2237102 1898890 2068598 2168163 1748741
34227 1748741 1322522 1534329 2093294 2365148 2527368 3154925 3983823 4133743 3483026
34218 3483026 2894502 3006968 3537952 3861143 3684229 3115645 2528223 2323316 2480535
34209 2480535 2526098 2249411 2072434 2340918 2774387 3106417 3644226 4539403 5159181 5014218
34199 5014218 4712109 5036400 5608441 5515937 4819120 4288472 3997663 3412371 2687542 2613840
$$ packed form
34267C811204r08172m52821K38359L32982k8296m25439p30656p28343k24389K97021
34257A181450J71865k43141k2934O72066P27704l2515n30946k83311q8194m13495
34247A138549n37406L5356N91932M35332L938l6704R8614q9508m20090l89307
34237H30706M5348N51329Q18389O03311n6519n55462l38212J69708R9565m19422
34227A748741m26219K11807N58965K71854J62220O27557Q28898J49920o50717
34218C483026n88524J12466N30984L23191j76914n68584n87422k04907J57219
34209B480535M5563k76687j76977K68484M33469L32030N37809Q95177O19778j44963
34199E014218l02109L24291N72041r2504o96817n30648k90809n85292p24829p3702
$$ plain form
34189 2613840 3268169 3873207 4072663 4254941 4499164 4293558 3547063 2905415 2758872
34180 2758872 2767179 2632344 2574628 2794199 3151873 3571891 4103290 4469772 4265920 3725802
34170 3725802 3580757 4000899 4371882 4282291 4039952 4007047 4089859 4160017 4405994 4931215
34160 4931215 5380902 5241301 4354109 3117000 2291693 2377745 2961085 3066854 2455800
34151 2455800 2019985 2443486 3165115 3371154 3305730 3637637 4128387 4068676 3622565 3549759
34141 3549759 3856844 3887638 3566664 3416771 3493505 3421942 3335333 3624366 3907808 3483750
34131 3483750 2713007 2660745 3350685 3687616 3239982 2807697 2979828 3350717 3504952 3691736
34121 3691736 4153731 4692932 5153709 5522217 5485863 4780942 3951209 3800908 4177919 4323526
$$ packed form
34189B613840O54329O05038J99456J82278K44223k05606p46495o41648j46543
34180B758872Q307j34835n7716K19571L57674M20018N31399L66482k03852n40118
34170C725802j45045M20142L70983q9591k42339l2905Q2812P0158K45977N25221
34160D931215M49687j39601q87192j237109q25307Q6052N83340J05769o11054
34151B455800m35815M23501P21629K06039o5424L31907M90750n9711m46111p2806
34141C549759L07085L0794l20974j49893P6734p1563q6609K89033K83442m24058
34131C483750p70743n2262O89940L36931m47634m32285J72131L70889J54235J86784
34121C691736M61995N39201M60777L68508l6354p04921q29733j50301L77011J45607
$$ plain form
34111 4323526 4252334 4591965 5212903 5357810 5065280 5075215 5353918 5181529 4707024 4835609
34101 4835609 5473503 5544916 4962791 4869957 5599672 6151622 6132276 6400706 7162261 7232450
34091 7232450 6053230 4789919 4471952 4552901 4297025 4151597 4649016 5197366 5061376
34082 5061376 4530681 4214404 4154140 4361765 5154382 6250968 6657083 6127543 5604900
34073 5604900 5609146 5478519 4859069 4545535 5022176 5506579 5327182 5000942 5089600 5212433
34063 5212433 5019748 4931837 5136871 5084450 4668772 4600830 4971946 4921248 4387655 4541843
34053 4541843 5685726 6467422 6130485 5778165 6340429 7064498 7192655 7341765 7925175
34044 7925175 7995961 7083407 6449924 7017542 7713146 7411098 6848967 6992817 7156475 6489779
$$ packed form
34111D323526p1192L39631O20938J44907k92530R935K78703j72389m74505J28585
34101D835609O37894P1413n82125r2834P29715N51950j9346K68430P61555P0189
34091G232450j179220j263311l17967Q0949k55876j45428M97419N48350j35990
34082E061376n30695l16277o0264K07625P92617J096586M06115n29540n22643
34073E604900M246j30627o19450l13534M76641M84403j79397l26240Q8658J22833
34063E212433j92685q7911K05034n2421m15678o7942L71116n0698n33593J54188
34053D541843J143883P81696l36937l52320N62264P24069J28157J49110N83410
34044G925175P0786r12554o33483N67618O95604l02048n62131J43850J63658o66696
$$ plain form
34034 6489779 5786555 6031234 6587683 6555783 6494014 7107293 7705001 7650715 7779212 8624258
34024 8624258 8895737 7631796 6245348 6419595 7519649 8105225 8412546 9222293 9860206
34015 9860206 9540697 9178541 9671953 9960747 9027992 8160763 8837533 10048747 10208240
34006 10208240 10003627 10694325 11324426 10522157 9453268 9962872 11251806 11432187 10940060
33997 10940060 11308324 11987825 11587192 10889220 11396335 12270795 12004651 11633074 12823228
33988 12823228 14315584 13969580 12841642 13316017 14636181 14438291 13375327 13855624 15372884
33979 15372884 15584894 14966891 15775072 17364659 17308329 16299130 17043945 19067250 19648871
33970 19648871 19205180 20510349 23145669 24063029 23224497 23364613 24670498 25087872 25175949
$$ packed form
34034F489779p03224K44679N56449l1900o1769O13279N97708n4286J28497Q45046
34024H624258K71479j263941j386448J74247J100054N85576L07321Q09747O37913
34015I860206l19509l62156M93412K88794r32755q67229O76770J211214J59493
34006A0208240k04613O90698O30101q02269j068889N09604J288934J80381m92127
33997A0940060L68264O79501m00633o97972N07115Q74460k66144l71577J190154
33988A2823228J492356l46004j127938M74375J320164j97890j062964M80297J517260
33979A5372884K12010o18003Q08181J589587n6330j009199P44815K023305N81621
33970A9648871m43691J305169K635320R17360q38532J40116J305885M17374Q8077
$$ plain form
33961 25175949 27017161 29265451 29281560 28931768 31676049 35423030 35724407 34455838 36880282
33952 36880282 41619232 43098326 42654456 46417246 53067003 55853985 56353765 62425039
33944 62425039 72297256 76601940 77385780 86344210 101462272 108590523 112522929 136424325
33936 136424325 172389616 163426928 69139921 -67654626 -157994564 -165363913 -132539361
33929 -132539361 -111666167 -106989184 -98186598 -83923969 -76683234 -75522678 -69862217 -60370678
33921 -60370678 -55975960 -56364089 -53846063 -48109687 -45151697 -44993307 -42667864 -38690329
33913 -38690329 -37665139 -38689567 -36935938 -32905561 -31159264 -31525419 -29975735 -26820233
33905 -26820233 -26021493 -27383480 -26945180 -24452410 -23420432 -24231620 -23768568 -21675995 -20823132
$$ packed form
33961B5175949J841212K248290J6109l49792K744281L746981L01377j268569K424444
33952C6880282M738950J479094m43870L762790O649757K786982M99780O071274
33944F2425039R872217M304684P83840Q958430J5118062P128251L932406K3901396
33936A36424325L5965291q962688r4287007j36794547r0339938p369349L2824552
33929a32539361K0873194M676983Q802586J4262629P240735J160556N660461R491539
33921f0370678M394718l88129K518026N736376K957990J58390K325443L977535
33913c8690329J025190j024428J753629M030377J746297l66155J549684L155502
33905b6820233P98740j361987M38300K492770J031978q11188M63052K092573Q52863
$$ plain form
33896 -20823132 -21593640 -21424201 -20017391 -19666946 -20398455 -19854441 -18010938 -17186332 -17439996
33887 -17439996 -16689165 -15276323 -15626194 -17318704 -17297214 -15286207 -14328306 -15376700 -15875198
33878 -15875198 -14559255 -13405811 -13701181 -14030884 -13382195 -12794041 -12797547 -12384517 -11513718
33869 -11513718 -11623182 -12734034 -12951279 -11713493 -10735217 -10903666 -10999400 -10326886 -9906466
33860 -9906466 -10164558 -10032286 -9251261 -9101825 -9925967 -10293484 -9546427 -8919451 -9235949
33851 -9235949 -9649548 -9546626 -9611095 -10117656 -10149604 -9391417 -8870700 -9138199 -9442230 -9347764
33841 -9347764 -9431564 -9808795 -9732221 -9162183 -8958053 -9090372 -8549124 -7442542 -7152474 -7856416
33831 -7856416 -7984640 -6869286 -5900065 -6165335 -6842091 -6892247 -6619639 -6563017 -6420414 -6002753
$$ packed form
33896b0823132p70508J69439J406810L50445p31509N44014J843503Q24606k53664
33887a7439996P50831J412842l49871j692510K1490K011007R57901j048394m98498
33878a5875198J315943J153444k95370l29703O48689N88154l506M13030Q70799
33869a1513718j09464j110852k17245J237786R78276j68449r5734O72514M20420
33860i906466k58092J32272P81025J49436q24142l67517P47057O26976l16498
33851i235949m13599J02922o4469n06561l1948P58187N20717k67499l04031R4466
33841i347764q3800l77231P6574N70038K04130j32319N41248J106582K90068p03942
33831g856416j28224J115354R69221k65270o76756n0156K72608N6622J42603M17661
$$ plain form
33821 -6002753 -5827688 -5996430 -5895595 -5630006 -6191194 -7551670 -8230696 -7521341 -6565089
33812 -6565089 -6417187 -6602363 -6424533 -6175746 -6137064 -5807327 -5032270 -4590420 -4851919 -5137121
33802 -5137121 -5080504 -5238432 -5692282 -5587784 -4826360 -4625075 -5500463 -6262195 -5996968 -5503335
33792 -5503335 -5664635 -5919717 -5588101 -5293851 -5713418 -6167409 -5866788 -5452919 -5859743
33783 -5859743 -6580041 -6493142 -5678389 -5083196 -5003307 -5085654 -5275370 -5650944 -5825032 -5516671
33773 -5516671 -5245939 -5559209 -6047013 -5973868 -5420195 -5024035 -5010145 -5123867 -5106301 -4751893
33763 -4751893 -4011487 -3387369 -3533381 -4156610 -4197793 -3443975 -2900282 -3100977 -3250360 -2705785
33753 -2705785 -2112592 -2233105 -2768290 -3234231 -3902579 -4879995 -5321871 -4678682 -3797949
$$ packed form
33821f002753J75065j68742J00835K65589n61188j360476o79026P09355R56252
33812f565089J47902j85176J77830K48787L8682L29737P75057M41850k61499k85202
33802e137121N6617j57928m53850J04498P61424K01285q75388p61732K65227M93633
33792e503335j61300k55082L31616K94250m19567m53991L00621M13869m06824
33783e859743p20298Q6899Q14753N95193P9889q2347j89716l75574j74088L08361
33773e516671K70732l13270m87804P3145N53673L96160J3890j13722J7566L54408
33763d751893P40406O24118j46012o23229m1183P53818N43693k00695j49383N44575
33753b705785N93193j20513n35185m65941o68348r77416m41876O43189Q80733
$$ plain form
33744 -3797949 -3673304 -3964284 -3876243 -3643054 -3897833 -4305675 -4115828 -3540517 -3381342 -3692473
33734 -3692473 -3873502 -3715200 -3435269 -3097041 -2810206 -2983916 -3591301 -3823237 -3303245
33725 -3303245 -2905816 -3426499 -4219879 -4245714 -3729884 -3575828 -3768191 -3658562 -3332626 -3370017
33715 -3370017 -3604298 -3403389 -2932891 -2934151 -3429398 -3758150 -3715649 -3601437 -3362778 -2774525
33705 -2774525 -2270181 -2477607 -3039331 -2969858 -2138990 -1401899 -1299240 -1591609 -2048198 -2728596
33695 -2728596 -3420661 -3659426 -3412240 -3086324 -2902299 -2875010 -3204442 -3957538 -4566875 -4403284
33685 -4403284 -3672324 -3059045 -2771211 -2659174 -2882659 -3559527 -4091016 -3807384 -3032787
33676 -3032787 -2578165 -2483883 -2268656 -2073863 -2364560 -2724529 -2273466 -1265460 -952429
$$ packed form
33744c797949J24645k90980Q8041K33189k54779m07842J89847N75311J59175l11131
33734c692473j81029J58302K79931L38228K86835j73710o07385k31936N19992
33725c303245L97429n20683p93380k5835N15830J54056j92363J09629L25936l7391
33715c370017k34281K00909M70498j260m95247l28752M2501J14212K38659N88253
33705b774525N04344k07426n61724O9473Q30868P37091J02659k92369m56589o80398
33695b728596o92065k38765K47186L25916J84025K7289l29432p53096o09337J63591
33685d403284P30960O13279K87834J12037k23485o76868n31489K83632P74597
33676c032787M54622R4282K15227J94793k90697l59969M51063J008006L13031
$$ plain form
33667 -952429 -1696207 -2476286 -2569341 -2507146 -2891097 -3332244 -3217622 -2724724 -2410595 -2336300
33657 -2336300 -2165364 -1788611 -1440233 -1380696 -1641446 -1940798 -1916141 -1640872 -1648364 -2118572
33647 -2118572 -2460361 -2217751 -1900934 -2183595 -2733739 -2760163 -2365396 -2314737 -2672146 -2747454
33637 -2747454 -2324659 -1903277 -1740424 -1655769 -1755165 -2306894 -2905281 -2836976 -2311076 -2219588
33627 -2219588 -2638509 -2771374 -2487613 -2592055 -3285091 -3712977 -3516180 -3490307 -4048971 -4286612
33617 -4286612 -3433751 -2186447 -1635913 -1732354 -1768836 -1673983 -1838107 -2180609 -2323812 -2339226
33607 -2339226 -2518774 -2684632 -2425715 -1794073 -1177873 -703399 -283683 -52057 -266934
33598 -266934 -906878 -1668445 -2213848 -2287638 -1911873 -1579911 -1813694 -2399368 -2593324 -2222788
$$ packed form
33667i52429p43778p80079r3055O2195l83951m41147J14622M92898L14129P4295
33657b336300J70936L76753L48378N9537k60750k99352K4657K75269p492m70208
33647b118572l41789K42610L16817k82661n50144k6424L94767N0659l57409p5308
33637b747454M22795M21382J62853Q4655r9396n51729n98387O8305N25900R1488
33627b219588m18921j32865K83761j04442o93036m27886J96797K5873n58664k37641
33617d286612Q52861J247304N50534r6441l6482R4853j64124l42502j43203j5414
33607b339226j79548j65858K58917O31642O16200M74474M19716K31626k14877
33598b66934o39944p61567n45403p3790L75765L31962k33783n85674j93956L70536
$$ plain form
33588 -2222788 -1919450 -2037850 -2107608 -1747190 -1358982 -1381200 -1529586 -1391666 -1178292 -1247169
33578 -1247169 -1415877 -1401975 -1447196 -1821382 -2164985 -2044930 -1755018 -1808685 -2004581 -1829583
33568 -1829583 -1515027 -1760196 -2466539 -2663932 -1879680 -830503 -430668 -667311 -855948
33559 -855948 -662041 -433937 -600126 -1074066 -1419259 -1493326 -1649348 -2138236 -2566897 -2351214
33549 -2351214 -1605141 -1068081 -1095168 -1262895 -1159754 -1021423 -1253737 -1780823 -2253220 -2544774
33539 -2544774 -2668649 -2518778 -2083642 -1677276 -1618045 -1866118 -2207347 -2533948 -2730848 -2616500
33529 -2616500 -2260199 -2034084 -2088388 -2119586 -1927479 -1809413 -2057267 -2426353 -2492254 -2239585
33519 -2239585 -1938070 -1716741 -1601512 -1694047 -1975250 -2177866 -2122226 -1903977 -1575097 -1074913
$$ packed form
33588b222788L03338j18400o9758L60418L88208k2218j48386J37920K13374o8877
33578a247169j68708J3902m5221l74186l43603J20055K89912n3667j95896J74998
33568a829583L14556k45169p06343j97393P84252J049177L99835k36643j88637
33559h55948J93907K28104j66189m73940l45193p4067j56022m88888m28661K15683
33549b351214P46073N37060k7087j67727J03141J38331k32314n27086m72397k91554
33539b544774j23875J49871M35136M06366N9231k48073l41229l26601j96900J14348
33529b616500L56301K26115n4304l1198J92107J18066k47854l69086o5901K52669
33519b239585L01515K21329J15229r2535k81203k02616N5640K18249L28880N00184
$$ plain form
33509 -1074913 -695122 -1013666 -1950109 -2488937 -1937792 -957565 -656505 -1083997 -1409001
33500 -1409001 -1292803 -1203222 -1441965 -1705657 -1749561 -1796407 -2032383 -2197186 -1960833 -1413470
33490 -1413470 -975022 -972629 -1369846 -1785164 -1809521 -1437767 -1105139 -1187306 -1612349 -2053708
33480 -2053708 -2252346 -2033640 -1370322 -646346 -468839 -932291 -1466033 -1711893 -2042343
33471 -2042343 -2746818 -3246641 -2831087 -1822992 -1221910 -1344829 -1578723 -1442835 -1154943
33462 -1154943 -1032285 -982423 -830582 -684026 -719162 -906687 -1118267 -1292387 -1405208 -1436170
33452 -1436170 -1375239 -1165574 -764034 -378062 -387609 -805596 -1108488 -919715 -574166 -627069
33442 -627069 -1078805 -1515321 -1761577 -1920889 -1976804 -1837511 -1601068 -1340535 -859869 -132844
$$ packed form
33509a074913L79791l18544r36443n38828N51145R80227L01060m27492l25004
33500a409001J16198Q9581k38743k63692m3904m6846k35976j64803K36353N47363
33490a413470M38448K393l97217m15318k4357L71754L32628q2167m25043m41359
33480b053708j98638K18706O63318P23976J77507m63452n33742k45860l30450
33471b042343p04475m99823M15554J008095O01082j22919k33894J35888K87892
33462a154943J22658M9862J51841J46556l5136j87525k11580j74120j12821l0962
33452a436170O0931K09665M01540L85972r547m17987l02892J88773L45549n2903
33442f27069m51736m36516k46256j59312n5915J39293K36443K60533M80666P27025
$$ plain form
33432 -132844 309008 10923 -636234 -910863 -833037 -1005729 -1534372 -1902213 -1914353 -1974322
33422 -1974322 -2294955 -2544741 -2475523 -2286948 -2153156 -1919658 -1472342 -952624 -465758 -4442
33412 -4442 264811 94262 -412103 -893204 -1230075 -1483836 -1494537 -1199471 -1191242 -2066608
33402 -2066608 -3208673 -3241034 -1945285 -699535 -551519 -848336 -470093 442603 898705
33393 898705 588732 38084 -429460 -948092 -1434730 -1467776 -937378 -276320 31163 -184334
33383 -184334 -818718 -1520367 -1793545 -1488256 -1086099 -1096112 -1298311 -1067363 -372111 100305
33373 100305 -98803 -598983 -798903 -657068 -611621 -933767 -1438831 -1761743 -1721412 -1422079
33363 -1422079 -1119173 -1006864 -1070068 -1114229 -980563 -777718 -856039 -1422030 -2152701 -2389190
$$ packed form
33432a32844M41852k98085o47157k74629P7826j72692n28643l67841j2140n9969
33422a974322l20633k49786O9218J88575J33792K33498M47316N19718M86866M61316
33412d442K69253j70549n06365m81101l36871k53761j0701K95066Q229q75366
33402b066608j142065l2361J295749J245750J48016k96817L78243R12696M56102
33393H98705l09973n50648m67544n18632m86638l3046N30398O61058L07483k15497
33383a84334o34384p01649k73178L05289M02157j0013k02199K30948O95252M72416
33373A00305j99108n00180j99920J41835M5447l22146n05064l22912M0331K99333
33363a422079L02906J12309o3204m4161J33666K02845p8321n65991p30671k36489
$$ plain form
33353 -2389190 -1879115 -1169465 -1009245 -1458049 -1891201 -1849171 -1523332 -1335022 -1380450 -1458087
33343 -1458087 -1396845 -1199096 -1041192 -1208638 -1796921 -2413817 -2487341 -1993130 -1539770 -1537835
33333 -1537835 -1634240 -1275668 -537785 8483 85496 -61573 -176477 -325762 -631292 -985405
33323 -985405 -1220113 -1391608 -1698430 -2149931 -2462283 -2345021 -1833552 -1250859 -843646 -570796
33313 -570796 -301341 -66448 48917 155084 448800 845331 948221 494583 -288748 -873334
33303 -873334 -943363 -694282 -620860 -984366 -1533963 -1873354 -2014182 -2251260 -2488185 -2196661
33293 -2196661 -1309309 -630971 -845033 -1500108 -1633526 -1136151 -743566 -797894 -873106 -722890
33283 -722890 -742717 -1155710 -1461331 -1183290 -660039 -597098 -1164303 -1933413 -2432916 -2438286
$$ packed form
33353b389190N10075P09650J60220m48804m33152M2030L25839J88310m5428p7637
33343a458087O1242J97749J57904j67446n88283o16896p3524M94211M53360J935
33333a537835r6405L58572P37883N46268P7013j47069j14904j49285l05530l54113
33323i85405k34708j71495l06822m51501l12352J17262N11469N82693M07213K72850
33313e70796K69455K34893J15365J06167K93716L96531J02890m53638p83331n84586
33303h73334p0029K49081P3422l63506n49597l39391j40828k37078k36925K91524
33293b196661Q87352O78338k14062o55075j33418M97375L92585n4328p5212J50216
33283g22890j9827m12993l05621K78041N23251O2941n67205p69110m99503n370
$$ plain form
33273 -2438286 -1990023 -1440401 -1250313 -1479360 -1692163 -1544418 -1183742 -921610 -858396 -1000841
33263 -1000841 -1347653 -1658063 -1583777 -1268745 -1303242 -1756601 -1832057 -991661 88544 352045
33253 352045 -199005 -621248 -409340 -31748 -70674 -458936 -760402 -787760 -721256 -814662
33243 -814662 -1094961 -1283106 -1081459 -626264 -467401 -934883 -1732109 -2339333 -2569213 -2506929
33233 -2506929 -2204259 -1743683 -1350115 -1125445 -911720 -684055 -737615 -1139792 -1387909 -1080748
33223 -1080748 -576428 -442242 -587037 -585058 -578763 -1072963 -1925274 -2336286 -1937192 -1220857
33213 -1220857 -770093 -673171 -843662 -1293728 -1844605 -2095830 -1954497 -1766702 -1720749 -1580517
33203 -1580517 -1238391 -1046014 -1265654 -1596276 -1610403 -1351734 -1152080 -1113392 -1109665 -1100528
$$ packed form
33273b438286M48263N49622J90088k29047k12803J47745L60676K62132O3214j42445
33263a000841l46812l10410P4286L15032l4497m53359p5456Q40396J080205K63501
33253C52045n51050m22243K11908L77592l8926l88262l01466k7358O6504r3406
33243h14662k80299j88145K01647M55195J58863m67482p97226o07224k29880O2284
33233b506929L02670M60576L93568K24670K13725K27665n3560m02177k48117L07161
33223a080748N04320J34186j44795J979O295m94200q52311m11012L99094P16335
33213a220857M50764R6922j70491m50066n50877k51225J41333J87795M5953J40232
33203a580517L42126J92377k19640l30622j4127K58669J99654L8688L727R137
$$ plain form
33193 -1100528 -1129734 -1165443 -1200489 -1353175 -1628563 -1754033 -1520507 -1139484 -972478 -1009093
33183 -1009093 -919211 -598182 -376215 -614122 -1258412 -1855788 -1916240 -1280249 -275732 457233
33173 457233 446451 -185418 -811191 -913058 -613839 -512245 -958880 -1620946 -1904617 -1710397
33163 -1710397 -1498488 -1569512 -1611432 -1199679 -511613 -168024 -397848 -706825 -496163 209811
33153 209811 816294 834176 351300 -169728 -450281 -640195 -992315 -1443126 -1689577 -1618075
33143 -1618075 -1424400 -1296688 -1228297 -1198763 -1263571 -1349134 -1231323 -877060 -558613 -472153
33133 -472153 -512386 -588783 -830405 -1226221 -1400698 -1093585 -597301 -363531 -414788 -501234
33123 -501234 -584047 -748777 -863258 -776989 -693564 -895677 -1242170 -1383091 -1338516 -1404100
$$ packed form
33193a100528k9206l5709l5046j52686k75388j25470K33526L81023J67006l6615
33183a009093Q9882L21029K21967k37907o44290n97376o0452O35991J004517P32965
33173D57233j0782o31869o25773j01867K99219J01594m46635o62066k83671J94220
33163a710397K11909p1024m1920M11753O88066L43589k29824l08977K10662P05974
33153B09811O06483J7882m82876n21028k80553j89914l52120m50811k46451P1502
33143a618075J93675J27712O8391K9534o4808q5563J17811L54263L18447Q6460
33133d72153m0233p6397k41622l95816j74477L07113M96284K33770n1257q6446
33123e01234q2813j64730j14481Q6269Q3425k02113l46493j40921M4575o5584
$$ plain form
33113 -1404100 -1596153 -1650489 -1476959 -1189577 -836602 -556413 -778979 -1681351 -2618391 -2776814
33103 -2776814 -2300019 -2038191 -2228863 -2246449 -1745964 -1190165 -980035 -870095 -627968 -536878
33093 -536878 -756466 -821086 -344027 264643 347717 -103219 -616648 -979920 -1287654 -1491870
33083 -1491870 -1417178 -1126929 -893575 -858235 -946590 -1005229 -875226 -532253 -268879 -451944
33073 -451944 -975670 -1304924 -1201163 -993022 -958733 -935676 -801700 -815312 -1111395 -1356091
33063 -1356091 -1322687 -1325687 -1611959 -1815857 -1590148 -1320779 -1545049 -2037040 -2210170 -2139685
33053 -2139685 -2376030 -2889587 -3018658 -2472475 -1657790 -961481 -404366 -86501 -254111
33044 -254111 -722400 -884499 -562560 -278746 -412234 -665659 -706203 -752578 -1040622 -1205572
$$ packed form
33113a404100j92053n4336J73530K87382L52975K80189k22566r02372r37040j58423
33103b776814M76795K61828j90672j7586N00485N55799K10130J09940K42127R1090
33093e36878k19588o4620M77059O08670Q3074m50936n13429l63272l07734k04216
33083a491870P4692K90249K33354L5340q8355n8639J30003L42973K63374j83065
33073d51944n23726l29254J03761K08141L4289K3057J33976j3612k96083k44696
33063a356091L3404l000k86272k03898K25709K69369k24270m91991j73130P0485
33053b139685k36345n13557j29071N46183Q14685O96309N57115L17865j67610
33044b54111m68289j62099L21939K83814j33488k53425m0544m6375k88044j64950
$$ plain form
33034 -1205572 -829617 -285146 -318158 -883331 -1110388 -583811 -19170 -262283 -1056039 -1394802
33024 -1394802 -959839 -542562 -841657 -1404350 -1274209 -396990 268124 52431 -617915
33015 -617915 -956317 -848792 -753257 -903044 -1084163 -1078649 -937823 -835412 -899280 -1133053
33005 -1133053 -1333915 -1251864 -1026021 -1188880 -1895009 -2421463 -1963355 -809733 -133500
32996 -133500 -541208 -1390129 -1760296 -1595714 -1475913 -1586666 -1468286 -807341 -56565 15473
32986 15473 -704600 -1419733 -1275686 -345076 465030 469027 -117418 -647004 -868674 -1020333
32976 -1020333 -1315767 -1681208 -1928165 -1919531 -1618723 -1182792 -891918 -760979 -408475 352997
32966 352997 985560 780173 -108922 -749090 -674610 -484649 -869949 -1518630 -1552501 -862402
$$ packed form
33034a205572L75955N44471l3012n65173k27057N26577N64641k43113p93756l38763
33024a394802M34963M17277k99095n62693J30141Q77219O65114k15693o70346
33015f17915l38402J07525R5535j49787j81119N514J40826J02411o3868k33773
33005a133053k00862Q2051K25843j62859p06129n26454M58108J153622O76233
32996a33500m07708q48921l70167J64582J19801j10753J18380O60945P50776P2038
32986A5473p20073p15133J44047R30610Q10106L997n86445n29586k21670j51659
32976a020333k95434l65441k46957Q634L00808M35931K90874J30939L52504P61472
32966C52997O32563k05387q89095o40168P4480J89961l85300o48681l3871O90099
$$ plain form
32956 -862402 -387159 -901225 -1960256 -2409010 -1757439 -656684 11856 112488 77611
32947 77611 99987 2371 -180457 -79103 355758 558284 59335 -835706 -1461989 -1640781
32937 -1640781 -1702122 -1838461 -1880213 -1664905 -1246217 -733686 -244860 -22595 -294040 -947203
32927 -947203 -1548742 -1720608 -1400915 -834352 -445873 -554043 -1000244 -1232344 -974060 -597850
32917 -597850 -582309 -867357 -1073339 -1063176 -874072 -408314 262975 560700 32345 -831150
32907 -831150 -1131077 -842275 -779507 -1242619 -1545506 -1151131 -490316 -220143 -296416 -286577
32897 -286577 -135627 -115150 -331972 -721199 -1290912 -2026169 -2731006 -3180838 -3221661 -2649666
32887 -2649666 -1399217 22965 809766 807147 685210 891517 1041060 737706 322589
$$ packed form
32956h62402M75243n14066j059031m48754O51571J100755O68540J00632l4877
32947G7611K2376r7616j82828J01354M34861K02526m98949q95041o26283j78792
32937a640781o1341j36339m1752K15308M18688N12531M88826K22265k71445o53163
32927i47203o01539j71866L19693N66563L88479j08170m46201k32100K58284L76210
32917e97850J5541k85048k05982J0163J89104M65758O71289K97725n28355q63495
32907h31150k99927K88802O2768m63112l02887L94375O60815K70173p6273R839
32897b86577J50950K0477k16822l89227n69713p35257p04837m49832m0823N71995
32887b649666J250449J422182P86801k619j21937K06307J49543l03354m15117
$$ plain form
32878 322589 184889 -62002 -889316 -1774862 -1775832 -982823 -424507 -514279 -566281 -96957
32868 -96957 305345 -72817 -917660 -1316763 -950508 -252857 384515 946932 1352980 1250754
32858 1250754 508207 -415929 -905671 -881682 -786873 -883142 -868106 -396862 220050 225032
32848 225032 -628696 -1671608 -2085139 -1832346 -1524198 -1510638 -1508880 -1187294 -738439 -606961
32838 -606961 -850548 -1114971 -1214319 -1357051 -1627913 -1613540 -974023 -191942 -138970 -826417
32828 -826417 -1251153 -802953 -165112 -239605 -771216 -896380 -641809 -768783 -1238472 -1081819
32818 -1081819 -85749 573005 -6014 -1122168 -1587916 -1348053 -1079186 -861089 -351123
32809 -351123 132173 -108937 -860939 -1065061 -316428 604827 931583 837292 828838 891837
$$ packed form
32878C22589j37700k46891q27314q85546r70P93009N58316q9772n2002M69324
32868i6957M02302l78162q44843l99103L66255O97651O37372N62417M06048j02226
32858A250754p42547r24136m89742K3989R4809r6269J5036M71244O16912M982
32848B25032q53728j042912m13531K52793L08148J3560J758L21586M48855J31478
32838f06961k43587k64423r9348j42732k70862J4373O39517P82081N2972o87447
32828h26417m24736M48200O37841p4493n31611j25164K54571j26974m69689J56653
32818a081819R96070O58754n79019j116154m65748K39863K68867K18097N09966
32809c51123M83296k41110p52002k04122P48633R21255L26756r4291q454O2999
$$ plain form
32799 891837 704866 274937 -64398 -69100 237914 609141 682658 293278 -259413 -519756
32789 -519756 -473908 -520738 -833917 -1135654 -1165599 -978866 -682971 -283972 68956 93354
32779 93354 -173257 -294238 -38556 256751 187345 -125280 -238142 -29273 120637 -252597
32769 -252597 -1205116 -2248054 -2681479 -2193678 -1150942 -208636 262841 228289 -273180
32760 -273180 -1045546 -1552121 -1333098 -624072 -116688 -103194 -317610 -567498 -892541 -1050468
32750 -1050468 -609252 182459 367644 -412099 -1219006 -1009591 -17933 683835 610660 175574
32740 175574 -143505 -249022 -166505 18837 1170 -425582 -898539 -828106 -212210 328007
32730 328007 312143 -197375 -868857 -1310133 -1098707 -183182 723976 746886 -36613 -630791
$$ packed form
32799H91837j86971m29929l39335m702L07014L71227P3517l89380n52691k60343
32789e19756M5848m6830l13179l01737k9945J86733K95895L98999L52928K4398
32779I3354k66611j20981K55682K95307o9406l12625j12862K08869J49910l73234
32769b52597r52519j042938m33425M87801J042736R42306M71477l4552n01469
32760b73180p72366n06575K19023P09026N07384J3494k14416k49888l25043j57927
32750a050468M41216P91711J85185p79743q06907K09415R91658P01768p3175m35086
32740A75574l19079j05517Q2517J85342j7667m26752m72957P0433O15896N40217
32730C28007j5864n09518o71482m41276K11426R15525R07158K2910p83499n94178
$$ plain form
32720 -630791 -439402 22887 -1464 -495253 -927973 -1084902 -1128045 -1111728 -948817 -737261
32710 -737261 -697280 -833082 -974384 -1077310 -1188607 -1211446 -1031694 -796659 -722308 -680790
32700 -680790 -363586 155797 451311 409920 411318 650395 733758 303933 -299804 -482215
32690 -482215 -263263 -151436 -229306 -3584 672591 1128909 744843 -110021 -524993 -246364
32680 -246364 111489 28081 -286222 -382576 -251215 -172405 -175616 -71975 53634 -187139
32670 -187139 -877498 -1463689 -1336696 -646750 -197096 -434755 -869766 -792548 -344045 -369887
32660 -369887 -1178828 -2002546 -2005323 -1384318 -963275 -984261 -945417 -571809 -263308 -380162
32650 -380162 -640009 -580365 -264845 -162525 -510981 -1062002 -1330554 -964076 -76845 671376
$$ packed form
32720f30791J91389M62289k4351m93789m32720j56929m3143J6317J62911K11556
32710g37261L9981j35802j41302j02926j11297k2839J79752K35035P4351M1518
32700f80790L17204N19383K95514m1391J398K39077Q3363m29825o03737j82411
32690d82215K18952J11827p7870K25722O76175M56318l84066q54864m14972K78629
32680b46364L57853q3408l14303r6354J31361P8810l211J03641J25609k40773
32670a87139o90359n86191J26993O89946M49654k37659m35011P7218M48503k5842
32660c69887q08941q23718k777O21005M21043k0986L8844L73608L08501j16854
32650c80162k59847N9644L15520J02320l48456n51021k68552L66478Q87231P48221
$$ plain form
32640 671376 631332 -34649 -444594 -97953 521481 758914 737277 944683 1226261 929907
32630 929907 -16498 -896881 -1205102 -1225761 -1373455 -1510310 -1316210 -932560 -749473 -747338
32620 -747338 -518576 63772 558339 437115 -347075 -1356202 -2078971 -2250319 -1881272
32611 -1881272 -1165563 -422406 -12225 -120157 -557007 -878757 -798426 -440154 -150024 -144850
32601 -144850 -396161 -727746 -919606 -828741 -533178 -271703 -158326 -92490 -26720 -85833
32591 -85833 -257109 -252599 22632 137350 -298497 -917494 -980379 -440515 -60456 -344529
32581 -344529 -872925 -963655 -605929 -397575 -760510 -1483965 -1958897 -1763149 -1126941 -793001
32571 -793001 -1189378 -1818685 -1841839 -1215458 -724111 -828885 -1126878 -1181326 -1186104 -1344538
$$ packed form
32640F71376m0044o65981m09945L46641O19434K37433k1637K07406K81578k96354
32630I29907r46405q80383l08221k0659j47694j36855J94100L83650J83087K135
32620g47338K28762N82348M94567j21224p84190j009127p22769j71348L69047
32611a881272P15709P43157M10181j07932m36850l21750Q0331L58272K90130N174
32601a44850k51311l31585j91860R0865K95563K61475J13377O5836O5770n9113
32591h5833j71276M510K75231J14718m35847o18997o2885N39864L80059k84073
32581c44529n28396r0730L57726K08354l62935p23455m74932J95748O36208L33940
32571g93001l96377o29307k3154O26381M91347j04774k97993n4448m778j58434
$$ plain form
32561 -1344538 -1232757 -469103 424439 588406 47 -625934 -899563 -972726 -861005 -423168
32551 -423168 -44167 -436741 -1507542 -2212895 -1911995 -1161280 -724743 -485855 23501
32542 23501 558041 433081 -364677 -1086298 -1232500 -1063425 -1016301 -1097542 -1023374 -648313
32532 -648313 -99088 337218 405245 123593 -161237 -117793 198688 450456 407819 86310
32522 86310 -361172 -675546 -577859 -114011 219620 25281 -435323 -607441 -469932 -511798
32512 -511798 -871830 -1045835 -655938 -58721 132008 -169464 -526171 -582990 -407210 -338336
32502 -338336 -658662 -1299615 -1811518 -1817256 -1521224 -1466961 -1745028 -1863394 -1539994 -1104374
32492 -1104374 -820236 -377557 424918 989746 643381 -242141 -655103 -372532 -168134
$$ packed form
32561a344538J11781P63654Q93542J63967n88359o25981k73629p3163J11721M37837
32551d23168L79001l92574j070801p05353L00900P50715M36537K38888N09356
32542B3501N34540j24960p97758p21621j46202J69075M7124q1241P4168L75061
32532f48313N49225M36306O8027k81652k84830M3444L16481K51768m2637l21509
32522H6310m47482l14374R7687M63848L33631j94339m60604j72118J37509m1866
32512e11798l60032j74005L89897N97217J90729l01472l56707n6819J75780O8874
32502c38336l20326o40953n11903n738K96032N4263k78067j18366L23400M35620
32492a104374K84138M42679Q02475N64828l46365q85522m12962K82571K04398
$$ plain form
32483 -168134 -536973 -1042215 -1192212 -1200767 -1414659 -1587051 -1295079 -691304 -279785 -182268
32473 -182268 -118166 51291 199363 236802 159137 -91885 -457619 -584843 -201890 428830
32463 428830 815353 888159 920546 882451 407309 -518192 -1336790 -1606119 -1508605 -1433084
32453 -1433084 -1388884 -1146767 -719217 -354923 -168996 -76701 -48965 -170538 -422646 -618464
32443 -618464 -631654 -553437 -528567 -524083 -403332 -234912 -350665 -916694 -1525871 -1515191 -786941
32432 -786941 -20633 159980 -43176 -34344 183574 -3435 -816529 -1622572 -1726515 -1223432
32422 -1223432 -747471 -661697 -831115 -999374 -1048017 -969691 -841284 -756054 -616622 -161095
32412 -161095 588567 1108393 923585 246979 -274589 -363967 -299046 -341920 -401467 -346289
$$ packed form
32483a68134l68839n05242j49997q555k13892j72392K91972O03775M11519R7517
32473a82268O4102J69457J48072L7439p7665k51022l65734j27224L82953O30720
32463D28830L86523P2806L2387l8095m75142r25501q18598k69329R7514P5521
32453a433084M4200K42117M27550L64294J85927R2295K7736j21573k52108j95818
32443f18464j3190P8217K4870M484J20751J68420j15753n66029o09177J0680P28250
32432g86941P66308J80613k03156Q832K17918j87009q13094q06043j03943N03083
32422a223432M75961Q5774j69418j68259m8643P8326J28407Q5230J39432M55527
32412a61095P49662N19826j84808o76606n21568q9378O4921m2874n9547N5178
$$ plain form
32402 -346289 -290451 -408802 -717900 -1147544 -1585531 -1781188 -1520236 -1027793 -851933 -1120227
32392 -1120227 -1248680 -733836 35991 227593 -281010 -687456 -307166 567600 1065406
32383 1065406 731593 -118742 -879001 -1197817 -1071885 -657726 -141073 294226 527491
32374 527491 589312 627541 718296 744593 548340 181025 -125330 -257850 -340674 -482215
32364 -482215 -567188 -431577 -107537 251038 531869 579444 177037 -554440 -940484 -462622
32354 -462622 337862 293207 -830109 -1809938 -1473839 -257435 383812 -138941 -971398
32345 -971398 -1095849 -482354 217031 521804 354505 -122234 -532097 -470186 11017 377426
32335 377426 353651 339494 712748 1077250 762852 -127071 -789965 -823910 -665188 -821301
$$ packed form
32402c46289N5838j18351l09098m29644m37987j95657K60952M92443J75860k68294
32392a120227j28453N14844P69827J91602n08603m06446L80290Q74766M97806
32383A065406l33813q50335p60259l18816J25932M14159N16653M35299K33265
32374E27491O1821L8229R0755K6297j96253l67315l06355j32520q2824j41541
32364d82215q4973J35611L24040L58575K80831M7575m02407p31477l86044M77862
32354d62622Q00484m4655j123316r79829L36099J216404O41247n22753q32457
32345i71398j24451O13495O99385L04773j67299m76739m09863O1911M81203L66409
32335C77426k3775j4157L73254L64502l14398q89923o62894l3945J58722j56113
$$ plain form
32325 -821301 -1205389 -1462800 -1522294 -1519698 -1483004 -1395883 -1363283 -1453040 -1532063 -1470783 -1356689
32314 -1356689 -1313410 -1257938 -1023155 -591967 -67532 423831 668041 435168 -174747 -669989
32304 -669989 -695005 -440417 -300192 -344917 -418900 -515804 -676787 -714012 -481604 -280718
32294 -280718 -502944 -960204 -1115061 -942463 -927912 -1129184 -963310 -226660 365646 177439
32284 177439 -355308 -373426 139915 459454 282184 42645 66726 114196 -54956 -237619
32274 -237619 -200764 -119591 -293863 -696008 -1041011 -1105562 -837689 -386347 -131244 -390688
32264 -390688 -963774 -1272420 -1095182 -791201 -633909 -421501 -87583 -157823 -983795 -1885672
32254 -1885672 -1820829 -792811 141754 283046 -42166 -351207 -724282 -1235983 -1380042
$$ packed form
32325h21301l84088k57411n9494K596L6694Q7121L2600q9757p9023O1280J14094
32314a356689M3279N5472K34783M31188N24435M91363K44210k32873o09915m95242
32304f69989k5016K54588J40225m4725p3983r6904j60983l7225K32408K00886
32294b80718k22226m57260j54857J72598J4551k01272J65874P36650N92306j88207
32284A77439n32747j8118N13341L19539j77270k39539K4081M7470j69152j82663
32274b37619L6855Q1173j74272m02145l45003o4551K67873M51342K55103k59444
32264c90688n73086l08646J77238L03981J57292K12408L33918p0240q25972r01877
32254a885672O4843J028018R34565J41292l25212l09041l73075n11701j44059
$$ plain form
32245 -1380042 -741619 162446 413454 -124734 -769974 -1062220 -1201512 -1416862 -1531403
32236 -1531403 -1379013 -1149189 -1002896 -732794 -176364 319499 283579 -164818 -425099 -247401
32226 -247401 -48818 -250536 -632964 -639736 -147801 403799 629914 607917 556812 419235
32216 419235 44312 -395554 -537823 -358407 -228969 -398703 -750464 -1150743 -1630926 -2006924
32206 -2006924 -1764922 -761718 273833 488252 -3025 -347678 -221747 -192731 -676291
32197 -676291 -1208908 -1163560 -682148 -363270 -337509 -231264 75688 219886 -45504 -439922
32187 -439922 -505964 -123880 427354 726472 470398 -297932 -1112054 -1409229 -1078006 -588531
32177 -588531 -475329 -755951 -951494 -649126 36609 588142 646601 390118 286298 510030
$$ packed form
32245a380042O38423R04065K51008n38188o45240k92246j39292k15350j14541
32236a531403J52390K29824J46293K70102N56430M95863l5920m48397k60281J77698
32226b47401J98583k01718l82428o772M91935N51600K26115k1997n1105j37577
32216D19235l74923m39866j42269J79416J29438j69734l51761m00279m80183l75998
32206b006924K42002J003204J035551K14419m91277l44653J25931K9016m83560
32197f76291n32617M5348M81412L18878K5761J06245L06952J44198k65390l94418
32187d39922o6042L82084N51234K99118k56074p68330q14122k97175L31223M89475
32177e88531J13202k80622j95543L02368O85735N51533N8459k56483j03820K23732
$$ plain form
32167 510030 758165 673657 265144 -217772 -653128 -1082574 -1472973 -1665301 -1554562 -1174405
32157 -1174405 -635575 -108095 214765 309984 412890 708462 990934 877925 367195 -65337
32147 -65337 8223 519340 1028317 1144881 807216 312223 85224 243806 382825 -2622
32137 -2622 -854608 -1535348 -1537767 -1010893 -500731 -357152 -486645 -540393 -287107 72959
32127 72959 -1253 -762997 -1674284 -1854962 -1083458 -25502 582827 583296 152348 -536262
32117 -536262 -1104221 -958612 -21850 861621 819765 66203 -418541 -173518 355626 658321
32107 658321 755639 834497 841314 689255 474136 252767 -65832 -400882 -391415 133276 796282
32096 796282 1016696 580341 -227759 -860806 -829786 -103945 670741 685836 -89888 -793584
$$ packed form
32167E10030K48135q4508m08513m82916m35356m29446l90399j92328J10739L80157
32157a174405N38830N27480L22860R5219J02906K95572K82472j13009n10730m32532
32147f5337P3560N11117N08977J16564l37665m94993k26999J58582J39019l85447
32137b622q51986o80740k419N26874N10162J43579j29493n3748K53286L60066
32127G2959p4212p61744r11287j80678P71504J057956O08329M69m30948o88610
32117e36262n67959J45609R36762Q83471m1856p53562m84744K45023N29144L02695
32107F58321R7318P8858O817j52059k15119k21369l18599l35050R467N24691O63006
32096G96282K20414m36355q08100o33047L1020P25841P74686J5095p75724p03696
$$ plain form
32086 -793584 -721965 -168946 103786 -91975 -308432 -242986 -76826 -52460 -141671 -210976
32076 -210976 -202497 -71624 201702 471660 513286 310283 75456 -47534 -124675 -249845
32066 -249845 -395326 -471742 -398364 -131649 220411 360675 83673 -429150 -798849 -903295
32056 -903295 -923777 -983340 -1006798 -927121 -753053 -445761 -35317 179798 -26386 -237779
32046 -237779 287927 1505256 2307255 1782344 362977 -751156 -1016305 -856534 -774970
32037 -774970 -805637 -852025 -954408 -1028480 -808672 -304946 36598 -108664 -491913 -634236
32027 -634236 -386030 93987 682882 1304947 1744122 1776494 1463953 1062755 653125 98700
32017 98700 -605669 -1180148 -1354400 -1176481 -935330 -851887 -898288 -861232 -557720 -45445
$$ packed form
32086g93584P1619N53019K72732j95761k16457O5446J66160K4366q9211o9305
32076b10976Q479J30873K73326K69958M1626k03003k34827j22990p7141j25170
32066b49845j45481p6416P3378K66715L52060J40264k77002n12823l69699j04446
32056i03295k0482n9563k3458P9677J74068L07292M10444K15115k06184k11393
32046b37779N25706J217329Q01999n24911j419367j114133k65149J59771Q1564
32037g74970l0667m6388j02383p4072K19808N03726L41544j45262l83249j42323
32027f34236K48206M80017N88895O22065M39175L2372l12541m01198m09630n54425
32017I8700p04369n74479j74252J77919K41151Q3443m6401L7056L03512N12275
$$ plain form
32007 -45445 375841 438807 181878 -117641 -251207 -212077 -55847 190216 427033 469846
31997 469846 271483 62545 123194 440722 693145 568734 63376 -489567 -652082 -240948
31987 -240948 471240 1000623 1148969 1107156 995862 595963 -177458 -783852 -543926 400965
31977 400965 1126017 1052593 564109 273445 188853 26807 -89178 125374 386745 61702
31967 61702 -834007 -1458517 -1181103 -365702 123234 -111713 -736063 -1139845 -985146 -486048
31957 -486048 -225275 -487674 -803071 -506308 259044 615952 174982 -398334 -363972 85377
31947 85377 279666 91284 -95568 -136223 -207498 -285764 -147677 145919 284529 201296
31937 201296 63081 -163396 -607563 -992702 -830663 -198747 242231 160754 -30703 129831
$$ packed form
32007d5445M21286O2966k56929k99519j33566L9130J56230K46063K36817M2813
31997D69846j98363k08938O0649L17528K52423j24411n05358n52943j62515M11134
31987b40948P12188N29383J48346m1813j11294l99899p73421o06394K39926R44891
31977D00965P25052p3424m88484k90664q4592j62046j15985K14552K61371l25043
31967F1702q95709o24510K77414Q15401M88936k34947o24350m03782J54699M99098
31957d86048K60773k62399l15397K96763P65352L56908m40970n73316L4362M49349
31947H5377J94289j88382j86852m0655p1275p8266J38087K93596J38610q3233
31937B01296j38215k26477m44167l85139J62039O31916M40978q1477j91457J60534
$$ plain form
31927 129831 520225 735672 624016 296275 -43887 -114254 218452 575735 371377 -346398
31917 -346398 -850853 -770167 -619897 -949373 -1492698 -1658736 -1420445 -1151292 -917685 -539252
31907 -539252 -131249 8045 -57703 15463 298227 552796 649648 605479 349912 -95832
31897 -95832 -361934 -154012 200457 179700 -73167 41951 540910 735540 296964 -247592
31887 -247592 -370132 -291667 -472387 -823722 -899527 -575966 -122871 191761 214907 -160263
31877 -160263 -780407 -1086231 -615812 314583 781490 259551 -736438 -1191615 -705130 117399
31867 117399 438707 167862 -82874 66145 293844 199045 -66515 -176241 -265937 -625769
31857 -625769 -992603 -835815 -285149 -47934 -312936 -466195 -122141 281216 274358 61032
$$ packed form
31927A29831L90394K15447j11656l27741l40162p0367L32706L57283k04358p17775
31917c46398n04455Q0686J50270l29476n43325j66038K38291K69153K33607L78433
31907e39252M08003J39294o5748P3166K82764K54569R6852m4169k55567m45744
31897i5832k66102K07922L54469k0757k52867J15118M98959J94630m38576n44556
31887b47592j22540P8465j80720l51335p5805L23561M53095L14632K3146l75170
31877a60263o20144l05824M70419R30395M66907n21939r95989m55177M86485Q22529
31867A17399L21308k70845k50736J49019K27699r4799k65560j09726q9696l59832
31857f25769l66834J56788N50666K37215k65002j53259L44054M03357o858k13326
$$ plain form
31847 61032 -51240 -286924 -833055 -1171857 -767729 -67412 36432 -434205 -601349 -161936
31837 -161936 142204 -240777 -767855 -658721 -105921 28185 -531371 -1164317 -1314902 -1212116
31827 -1212116 -1388720 -1834552 -2028085 -1736399 -1377266 -1399054 -1593109 -1399545 -797079 -417431
31817 -417431 -637780 -996822 -854894 -329148 -94579 -359447 -556288 -195929 371775 381211
31807 381211 -315544 -992339 -935269 -362184 -172748 -786020 -1566469 -1634351 -963224 -258883
31797 -258883 75584 275289 503325 466910 2885 -534620 -854055 -1176576 -1647431 -1812663
31787 -1812663 -1309388 -667326 -667103 -1145264 -1234975 -688154 -135074 8475 68393 348343
31777 348343 598257 588013 579331 808572 990704 760370 234489 -226258 -485135 -550594
$$ packed form
31847F1032j12272k35684n46131l38802M04128P00317J03844m70637j67144M39413
31837a61936L04140l82981n27078J09134N52800J34106n59556o32946j50585J02786
31827a212116j76604m45832j93533K91686L59133k1788j94055J93564O02466L79648
31817d17431k20349l59042J41928N25746K34569k64868j96841L60359N67704R436
31807C81211o96755o76795N7070N73085J89436o13272p80449o7882O71127P04341
31797b58883L34467J99705K28036l6415m64025n37505l19435l22521m70855j65232
31787a812663N03275O42062K23m78161q9711N46821N53080J43549N9918K79950
31777C48343K49914j0244q682K29241J82132k30334n25881m60747k58877o5459
$$ plain form
31767 -550594 -385014 -122792 -147963 -612113 -1162479 -1443136 -1534966 -1594468 -1462064 -1055135
31757 -1055135 -777759 -1009884 -1454785 -1538975 -1257900 -1065529 -1088471 -1066350 -992213 -1138312
31747 -1138312 -1379006 -1159095 -375315 286838 258805 -106625 -62953 493230 970269 930041
31737 930041 556060 259699 173551 169546 142769 68745 -123701 -505342 -923199 -1016587 -630147
31726 -630147 -113933 15471 -306620 -663085 -758145 -726110 -733427 -666450 -483813 -501878 -899503
31715 -899503 -1231892 -994463 -499229 -530531 -1133278 -1468058 -1093015 -689555 -1038918 -1811150
31705 -1811150 -2014798 -1362955 -514782 -32665 235202 579279 806159 575498 58513
31696 58513 -167211 154993 634697 707421 261215 -309956 -578504 -473268 -213223 -8580
$$ packed form
31767e50594J65580K62222k5171m64150n50366k80657r1830n9502J32404M06929
31757a055135K77376k32125m44901q4190K81075J92371k2942K2121P4137j46099
31747a138312k40694K19911P83780O62153k8033l65430M3672N56183M77039m0228
31737I30041l73981k96361q6148m005k6777p4024j92446l81641m17857r3388L86440
31726f30147N16214J29404l22091l56465r5060L2035p317O6977J82637j8065l97625
31715h99503l32389K37429M95234l1302o02747l34780L75043M03460l49363p72232
31705a811150k03648O51843Q48173M82117K67867L44077K26880k30661n16985
31696E8513k25724L22204M79704P2724m46206n71171k68548J05236K60045K04643
$$ plain form
31686 -8580 60756 -43906 -339491 -707955 -915649 -851895 -654294 -484976 -270526 160806
31676 160806 693314 881593 440730 -297209 -605395 -122885 711758 1130476 904929 555233
31666 555233 637434 1048891 1236742 924790 334309 -241690 -721836 -1054433 -1138887 -1104688
31656 -1104688 -1314819 -1794237 -1945253 -1256568 -147306 387550 15478 -501012 -298185
31647 -298185 531657 1181209 1167226 720977 234298 -210676 -600714 -678939 -273063 214062
31637 214062 109036 -638174 -1259701 -1109379 -464620 -29419 74643 274475 641576 726270
31627 726270 425119 297123 629802 824292 297439 -520105 -853522 -895288 -1499310 -2635374
31617 -2635374 -3164775 -2447219 -1309615 -901306 -1226435 -1417628 -1019601 -360271 110419
$$ packed form
31686h580O9336j04662k95585l68464k07694O3754J97601J69318K14450M31332
31676A60806N32508J88279m40863p37939l08186M82510Q34643M18718k25547l49696
31666E55233Q2201M11457J87851l11952n90481n75999m80146l32597q4454L4199
31656a104688k10131m79418j51016O88685J109262N34856l72072n16490K02827
31647b98185Q29842O49552j3983m46249m86679m44974l90038p8225M05876M87125
31637B14062j05026p47210o21527J50322O44759M35201J04062J99832L67101Q4694
31627G26270l01151j27996L32679J94490n26853q17544l33417m1766o04022j136064
31617b635374n29401P17556J137604M08309l25129j91193L98027O59330M70690
$$ plain form
31608 110419 275075 239583 202362 366139 679825 811738 638911 510723 701063 904844
31598 904844 716641 325670 201759 312454 256202 37563 61723 382816 584840 456327
31588 456327 202616 -58684 -414906 -710649 -621994 -281501 -158290 -189885 190121 927362
31578 927362 1133382 453155 -211785 -7232 609054 720958 411329 378797 585718 419276
31568 419276 -29578 -20078 473874 571070 -79091 -654325 -395057 328928 717739 662695
31558 662695 589214 652475 672573 587999 502079 466234 527380 744210 913697 647635 33363
31547 33363 -207011 334734 1025195 967315 215789 -424149 -627548 -837038 -1297094 -1562628
31537 -1562628 -1271581 -812329 -757837 -1005420 -984604 -547161 -157927 -183910 -397837 -346171
$$ packed form
31608A10419J64656l5492l7221J63777L13686J31913j72827j28188J90340K03781
31598I04844j88203l90971j23911J10695n6252k18639K4160L21093K02024j28513
31588D56327k53711k61300l56222k95743Q8655L40493J23211l1595L80006P37241
31578I27362K06020o80227o64940K04553O16286J11904l09629l2532K06921j66442
31568D19276m48854R500M93952R7196o50161n75234K59268P23985L88811n5044
31558F62695p3481O3261K0098q4574q5920l5845O1146K16830J69487k66062o14272
31547C3363k40374N41745O90461n7880p51526o39938k03399k09490m60056k65534
31537a562628K91047M59252N4492k47583K0816M37443L89234k5983k13927N1666
$$ plain form
31527 -346171 49629 467420 627690 557796 439791 354032 218903 -79390 -509921 -827385
31517 -827385 -755257 -330363 35863 23369 -148535 -21764 362278 414649 -146807 -769238
31507 -769238 -708167 60390 909140 1314721 1171341 579666 -188168 -639827 -506121 -201697
31497 -201697 -341576 -831705 -1009906 -690918 -373410 -264721 105842 901493 1349033 757762
31487 757762 -336448 -787927 -323167 294843 423050 160166 -172543 -506716 -809861
31478 -809861 -885560 -638978 -272089 -68101 -158613 -519327 -987764 -1312301 -1406753 -1486394
31468 -1486394 -1701066 -1765322 -1318604 -563435 -93449 -73204 -64089 212962 410116 109934
31458 109934 -508079 -899983 -860064 -674662 -652333 -762434 -770640 -580095 -345836 -251619
$$ packed form
31527c46171L95800M17791J60270o9894j18005q5759j35129k98293m30531l17464
31517h27385P2128M24894L66226j2494j71904J26771L84042N2371n61456o22431
31507g69238O1071P68557Q48750M05581j43380n91675p67834m51659J33706L04424
31497b01697j39879m90129j78201L18988L17508J08689L70563P95651M47540n91271
31487G57762j094210m51479M64760O18010J28207k62884l32709l34173l03145
31478h09861p5699K46582L66889K03988r0512l60714m68437l24537r4452p9641
31468a486394k14672o4256M46718P55169M69986K0245R115K77051J97154l00182
31458A09934o18013l91904L9919J85402K2329j10101q206J90545K34259R4217
$$ plain form
31448 -251619 -243008 -123391 56787 -50037 -546023 -923680 -615255 188921 693861 503324
31438 503324 64815 -6895 322182 629711 602332 239792 -274957 -670269 -715887 -471546
31428 -471546 -284843 -381444 -588585 -603438 -376968 -75582 175974 337704 394474 439304
31418 439304 661463 1038727 1194387 831734 212241 -97460 77165 369201 432089 341277
31408 341277 334529 435449 525356 579824 596829 429061 -33433 -554939 -704867 -367619
31398 -367619 121335 415540 501577 496849 376250 132795 -8896 138285 373562 380530
31388 380530 264912 401261 743614 771572 270668 -292520 -433464 -278494 -188949 -123649
31378 -123649 163448 529222 559192 205253 -146412 -257275 -304905 -508984 -798597 -946167
$$ packed form
31448b51619Q611J19617J80178j06824m95986l77657L08425Q04176N04940j90537
31438E03324m38509p1710L29077L07529k7379l62540n14749l95312m5618K44341
31428d71546J86703r6601k07141j4853K26470L01386K51556J61730N6770M4830
31418D39304K22159L77264J55660l62653o19493l09701J74625K92036O2888r0812
31408C41277o748J00920Q9907N4468J7005j67768m62494n21506j49928L37248
31398c67619M88954K94205Q6037m728j20599k43455j41691J47181K35277O968
31388C80530j15618J36349L42353K7958n00904n63188j40944J54970Q9545O5300
31378a23649K87097L65774K9970l53939l51665j10863m7630k04079k89613j47570
$$ plain form
31368 -946167 -828010 -501890 -173723 -75877 -249111 -505851 -711735 -941594 -1200884 -1218451
31358 -1218451 -774976 -61718 529018 772280 570662 -91902 -813747 -821784 90229 1011435
31348 1011435 967677 258503 -25399 371903 639454 282463 -241207 -488055 -702364 -1107789
31338 -1107789 -1328507 -1060542 -696305 -719843 -961072 -958493 -650593 -265143 61942 145455
31328 145455 -297144 -1071091 -1346261 -650098 345121 614484 71316 -509728 -617396 -451198
31318 -451198 -377759 -498341 -740967 -970500 -1017097 -858190 -661029 -460654 -73993 430868
31308 430868 586893 233108 -43708 313878 948397 1046705 432704 -363912 -909614 -1148201
31298 -1148201 -1052887 -612971 -104278 149332 218621 330467 359449 70690 -313837 -377922
$$ packed form
31368i46167J18157L26120L28167R7846j73234k56740k05884k29859k59290j7567
31358a218451M43475P13258N90736K43262k01618o62564p21845q037R12013R21206
31348A011435m3758p09174k83902L97302K67551l56991n23670k46848k14309m05425
31338a107789k20718K67965L64237k3538k41229K579L07900L85450L27085Q3513
31328A45455m42599p73947k75170O96163R95219K69363n43168n81044j07668J66198
31318d51198P3439j20582k42626k29533m6597J58907J97161K00375L86661N04861
31308D30868J56025l53785k76816L57586O34519R8308o14001p96616n45702k38587
31298a148201R5314M39916N08693K53610O9289J11846K8982k88759l84527o4085
$$ plain form
31288 -377922 -204119 -202851 -370904 -367799 -252928 -449250 -953938 -1259029 -1137535 -879700
31278 -879700 -662033 -324466 85328 181308 -126129 -412442 -380302 -231804 -199035 -169166
31268 -169166 10940 256618 433656 466467 201944 -416038 -1017647 -1132129 -847268 -617465
31258 -617465 -457254 1609 634160 808076 419370 124897 244447 238500 -304363 -927974
31248 -927974 -1083080 -962457 -976361 -983863 -663921 -157624 246003 598741 908406 775550
31238 775550 56529 -578341 -451731 143829 465049 419351 397109 386146 137111 -39543
31228 -39543 404809 1211413 1504185 1066739 566304 402579 219461 -200141 -427401 -198375
31218 -198375 20318 -172031 -344587 100082 911824 1298778 1001547 445984 -24582 -424251
$$ packed form
31288c77922J73803J268j68053L105J14871j96322n04688l05091J21494K57835
31278h79700K17667L37567M09794R5980l07437k86313L2140J48498L2769K9869
31268a69166J80106K45678J77038L2811k64523o17982o01609j14482K84861K29803
31258f17465J60211M58863O32551J73916l88706k94473J19550n947n42863o23611
31248i27974j55106J20623j3904p502L19942N06297M03627L52738L09665j32856
31238G75550p19021o34870J26610N95560L21220m5698k2242j0963k49035j76654
31228c9543M44352Q06604K92772m37446n00435j63725j83118m19602k27260K29026
31218a98375K18693j92349j72556M44669Q11742L86954k97231n55563m70566l99669
$$ plain form
31208 -424251 -630623 -281325 574907 1225447 1088395 442203 -54435 -303668 -665932 -1048624
31198 -1048624 -861471 -98980 298539 -259101 -944570 -562583 684426 1453548 1186323
31189 1186323 707944 718761 795081 430163 87401 374865 872008 744687 111584 -153097
31179 -153097 231658 676662 701023 384618 -128881 -795087 -1257536 -1006057 -140038 610121
31169 610121 794116 653235 499900 259190 -150745 -491151 -544642 -418147 -288301 -177435
31159 -177435 -147335 -367262 -813711 -1215410 -1437034 -1602765 -1732597 -1626696 -1270044 -993803
31149 -993803 -1033795 -1229701 -1342170 -1377243 -1416012 -1400897 -1285895 -1169038 -1110898 -1028652 -898268
31138 -898268 -855504 -985889 -1197727 -1363696 -1411783 -1297820 -1118183 -1170052 -1581180 -1973946
$$ packed form
31208d24251k06372L49298Q56232O50540j37052o46192m96638k49233l62264l82692
31198a048624J87153P62491L97519n57640o85469L81987J247009P69122k67225
31189A186323m78379J0817P6320l64918l42762K87464M97143j27321o33103k64681
31179a53097L84755M45004K4361l16405n13499o66206m62449K51479Q66019P50159
31169F10121J83995j40881j53335k40710m09935l40406n3491J26495J29846J10866
31159a77435L0100k19927m46449m01699k21624j65731j29832J05901L56652K76241
31149i93803l9992j95906j12469l5073l8769J5115J15002J16857N8140Q2246J30384
31138h98268M2764j30385k11838j65969m8087J13963J79637n1869m11128l92766
$$ plain form
31128 -1973946 -1901903 -1530207 -1387542 -1518096 -1497303 -1278747 -1272791 -1445738 -1180077 -382139
31118 -382139 95546 -307144 -918665 -832163 -248505 -27268 -353245 -724749 -965110 -1306108
31108 -1306108 -1566650 -1183218 -190215 610245 683616 337072 52900 -126681 -257399 -128317
31098 -128317 305759 527368 -5488 -1085717 -1898290 -1882293 -1232530 -619493 -573355 -1051643
31088 -1051643 -1473179 -1257427 -425915 419283 753374 599959 287044 -22247 -358049
31079 -358049 -670082 -787164 -632675 -320201 -52413 -35081 -408429 -1063514 -1535221 -1308516
31069 -1308516 -357775 732955 1300298 1178974 680746 159786 -186706 -187111 280885 1020960
31059 1020960 1552492 1613229 1420247 1233175 921365 301082 -316987 -401845 29071 405630
$$ packed form
31128a973946P2043L71696J42665j30554K0793K18556N956j72947K65661P97938
31118c82139M77685m02690o11521Q6502N83658K21237l25977l71504k40361l40998
31108a306108k60542L83432R93003Q00460P3371l46544k84172j79581j30718J29082
31098a28317M34076K21609n32856j080229q12573J5997O49763O13037M6138m78288
31088a051643m21536K15752Q31512Q45198L34091j53415l12915l09291l35802
31079c58049l12033j17082J54489L12474K67788J7332l73348o55085m71707K26705
31069a308516R50741J090730N67343j21324m98228n20960l46492m05M67996P40075
31059A020960N31532O0737j92982j87072l11810o20283o18069q4858M30916L76559
$$ [...]
##END NTUPLES=NMR SPECTRUM
##END=
