##TITLE=31Pdec_LY-TMF-2.40.3
 D2O, 24 sc
 27.2.2020
##JCAMPDX= 6.0         $$ Bruker NMR JCAMP-DX V2.0
##DATA TYPE= NMR SPECTRUM
##DATA CLASS= NTUPLES
##ORIGIN= UXNMR, Bruker Analytische Messtechnik GmbH
##OWNER= root
$$ XWIN-NMR		Version 3.5
$$ Thu Feb 27 15:17:10 2020 Russian Standard Time (UT+4h)  she@DPX200
##.OBSERVE FREQUENCY= 81.013821
##.OBSERVE NUCLEUS= ^31P
##.ACQUISITION MODE= SIMULTANEOUS
##.ACQUISITION SCHEME= undefined
##.AVERAGES= 24
##.DIGITISER RES= 17
##SPECTROMETER/DATA SYSTEM= spect
##.PULSE SEQUENCE= zgpg30
##.SOLVENT NAME= CDCl3
##.SHIFT REFERENCE= (INTERNAL, CDCl3, 0, 182.463)
##AUDIT TRAIL= $$ (NUMBER, WHEN, WHO, WHERE, WHAT)
$$ ##TITLE= Audit trail, XWIN-NMR		Version 3.5
$$ ##JCAMPDX= 5.01
$$ ##ORIGIN= Bruker BioSpin GmbH
$$ ##OWNER= she
$$ F:/spectra/data/she/nmr/P31/1/pdata/1/auditp.txt
$$ ##AUDIT TRAIL=  $$ (NUMBER, WHEN, WHO, WHERE, WHAT)
(   1,<2020-02-27 15:12:21.87 +0400>,<she>,<DPX200>,
      <created by zg, POWCHK disabled, PULCHK disabled
       configuration hash MD5:
       00 E9 B6 7A A2 85 ED C7 34 08 36 98 17 FE 4E 26
       data hash MD5: 32K
       AC 7B A9 1D DE 84 E1 5D 19 83 7C F0 42 92 B1 A4>)
(   2,<2020-02-27 15:15:59.04 +0400>,<she>,<DPX200>,
      <Start of raw data processing
       efp BC_mod = 2 LB = 1 FT_mod = 6 PKNL = 1 PHC0 = -1707.282 PHC1 = 848.8014 SI = 64K 
       data hash MD5: 64K
       CC 2D AA 5A 08 86 23 DA 4C 42 DE 16 62 BE 00 A5>)
(   3,<2020-02-27 15:16:34.09 +0400>,<she>,<DPX200>,
      <pk PHC0 = 66.5351 PHC1 = -122.2 
       data hash MD5: 64K
       81 0A 24 21 4F F6 46 54 15 70 EF E2 84 60 36 69>)
(   4,<2020-02-27 15:16:37.31 +0400>,<she>,<DPX200>,
      <abs ABSG = 5 
       data hash MD5: 64K
       F0 DC 46 12 94 7E C0 59 49 3B 5C 0D A4 E7 FD AC>)
$$ ##END=
$$ 
$$ hash MD5
$$ BD BB 51 A8 78 B9 F7 82 7D 76 8A 36 7A 3D 6D 55
##$RELAX= 
##$RELAX= 
##$RELAX= 
##$RELAX= 
##$RELAX= 
##$RELAX= 
##$RELAX= 
##$RELAX= 
$$ Bruker specific parameters
$$ --------------------------
##$DU= <F:/spectra>
##$EXPNO= 1
##$NAME= <P31>
##$PROCNO= 1
##$TYPE= <nmr>
##$USER= <she>
##$AMP= (0..31)
100 100 100 100 100 100 100 100 100 100 100 100 100 100 100 100 100 100 
100 100 100 100 100 100 100 100 100 100 100 100 100 100 
##$AQSEQ= 0
##$AQ_mod= 1
##$AUNM= <au_zg>
##$AUTOPOS= <>
##$BF1= 81.014009
##$BF2= 200.13
##$BF3= 200.13
##$BF4= 200.13
##$BF5= 200.13
##$BF6= 200.13
##$BF7= 200.13
##$BF8= 200.13
##$BYTORDA= 1
##$CFDGTYP= 0
##$CFRGTYP= 5
##$CHEMSTR= <none>
##$CNST= (0..31)
1 1 145 1 1 1 1 1 1 1 1 1 1 1 1 1 1 1 1 1 1 1 1 1 1 1 1 1 1 1 1 1 
##$CPDPRG= <waltz16>
##$CPDPRG1= <>
##$CPDPRG2= <waltz16>
##$CPDPRG3= <>
##$CPDPRG4= <mlev>
##$CPDPRG5= <mlev>
##$CPDPRG6= <mlev>
##$CPDPRG7= <mlev>
##$CPDPRG8= <mlev>
##$CPDPRGB= <>
##$CPDPRGT= <>
##$D= (0..31)
0 1 0 0 0 0 0 0 0 0 0 0.03 2e-05 3e-06 0 0 0 0 0 0 0 0 0 0 0 0 0 0 0 0 
0 0 
##$DATE= 1582801941
##$DBL= (0..7)
120 120 120 11 120 120 24 19 
##$DBP= (0..7)
150 150 150 150 150 150 150 150 
##$DBP07= 0
##$DBPNAM0= <>
##$DBPNAM1= <>
##$DBPNAM2= <>
$$ [...]
##$SUBNAM3= <"">
##$SUBNAM4= <"">
##$SUBNAM5= <"">
##$SUBNAM6= <"">
##$SUBNAM7= <"">
##$SUBNAM8= <"">
##$SUBNAM9= <"">
##$SW= 369.568048894756
##$SWIBOX= (0..15)
0 1 3 0 0 0 0 0 0 0 0 0 0 0 0 0 
##$SW_h= 29940.119760479
##$TD= 32768
##$TD0= 1
##$TE= 0
##$TE2= 300
##$TE3= 300
##$TEG= 300
##$TL= (0..7)
0 120 53 12 22 120 120 120 
##$TP= (0..7)
150 150 150 150 150 150 150 150 
##$TP07= 0
##$TPNAME0= <>
##$TPNAME1= <>
##$TPNAME2= <>
##$TPNAME3= <>
##$TPNAME4= <>
##$TPNAME5= <>
##$TPNAME6= <>
##$TPNAME7= <>
##$TPOAL= (0..7)
0.5 0.5 0.5 0.5 0.5 0.5 0.5 0.5 
##$TPOFFS= (0..7)
0 0 0 0 0 0 0 0 
##$TUNHIN= 0
##$TUNHOUT= 0
##$TUNXOUT= 0
##$USERA1= <user>
##$USERA2= <user>
##$USERA3= <user>
##$USERA4= <user>
##$USERA5= <user>
##$V9= 5
##$VALIST= <valist>
##$VCLIST= <CCCCCCCCCCCCCCC>
##$VD= 0
##$VDLIST= <DDDDDDDDDDDDDDD>
##$VPLIST= <PPPPPPPPPPPPPPP>
##$VTLIST= <TTTTTTTTTTTTTTT>
##$WBST= 1024
##$WBSW= 4
##$XGAIN= (0..3)
0 0 0 0 
##$XL= 0
##$YL= 0
##$YMAX_a= 14138
##$YMIN_a= -13841
##$ZGOPTNS= <>
##$ZL1= 120
##$ZL2= 120
##$ZL3= 120
##$ZL4= 120
##$ABSF1= 182.463
##$ABSF2= -187.1042
##$ABSG= 5
##$ABSL= 3
##$ALPHA= 0
##$AQORDER= 0
##$ASSFAC= 0
##$ASSFACI= 0
##$ASSFACX= 0
##$ASSWID= 0
##$AUNMP= <proc_1d>
##$AZFE= 0.1
##$AZFW= 0.5
##$BCFW= 0
##$BC_mod= 2
##$BYTORDP= 0
##$COROFFS= 0
##$CY= -3
##$DATMOD= 1
##$DC= 0
##$DFILT= <>
##$DTYPP= 0
##$F1P= 0
##$F2P= 0
##$FCOR= 1
##$FTSIZE= 65536
##$FT_mod= 6
##$GAMMA= 0
##$GB= 0
##$INTBC= 1
##$INTSCL= 5.30512e-09
##$ISEN= 30
##$LB= 1
##$LEV0= 0
##$LPBIN= 0
##$MAXI= 10000
##$MC2= 0
##$MEAN= 0
##$ME_mod= 0
##$MI= 50
##$NCOEF= 0
##$NC_proc= -4
##$NLEV= 6
##$NOISF1= 182.463
##$NOISF2= 159.3651
##$NSP= 0
##$NTH_PI= 0
##$NZP= 0
##$OFFSET= 182.463
##$PC= 4
##$PHC0= -1640.747
##$PHC1= 726.6014
##$PH_mod= 1
##$PKNL= yes
##$PPARMOD= 0
##$PSCAL= 0
##$PSIGN= 0
##$REVERSE= no
##$SF= 81.0140089999434
##$SI= 65536
##$SIGF1= 159.3651
##$SIGF2= -187.1042
##$SINO= 113.3802
##$SIOLD= 16384
##$SREGLST= <1H.CDCl3>
##$SSB= 0
##$STSI= 65536
##$STSR= 0
##$SW_p= 29940.119760479
##$SYMM= 0
##$S_DEV= 0
##$TDeff= 32768
##$TDoff= 0
##$TI= <>
##$TILT= no
##$TM1= 0
##$TM2= 0
##$TOPLEV= 0
##$USERP1= <user>
##$USERP2= <user>
##$USERP3= <user>
##$USERP4= <user>
##$USERP5= <user>
##$WDW= 1
##$XDIM= 65536
##$YMAX_p= 420808988
##$YMIN_p= -8883928
$$ End of Bruker specific parameters
$$ ---------------------------------
##NTUPLES= NMR SPECTRUM
##VAR_NAME=  FREQUENCY,     SPECTRUM/REAL,   SPECTRUM/IMAG
##SYMBOL=    X,             R,               I
##VAR_TYPE=  INDEPENDENT,   DEPENDENT,       DEPENDENT
##VAR_FORM=  AFFN,          ASDF,            ASDF
##VAR_DIM=   65536,         65536,           65536
##UNITS=     HZ,            ARBITRARY UNITS, ARBITRARY UNITS
##FACTOR=    0.456856943014862, 1,           1
##FIRST=     14782.0589164792, 0,            0
##LAST=      -15158.0608439998, 0,           0
##MIN=       -15158.0608439998, -8883928,    0
##MAX=       14782.0589164792, 420808988,    0
$$ Real data points
##PAGE= N=1
##DATA TABLE= (X++(R..R)), XYDATA
$$ [...]
36957a98950O5433K26745L36946L05997O0627k93448m76429l19766K7717K63604
36947a524K45665Q2649l8174n3222n0277j04528j32065q389J70379J35581j45971
36936A00124l21787j08700K79768M19541K49081N1787l0829j09425k02204j62034
36926A65322l654M8660n4342p6972Q7756J95373K8415k49240l28545j67397L0686
36915c23938J19848J19215R8915Q7840N4666n5981k03400k11267M884K36630K33038
36904A60450Q6789O7103J16748o9841m27290m73418p1275K54101Q9034k11483
36894d79082q3585L58238N15694K02495j75607k73015j69708p5083o3240j37239
36884c80132k24193j07410K97976O28012M32004j28748l95291j25106J82785Q3007
$$ y = [-198950, -133517, 93228, 430174, 736171, 796798, 503350, 26921, -292845, -265128, -1524, 244141, 326790, 288616, 235394, 185117, 80589, -51476, -59865, 110514, 246095, 100124, -221663, -330363, -50595, 368946, 618027, 669814, 638985, 529560, 327356, 165322, 161668, 210328, 155986, 79014, 166770, 362143, 390558, 141318, -187227, -354624, -323938, -204090, -84875, 14040, 101880, 156546, 100565, -102835, -314102, -309218, -72588, 160450, 247239, 314342, 431090, 361249, -66041, -539459, -610734, -356633, -267599, -479082, -562667, -204429, 311265, 513760, 338153, 65138, -104570, -179653, -242893, -380132, -604325, -711735, -413759, 214253, 646257, 517509, 122218, -2888, 179897, 262904]
36874B62904j70219j26044J05542P9871k26238l95687k37436l32J08047J84739
36864d14853L00808K96560J05990l2994M7647J05932j63416n84909o43990j67247
36854a150472M10619N33686J16989m06834n34620j68067K91488L59125L1340j92232
36844g08978K8482L84303L48053o9209l72387l22060j71436j23200l1675J82064
36834h56043K75697J22898R018J55849K98864J22569j80380k11444Q506J53501
36824a00965J37373J01745L4547j32665j96350N3909L57992K89407n3266k02340
36814B89387r4220q2372k00805q9925K52412L34846l776k73529j12034K01178
36804B21162L07199K72979K02955p4955n31537o96377l60824j3823q3269k48637
$$ y = [262904, 92685, -33359, 72183, 152054, -74184, -469871, -707307, -707639, -599592, -414853, -114045, 182515, 288505, 255511, 303158, 409090, 245674, -339235, -983225, -1150472, -739853, -206167, -89178, -496012, -1030632, -1198699, -907211, -548086, -516746, -708978, -680496, -296193, 51860, -17349, -389736, -711796, -883232, -1006432, -1038107, -856043, -580346, -457448, -448430, -292581, 6283, 128852, -51528, -262972, -254466, -100965, 36408, 138153, 172700, 40035, -156315, -102406, 255586, 544993, 491727, 289387, 195167, 112795, -88010, -177935, 74477, 409323, 405547, 132018, 19984, 221162, 528361, 801340, 1004295, 929340, 397803, -298574, -659398, -673221, -756490, -1005127]
36794a005127p2644J82614N8469j96917j6826M61860N83640K50705O200N4841
36784C06815p075l54362n46222k36985K85976N51819M66652K04651p9479k35936
36774C55854j57542J0059M035j23721o7029J72948K18962n5576k84243k02991
36764a29244n4963j23315k51372j65088M7947J43553J47387K06156K18632P455
36754D7148k68157k62108L3018K53065J74285l4918j29469r6932m5584J5321J29152
36743a85179K34399K09994N9529o4675n2566K2567J2833r7542j77833j35401k3045
36732a96919N4760N1222k6779j24923j25413L2935J90585J17359j09258j24721
36722b61152J81904M16957K08573k51355m87777l71510j38334N1088J92970K06477
$$ y = [-1005127, -1077771, -895157, -836688, -1033605, -1050431, -588571, -4931, 245774, 251974, 306815, 299740, -54622, -600844, -837829, -551853, -34, 466618, 671269, 591790, 355854, 198312, 208371, 212406, 88685, 21656, 194604, 413566, 357990, 73747, -129244, -184207, -307522, -558894, -723982, -676035, -532482, -385095, -178939, 39693, 47148, -221009, -483117, -450099, -197034, -22749, -57667, -187136, -284068, -329652, -314331, -185179, 49220, 259214, 318743, 254068, 201502, 224069, 236902, 139360, -38473, -173874, -196919, -142159, -90937, -117716, -242639, -368052, -335117, -144532, -27173, -136431, -261152, -79248, 337709, 546282, 294927, -192850, -564360, -702694, -651606, -458636, -252159]
36712b52159L1166j06039O2908L62881L62661M5798j57462n9036M0572p7198j95852
36701E8240r6428N6918K5140j28594k17105k14458j46278L9858K83114L50169
36691A0576J81299L7856Q7573J16510q4184l01411j93090J70428L74248J89459
36681E89264k03818m66162l98307o0647K73620L54834K11682O0625l1770j70107
36671A59214l03610k06628J11289L15935K29984P2956M0674L160j48293k23404
36661E1277r6166L780j04613j93817m0621J29160K7673j69700j50510l1183p5264
36650f49984j02450K14376O34568N99039J43407j09313P1817K10584l5919l32516
36640F43609k64427J3390J01239j5275l8995J34095K97816K33782o0664l71702
$$ y = [-252159, -220993, -327032, -264124, 98757, 461418, 507216, 349754, 290718, 331290, 254092, 58240, -38188, 18730, 43870, -84724, -301829, -516287, -662565, -622707, -339593, 10576, 191875, 229731, 317304, 433814, 349630, 48219, -144871, 25557, 399805, 589264, 385446, -80716, -479023, -539670, -266050, 88784, 300466, 361091, 329321, 159214, -144396, -351024, -239735, 76200, 306184, 379140, 419814, 422974, 274681, 51277, -44889, -41109, -145722, -339539, -380160, -251000, -223327, -393027, -543537, -574720, -649984, -752434, -538058, 96510, 695549, 838956, 729643, 801460, 1012044, 976125, 643609, 379182, 392572, 493811, 478536, 439541, 573636, 871452, 1105234, 1044570, 672868]
36630F72868m25499j68995R6399N7170j51464j17704J88712L05755k7305m33787
36620c850m24306p8591J26658R406j37906l0418K25328L07728R4135k00120k76770
36609c88706r4821J05806J27687M3099J2002K2570n843N535J58605K96965J70419
36598D53318j40467k88289j72802n9639j17578j78092q7467J5804m2264j85741
36588h03217k32978j24160J12152L91574M82847J80152k99400m19012k0904M02633
36578c30313L83644R6788j8030N1356l887k06560k51063j7517K58830L46636K46546
36567E56430N1163j60327k76603k29102j16472p3149o3440K402M2898n3238j48923
36556d68361k8202J99062J99751n5176k09217n6424J62554J58923J7256m0J19338
$$ y = [672868, 247369, 78374, 174773, 231943, 80479, -37225, 151487, 457242, 429937, -3850, -428156, -506747, -380089, -370683, -508589, -539007, -313679, -5951, 88184, -111936, -388706, -483527, -377721, -250034, -206935, -194933, -172363, -178206, -172671, -14066, 282899, 453318, 312851, 24562, -148240, -207879, -325457, -503549, -591016, -575212, -617476, -803217, -1036195, -1160355, -1048203, -656629, -173782, 6370, -293030, -712042, -732946, -330313, 53331, 150119, 132089, 183445, 179558, -27002, -278065, -295582, -36752, 309884, 556430, 607593, 447266, 170663, -58439, -174911, -248060, -311500, -309098, -266200, -319438, -468361, -496563, -297501, -97750, -152926, -362143, -418567, -256013, -97090, -79834, -79874, 39464]
36545C9464J52641N605j57360j61343n3084j2011q6028j19486K369J29850M3437
36534b15946j48770q1493K88610M85669J64446l14798l62425k5336J25135r6047
36524a80955k63543j18655K1300j02829j85187R4256M31157L39683l4737j26261
36514a25771J41786K47304q1986m50460m20033j21280M5376Q637r784M8560J0429
36503g07222j67023k57442q3354J98668K69820N3253j80653j50731Q9772K60424
36493f74488K55183K33494K61742J28831k65189n59286l34084K27622N06208L04646
36483H4679R3688K36260M23490K19429j99651l15321o1674J47759R8159j4589
36473G12229n1956j22298k10497r7699J65928J67442k08938m48264j22270L97159
$$ y = [39464, 192105, 197710, 40350, -120993, -174077, -186088, -272116, -391602, -389233, -259383, -215946, -364716, -446209, -157599, 328070, 492516, 177718, -184707, -210043, -84908, -180955, -444498, -563153, -541853, -644682, -829869, -735613, -304456, 35227, 490, -125771, 16015, 263319, 181333, -269127, -689160, -810440, -765064, -756427, -766211, -717651, -707222, -874245, -1131687, -1215041, -1016373, -746553, -693300, -873953, -1024684, -934912, -674488, -419305, -185811, 75931, 204762, -60427, -619713, -953797, -726175, -219967, 84679, 178367, 414627, 838117, 1057546, 857895, 542574, 480900, 628659, 726818, 712229, 660273, 537975, 327478, 229779, 395707, 563149, 354211, -94053, -216323, 180836]
36463A80836M26250m2357l71705k24484O2930J10789k291n6286q6627j78425j71850
36452c53220Q9082L90401L61778n866l29604l23844j07173K0290n0119j54587
36442d62862p4948K05955M50907L91705L1748l25702l97566k10199r696M6448
36432c54210R868p950J2181K1351P053J6227P3848J13594M5835q5447r6174R5643
36420a48181K88040K09670r8733k97744j84959N9694J48581M4810p5645r4638
36410a49105m5640r488k4581n5824r488J39330K31706R6933j44071j77646L6427
36399a11447J82960J04011N5991K20299L13439N8727k57138j85900J34036J88706
36389G03684o4723j77502l7907o2424m00684n84552k78013J68098K99261K31193
$$ y = [180836, 607086, 564729, 193024, -31460, 31470, 142259, 139968, 83682, -2945, -181370, -353220, -264138, 126263, 488041, 482175, 152571, -171273, -278446, -258156, -308275, -462862, -537810, -331855, 119052, 510757, 542505, 216803, -180763, -390962, -400658, -354210, -344342, -352292, -340111, -318760, -311707, -295480, -221632, -108038, -62203, -147650, -243824, -148181, 139859, 349529, 250796, -46948, -231907, -172213, -23632, 21178, -54467, -149105, -194745, -204233, -228814, -284638, -294126, -154796, 76910, 173843, 29772, -147874, -111447, 71513, 175524, 231515, 451814, 765253, 823980, 566842, 380942, 514978, 703684, 638961, 461459, 423552, 361128, -39556, -624108, -902121, -734023, -434762, -203569]
36379b03569K93859L90698K24909j04160k41796j42590l5566K3094J15724J29885
36369D50488o4315k23085k9931K82750J72288l36734n89104k41783K66596M02091
36359H9261K15585O3656N2154O7829N6087j4557k03319l82981k63873J35947L66028
36348A81817J65380j25481j15083J1707j34029m09544l22762J56074M99405L68129
36338B75613N218j96988j44746M6289K60295L67632K53645j6824k36947l02300
36328C10887k47804p8757J87059L45809J89621j28082k40183j09221n4343j69726
36318E260j50864J22798K75755J9685l17973k51480J32866L39923K05482K9003
36308D10455K3380O5746M2449N2002J31620J01169j27813l24223k43166m780P3159
$$ y = [-203569, 90290, 480988, 705897, 601737, 359941, 217351, 181785, 204879, 320603, 450488, 386173, 163088, 133157, 415907, 588195, 251461, -337643, -579426, -312830, 89261, 304846, 368502, 420656, 488485, 544572, 530015, 326696, -56285, -320158, -184211, 181817, 347197, 221716, 106633, 118340, -15689, -425233, -747995, -591921, -92516, 275613, 280831, 83843, -60903, -14614, 245681, 613313, 866958, 850134, 613187, 310887, 63083, -15674, 171385, 517194, 706815, 578733, 338550, 229329, 174986, 5260, -145604, -22806, 252949, 272634, -45339, -296819, -163953, 175970, 381452, 410455, 433835, 499581, 542030, 594032, 725652, 826821, 699008, 374785, 131619, 126839, 199998]
36297A99998n3482j04017Q0929K79717K20582O124l4636J31243J62724j14381
36287G74801l79149k70362M8940J27031r5843k49424j58228n5342p4634K888K60038
36276f9284L35459k6027m54367m35455p6476J04722J2815M3790L18387M14726
36266A68290O3780l48717l03492J18086L76866K16764o7836j02211R3651K09451
36256D24632Q7296r6420j01698M1672Q6351q3057l04941l74940k66365n4497J91879
36245d50088L35133K03864j12052k19772O4060L60106K22855j72599k64166N5290
36235B2631L12570K09146O632m551L8511p6928k05551j13731P3778N9235j50925
36224A70817k83360k18487q2100K5027J22056J92123J62302N2205k8391l3057
$$ y = [199998, 146516, 42499, 123428, 403145, 623727, 629851, 595215, 726458, 889182, 774801, 395652, 125290, 174230, 301261, 205418, -44006, -202234, -257576, -332210, -329322, -69284, 266175, 240148, -214219, -649674, -726150, -621428, -608613, -564823, -246436, 168290, 232070, -116647, -420139, -302053, 74813, 291577, 223741, 121530, 215181, 424632, 511928, 415508, 313810, 355482, 441833, 358776, 53835, -321105, -587470, -641967, -450088, -114955, 88909, -23143, -242915, -178855, 181251, 404106, 231507, -32659, 22631, 335201, 544347, 550979, 546428, 584939, 508011, 302460, 188729, 262507, 321742, 170817, -112543, -331030, -413130, -388103, -266047, -73924, 88378, 140583, 112192, 79135]
36214G9135K81M8110Q9204M6919j04969k27346j73452k8049r197j37069j88929
36203f05362k7004J95595K45422J12941Q23N5355J97505K30732P9293j10796j29291
36192B45213M5791K01240J27888j27562l04416k21754J5797J43674O0567l9378
36182A47060P5778L33552M15611J78673j61698l54869m14900m23499k59693J59312
36172c04673N17032L94323q4750l31447j13346J18690p3253m60240m94682o1813
36162h94159M40484O29878M68106J51902q7825j22900k2332L7603J9262L4633
36152F54652O2954q1917l71604m55240j60542J79602J87529l1086j45080j31456
36142b92188j59405j59081K8644K06860K4707m09300n82515k74690K08003N14590
$$ y = [79135, 79416, 127526, 216730, 263649, 158680, -68666, -242118, -270167, -279364, -416433, -605362, -632366, -436771, -191349, -78408, -77585, -22230, 175275, 406007, 485300, 374504, 245213, 291004, 492244, 620132, 492570, 188154, -33600, -17803, 125871, 186438, 147060, 222838, 556390, 972001, 1150674, 988976, 634107, 219207, -204292, -463985, -304673, 212359, 606682, 521932, 190485, 77139, 195829, 122576, -337664, -832346, -894159, -453675, 176203, 644309, 796211, 708386, 585486, 563154, 600757, 620019, 654652, 717606, 635689, 264085, -191155, -351697, -172095, 15434, -15652, -160732, -292188, -451593, -610674, -582030, -375170, -350463, -759763, -1342278, -1616968, -1408965, -894375]
36132h94375N63531L66016k3304l22401k31230Q6338J64284l9715p4723K11078
36122a94501L68284J07493j77854n1011K57238K51673n9807k92268l07242k24214
36112c22209m0996K52502L73592R3917k56452j92263J23595R9396k89817m15330
36102e74065k3147L48487K60154L0773Q2161J92139l2261l61351k81130J21292
36092b36948K81326O9558o9740P9550J87460J5671j84741j65562r6342j71405
36082b91173k02442K5294L04224L10921J25563M1237M3294q5315k62150j79103
36072a69650J40130L06784J56293l6857n0004l6321j74112l19517k51087k7729
36062d62070J33536J70555J62483J41082R9900Q1418J01520Q8063J1749m5844
$$ y = [-894375, -330844, 35172, 11868, -310533, -541763, -455425, -291141, -330856, -405579, -194501, 173783, 281276, 103422, 52411, 309649, 561322, 501515, 209247, -97995, -322209, -363205, -110703, 262889, 356806, 100354, -91909, 31686, 131082, -158735, -574065, -597212, -248725, 11429, 42202, 124363, 316502, 284241, -77110, -358240, -236948, 44378, 113936, 44196, 123746, 311206, 326877, 142136, -23426, -119768, -291173, -493615, -468321, -164097, 146824, 272387, 313624, 356918, 271603, 9453, -169650, -29520, 277264, 433557, 396700, 346696, 310375, 136263, -183254, -434341, -462070, -328534, -157979, 4504, 145586, 245486, 326904, 428424, 516487, 528236, 482392]
36052D82392o0069j38194k94679l28145j06394J68670J89537m9692k59673k15256
36042f11503L6188K76994L22423J76083L9783P4841J42144l0898l88807n27784
36032d90536k57108J11957K25729J43232R2846P7295L5491J08746L47334L95369
36022G90355n1843o27698o50859o4816M71698M69866J29843j12573j29533l5183
36012A89257P3128J23335O2116l7043n7103n6901j63286k58388j02313K09796
36002a7402K84169N137k88391l17176j90993q4824L9274J89552J76926n8153k42735
35991e04616j50448O7040J64479J66059J87659J38587r9393l72288m21828k28546
35981a053295M5602L09347N01169M64163J53153j47662j19349J31851J96891n9709
$$ y = [482392, 422323, 284129, -10550, -338695, -445089, -276419, -86882, -136574, -396247, -611503, -575315, -298321, 24102, 200185, 239968, 314809, 456953, 426055, 37248, -490536, -747644, -635687, -409958, -266726, -173880, -96585, -61094, 47652, 394986, 790355, 738512, 110814, -540045, -604861, -133163, 336703, 466546, 353973, 224440, 189257, 262385, 385720, 447836, 410793, 353690, 296789, 133503, -124885, -227198, -17402, 266767, 271904, -16487, -333663, -524656, -609480, -570206, -380654, -203728, -261881, -504616, -655064, -588024, -423545, -257486, -69827, 68760, -30633, -402921, -824749, -1053295, -1007693, -698346, -197177, 266986, 420139, 272477, 153128, 284979, 481870, 422161]
35971D22161l20105k72309k1897R0316m2702j70894m0845K46967L55605J66310
35961D12607o3052q5589j5481q2743k05994j25229J22066K17915N8731j18297
35951A14934j46113j20207j16951o5582K3749N0760R5473L00131M44203J53544
35941G33941l56658l73685K15045N80969J56526m55315m03588J09205K42156j15502
35931C33094k81320K4758K95092J54211r4777r4437J0162l6564j20040j7514J80658
35920C53323K26841Q4440r4409j95263j75998l2755J26203J13115j10138l43592
35910d8233l69840j71466R7021K43743J49799j16980k97637j82454J49587M32667
35900a13793M93886L21494j5734l37257l81559j11304J35172O9252j03034J280
$$ y = [422161, 102056, -170253, -192150, -101834, -144536, -315430, -356275, -109308, 246297, 412607, 349555, 263966, 248485, 165742, -40252, -165481, -43415, 174500, 233231, 114934, -31179, -151386, -268337, -333919, -310170, -259410, -163937, 136194, 580397, 733941, 377283, 3598, 218643, 799612, 956138, 500823, 97235, 206440, 448596, 333094, 51774, 76532, 371624, 525835, 431058, 336621, 346783, 310219, 190179, 172665, 353323, 580164, 664604, 570195, 374932, 198934, 166179, 292382, 405497, 295359, -48233, -418073, -589539, -492518, -248775, -98976, -215956, -513593, -696047, -546460, -113793, 380093, 701587, 685853, 348596, -32963, -144267, -9095, 60157, -42877, -41597]
35890d1597K93306L11121m7173l48473k83376p5265m5719j37591j23833j0730
35880e09330N3635R0913K27566L98618L61668K9693l51518m27210j19863K49697
35870C869L00145M7224j30818m7304J5772k13443m90411l83354M5138L14332K33554
35859c05296Q6371P8554P1422m909O6150L46269M76669J87347k15042k40808P3947
35848F20674K25802m2200m12932m32732m8888L86261N21470L20147J9223j33566
35838A023259p1892R7809J94591N5355l22814o63497n96077r9558L76027M00416
35828C93619N3861k45948k59898n3977K29418M40072L82763L3236k86227k62356
35818D24563m2662J587j33415j35724L7539R4129m9404j30915m0168Q362o4873
$$ y = [-41597, 251709, 562830, 515657, 167184, -116192, -191457, -237176, -374767, -498600, -509330, -455695, -364782, -137216, 261402, 623070, 652763, 301245, -125965, -245828, 3869, 304014, 351238, 220420, 173116, 188888, -24555, -514966, -898320, -853182, -538850, -305296, -218925, -140371, -68949, -73858, -7708, 338561, 815230, 1002577, 787535, 546727, 620674, 846476, 804276, 391344, -41388, -90276, 295985, 817455, 1137602, 1156825, 1023259, 951367, 1049176, 1243767, 1299122, 976308, 312811, -283266, -382824, -6797, 393619, 447480, 201532, -58366, -112343, 117075, 557147, 939910, 973146, 686919, 424563, 381901, 383488, 250073, 114349, 151888, 246017, 196613, 65698, 25530, 33892, -30981]
35807c0981l3679J50983J56837j80233m93398l87806M921K85188L33105K91850
35797I6787K29330J23389K1682m3498j57491l29310l61968j32707J53642K09064
35787a91080L6580j24706j17433J9337J44189J20527m4085j20067R2728M06504
35777B22494M05545K7114l29379l75577k69943k26920j59254N4086K68067L07456
35767g6311K32405J31336o6426l28058l76485j01795J74678J56422J6837N9681
35757a77716J99722J50518q2708k60520k84119j88096M8576L56223M44147J69895
35747C75922j51948j67433j0986k9366j79057j51278M0934Q3198q3778j81910
35737d55702q0567L7911M1930L5220J15526K19810K51898J64866m8411k60065
$$ y = [-30981, -64660, 86323, 243160, 62927, -430471, -818277, -813356, -528168, -195063, 96787, 326117, 449506, 471188, 427690, 270199, -59111, -421079, -553786, -400144, -191080, -154500, -279206, -396639, -377302, -233113, -112586, -156671, -276738, -184010, 222494, 628039, 655153, 325774, -49803, -319746, -546666, -705920, -651834, -383767, -76311, 156094, 287430, 221004, -107054, -483539, -585334, -410656, -254234, -237397, -177716, 22006, 172524, 89816, -170704, -454823, -642919, -594343, -238120, 206027, 375922, 223974, 56541, 45555, 16189, -162868, -314146, -273212, -190014, -273792, -455702, -536269, -498358, -456428, -421208, -305682, -85872, 166026, 330892, 282481, 22416]
35727B2416k21733Q9653K97669R7129k58100k93203o192J76950N9804j27972j69511
35716c33090j01501N13J25966J95336J27625L2060N0518Q3872p724o3644J07280
35705B17211K47627l2393n16224n65764j08264K01462L496k19287K6479M31229
35695c14428M15367O3997p4372R8198J38941j35632l33561j36165J84116J89442
35685I5903o2916j45997O7025K39883J34553j7304P5748K46951J12877k85130
35675D61593m77803k30443J53948K88445J34085j32777l53841l55223l2014L61591
35665a82439L70901j2843k61509r8053Q6919o2276k44116n9901K44246J87860
35655c1211j20825j98397J4629J80393J94139J87123Q7283k02502l68123q7122
$$ y = [22416, -199317, -109664, 188005, 285134, 27034, -266169, -272361, -95411, -35607, -163579, -333090, -434591, -434078, -308112, -112776, 14849, 46909, 97427, 181299, 173575, 109931, 217211, 464838, 432445, -83779, -649543, -757807, -556345, -552849, -772136, -745657, -314428, 100939, 164936, 90564, 188762, 327703, 192071, -141490, -277655, -93539, 95903, 32987, -113010, -45985, 193898, 328451, 311147, 386895, 633846, 746723, 461593, -16210, -246653, -92705, 195740, 329825, 197048, -156793, -512016, -544030, -182439, 188462, 175619, -85890, -183943, -97024, -159300, -403416, -463317, -219071, -31211, -152036, -350433, -335804, -155411, 38728, 225851, 313134, 110632, -257491, -344613]
35645c44613K93388J91597k27510k80373R7657K84874P3926l7689J76535K58806
35635D86598p3387m09445l46685o9195J13127K19763K84884J55034j03932j52149
35625A04613R554m3760l71931m45841l7574L23999J86526j54980k47773j54123
35615h31290r3163K2210K36650K81440Q6705J9170K07573K43353l3314j57709
35605a8375O5099R0911l19835m52193J51350O76090K66918m71437m27783J59662
35595b79593J92759l27746l59885K56192M87978n7609m57693j03648L04945O9635
35585b74665l27319j70017K67635L30110J17066J16395K24536K9147k87933k02780
35575a77825J93218K97545j4898k46125j40487j0716p2128p6035J42297K72544
$$ y = [-344613, -51225, 140372, -87138, -367511, -269854, 15020, 88946, 51257, 227792, 486598, 413211, 3766, -342919, -412114, -298987, -79224, 205660, 360694, 256762, 104613, 114167, 70407, -301524, -747365, -784939, -460940, -274414, -429394, -677167, -831290, -924453, -902243, -665593, -384153, -297448, -278278, -70705, 172648, 139334, -18375, 46724, 137635, -182200, -634393, -483043, 193047, 459965, -11472, -439255, -279593, -86834, -414580, -774465, -518273, -30295, -87904, -545597, -649245, -344300, -274665, -601984, -772001, -504366, -174256, -57190, 59205, 283741, 312888, 24955, -177825, 15393, 312938, 298040, 51915, -88572, -99288, -171416, -247451, -105154, 167390]
35565A67390M0874k71696k39668K1673M1085k30073l09382M7530M11959L00950
35555a9358r3607k09981K7262J55462l1679j68310L1589K87141K27820k6414j41538
35544C8387j17402j33908r9170J64352M41060L41301n5183k60479r4126J18254
35534C43086J15980L1638L4516M6946k0363q6095j18394k37008m22558m06267
35524g18519o5061K92688K73930q6235l54805k01419K46980N41144L66914j20340
35514A75277m57201l88568r8797J31914K77203L90022L31575O249k98756k00798
35504a31880K17509N00719M28908J73339j00339l67781m93710k99397M2004J08868
35494G8240j50807l11765j22181J50327K12052J73357K18685K06882n3883l78533
$$ y = [167390, 208264, -63432, -303100, -281427, -240342, -470415, -779797, -732267, -320308, -19358, -112965, -322946, -295684, -140222, -171901, -340211, -308622, -21481, 206339, 179925, 38387, -79015, -212923, -312093, -147741, 293319, 634620, 579437, 318958, 224832, 343086, 459066, 490704, 525220, 572166, 551803, 465708, 347314, 110306, -312252, -718519, -783580, -490892, -216962, -303197, -658002, -859421, -612441, -71297, 295617, 175277, -281924, -670492, -769289, -637375, -360172, 29850, 361425, 367674, 68918, -131880, 85629, 586348, 1015256, 1188595, 1088256, 720475, 226765, -72632, -30628, 78240, -72567, -384332, -506513, -356186, -144134, 29223, 247908, 454790, 400907, 22374]
35484B2374m08914j24513J40462J40025l3247j24513r731J98559L06699K94050
35474D01251L11809L56613J64266l24309o24958k77713L74326N21596J3024m43667
35464D72238l35274J4132J18676N3141Q3157Q2167j48503l47321j59678J94840
35454B7575J92523j79975m20202k82835n3766n234l5264J2395M3183o4487j78596
35443i44683q2517J88391L60339K61242L8631k6237J03513J60459r228j34320
35433h4410R8400M52345L68335j61800m60721j47028K55971J19112l18880l71063
35423b49739j3476J27453j72783m07450j92855J71859K65000J55150J14618J20898
35413h1325L0106m6961N1504J58587J4688k30004j67930K16121M40282J78965
$$ y = [22374, -386540, -511053, -370591, -230566, -263813, -388326, -398057, -199498, 107201, 401251, 713060, 1069673, 1233939, 909630, 284672, 6959, 381285, 902881, 915905, 472238, 136964, 151096, 269772, 322913, 406070, 488237, 339734, -7587, -167265, 27575, 220098, 40123, -380079, -662914, -716680, -721914, -757178, -744783, -701600, -766087, -944683, -1027200, -838809, -478470, -217228, -178597, -204834, -101321, 59138, 49910, -84410, 13990, 466335, 834670, 672870, 212149, 65121, 321092, 440204, 121324, -249739, -263215, -135762, -308545, -715995, -908850, -736991, -471991, -316841, -202223, -81325, -51219, -98180, -46676, 111911, 126599, -103405, -271335, -55214, 385068, 564033]
35403E64033k86365m40182j47830K76308M67903L12082m5700l16690k68346L2403
35393A47616K28729Q0093k05865k37957J9029K27560K00602J22480J37827N9919
35383G80033k51778m96429k95943J75877L41895P941l77041l50251J525K81438
35373a82733L19346K29239J02092q1001k67232k96565j13868J11149J66545N6976
35363D3948r703Q1881J62846K751l15537m41353k34347K5108N8576P499J69050
35352d49281M67697N27522K32971j09931k12123j18994k0802K815m3104j37695
35342A39075j93275j10800M6447J02621L1402k4732l2948j33323l36539l92054
35332i04126j20634K72849L94635J26805k08912j79104K55126N95873L29680l69784
$$ y = [564033, 277668, -162514, -310344, -34036, 433867, 745949, 700249, 383559, 115213, 147616, 376345, 456438, 250573, 12616, 31645, 259205, 459807, 582287, 720114, 780033, 528255, 31826, -264117, -88240, 253655, 261596, -115445, -465696, -464171, -182733, 136613, 365852, 467944, 386943, 119711, -176854, -290722, -179573, -13028, 43948, 34245, 116126, 278972, 281723, -33814, -475167, -709514, -684406, -625830, -618331, -449281, 18416, 545938, 778909, 668978, 456855, 337861, 317059, 319874, 276770, 139075, -54200, -165000, -118553, -15932, 15470, -9262, -42210, -175533, -512072, -904126, -1024760, -751911, -357276, -230471, -439383, -618487, -363361, 232512, 562192, 192408]
35322A92408p27481l27620L24827N18969K90747J68170K17557J3657m91888p76952
35312e97606n57134j68062N2613J84879L03799K29996N929M5897M28552N83256
35302E12119J43866l80317l31426J11496K81414N7671q7291Q3012K95084K88253
35292I73881J19450o8604k01177j95484m0209Q9100N3855j4279L6755O4462j16926
35281G00824l40316l06713p1760O3376M7920R1307K37872K89068J33476j31128
35271G13926l64058m37766k44623J02095K39975J9063k04560p5624J83015J30952
35261F2395j42821j55760J72311M00091K64016L911r3821m8789K4253J04906J37910
35250G28602L7271j00414q8908j051r5876l49151m14105j50435J45227J81309
$$ y = [192408, -535073, -862693, -537866, -18897, 271850, 440020, 657577, 671234, 179346, -597606, -1154740, -1322802, -1270189, -1085310, -781511, -551515, -545586, -499689, -71137, 512119, 655985, 275668, -55758, 55738, 337152, 394823, 307532, 390544, 685628, 973881, 1093331, 1024727, 823550, 628066, 587857, 676957, 730812, 716533, 753288, 817750, 700824, 360508, 53795, -17965, 45411, 93331, 184638, 422510, 711578, 845054, 713926, 349868, -87898, -332521, -230426, 9549, 28612, -175948, -251572, -68557, 62395, -80426, -236186, -63875, 336216, 600232, 604143, 510322, 461533, 485786, 590692, 728602, 765873, 665459, 576551, 575500, 479624, 130473, -283632, -434067, -288840, -107531]
35240a07531N6866M0965J86585L21402K82197O1360j81034k34920p4564P3468
35230D24794K5275j02080j03499j7182j413j7317O8657J71771J00113r3801j89185
35219B66133j60946j53395j58426m9521J16415J54554O0221l3896j10993j70931
35209b40785l7544L44619N87930L13708j96871l33085n5216J11698m3713j77629
35199B73112r7111o9046k43062l44270j83960J9768P1329R6120J88852K01642
35189h6626R5569O8565J30884J1868k91670l63418l8108K54252J36971j67304
35179b49017k85657k59597k76434k37338k3302J45833N7825o9752N5753K71973
35169h69713K20009o1856k22366j35757J8185R9735J08081M1843n6003l3842J39661
$$ y = [-107531, -50665, -9700, 176885, 498287, 780484, 841844, 660810, 425890, 351326, 424794, 450069, 347989, 244490, 227308, 225895, 208578, 277235, 449006, 549119, 455318, 266133, 105187, -48208, -206634, -256155, -139740, 14814, 75035, 41139, -69854, -240785, -278329, 66290, 654220, 967928, 771057, 437972, 382756, 494454, 450741, 273112, 176001, 106955, -136107, -480377, -664337, -644569, -573240, -477120, -288268, -86626, 8943, 77508, 208392, 220260, -71410, -434828, -472936, -218684, -81713, -249017, -534674, -794271, -1070705, -1308043, -1331345, -1185512, -1127687, -1197439, -1141686, -869713, -649704, -711560, -933926, -1069683, -1051498, -951763, -843682, -801839, -857842, -891684, -752023]
35158g52023K40580J31023L7676J96969M13532L14887q1035l85273l49445p7872
35148c10981J97204K98568J40787j72820l52053k23549M0992J70741J52504J54522
35138I5915K20168K45387J64953j6135k72477m84946m50497j30442K35282M01025
35128H233L59788K08548j6884k28018k49522r2849k5809j57354k12150K0496K79789
35117a05732K17369k7582m4283J74417K00442j65441n60470n23235p2783L29184
35107e78114L21997L9922q7481J01605K99887K10442J3605M8754K02157Q6774
35097F59548k23283k25954J41645L04223k0210l15648j13524K24519J26246k44058
35087C13504l06833k5160J32992J6805p5485k5355n1231k03281k24344j2843J92501
$$ y = [-752023, -511443, -380420, -342744, -145775, 267757, 582644, 501609, 116336, -233109, -310981, -113777, 184791, 325578, 152758, -199295, -422844, -381852, -211111, -58607, 95915, 316083, 561470, 726423, 710288, 437811, -47135, -497632, -628074, -392792, 8233, 368021, 576569, 559685, 331667, 82145, -10704, -36513, -193867, -406017, -385521, -105732, 111637, 84055, 39772, 214189, 414631, 249190, -311280, -834515, -907298, -578114, -256117, -216195, -303676, -202071, 97816, 308258, 321863, 370617, 572774, 659548, 436265, 210311, 351956, 656179, 635969, 320321, 206797, 431316, 557562, 313504, 6671, -18489, 114503, 131308, 55823, 30468, -20763, -224044, -448388, -461231, -268730]
35076b68730J95179Q3449J7654L7317J08487J44093J2230k61054l90081j73954
35066d95410J74696L10889K26847J40616P2862r7956k69311k01235O7224K41800
35056A71022J97870P5537j2899p5918r2539n4433r1990k78608m05750k54066K4958
35045g96816J33220J14580K35064M54727M38349R5292k68515l79606k68978r1440
35035c34123N3606J13723J22777K02044L22614K18558j93623n09313l24169J38437
35025a89469L23569J47331K2906J39197K20908N7274j87062k99700k86272k01495
35015b52813l3044J47306J82989O2033n9173q3478m8547j2857k3573r7481j02686
35004c21324J29565M23767L34196j51479m16850j06533K69641J48687j67273j03588
$$ y = [-268730, -73551, 9898, 27552, 64869, 173356, 317449, 329679, 68625, -321456, -495410, -320714, -9825, 217022, 357638, 430500, 332544, 63233, -138002, -70778, 171022, 368892, 444429, 431530, 355612, 263073, 208640, 116650, -161958, -567708, -821774, -796816, -663596, -549016, -313952, 140775, 579124, 674416, 405901, 26295, -242683, -334123, -280517, -166794, -44017, 158027, 480641, 699199, 505576, -3737, -327906, -189469, 134100, 281431, 304337, 443534, 664442, 721716, 534654, 234954, -51318, -252813, -285857, -138551, 44438, 106471, 47298, -36180, -84727, -97584, -121157, -218638, -321324, -191759, 232008, 566204, 414725, -2125, -108658, 160983, 309670, 142397, 38809]
34994C8809J35115j6773l58252k22391K75767L63165m6194k21642O2991J83126
34984A93721j16434k49176P5961K91641N8355p4457K76225N20955R9941m86980
34974E89752m77404m5492J30377q544l7100Q9389R7295K0619N0548L4383k07808
34963B36015l51007l1341M13916L72215q1585l40275k22380q7789j04134p5537
34953b71902L6516M7014r451O2887J54050O328k09816q8903K52301K66665j00639
34942A45050k52849J02555M71593L62560K2170k5985K11694L03365Q2413j83434
34932A239132k43600j60894j25242j78596k12424j61156j07773j56130k44750
34923c51433k10574n3421L3309k9360o8833L1205J04167q089j40589n5684J52577
$$ y = [38809, 173924, 157151, -201101, -423492, -147725, 215440, 169246, -52396, 10595, 193721, 77287, -171889, -95928, 195713, 254068, 179611, 455836, 976791, 1076732, 589752, 112348, 66856, 197233, 188689, 151589, 240978, 338273, 358892, 409440, 443823, 236015, -114992, -146333, 267583, 639798, 558213, 217938, -4442, -92231, -196365, -271902, -235386, -188372, -197823, -134936, 19114, 25442, -184374, -273277, -20976, 245689, 145050, -107799, -5244, 466349, 828909, 851079, 825094, 1036788, 1340153, 1422566, 1239132, 995532, 834638, 709396, 530800, 318376, 157220, 49447, -106683, -351433, -562007, -615428, -582119, -611479, -680312, -649107, -544940, -553029, -693618, -749302, -596725]
34912e96725K13465J22202R7705J69179J48137N35q0781j1921O2152L9726l10
34901A63364M015p508n6909o7244k6792k4992o3599j6952J46574K74829K49935
34890E74721J47420Q3098L1034q7923k21260k20718n3402J19373J20016k5032
34880D67327j11042j9321J21671J11793n6853k30786l27403l68899l22518j18322
34870h54353J63294L34241L52598L15089J93111j24954m70323m35253M1615M56339
34860b8596L61763n1156k73449j60598J6473M7424j2039m1691J940J14798K22930
34849A97799J81662m4837k77086l32460k44970j42618l5612J20846K76267L48077
34839D7068L23386J90278o9955l10705k59313R8800L85149K83402n4973k66383
$$ y = [-596725, -383260, -261058, -163353, 5826, 153963, 154498, 73717, 61796, 123948, 163674, 163364, 167379, 159871, 102962, 35718, 8926, -16066, -79665, -96617, 49957, 324786, 574721, 722141, 805239, 836273, 748350, 527090, 306372, 252970, 372343, 492359, 467327, 356285, 336964, 458635, 570428, 513575, 282789, -44614, -413513, -736031, -854353, -691059, -356818, -4220, 310869, 503980, 379026, -91297, -526550, -484935, -28596, 333167, 282011, 8562, -152036, -135563, -88139, -100178, -141869, -139929, -25131, 197799, 379461, 334624, 57538, -274922, -519892, -662510, -698122, -577276, -301009, 47068, 370454, 560732, 490777, 180072, -79241, 19559, 404708, 688110, 633137, 366754]
34829C66754k50250j61853r9527m4761L744M2393J04554J45351L8436j79120k60576
34818b94855r9309R9280J52613J49096J85183J50554k798q2204J696K3580j49875
34807A32961k76119j71469p1146j82972k49795o210K77447K29379M2648J21207
34797a54069L24981K27197o0715m2743K53732K68519j27690l77697j40247J92823
34787C64091J73696m5241q8955K4993L7644o7245j01102l6201k5672j21723j99711
34776h5426j63771r2533j33463k79612l10835m8711L46323N03906L09968L1368
34766G7214r3511j14409j08163j236J55962J16220r9509p8937K90450M59273K8984
34755F32338n04504m38172N9775K71113O6457o6602P203q5445l91721m46817p7445
$$ y = [366754, 116504, -45349, -144876, -189637, -185893, -143500, -38946, 106405, 144841, -34279, -294855, -394164, -294884, -142271, 6825, 192008, 342562, 339764, 257560, 259256, 282836, 132961, -143158, -314627, -385773, -568745, -818540, -824750, -547303, -317924, -275276, -154069, 170912, 398109, 337394, 294651, 548383, 816902, 689212, 311515, 171268, 364091, 537787, 492546, 403591, 428584, 466228, 398983, 297881, 261680, 236008, 114285, -85426, -249197, -341730, -475193, -754805, -1065640, -1114351, -768028, -264122, 45846, 77214, -16297, -130706, -238869, -240105, -84143, 32077, -67432, -146369, 144081, 603354, 632338, 127834, -310338, -250563, 20550, 87007, 20405, 27608, -57837, -449558, -896375, -973820]
34744i73820L06272M07420L97033L85654J68000k57043m80459k81173M1183J63632
34734a23301J25016L5186j24068k29070m3136K95017L24387J50j68298N6031K67009
34723D14923J67961O6166J99742J84480k99985p75045n85216P4475M27315K20666
34713I5482q0115j20202n5561p0389m4127J13676K08638R2414k6786J16761L82088
34702F11879L50666p6219m75410m44525j44715k6092j30064q2097J85551K25248
34692e778j51105m00990l1156N54854N99044J06986k54359k19403j55534k59275
34682b16716k61561n2434P1155k5309p8668M6471J37999J15200J80923L16245
34672B33305J89281k13685m25949k21028M0556M5545j9720P5387K17070K88672
$$ y = [-973820, -667548, -260128, 136905, 522559, 690559, 433516, -46943, -328116, -286933, -123301, 1715, 36901, -87167, -316237, -359373, -64356, 260031, 260181, 91883, 147914, 414923, 582884, 649050, 848792, 1033272, 733287, -41758, -626974, -552499, -125184, 95482, 15367, -104835, -160396, -230785, -274912, -161236, 47402, 139816, 113030, 229791, 611879, 962545, 886326, 410916, -33609, -178324, -204416, -334480, -416577, -231026, -5778, -156883, -557873, -589029, -34175, 564869, 671855, 417496, 198093, 42559, -216716, -478277, -530711, -459556, -484865, -563533, -517062, -379063, -263863, -82940, 233305, 422586, 208901, -217048, -438076, -397520, -351975, -371695, -296308, -79238, 209434]
34662B09434L83292M18360J06258m05117m87423Q333L86871J50456k34744j64273
34652C71447J20096M4031k98993m02534k43564j82270k10040j6129L29579M17555
34642g0822J68559r5991k07629k68043k56067j2062L70724N62753M44850K09864
34632H46136K4751j09262j85341j62497r4518o8216n8709j7727j859m6939n6212
34621F9607K1279O6934J698p9511j26716k39938l94429l51037m4223K32438K47922
34610e95976J46825J24569J14419M1185M7581J92078K51587J05624k2215J2917
34600D18594o261j95875k34613R4495L95096J78302l70905o26857l52356J12466
34590e87914L55033K50107n9739k88841k46577q7547j00029j99240l6037L14680
$$ y = [209434, 592726, 1011086, 1117344, 712227, 224804, 233137, 620008, 770464, 535720, 371447, 491543, 535574, 236581, -165953, -409517, -591787, -801827, -817956, -488377, -70822, 97737, 1746, -205883, -473926, -729993, -742055, -371331, 191422, 636272, 846136, 870887, 761625, 576284, 413787, 319269, 251053, 192344, 174617, 172758, 125819, 69607, 90886, 157820, 159518, 80007, -46709, -286647, -681076, -1032113, -1076336, -843898, -595976, -449151, -324582, -210163, -168978, -121397, 70681, 322268, 427892, 405677, 418594, 412333, 216458, -18155, 76340, 471436, 649738, 278833, -348024, -700380, -587914, -232881, 17226, -42513, -331354, -577931, -665478, -765507, -964747, -1000784, -686104]
34580f86104L40984l4823k13589J26456M89958M08564J69518J74847K11992r997
34570I77806j86340J7918K46443L7223l27445l18147r1903j39685l62895l11642
34560d58667m7551L2152k1121J16470L07931J75281j38322j71795O4742K00239
34550E9359J84962J75706J8947m11511o65835l14274K06350J99633j39904j16959
34540h03526K18171K57280L9247J25668L94211J70085m18915m64355J68027N23679
34530B09572J19667l36422k28332M5706j2388j24106P6870K75748P7926k38301
34520a34060k04320P8502K01584R0003m8858q7866J2301K32782L57708J84734
34510F82510n3959K9103K52581O0175m84032o43052j53939L32722K71004m0579
$$ y = [-686104, -345120, -379943, -593532, -467076, 22882, 431446, 600964, 775811, 987803, 977806, 791466, 809384, 1055827, 1093050, 765605, 447458, 355555, 215870, -147025, -458667, -506218, -474066, -495187, -378717, -70786, 104495, -33827, -205622, -140880, 59359, 244321, 420027, 438974, 27463, -638372, -952646, -746296, -546663, -686567, -803526, -585355, -328075, -288828, -163160, 231051, 401136, -17779, -482134, -314107, 209572, 329239, -7183, -235515, -189809, -202197, -326303, -249433, 26315, 104241, -134060, -338380, -259878, -58294, 31709, -17149, -105015, -92714, 140068, 497776, 682510, 628551, 657654, 910235, 970410, 486378, -156674, -310613, 22109, 293113, 252534]
34500B52534j17154k6419l9476j03702p9165l1489K7915K15142L53148N1917n34194
34489c0943o68875r1670N12953M91561O9499j89911j91944j17700M3131K77011
34479A03112L07933K6667k27605j88754o5552r4801j39324o4076m4288j50782
34469e37470j04228J95519L72174J77705p7777p3627K4511k774K203J55765J78818
34458C10819q2080k49454j3212L06333K93078J12604J20948J78093n9530m39183
34448D78416m93330j72030J08019P2701j38823k57321j51915J23301L59697L56709
34438B85424J56036j0696k0931P3826K02449K25858r0953o48740p92862j31968
34428g52557O31965M96549l20953o10645K9313O65302N42085O3130j55471j95124
$$ y = [252534, 135380, 108961, 69485, -34217, -113382, -144871, -116956, 98186, 451334, 503251, -30943, -699818, -791488, -278535, 213026, 282525, 92614, -99330, -217030, -173899, 103112, 411045, 437712, 210107, 21353, -44199, -139000, -278324, -342400, -386688, -537470, -641698, -446179, -74005, 103700, 25923, -47704, -23193, -25967, -23764, 132001, 310819, 228739, -20715, -33927, 272406, 565484, 678088, 799036, 977129, 917599, 478416, -14914, -186944, -78925, -6224, -145047, -402368, -554283, -430982, -71285, 285424, 441460, 430764, 409833, 483659, 686108, 911966, 821013, 172273, -620589, -752557, -120592, 375957, 55004, -555641, -526328, 138974, 681059, 744189, 588718, 393594]
34418C93594k55969j09493K46077K48666k50052m99137l8033M48953K45117k20384
34408B09339j87723J42583J01695k25473k58118J1155J33532P3546J15248J77242
34398B93026J269k34807k06450o7452j15945j63760O9713K79041L2348l85283
34388d98300l43643J39796M85494M39136K24224l45k23953l07362j66490l0844
34378b82287o2256k2709K32564L51187Q3553j84352p1393J23116J3324j30784
34368D9963N6123K58715N7718k12958m4463K66185J35132k04490r9551L22044
34358E84418L51668q2161l59984k37744p7682o8278k2773Q4533R8745J19086L02380
34347F92208L97923J23762k30999k49634j30096k59926m02253j27729K81090K56765
$$ y = [393594, 137625, 28132, 274209, 522875, 272823, -226314, -264347, 184606, 429723, 209339, 21616, 164199, 265894, 40421, -217697, -206542, -73010, 536, 115784, 293026, 294295, 59488, -146962, -214414, -330359, -494119, -424406, -145365, -113017, -498300, -841943, -702147, -216653, 222483, 446707, 446362, 222409, -84953, -251443, -282287, -344543, -367252, -134688, 216499, 300052, 115700, 44307, 167423, 180747, 49963, 106086, 364801, 422519, 209561, 165098, 431283, 566415, 361925, 262374, 584418, 936086, 853925, 493941, 256197, 178515, 110237, 87464, 171997, 270742, 389828, 692208, 1090131, 1213893, 982894, 733260, 603164, 343238, -59015, -186744, 94346, 351111]
34337C51111k1134L0311K87066J63307k29471k27771J67277K66640j01143l50842
34327C35351j85826K3426J1794m1835l6642q4462r7384Q8320K47854R4478j05154
34316B49920L9635K56990P0101k51489j24919K34751J54902k65609l44378n9967
34306d0063J0750j29461M9041M38463L79823q2030k22807M3131P4044k08960j94791
34295A17140J33615P7194m10848n26978o7841K08483J0831j074M07757N01397
34285D49676l1483l91150n6388K98519L6910l44031j79734K13866K16171l1656
34275A80700n9484N4512p849j28713l4043J75925K72675K59161J38476j81376
34265F69984m82017l23500J98695M23738J08694k34328k29648j37720j95221k07480
$$ y = [351111, 329977, 360288, 647354, 810661, 581190, 353419, 520696, 787336, 686193, 335351, 149525, 172951, 184745, 142910, 106268, 21806, -75578, 12742, 260596, 355074, 249920, 289555, 546545, 616646, 365157, 240238, 474989, 629891, 364282, 19904, -40063, -29313, -158774, -109733, 328730, 708553, 626523, 403716, 446847, 520891, 311931, 117140, 250755, 327949, -82899, -609877, -677718, -469235, -458404, -459478, -51721, 449676, 418193, 27043, -29345, 269174, 306084, -37947, -217681, -3815, 212356, 180700, 121216, 175728, 167879, 39166, 5123, 181048, 453723, 712884, 851360, 669984, 187967, -135533, 63162, 486900, 595594, 361266, 131618, -6102, -201323, -408803]
34255d08803r3437r9546k01565m5933K89876L03789M3725J43292O19000O57536
34245A207934k452n13664k64274K00730J98109o2283j11922o9547j84984k47163
34235A50484p1372N0060q6499j90438p1429R231n0675M6692K85596J87068k56375
34224B343l60628J11096M75621K66072n4565l0795L2301j69894k81682j819L11395
34213B99445L15403K30620K28540M8554l21870m05162j08428K2086j69632j15692
34203B3864L46008N41231J66730j33918L3723J29156j90420l56408m983K74420
34193H29403M2817j94387l6008N0220k28989k99971J16084K92486j72871m76706
34183g7922k1635M49271J85377k31299k9946L26889R5017l37801k50410N5957
$$ y = [-408803, -502240, -601786, -803351, -849284, -559408, -255619, -211894, -68602, 550398, 1207934, 1205482, 691818, 427544, 628274, 826383, 764100, 652178, 582631, 397647, 150484, 79112, 129172, 42673, -147765, -219194, -209963, -260638, -213946, 71650, 258718, 2343, -358285, -247189, 228432, 494504, 439939, 409144, 441445, 271551, -10131, -11950, 299445, 614848, 845468, 1074008, 1122562, 800692, 395530, 287102, 309188, 139556, 23864, 369872, 911103, 1077833, 943915, 977638, 1106794, 916374, 559966, 554983, 829403, 872220, 677833, 641825, 692045, 463056, 163085, 279169, 571655, 398784, -77922, -99557, 349714, 535091, 303792, 273846, 600735, 695752, 357951, 107541, 163498]
34173A63498n4909k89786n7500L53873L72383K06674K45210J57232l38893o26560
34163A31222k13754K35560L1044k61148J09688N96189K88695m27058n35217q7807
34153a32586R7388j04942k18940k04532k53238q9251M47690P29487K93708k15868
34143C48916j00313J85668l2917l58423j46022K19219J07941j10245J43981M52792
34133G10597K38421m1919J95297M42125P4995l85233k94052j49360m78174n78992
34123b66295J32815P04009K17421m06691Q145O97226L35154m98441m05174K54453
34113G72622J55732m43106l07709K92064J07686o00019m89558L27565N24855L4688
34103C74820j0229M37355L72924j44065j26593K86821J12541l75870p2060O61831
$$ y = [163498, 108589, -181197, -238697, 115176, 487559, 694233, 939443, 1096675, 757782, 131222, -82532, 153028, 184072, -77076, 32612, 628801, 917496, 490438, -44779, -132586, -35198, -140140, -359080, -563612, -816850, -906101, -458411, 271076, 564784, 348916, 248603, 434271, 401354, 42931, -103091, 116128, 224069, 113824, 257805, 710597, 949018, 907099, 1102396, 1544521, 1619516, 1234283, 940231, 790871, 312697, -266295, -133480, 570529, 787950, 381259, 389404, 1086630, 1421784, 923343, 518169, 772622, 928354, 485248, 177539, 469603, 577289, -22730, -512288, -184723, 340132, 374820, 364591, 801946, 1174870, 1030805, 904212, 1191033, 1303574, 927704, 855644, 1517475]
34093A517475M41638n50256p85797j09448J51058k40770j73635M26816L89954
34084A067035l40784n04630R3612K95275j07596p9016M33230K99467m97288o72763
34074a3458l7506J91507k56514l28967J22536O9325m72551l19618M88033N77861
34064B0648j58669l03173M16390O74769J42388l563M31523K49181n95510o70264
34054B03720J75269L86012l73579n73209K39747N87624p9887m01936J74799L94355
34044G32915j96776l21104M03648N71511k96851p65308j82191K29300r3483p5060
34034F601N30697M25141n33335o87594L71877R18611K30973k39942J76452K16024
34024A415505m93019n04349M51395O56357k91795n69811L39561N62722m87921
$$ y = [1517475, 1959113, 1408857, 623060, 513612, 664670, 423900, 250265, 677081, 1067035, 726251, 221621, 315233, 610508, 502912, 423896, 857126, 1156593, 659305, -13458, -50964, 140543, -115971, -444938, -322402, -253077, -725628, -1045246, -557213, 20648, -138021, -441194, -24804, 649965, 792353, 788790, 1220313, 1469494, 873984, 203720, 378989, 765001, 391422, -181787, 57960, 645584, 565697, 163761, 338560, 732915, 536139, 215035, 618683, 1190194, 893343, 128035, -54156, 175144, 81661, 6601, 537298, 962439, 429104, -258490, 113387, 1031998, 1262971, 1023029, 1199481, 1415505, 922486, 418137, 869532, 1525889, 1234094, 664283, 1003844, 1566566, 1078645]
34015A078645q52952J84833O48317k82624o51558L78519P71626l94073r76247
34006i5514J79514J008449J74643n08833J95287N90386l25006p09114L19927O61072
33996A490811n95019j031952N21628J468061J86966r47792j36755O01806k63397
33987A294357o79563O34588J268595j57921r86895L75447J170333l53306j345414
33978A220221J00298J082479l87496j306413L44395J305880n78785j709905M21782
33969D92456J994809N8470j527495N06808K227377N0285j970270J64853K394586
33960D391879L53685j951206O0952K320469J08606k183953M55420L155290L39508
33951G050650k652106N38942M210091J146852k588744J142779N841718K424706
$$ y = [1078645, 225693, 410526, 1058843, 776219, 124661, 503180, 1274806, 880733, -95514, 84000, 1092449, 1267092, 758259, 953546, 1543932, 1218926, 509812, 829739, 1490811, 895792, -136160, 385468, 1853529, 2040495, 1092703, 955948, 1557754, 1294357, 614794, 1249382, 2517977, 2360056, 1373161, 1748608, 2918941, 2565635, 1220221, 1320519, 2402998, 2015502, 709089, 1053484, 2359364, 1780579, 70674, 492456, 2487265, 2545735, 1018240, 1525048, 3752425, 3802710, 1832440, 1997293, 4391879, 4745564, 2794358, 2855310, 5175779, 5284385, 3100432, 3555852, 6711142, 7050650, 4398544, 4937486, 9147577, 10294429, 7705685, 8848464, 14690182, 17114888]
33943A7114888j719730L962580J0994272O927880K018846J1625030K2701770J6073400
33935H9698936J4702049N8143260J21564364J18968152J7732227r9157989j29673948
33928A91977051p6067211k2078410j3687753k1761414j4029830k309423n030251
33921C7012759j1366103o206173J765640m25000n959332l552815J572981q2464
33913A2759493m052150k064759J910529M53284k925185j522996J498382O0645
33905F117243k827999j409212J581798O51665j827656p38506J763729Q28748j626547
33896B513263j002958J058868L29385j642704q80881J131838N79331j198333o33450
33887B54359R58932K12927j454276o55517J198287N83885j310825r20258R11630
$$ y = [17114888, 15395158, 19357738, 30352010, 37279890, 39298736, 50923766, 73625536, 89698936, 104400985, 162544245, 284108609, 403076761, 420808988, 321650999, 191977051, 115909840, 93831430, 80143677, 58382263, 44352433, 42043010, 37012759, 25646656, 19440483, 21206123, 20781123, 14821791, 11268976, 12841957, 12759493, 8707343, 6642584, 8553113, 9006397, 6081212, 4558216, 6056598, 6117243, 3289244, 1880032, 3461830, 4113495, 2285839, 1547333, 3311062, 4139810, 2513263, 1510305, 2569173, 2898558, 1255854, 374973, 1506811, 2086142, 887809, 254359, 1213291, 1426218, -28058, -683575, 514712, 1098597, -212228, -1132486, -220856]
33878b20856P74074p80135o43484P44859N70103o93786l97381R33818P00819o28049
33868C59982n66598M61731J50748r65532n98207O64734M80880o25964l58478P37474
33858b59230L30698j009582p59419P43311R31053j92761k95230P28702P45391
33849I62933l66056n78265L16856N01384k09277k05818N14478L48684o08893o91887
33839a5861M9949L1175o03319k47625Q18042P27900m21919o68867J95254L91782
33829B56511m04898o31708K5736K07091k37635j2196P80767N97109n03029p58656
33819f80908O5648L28934k90100k49469P38241J010300K7509o61679k74928K6503
33809D0051m03091n61551M3493M25948J16976j8223L44571L64701j23992k00243
$$ y = [-220856, 553218, -226917, -870401, -125542, 444561, -249225, -646606, 287212, 988031, 359982, -206616, 255115, 405863, -559669, -1157876, -493142, -12262, -638226, -996704, -259230, 71468, -938114, -1697533, -954222, -23169, -215930, -511160, 217542, 962933, 596877, 18612, 335468, 836852, 627575, 421757, 936235, 1284919, 676026, -15861, 34088, 65263, -538056, -785681, 32361, 760261, 338342, -330525, -135271, 256511, -148387, -780095, -754359, -547268, -784903, -797099, -16332, 580777, 77748, -680908, -615260, -286326, -576426, -825895, -87654, 922646, 950155, 288476, 13548, 40051, -363040, -924591, -881098, -455150, -338174, -356397, -11826, 352875, 228883, 28640]
33799B8640K16702J09827n14027m11768M99317P59106m1752n17738j1050L58441
33789D75698n5024k96784J61282L50644k32393n48798K9829N03843Q5750m18500
33779E5547j91722J65775p7179m33707k38024J49061J70018O3218J72986K27165
33769F3138J3472j27519l2910l9636j93434r9666J73190R9393k10632r2892L41783
33758a05713K51688l80325o06306j68642J11833j04811j56476K33380M50536K46193
33748b28643J36528K15571m3776n00406l20440M16971N95842n9691n07932k24211
33738e20187L9955j65083k12221K06321M18289J36553K5317K85040J49439n50102
33728a86679q08231j63415M46359L00258l1311J7494M0098k24327j91584L17564
$$ y = [28640, 245342, 355169, -158858, -570626, -71309, 687797, 646045, 128307, 117257, 475698, 420674, 123890, 285172, 635816, 403423, -145375, -115546, 388297, 474047, 55547, -136175, 29600, -47579, -481286, -719310, -570249, -400231, -337013, -164027, 63138, 76610, -50909, -83819, -123455, -316889, -416555, -243365, -143972, -354604, -447496, -105713, 145975, -234350, -840656, -1009298, -897465, -1002276, -1158752, -925372, -474836, -228643, -92115, 123456, 79680, -420726, -741166, -324195, 271647, 211956, -295976, -520187, -480232, -645315, -857536, -651215, -232926, -96373, -71056, 213984, 363423, -186679, -994910, -1158325, -711966, -411708, -443019, -425525, -385427, -609754, -801338, -483774]
33718d83774M75639o4950m19308m8820K67965n8201l24619O2755M19418J01708
33708g2187k50642O3965M90429K85518j41659j14477N4087j68748m04194j22524
33698c80432K79084K23056Q157J23831K73424M3613k12181r2299K1511k29238
33688E8526l28424K06736Q11129P17176J38037k66719m17245m89211l12953Q5640
33678B02692J27561l22701m52273J59424O29420J81213m70882k87144L82016M90691
33668F40017L2708j89927k9989l276j88556k20323j08222j18372j23807R3631
33658b16116K41658Q92k87177j65595J44318K11703J51993J99381J06046k73151
33648A13952m26405l3019K93361m428l72772p4781M78349M26519o2359j83120
$$ y = [-483774, -8135, -73085, -492393, -541213, -273248, -331449, -656068, -593313, -173895, -72187, -322829, -258864, 231565, 517083, 375424, 260947, 315034, 146286, -257908, -380432, -101348, 121708, 129865, 253696, 527120, 570733, 358552, 266253, 287764, 58526, -269898, -63162, 747967, 1465143, 1603180, 1336461, 919216, 430005, 117052, 202692, 330253, 7552, -444721, -285297, 344123, 525336, 54454, -232690, 149326, 640017, 672725, 482798, 452809, 449533, 260977, 40654, -67568, -185940, -309747, -216116, 25542, 26434, -260743, -426338, -282020, -70317, 81676, 281057, 387103, 113952, -312453, -345472, -52111, -56539, -429311, -504092, -25743, 400776, 338417, 155297]
33638A55297O9856M4086k92209l70585j43246j03018k80130k10305J34758K74528
33628g20968P0612j15909r6491k8128J7395R4339J27831Q7121J59001L30781K20431
33617A46015k20715l96253j0069L24904R1866k24079m2464K33158J6184k77880
33607c59333J3315M51996J85700m60370m49603J53043K54461l84104p15233j14959
33597a425087O67102P02688J15522l40335k68122J79958O08038O18561J22066
33588I80391m74937o85315m94495k05371N6851K92360L45346J48050m675J05748
33578F3953J96378k2918k74533j72832Q9076Q9937j10598j82223j06733o775K15815
33567b21453N19056M62513q3402m77227k25930J74258O3765k71883j77717J98260
$$ y = [155297, 225153, 269239, -22970, -393555, -536801, -639819, -919949, -1130254, -995496, -720968, -650356, -766265, -862756, -890884, -873489, -779150, -651319, -564198, -405197, -74416, 146015, -74700, -470953, -481022, -156118, -64252, -288331, -330795, -97637, -81453, -359333, -346018, 105978, 291678, -168692, -618295, -465252, -210791, -594895, -1310128, -1425087, -757985, -55297, 60225, -280110, -548232, -368274, 239764, 858325, 980391, 505454, -179861, -674356, -879727, -822876, -530516, -185170, -37120, -41795, 63953, 260331, 237413, -37120, -209952, -120876, -30939, -141537, -323760, -430493, -437268, -221453, 297603, 760116, 676714, 199487, -26443, 147815, 211580, -60303, -238020, -39760]
33557c9760K48101k17p5101Q821p0368j76413j8993J41120k6602j57325J63216
33546c521M57029R0659n02547m66056J7451J06228k00162k01416J20215J51547
33536d30573q4837q043K83865J50595k66823j70564M14301N80897P4850l52647
33526A91021k76216r2396l2466J50410L44737Q6651m28061m70447n3643P8503
33516e01907j59955q4749L30726K86797k91969m39957J68039N84916K24016j74393
33506e8436P8892M58949K58614k13180k95163l2036J61344J98633R4633k70377
33496C81873o69595n46774M9661L40843L7189j94042O5202K61738o4976m15259
33486g54140k10760K54135M24634L41183K57858Q8798j80083k03086O1099R7967
$$ y = [-39760, 208341, 208124, 133023, 141844, 71476, -104937, -123930, 17190, -9412, -166737, -3521, 453508, 544167, 41620, -424436, -406985, -300757, -500919, -702335, -582120, -430573, -515410, -523453, -239588, -88993, -355816, -526380, -112079, 468818, 543668, 191021, -85195, -177591, -210057, -59647, 285090, 371741, -56320, -526767, -580410, -501907, -661862, -746611, -415885, -129088, -421057, -861014, -692975, -108059, 115957, -58436, 20456, 479405, 738019, 524839, 229676, 197640, 358984, 557617, 652250, 381873, -287722, -834496, -784835, -443992, -406803, -600845, -535643, -273905, -338881, -754140, -964900, -710765, -286131, 55052, 312910, 401708, 221625, 18539, 79638, 177605]
33476A77605k44264l58712N5517L61696N2622l63557k51580J37578K77393K63427
33466A07725L38712K28335k37712m95639j04052L57749J38385m45722n31277o7628
33456g11124K47126J14982j04623j14282L5066K30069L24679J01823l29562m18475
33446f24321P3730N78804M85516R03k84262k83762k90089l27015k24813n4299
33436i49608L7891J45373L10947K73956n2720k59649n6749K19562J90866N6963
33426h3168J12112J40116j08709l06916p6229K80564K48008n1441j43851l0607
33416b0121n9721k24947k38109j01025k1409M8444K47320L82016J96339j19363
33406H9424j79489K713J10077L8799o4883j05854o3691P1888J62672K3717j68779
$$ y = [177605, -66659, -425371, -369854, -8158, 44464, -319093, -570673, -433095, -155702, 107725, 446437, 674772, 437060, -58579, -162631, 195118, 333503, -112219, -643496, -711124, -463998, -349016, -453639, -567921, -532855, -302786, 21893, 123716, -205846, -624321, -550591, 28213, 513729, 514632, 230370, -53392, -343481, -670496, -895309, -949608, -911717, -766344, -455397, -181441, -234161, -493810, -550559, -330997, -140131, -83168, 28944, 169060, 60351, -246565, -322794, -42230, 205778, 154337, 10486, -20121, -79842, -304789, -542898, -643923, -665332, -616888, -369568, 12448, 208787, 89424, -90065, -87352, 22725, 61524, -3359, -109213, -172904, -101016, 61656, 85373, -83406]
33395h3406j5657L80430M10523o3793m00353j96756R8797M3280q2795M3406J33569
33384B67245n8526j56334Q9276J94151j80486m74727j64956K69826K00010m6959
33374f1480R8564L11726K6225l90657k64915J14604M3756k54170q0342L49648
33364a07041K75828j56144j60717J90339J19530l22147k89223K70032M66335N4614
33354C41406k06481k0718j8082l83542l58561L36355P95298L37255l95596m86510
33344e9176n0863K32061K01708J30186Q5365j0461q4151j09519k14583l13161
33334a92594j14051K72750L27040k3181j84901J25978L68112O9299l88434m03523
33324a43505n7198J67968J60549J31386J02005m8202k21088k11453o1093O853
$$ y = [-83406, -99063, 281367, 691890, 628097, 227744, 30988, 129785, 173065, 90270, 133676, 267245, 208719, 52385, 141661, 335812, 155326, -319401, -484357, -214531, -14521, -61480, 37084, 348810, 375035, -15622, -280537, -165933, -122177, -376347, -456689, -107041, 168787, 12643, -148074, 42265, 161795, -160352, -449575, -179543, 286792, 341406, 134925, 114207, 96125, -287417, -645978, -309623, 485675, 822930, 427334, -59176, -110039, 122022, 323730, 453916, 539281, 528820, 444669, 335150, 120567, -192594, -306645, -33895, 293145, 269964, 85063, 211041, 579153, 648452, 260018, -143505, -200703, -32735, 127814, 259200, 361205, 313003, 91915, -119538, -180631, -173778]
33314a73778q5469k06767j81946O5996L99403M94825K06260j52201j83028J2702
33304A95997J6664k04565k52381K5492K86732K21828p3402l32431l74927j22295
33294f13288K83148M31328J17295k47620j59355J96376K46758l5195j71827n6517
33284h897l4680j27197K1257L39407K97467j44967l56103m5168K97487K61875
33274E00481R4496Q7726Q6016l8836o5055O1691K587l22179m57623j56721J89361
33263a8056K30030J73454K44734K21036o8316l33657l45195l34133m65244m50146
33253a145493j13544J93981J89666J25250K12059J56984k07159m02196l6423M40054
33243e86821L86971j7016j09865K02735M09506K26258j30828l83794m09350j48408
$$ y = [-173778, -259247, -466014, -647960, -581964, -182561, 312264, 518524, 366323, 183295, 195997, 212661, 8096, -244285, -218793, 67939, 289767, 216365, -116066, -490993, -613288, -330140, 101188, 218483, -29137, -188492, 7884, 254642, 219447, 47620, -8897, -43577, -170774, -149517, 189890, 487357, 342390, -13713, -58881, 238606, 500481, 594977, 682703, 768719, 729883, 664828, 726519, 729106, 406927, -50696, -207417, -18056, 211974, 385428, 630162, 851198, 782882, 449225, 104030, -230103, -695347, -1145493, -1259037, -1065056, -875390, -750140, -538081, -381097, -588256, -990452, -1026875, -586821, -199850, -216866, -326731, -123996, 285510, 511768, 380940, -2854, -412204, -560612]
33233e60612K61825M18923J30857k09944j31396K21070L12350j0234l91467n11617
33223d70245l74171j17267J32430K48718J91121P0147l769l0834j0685P7672J17364
33212a69519n3671l13546l44308j38173l7602j57575k00074l881J82215J83313
33202a052821J86142K99301K98523Q9775l6717Q6260J92879P6381p1316j02620
33192c4213j94061l65819k69062J60401L87653P4741l26791k74883N8521K05511
33182e78002J65029J91079K27235J12539m897K4331m972k13536k63220N2063K90983
33171a368L9528l32886k59147P4399R3372j57568j42480K18579M61514L50352
33161C44295J08848n2859j05619O815K57485L53311J09103j87441k12618j31292
$$ y = [-560612, -298787, 120136, 250993, 41049, -90347, 130723, 443073, 432839, 41372, -470245, -844416, -961683, -829253, -580535, -389414, -319267, -323036, -353870, -364555, -286883, -169519, -223190, -536736, -881044, -1019217, -1056819, -1214394, -1414468, -1418349, -1236134, -1052821, -866679, -567378, -268855, -179080, -215797, -129537, 63342, 139723, 68407, -34213, -228274, -594093, -863155, -702754, -315101, -240360, -567151, -842034, -783513, -578002, -412973, -221894, 5341, 117880, 112983, 137314, 132342, -81194, -344414, -292351, -1368, 38160, -294726, -553873, -479474, -386102, -543670, -686150, -467571, -6057, 344295, 453143, 400284, 294665, 301480, 558965, 912276, 1021379, 833938, 621320, 490028]
33151D90028k12810k61957l268K89407J88202j32494j93758l0125l6015k01630
33141a04420j93126l0995m705n2477R2941K67256P8158l39165m47414j40982J69565
33130g05364K43888J87771M3973j88862k51956M1390L17860J30560k46073k05273
33120f32086J97565M04797L30185L25839L21726n5625n51197m72776J03408L19570
33110B91406q4491l68419o5993K90621J47063k20084l25252k30717j74971o0689
33100h01526J94464L21397J57489k7029k9399n8678k31138k28610J46805N37796
33090a8429N50871L08132J17805j9196k15511l57593l00731j28237K6737J39895
33080A03743J34892p6873k86429j58255J72400J86878j80697l73222r8004K26127
$$ y = [490028, 277218, 15261, 11993, 301400, 489602, 357108, 163350, 133225, 97210, -104420, -297546, -328541, -333246, -385723, -292782, -25526, 52632, -286533, -733947, -874929, -705364, -461476, -273705, -229732, -418594, -670550, -629160, -311300, -180740, -426813, -632086, -434521, -29724, 300461, 626300, 948026, 892401, 341204, -131572, -28164, 291406, 206915, -161504, -227497, 63124, 210187, -9897, -335149, -565866, -740837, -801526, -607062, -285665, -128176, -155205, -184604, -243282, -474420, -703030, -556225, -18429, 532442, 840574, 958379, 939183, 723672, 366079, 65348, -62889, -36152, 103743, 238635, 161762, -124667, -282922, -110522, 76356, -104341, -477563, -575567, -349440]
33070c49440K12293Q1085J03306O4520k21192l87645q2892L38384K82215j87775
33060a47141m66213k57690J49797L65212K79828L3271j48894j41098o1361r5026
33050d89315j56421n803K75259L22266Q4303o6008M7115J50331O1894k2771l257
33039A97593j00824l44952l76025q1577J12830m6914j92555j3078J67184l344
33029f81662k27345p1099K73917L46565J82897J30451J93698J49113N6899R2417
33019D45851J00556j28977l62202k49019N1394J21694k9106q5408m0747j08485
33009b84449j74197M5048L90818M31495J92980J02598K05705Q2568l56405o21185
32999A4976m07017o9721l5422j61612m6910K99803M70904K41481j46326l10185
$$ y = [-349440, -137147, -56062, 47244, 111764, -109428, -497073, -579965, -241581, 40634, -147141, -613354, -871044, -721247, -356035, -76207, -42936, -191830, -332928, -394289, -489315, -645736, -651539, -376280, -54014, 30289, -35719, 11396, 161727, 223621, 200850, 197593, 96769, -248183, -624208, -705785, -592955, -639869, -832424, -845502, -678318, -681662, -909007, -980106, -706189, -359624, -176727, -46276, 147422, 296535, 353434, 445851, 546407, 417430, 55228, -193791, -142397, -20703, -49809, -135217, -175964, -284449, -458646, -413598, -22780, 408715, 601695, 704293, 909998, 992566, 636161, 14976, -392041, -461762, -497184, -658796, -705706, -405903, 65001, 306482, 160156, -150029]
32989a50029j85215n6499j44438k79683j47653K02219L70899J95751N058J09589
32979h0001L32715L03537q777l19407m07324k43714P0875K95324J95996r8577
32969D0647j60744J13286K83516L7177l04256l10238r4621m155r423Q0140J09271
32958b19400j30708l48576j17822L68494N32480K92481Q9090J04419R0338m6205
32948F14591j22774j66895l85096n93719l46840K41248M75834J01740k97723k06646
32938f86280J29188K66689K41630K35590Q9567l02227n21426j65261M02310M67586
32928A57366J2086k77411n5037K26666R0296k42103k48817Q9663L15865K03583
32918B72157J8866J3961L5164j38066l33393k21536J03870J97107m5770j82650
$$ y = [-150029, -335244, -391743, -536181, -815864, -963517, -761298, -390399, -194648, -189590, -80001, 252714, 556251, 547474, 228067, -179257, -422971, -352096, -56772, 139224, 40647, -120097, -6811, 276705, 313882, 9626, -300612, -395233, -399388, -408811, -328671, -219400, -350108, -698684, -816506, -448012, 84468, 376949, 466039, 570458, 660796, 614591, 491817, 324922, -60174, -653893, -1000733, -759485, -283651, -181911, -479634, -686280, -557092, -290403, -48773, 186817, 276384, -25843, -547269, -712530, -310220, 157366, 169452, -107959, -162996, 63670, 153966, -88137, -336954, -247291, 68574, 272157, 291023, 304984, 340148, 202082, -131311, -352847, -248977, -51870, -97640, -280290]
32908b80290R0801M26392L26384j00056k96417n8285K38250K14608n7706k70007
32898B33674k72315j32837K0908J03591J03212P1956N0900K7412O666L6155Q5948
32887C35270L0861j35420k13487p9387R2671Q0349m4832m8001R4310J85676J26642
32876D24652K9890L1763J33914K08130Q5717k55271n36023m09404M4399L04020
32866F1787O6762l34504m03231j15153J89599L11517K81375J51023L049j3832
32856A98392P2844J2019k17806k38443J03241L31268M1726l66077k73011J45569
32846a90278K06258j64475l69536j48097J20889J77781K12076K97621J90873j03801
32836B29311k02145o376Q9326r4454j95823J5037J97023K9764k43982k49916n0918
$$ y = [-280290, -189489, 236903, 563287, 463231, 166814, 108529, 346779, 561387, 503681, 233674, -38641, -171478, -150570, -46979, 56233, 128189, 179089, 206501, 213167, 249322, 335270, 366131, 230711, 17224, -62163, 30508, 110857, 66025, 18024, 112334, 298010, 424652, 454542, 486305, 620219, 828349, 914066, 658795, 122772, -286632, -242233, 61787, 128549, -205955, -609186, -724339, -534740, -223223, 58152, 209175, 212224, 198392, 271236, 283255, 65449, -172994, -69753, 261515, 303241, -62836, -335847, -190278, 15980, -148495, -518031, -666128, -545239, -367458, -155382, 142239, 333112, 229311, 27166, 20790, 110116, 15662, -180161, -165124, 31899, 61663, -182319, -432235, -483153]
32825d83153P7433R2545Q3900M1146o396P0644K10693J63357m0825n8292J35355
32814B86407J10730k35499l54770P4820N12694L56897j08686k22028n332J2503
32804D27736k28174k94574j02580k2146j23684l7726K98667M17899R2619k37002
32794A91035j36868J78085K51328P5337m6677p9291k32209m57351m18167k4715
32784f99493L57082L89540K01498J34653K27179K12844l0854l07375m11028l73368
32774b99322l04614k00440m6767O6870J07176K05599M19121N44193L89948Q7058
32764I68822j19105k25784l34480l18706r338L79652M27602J02957k05282k63028
32754D03310k03766j39305P272J82568J46373j01863k25917p1189Q0298j1540
$$ y = [-483153, -405720, -313175, -229275, -188129, -194525, -123881, 86812, 250169, 209344, 151052, 286407, 397137, 161638, -193132, -118312, 394382, 751279, 642593, 420565, 415233, 427736, 199562, -95012, -197592, -219738, -343422, -381148, -82481, 335418, 428037, 191035, 54167, 232252, 483580, 558917, 512240, 432949, 200740, -256611, -674778, -699493, -342411, 47129, 248627, 383280, 610459, 823303, 792449, 485074, 74046, -299322, -603936, -804376, -851143, -784273, -677097, -471498, -52377, 491816, 881764, 968822, 849717, 623933, 289453, -29253, -38591, 341061, 768663, 871620, 666338, 403310, 199544, 60239, 67511, 250079, 396452, 294589, 68672, -2517, 77781, 66241]
32744F6241j49396m1350K35280L83482L03382J28543n124m8875k0860o343o3445
32733G81535j06650m4224J4858o9573j71157r1362M0727k1667j23216O9556L64655
32722F43482K20108l00630m75733m7380L42577J89990j22769r3053O4545n3990
32712C67147k59261j85036r532o5982j41778J11726M16539K74528j26379j86158
32702A95814J04132K01802m2677k29623j73887j14161j31912k8657J56061J29930
32692F6822p6515j15486L3533K9403j48646j23096J54070K46480l386j95640j05031
32681b37492n8261k56384l33863j7732L18274K58757M8195J30282L48598K24797
32671D25171j86722l53013j08972J24825L1610j82316k06367p2933K2014O0250
$$ y = [66241, -83155, -124505, 110775, 494257, 797639, 926182, 921058, 872183, 851323, 844980, 781535, 674885, 630661, 645519, 575946, 404789, 313427, 354154, 332487, 209271, 278827, 643482, 863590, 562960, 87227, 39847, 382424, 572414, 449645, 356592, 421137, 367147, 107886, -77150, -86682, -152664, -294442, -182716, 233823, 508351, 381972, 195814, 299946, 501748, 459071, 229448, 55561, -58600, -190512, -219169, -63108, 66822, -9693, -125179, -91646, -62243, -210889, -333985, -179915, 66565, 63179, -132461, -237492, -295753, -552137, -886000, -903732, -585458, -326701, -278506, -148224, 200374, 425171, 238449, -114564, -223536, -98711, -67101, -249417, -455784, -528717, -506703, -446453]
32661d46453J27728J83397J35079M8077O5503J59259J54792J2231j01087p3816
32651B64710j2505l8918r0537p5484p0784j53946j76131J2175K12162J13385j59362
32640a75235j59547J70754L66501J68028q6761n0024J08303R9079K1254N7634
32630E19986M0940j96267l65435j53902J57012R5084j88869j53121K08529L52981
32620C16938R4594j48035j11871n7101j80045k37545m0772J48097L1127k61282
32610d45895l98286k72601j59K45305K61994k5418l29259k45287J54465L52206
32600g02935J46072m9395J12750L65460K99710J5500j02285L811Q9523P6314R6275
32589C50800J57367J16355l5968j41473j22747m9273K3259Q8200R1058j8553j56205
$$ y = [-446453, -318725, -135328, -249, 47828, 113331, 272590, 427382, 439613, 338526, 264710, 252205, 213287, 122750, 47266, -23518, -177464, -353595, -341420, -129258, -15873, -175235, -334782, -164028, 202473, 370501, 283740, 233716, 342019, 441098, 462352, 519986, 560926, 364659, -776, -154678, 2334, 97418, -91451, -244572, -36043, 316938, 411532, 263497, 151626, 94525, -85520, -323065, -363837, -215740, -184613, -445895, -844181, -1116782, -1116941, -871636, -609642, -635060, -964319, -1209606, -1055141, -702935, -556863, -606258, -493508, -128048, 171662, 187162, 84877, 88688, 178211, 254525, 350800, 508167, 624522, 588554, 447081, 324334, 275061, 298320, 386520, 477578, 459025, 302820]
32578C02820j91088j48803j60266k12218j29303J39849L71495L18335L4373j86823
32568A38371j87581j12200j31493j53628R219K70718L24399Q7014j71866k22555
32558a49602j38791n3572O5174K13916K06646k8437k44318k20535q2813k5989
32548d58321J4411J17718J00317j47677l28970j67660Q9929P0234q7389j5709
32538h13117J87214J50338n8323n0598J64623K29518J16801R8293J11137j32839
32528C047m51233l68121J5429J33595l2542O1467M31480M27136q4024l90897j51009
32517d05672O4790j07826j73741J71550L50292j441k20912K01670N45102L9536
32507D63348o59807m36413M25648O95163J66748j99360N973J48819j03395k21595
$$ y = [302820, 111732, -37071, -197337, -409555, -538858, -399009, -27514, 290821, 325194, 138371, -49210, -161410, -292903, -446531, -437312, -166594, 157805, 244819, 72953, -149602, -288393, -341965, -276791, -62875, 143771, 115334, -128984, -349519, -432332, -458321, -443910, -326192, -225875, -373552, -702522, -870182, -780253, -710019, -797408, -813117, -625903, -475565, -533888, -584486, -419863, -190345, -73544, 24749, 135886, 3047, -448186, -816307, -800878, -667283, -699825, -638358, -206878, 220258, 136234, -254663, -405672, -340882, -448708, -622449, -450899, -100607, -102048, -322960, -121290, 423812, 463348, -196459, -632872, -207224, 487939, 654687, 455327, 461300, 610119, 506724, 285129]
32497B85129P5048K68132N0633p6564K45257N07868J75091l98635n28326k14343
32487C89290O677q3081k13909j38765J04637L33896L42403J0466m82513p05416
32477d36315m36540N0070L12108K20580o253j06424O918K17293L11017J89939
32467C22393j5682j36522j90256k63260k79971j25292R7185J96180J92151J98986
32457d088J25657j42449l67827k10901J74193K69000m1439l07272k19799r52P7014
32446f48863R7075J83628J95147K2759j35393r2735N218m5165j53447j25630N028
32435f92378R4651J49078K25900K50322J65488J09176K06145L17694K25747l4864
32425A016959k27946k18367o6272R0096J19090k1004j71881j02126J35470J75985
$$ y = [285129, 360177, 628309, 678942, 602378, 847635, 1355503, 1530594, 1131959, 603633, 389290, 395967, 312886, 98977, -39788, 64849, 398745, 741148, 751614, 269101, -436315, -872855, -822785, -510677, -290097, -296350, -402774, -395856, -178563, 132454, 322393, 306711, 170189, -20067, -283327, -563298, -688590, -591405, -395225, -203074, -4088, 121569, -20880, -388707, -599608, -425415, -156415, -197854, -505126, -724925, -725877, -648863, -551788, -368160, -173013, -150254, -285647, -378382, -373164, -418329, -571776, -697406, -692378, -597727, -448649, -222749, 27573, 193061, 302237, 508382, 826076, 1051823, 1016959, 789013, 570646, 504374, 594470, 713560, 692556, 520675, 418549, 554019, 730004]
32415G30004j43258m45334k64204K93700O39439M19616j23809n27545n91887m13181
32405d26459j43425J15815K66093K27754M4215j06660q0390N9738J04792l3571
32395B7902j91523j59749L6858J73855J22227l048j2184J17012K03529N9213k69838
32384A04254m82073l31110M7480K73642K15396J21568J68952J68375n0548k48823
32374a2887j37721Q1593n7k82209k46843J94020M82470K40701j69233k35188o0311
32363a45665j02064l70778l86714N9835N28250M89926J9311l28962k45514j230
32353d83605J6860j32075r2493J82431L22380J06088j92936k12680J7560K37045
32343b31425L47722L72082K42780m1566k36107j58744j762K419J338J92012L14244
$$ y = [730004, 586746, 141412, -122792, 170908, 810347, 1229963, 1106154, 578609, -13278, -426459, -569884, -454069, -187976, 39778, 83993, -22667, -103057, -43319, 61473, 27902, -163621, -323370, -286512, -112657, 9570, 6522, -5662, 111350, 314879, 374092, 104254, -377819, -708929, -661449, -387807, -172411, -50843, 118109, 286484, 235936, -12887, -150608, -69015, -69072, -351281, -598124, -404104, 78366, 319067, 149834, -85354, -145665, -247729, -618507, -1005221, -945386, -417136, 72790, 92101, -236861, -482375, -483605, -466745, -598820, -691313, -508882, -186502, -80414, -273350, -486030, -468470, -231425, 116297, 488379, 731159, 689593, 453486, 294742, 292980, 295399, 296737, 488749, 802993]
32332H02993K2679m07165l86807L5175K16374m6288k37651l3540K16161J83030
32322C64961P8360J21447R6481j38819k54341l0940J58307k8182k53320o6978
32312D6976K73409K14094j42101k07295J01140K50839p298k80133k21067l3585
32302e021l8841j45523n4412K41674M41445L36458M0061j91334k66372l08523
32292D9612l82249l01167R6713N47358N55925P2812l52856k71569J10573K99628
32282D24780J65453m9273j51330j36180n5197J6442O067j5277Q2191J65317n3812
32271C99181m34950m07346J47309N25961J89439l71932l80384M5267K19946R6604
32261B9095K18671N70017M64705k46096p72939n62652r8203l6826j99560l2160
$$ y = [802993, 825672, 418507, 31700, 66875, 283249, 236961, -690, -34230, 181931, 364961, 443321, 564768, 661249, 522430, 268089, 237149, 395456, 367274, 113954, 46976, 320385, 534479, 392378, 185083, 286223, 537062, 529764, 249631, 28564, -5021, -43862, -189385, -243797, -2123, 439322, 775780, 815841, 624507, 358135, 49612, -332637, -633804, -537091, 10267, 566192, 639004, 286148, 14579, 125152, 424780, 590233, 540960, 389630, 253450, 198253, 214695, 220762, 205485, 287676, 452993, 399181, -35769, -443115, -295806, 230155, 419594, 47662, -332722, -287455, -67509, 29095, 247766, 817783, 1282488, 1036392, 263453, -299199, -397402, -434228, -633788, -665948]
32251f65948L87986M81961Q9952l33866l99370j97089j0916N0275O4843J35428
32241c96744K50659K38049n6098m61517n36376q9264N07968P26190M69928O1112
32231G13907k34009l96526m37857k91817M273K32796K30509R8459O4735J77121
32221A61591K34157N2810k57446l78315j58458J85467L20746J82860m846m9987
32211B88579J7006P1536O6074K3567k3768k6644N9302J78388J73958m3505l63033
32200D21460n62411n12599k62079N2566L20486M65918M11981J47750j45864j82257
32190A54951Q6423L23151K06806j03113j84698q056M918l23592n74584l31652
32180g49446J94726M78625L74559J43796k7520j50201j93442j12388n3235j73600
$$ y = [-665948, -277962, 203999, 293951, -39915, -439285, -636374, -647290, -597015, -532172, -396744, -146085, 91964, 35866, -425651, -962027, -1051291, -543323, 182867, 652795, 713907, 479898, 83372, -354485, -646302, -642029, -409233, -178724, -80265, -15530, 161591, 395748, 448558, 191112, -187203, -345661, -160194, 160552, 343412, 338566, 288579, 305585, 377121, 443195, 466762, 442994, 416350, 475652, 654040, 827998, 784493, 421460, -140951, -653550, -915629, -863063, -542577, -76659, 335322, 483072, 337208, 154951, 241374, 564525, 771331, 668218, 483520, 475464, 480382, 156790, -417794, -749446, -554720, -76095, 298464, 442260, 414740, 264539, 71097, -41291, -94526, -268126]
32170b68126l05693j54456J98196L54720J76113o2886j31035j05098j02998p5891
32160d77154J9009R3640P7767p6j05288j74405n0729K87458N00660K41698k88107
32149A24473n27335l15731m3787J6784N6407K37025L23251R2326k37215l00316
32139e74118p4712J74900K45706J00571j72067l45152k18676P2691J65592j1842
32129f37107j33164j0486J29821R2425L8738J10142J16544p4104k03031n9016
32119f29238Q9089o1625k67801j13853K55187L33823P7342m5148J72126L69125
32109A79027K14001j31435l14078k36420l0668J72078K91509K83750J90539R8483
32099G16786K0106p7034j56376j73838k00666l07951l81967k52038M0809K98074
$$ y = [-268126, -573819, -728275, -530079, -175359, 754, -62132, -193167, -298265, -401263, -477154, -458145, -364505, -286738, -286814, -392102, -566507, -617236, -329778, 170882, 412580, 124473, -402862, -718593, -762380, -745596, -689189, -452164, -128913, -36587, -273802, -574118, -648830, -473930, -228224, -127653, -299720, -644872, -863548, -790857, -625265, -637107, -770271, -780757, -650936, -558511, -519773, -409631, -293087, -367191, -570222, -629238, -540149, -601774, -869575, -983428, -728241, -394418, -317076, -362224, -190098, 179027, 393028, 261593, -52485, -288905, -319573, -147495, 144014, 427764, 618303, 716786, 736892, 659858, 503482, 329644, 128978, -178973, -560940, -812978, -772169, -474095]
32089d74095M30246M65743L78626J61816j234O2605J84823N3714k63060l61691
32079F37493j25089Q3145j0608j94040j67901j6963J6723k1856N7589J62008K7314
32068D47815k70764l09642O7845M50566L77043m7506l05118j42863J63546K32827
32058F63749K9733j98381k55490j34972M3099R6113r2671l60091l33344P1521
32048d70734L91205J79433k98765l77286L3012L09514R4133j66199R318L33013
32038C6644K37793j80076l19634j7568K72551K30949M9857l0671q0584j98974
32028B87k61136j54761P600Q2087P7935L5688n3001j15715k9434J39487J79974
32017i0989Q9614Q4862J71915P3538k38580l27038Q2007N66384N15203j3552l77570
$$ y = [-474095, -43849, 421894, 800520, 962336, 961102, 1023707, 1208530, 1262244, 999184, 637493, 512404, 595549, 584941, 390901, 223000, 206037, 222760, 200904, 258493, 420501, 447815, 177051, -132591, -64746, 385820, 762863, 715357, 410239, 267376, 430922, 663749, 693482, 495101, 239611, 104639, 147738, 243851, 151180, -208911, -542255, -470734, -79529, 99904, -198861, -576147, -543135, -233621, -139488, -305687, -296369, 36644, 274437, 94361, -225273, -242841, 29710, 260659, 310516, 279845, 199261, 287, -260849, -415610, -408010, -325923, -247988, -212300, -265301, -381016, -410450, -270963, -90989, -1375, 83487, 255402, 328940, 90360, -236678, -154671, 411713, 926916, 913364, 535794]
32006E35794k40544L6091k7815l87277n84687l32287J83054N22643M36864R5271
31996B37107j11910j3348J59094R1253j85378l34165j69392J04620J93652J11926
31986H3459J07603K37228K44638k8733l10639k26754J21675K40396n1233l61688
31976E5952l49418k16503k47054k21378J74631O02517M33723j80333l71540J31014
31966a88389N29219K03954k95725j62457L45849L41549k55911o41133m13379n2466
31956e88889K5516N1458K37430K75803l3415k60897r910L61725K83688j02728
31946B39781k03346N4957J67067r3720l76948l68480j67265N6992K98629M68349
31936G6016L65817Q0443m341J87149K39087q3578m05388l27301n6328j7806j55980
$$ y = [535794, 295250, 331341, 303526, -83751, -668438, -1000725, -817671, -295028, 141836, 237107, 125197, 111849, 270943, 362196, 176818, -157347, -326739, -222119, -28467, 83459, 191062, 428290, 672928, 644195, 333556, 106802, 228477, 468873, 417640, 55952, -293466, -509969, -757023, -978401, -803770, -201253, 232470, 52137, -319403, -188389, 340830, 544784, 249059, 86602, 432451, 774000, 518089, -123044, -536423, -588889, -563373, -511915, -274485, 1318, -32097, -292994, -302904, 58821, 342509, 239781, 36435, 91392, 258459, 164739, -212209, -580689, -747954, -690962, -392333, 76016, 441833, 522276, 517935, 705084, 944171, 860593, 455205, 127904, 71576, 53770, -102210]
31925a02210j24014N3745O3776o5988J0484K99798L89319J35891p2492N6840K67489
31914I12638J82121j64441m82771o25975n73641k91966J12313L29131K14669K7091
31904c60831L8661J30189N9144q9250p0494O8847Q9104p641k4806K6344k4986
31893a65719r5980Q1034M35446N32530J94975k30069l88519l51144l20738k37492
31883e45676L3898L53800M50081K88381O3125p6450r3019K5425K06770K50582
31873I56917N7456j74731j88986l2948K8126r1136k09266j71920k3141J24314
31863B74685K01717J57071k979j28665o6762R4150J08517o4389j94642j44255
31853B34448p2479j54077k90423k72180q4660J21814K49404K74314J66460k9438
$$ y = [-102210, -226224, -172479, -108703, -174691, -164207, 135591, 524910, 660801, 588309, 645149, 912638, 1094759, 930318, 447547, -178428, -752069, -1044035, -931722, -602591, -387922, -360831, -322170, -191981, -132837, -222087, -292581, -223734, -134630, -142271, -167077, -140733, -165719, -261699, -180665, 254781, 787311, 982286, 752217, 363698, 12554, -308184, -545676, -511778, -157978, 292103, 580484, 643609, 567159, 474140, 499565, 706335, 956917, 1014373, 839642, 650656, 617708, 645834, 554698, 345432, 173512, 150371, 274685, 476402, 633473, 630494, 501829, 435067, 529217, 637734, 573345, 378703, 234448, 161969, 7892, -282531, -554711, -639371, -517557, -268153, 6161, 172621, 143183]
31843A43183j36449o5846O973r0544j94771l3849K74350L11784j6390l08952k38858
31832c49369L4833J95294J99060J60506Q3877l3992p3467k0657p9784k85600k97358
31821d66657N8684L44442R7720l77980m08315J2901K59295J18257M9692K64466
31811d7495L22853j6169k66875l5203K47956L1280l97701l59337J34587M66809
31801H0705L95252K30690J16609j42472m72626m36035M6304M37204L18114o0540
31791E13205k34470j51773m8703m057O2943J39810J40221O7084l0354j57589k94096
31780B221l26245j87879K8329J90771K60533K42214J27841l5398j27623p4602
31770A00162Q1318K32383K52036N1448k74695m37941k81314l4971q184j09074
$$ y = [143183, 6734, -59112, -52139, -142683, -337454, -371303, -96953, 214831, 198441, -110511, -349369, -314536, -119242, 79818, 240324, 324201, 290209, 216742, 196085, 116301, -169299, -466657, -407973, -63531, 34189, -343791, -752106, -739205, -479910, -361653, -311961, -47495, 275358, 259189, -7686, -42889, 205067, 236347, -161354, -520691, -386104, 80705, 475957, 706647, 823256, 680784, 208158, -227877, -181573, 255631, 573745, 513205, 278735, 126962, 78259, 74202, 137145, 276955, 417176, 484260, 453906, 296317, 2221, -324024, -511903, -483574, -292803, -32270, 209944, 337785, 302387, 174764, 100162, 181480, 413863, 665899, 717347, 442652, 4711, -276603, -311574, -319758, -428832]
31760d28832M998L24949M28713J14567k71373l25277j13270O977j21869l50841
31750g31258m57226l12286O0946M62468O45024N47979L09389N2455j69615k48034
31740A59842j04090Q2355L4460j74270j70865J16794K85155O8335k38518k40299
31730a81101j1872J16274Q7269P2616P9986j6519j47104j01534R8884J78440o574
31719A68765k73846l56828j97589L9753J66990J62895J70932K66526K88142O0968
31709D96708k57567l21020j08481K2121j01249j94882j6016K04034J25514j52960
31699c03798k55389p6042J58993K76583L04217K81094J72718k4943k44549l85139
31689i6255l33805p1525J99492K34426J02663R6997K29869J97151l2014o5411
$$ y = [-428832, -423834, -98885, 329828, 444395, 173022, -152255, -265525, -258548, -380417, -731258, -1188484, -1500770, -1439824, -977356, -332332, 215647, 525036, 577491, 407876, 159842, 55752, 138107, 172567, -1703, -172568, -55774, 229381, 297716, 59198, -181101, -192973, -76699, 10570, 83186, 163172, 146653, -451, -101985, -3101, 175339, 168765, -105081, -461909, -659498, -619745, -452755, -289860, -118928, 147598, 435740, 496708, 239141, -81879, -190360, -168239, -269488, -464370, -480386, -276352, -150838, -303798, -559187, -635229, -476236, -199653, 104564, 385658, 558376, 533433, 288884, -96255, -430060, -501585, -302093, -67667, 34996, 131993, 361862, 559013, 526999, 461588]
31679D61588K16454L27458n4860m73472l82308k5618K0970j63272q0048J96287
31669D3179J20957k79516l48188Q7955L82300J33761j76528m0194K41900J29006
31659B94632k43134l30157o6890J09533k002j26074j3410K17351L17359K22246
31649C79454N1442m8194j9246N2679J6565j44905k59250j92058m9551l5181j51693
31638c99938j72291O7926M15740M99415J37198l70598m92374q7455L71056L55840
31628C24519o8773l92388l44344j24541K8346J47395L04636L59183J44877k38301
31618A40609m95423m43571j58369J37190K75800K60126J83392O0766j47973l31196
31608e18649k56055O8926K99842K32526J19939K24965L21809O1954l67305m65236
$$ y = [461588, 678042, 1005500, 950640, 477168, 94860, 69242, 90212, -73060, -153108, 43179, 164136, -115380, -463568, -375613, 6687, 140448, -36080, -76274, 165626, 294632, 51498, -278659, -345549, -236016, -238018, -364092, -377502, -160151, 157208, 379454, 430896, 382702, 363456, 416135, 432700, 287795, 28545, -163513, -213064, -248245, -399938, -572229, -504303, -88563, 410852, 548050, 177452, -314922, -402377, -31321, 324519, 255746, -136642, -480986, -605527, -577181, -429786, -125150, 234033, 378910, 140609, -354814, -798385, -956754, -819564, -543764, -283638, -100246, -39480, -187453, -518649, -774704, -705778, -405936, -173410, -53471, 171494, 493303, 555257, 187952, -277284]
31598b77284j96043L439l3543l8330O2587j7067k72098k17125L13291P22226M61493
31587E11546j32776l24771j5237K34602P5315k32892l02659j05140J29756K44599
31577H2343K53824K25041J68687O2588l9155j9247J03848J16957q5406k82422
31567E87058k51782j49891k20621k85742j4908L82812L46264j13475l44835r7613
31557a62733O6882k38967n10697j64199M70777O18370J58218l71539o04995n63432
31547a302315k53855K90539O66624M41836j37990l46129M0492M62065M07207N7736
31537C26210j05437K6264J74899J17610q9551k42798k09691m2136R2085R9008
31527A46463L3732k9721q8899j27924r3604j9213M445L3345K06729M15160L51027
$$ y = [-277284, -473327, -469888, -503431, -541761, -479174, -496241, -768339, -985464, -672173, 50053, 511546, 378770, 53999, 38762, 273364, 348679, 115787, -186872, -292012, -162256, 82343, 336167, 561208, 729895, 792483, 753328, 734081, 837929, 954886, 869480, 587058, 335276, 185385, -35236, -320978, -335886, 46926, 393190, 279715, -65120, -162733, -95851, -334818, -845515, -1009714, -538937, 79433, 237651, -133888, -738883, -1302315, -1556170, -1265631, -599007, -157171, -295161, -641290, -600798, -138733, 268474, 326210, 220773, 247037, 421936, 539546, 449995, 207197, -2494, -44630, 47455, 146463, 180195, 150474, 61575, -66349, -159953, -179166, -174721, -141376, 65353, 480513, 831540]
31516H31540J5857j88971p0256N4471p8522k35211j53435l7456j44728k62628
31506b69339j04875J11406M6560j03588N4089L61799L63792J21015O8444J73709
31496H23012j4357m82332o61687l32813N2770J19451L3063L6733P9504J06990
31486b39666K17059L38955K28915n8777j69167m6255l3268k36019l19036j12668
31476d29927J08211J48108J64509K16838R3184j84376k46689k4378P3176j00650
31466a81994j40406J24640K37779l9855j85694J84025N14089J61193m72023n12773
31456c11019J0726K69402m3581l53632k06930J17539J72278m6822k51424k35272
31446h78735K2144L32305L68248M3954k48308j00243L26801N43211M21515K18580
$$ y = [831540, 847397, 658426, 588170, 642641, 564119, 328908, 175473, 138017, -6711, -269339, -374214, -262808, -216248, -319836, -265747, 96052, 459844, 580859, 649303, 823012, 808655, 326323, -335364, -668177, -615407, -495956, -462893, -426160, -346656, -239666, -22607, 316348, 545263, 486486, 317319, 271064, 237796, 1777, -317259, -429927, -321716, -173608, -9099, 207739, 300923, 116547, -130142, -154520, -81344, -181994, -322400, -197760, 40019, 164, -185530, -1505, 512584, 673777, 201754, -311019, -300293, -30891, -74472, -428104, -635034, -517495, -345217, -392039, -643463, -878735, -856591, -524286, -156038, -112084, -360392, -460635, -133834, 409377, 830892, 1049472]
31436A049472L4597k48277n36535n48317k95412q6281k3726N4179J24555l3187
31426e08932l39746m02975j15785J95350L28058M28019N25547L73779l2224k77666
31416A73425j49535K6915k0902n4131J62977L37669J28672k04229j90641N1115
31406B61335K400l74766n42533k21428J99986K51345j7962k25804j68730M8158
31396g87999K12448J86249L265j39094q7382O4726J23616J05119J71474K80834
31386A33256K04598m7961j61867k5190L5451k13371m49934k41187K56119M80154
31376b9932K71173L8982R1565K39449K06866L5245j39909l58092n95403n65382
31366h05438j18765L77531M52453J79757J6790R0981Q9671j41223l45296l17296
$$ y = [1049472, 1084069, 835792, 299257, -249060, -544472, -630753, -654479, -600300, -475745, -508932, -848678, -1251653, -1367438, -1172088, -844030, -416011, 109536, 483315, 451091, 173425, 23890, 50805, 29903, -24228, 138749, 476418, 605090, 400861, 210220, 261335, 263735, -111031, -653564, -874992, -675006, -423661, -441623, -667427, -836157, -787999, -575551, -389302, -386037, -525131, -612513, -547787, -424171, -319052, -147578, 133256, 337854, 289893, 128026, 102836, 138287, -75084, -525018, -766205, -510086, -29932, 241241, 280223, 371788, 611237, 818103, 853348, 713439, 355347, -240056, -805438, -924203, -546672, -94219, 85538, 102328, 193309, 282980, 141757, -203539, -520835]
31356e20835k12276k00675j54494O8622K82707K04497j08993l04333j65015J59120
31346i51675L30310J61344j70945k56860P2925M46721L61834j10168l59812p7041
31336e53367L11349K61791j43822l83359k06683J55628L68721L02038M2698j84459
31326b9465j84525k3332L6874o5861r1372O5606J47982j4896j61494l4812J49400
31315b05895Q4026o6022K5829K12151J14637j59801j69656O8636R8770j43665
31305a40990j98036R3050K94682J51482M510J12951J71170p4203k85553j31673
31295b610O9023q1279k56620Q4670O41925N63595k07900p07367l08929L80115
31285A74623M21659j67249n83041m01377J9960K43351K93613L34366K45693j29248
$$ y = [-520835, -733111, -933786, -1088280, -1019658, -736951, -532454, -641447, -945780, -1110795, -951675, -621365, -460021, -630966, -887826, -814901, -368180, -6346, -116514, -476326, -553367, -242018, 19773, -124049, -507408, -714091, -558463, -189742, 112296, 154994, -29465, -213990, -237322, -200448, -266309, -357681, -292075, -144093, -158989, -320483, -355295, -205895, -121869, -187891, -162062, 50089, 164726, 4925, -164731, -96095, 2675, -140990, -339026, -245976, 48706, 200188, 204698, 317649, 488819, 414616, 129063, -2610, 66413, -14866, -271486, -186816, 455109, 1018704, 810804, 103437, -205492, 174623, 596282, 429033, -154008, -555385, -535425, -292074, 1539, 335905, 581598, 452350]
31275D52350n44508n54636j33642K44449K24719j3230j10098m0204k0862q6194
31265e81856o7818N7955J10185J7340o7274k7714N4564P9526P9932J12151J51182
31254h1827J60821J32230K3769j79473l33671k58917k0706J23876R4827O2521
31244b76550J02721O5195r7611j58547M1826L13210L72450J90660q2784l25823
31234A44747l89335q8898M78746Q10634N09289j83802o48956o09530l31834j64097
31224d73036j51666j32170m224J62658K03684N3144j17904q0341J05753J43530
31214b90572j3798l4842K32102M11557J51309k70493l34653o9641O1866n3758
31204b10923q0001Q7690J26309r0841k18982l4729J67973R0410o3604K7711K25933
$$ y = [452350, -92158, -646794, -780436, -535987, -311268, -324498, -434596, -474800, -495662, -581856, -649674, -591719, -481534, -464194, -531468, -559182, -504618, -425092, -345160, -233009, -81827, 78994, 211224, 234993, 55520, -278151, -537068, -557774, -433898, -339071, -276550, -173829, -108634, -206245, -364792, -322966, -9756, 362694, 553354, 470570, 144747, -244588, -333486, 145260, 955894, 1465183, 1281381, 632425, 22895, -308939, -473036, -624702, -756872, -761096, -598438, -394754, -341610, -459514, -539855, -434102, -290572, -304370, -339212, -107110, 304447, 455756, 185263, -149390, -219031, -157165, -210923, -290924, -203234, -76925, -167766, -386748, -421477, -253504, -163094, -226698, -198987, 26946]
31193B6946J69182j09174k34338q4536O3557j698j46699j54439k1782J10983J67001
31182b14997J69529J62241J60630J41189O2635o8017j68559j64428p2181L6612
31172D4654J10533J19869M7269o8536j40059j35522j12610j04377o0688L7239
31162b62228J09630J12289J31028K25506K74241J24242j59238l39509k85337q4767
31152a54143R2997J39874M1693j17120j97834j51073q3749r0819q5692O6679L01916
31141b37271M07669L03451J09485m8346j35125j27728l8953k0347k07821m30414
31131d25400l40243P2092L72904K63446r426o1256O1479N4865p9376n4361J73257
31120B7981L07264J93464K6941k2455m1949q8103j5751J86382K14242r3274l80653
$$ y = [26946, 196128, 86954, -147384, -231920, -168363, -170061, -316760, -471199, -492981, -381998, -214997, -45468, 116773, 277403, 418592, 481227, 413210, 244651, 80223, 8042, 44654, 155187, 275056, 322325, 253789, 113730, -21792, -134402, -238779, -299467, -262228, -152598, -40309, 90719, 316225, 590466, 714708, 555470, 215961, -69376, -154143, -61146, 78728, 120421, 3301, -194533, -345606, -429355, -520174, -605866, -539187, -237271, 170398, 473849, 583334, 534988, 399863, 272135, 233182, 212835, 5014, -425400, -765643, -693551, -320647, -57201, -66627, -127883, -66404, -11539, -90915, -145276, 27981, 335245, 528709, 555650, 533195, 491246, 403143, 387392, 573774, 788016, 694742, 314089]
31109C14089k35837J56814K48880o0863k93261j19501J89756K20426k551j37004
31099B80948k8743J56562K13393J01947r6160k77099l63045l34112k20781n1224
31089f18314J46412K84268K53876P3783q4922q7025N372J6874j22134k75244k26548
31078f33602O1426L21840K35958j26595l00489k8245L21770K41083j60571l05799
31068c73224k6136K12323Q1563j22396m9920J02051j5370k46506j79375J38606
31058d78384K58936N6421r4155O6652L00169K50258q1098l89696m17287j49455
31048f77639J95922L37969K05645J8873j6835J2536n7547j33003l5927R5214l7319
31037i2111l52362m12596o0734L35571M01867J95223j9340j25286j15023L1509
$$ y = [314089, 78252, 235066, 483946, 423083, 129822, 10321, 200077, 420503, 417952, 280948, 252205, 408767, 622160, 724107, 627947, 350848, -12197, -346309, -567090, -618314, -471902, -187634, 66242, 140025, 55103, -31922, -26550, -9676, -131810, -407054, -633602, -572176, -250336, -14378, -140973, -441462, -469707, -147937, 93146, -67425, -373224, -399360, -187037, -105474, -227870, -277790, -175739, -191109, -437615, -616990, -478384, -219448, -163027, -257182, -190530, 109639, 359897, 278799, -110897, -528184, -677639, -481717, -143748, 61897, 80770, 63935, 76471, 18924, -114079, -150006, -54792, -92111, -444473, -857069, -917803, -582232, -180365, 14858, -4482, -129768, -244791, -213282]
31027b13282K29351K65013O9925j59247k39950k05031j22827L5377K13389K18425
31017I1143K4650j18950o7392j4476j40364k77571j82657P0655K29397K12488
31007a73077Q9379r6528k41449j35485K13663M19756J98708j79069k62267o8385
30997b34754L3042m9718n8460J08413K49722K41310J75866Q6814r8641k77865
30987A75729k13796N0683J68749K779j62195o6508J59005K51583J86149R5501
30977F47679K1581o8570j57885k06781j97185r1256J07689K34448J12359j42148
30967B59931k13627m4388P7949k0765j52437j12268K8214J51764L15629N05674
30957G95676M58678M2520m01462m41145j50629L381j93814m72985m82862j80994
$$ y = [-213282, 16069, 281082, 351007, 191760, -48190, -253221, -376048, -340671, -127282, 91143, 115793, -3157, -70549, -85025, -225389, -502960, -685617, -614962, -385565, -173077, -83698, -180226, -421675, -557160, -343497, 76259, 274967, 95898, -166369, -234754, -201712, -251430, -309890, -201477, 48245, 289555, 465421, 552235, 453594, 175729, -38067, 12616, 181365, 184144, 21949, -44559, 114446, 366029, 552178, 647679, 669260, 600690, 442805, 236024, 38839, -52417, 55272, 289720, 402079, 259931, 46304, 1916, 79865, 59100, -93337, -205605, -177391, -25627, 290002, 795676, 1254354, 1296874, 895412, 454267, 303638, 307019, 113205, -359780, -842642, -1023636]
30947a023636J92617L57936K08826r2143k59915j98995o6896L5352K24329N31431
30937i1094O81204M41009J5079k09517j73670r4407l6511R5220K13868J08956
30927I50137j40992k01042P976J85898J35890K0291n128p1454k97195m86185l84557
30916b86361o0103K09846L01127K85048K08889M5505j64689k78257j86906M8878
30906A22977K02176O2200k95460m89395k56525J57332K72088J4960k23567k07758
30896f40972j45785k09852j71639J75463N47820N25118J81120m6977j1087L8434
$$ y = [-1023636, -831019, -473083, -264257, -356400, -616315, -815310, -882206, -846854, -622525, -91094, 590110, 1031119, 1046198, 836681, 663011, 568604, 532093, 627313, 841181, 950137, 809145, 608103, 616079, 801977, 937867, 958158, 953030, 881576, 584381, 98196, -286361, -346464, -136618, 164509, 449557, 658446, 703951, 539262, 261005, 74099, 122977, 325153, 387353, 91893, -397502, -654027, -496695, -224607, -209647, -433214, -640972, -786757, -996609, -1168248, -992785, -444965, 80153, 261273, 214296, 203209, 241643]
$$ [...]
##END NTUPLES=NMR SPECTRUM
##END=
