##TITLE=31Pdec_LY-TMF-2.24.R.t
 D2O, 24 sc
 27.2.2020
##JCAMPDX= 6.0         $$ Bruker NMR JCAMP-DX V2.0
##DATA TYPE= NMR SPECTRUM
##DATA CLASS= NTUPLES
##ORIGIN= UXNMR, Bruker Analytische Messtechnik GmbH
##OWNER= root
$$ XWIN-NMR		Version 3.5
$$ Thu Feb 27 15:23:13 2020 Russian Standard Time (UT+4h)  she@DPX200
##.OBSERVE FREQUENCY= 81.013821
##.OBSERVE NUCLEUS= ^31P
##.ACQUISITION MODE= SIMULTANEOUS
##.ACQUISITION SCHEME= undefined
##.AVERAGES= 24
##.DIGITISER RES= 17
##SPECTROMETER/DATA SYSTEM= spect
##.PULSE SEQUENCE= zgpg30
##.SOLVENT NAME= CDCl3
##.SHIFT REFERENCE= (INTERNAL, CDCl3, 0, 182.463)
##AUDIT TRAIL= $$ (NUMBER, WHEN, WHO, WHERE, WHAT)
$$ ##TITLE= Audit trail, XWIN-NMR		Version 3.5
$$ ##JCAMPDX= 5.01
$$ ##ORIGIN= Bruker BioSpin GmbH
$$ ##OWNER= she
$$ F:/spectra/data/she/nmr/P31/1/pdata/1/auditp.txt
$$ ##AUDIT TRAIL=  $$ (NUMBER, WHEN, WHO, WHERE, WHAT)
(   1,<2020-02-27 15:21:52.67 +0400>,<she>,<DPX200>,
      <created by zg, POWCHK disabled, PULCHK disabled
       configuration hash MD5:
       00 E9 B6 7A A2 85 ED C7 34 08 36 98 17 FE 4E 26
       data hash MD5: 32K
       AB AE 7B 9B ED 0E 17 8B 4D 5C 58 8C 3D AE 25 64>)
(   2,<2020-02-27 15:22:12.35 +0400>,<she>,<DPX200>,
      <Start of raw data processing
       efp BC_mod = 2 LB = 1 FT_mod = 6 PKNL = 1 PHC0 = -1640.747 PHC1 = 726.6014 SI = 64K 
       data hash MD5: 64K
       9D 23 04 1C 5D A4 EE 35 37 E5 AE 7B 87 18 2E CA>)
(   3,<2020-02-27 15:22:34.12 +0400>,<she>,<DPX200>,
      <pk PHC0 = -21.9711 PHC1 = 44 
       data hash MD5: 64K
       82 5C 30 1E 88 55 EC 8B 31 34 72 C2 99 5A BA BE>)
(   4,<2020-02-27 15:22:37.43 +0400>,<she>,<DPX200>,
      <abs ABSG = 5 
       data hash MD5: 64K
       5B EA 5F 98 D4 81 FD DE C2 6D D0 16 FF 57 B9 0D>)
$$ ##END=
$$ 
$$ hash MD5
$$ 09 5F AA 36 6B 21 24 EE 86 31 06 77 66 4C 89 59
##$RELAX= 
##$RELAX= 
##$RELAX= 
##$RELAX= 
##$RELAX= 
##$RELAX= 
##$RELAX= 
##$RELAX= 
$$ Bruker specific parameters
$$ --------------------------
##$DU= <F:/spectra>
##$EXPNO= 1
##$NAME= <P31>
##$PROCNO= 1
##$TYPE= <nmr>
##$USER= <she>
##$AMP= (0..31)
100 100 100 100 100 100 100 100 100 100 100 100 100 100 100 100 100 100 
100 100 100 100 100 100 100 100 100 100 100 100 100 100 
##$AQSEQ= 0
##$AQ_mod= 1
##$AUNM= <au_zg>
##$AUTOPOS= <>
##$BF1= 81.014009
##$BF2= 200.13
##$BF3= 200.13
##$BF4= 200.13
##$BF5= 200.13
##$BF6= 200.13
##$BF7= 200.13
##$BF8= 200.13
##$BYTORDA= 1
##$CFDGTYP= 0
##$CFRGTYP= 5
##$CHEMSTR= <none>
##$CNST= (0..31)
1 1 145 1 1 1 1 1 1 1 1 1 1 1 1 1 1 1 1 1 1 1 1 1 1 1 1 1 1 1 1 1 
##$CPDPRG= <waltz16>
##$CPDPRG1= <>
##$CPDPRG2= <waltz16>
##$CPDPRG3= <>
##$CPDPRG4= <mlev>
##$CPDPRG5= <mlev>
##$CPDPRG6= <mlev>
##$CPDPRG7= <mlev>
##$CPDPRG8= <mlev>
##$CPDPRGB= <>
##$CPDPRGT= <>
##$D= (0..31)
0 1 0 0 0 0 0 0 0 0 0 0.03 2e-05 3e-06 0 0 0 0 0 0 0 0 0 0 0 0 0 0 0 0 
0 0 
##$DATE= 1582802512
##$DBL= (0..7)
120 120 120 11 120 120 24 19 
##$DBP= (0..7)
150 150 150 150 150 150 150 150 
##$DBP07= 0
##$DBPNAM0= <>
##$DBPNAM1= <>
##$DBPNAM2= <>
$$ [...]
##$SUBNAM3= <"">
##$SUBNAM4= <"">
##$SUBNAM5= <"">
##$SUBNAM6= <"">
##$SUBNAM7= <"">
##$SUBNAM8= <"">
##$SUBNAM9= <"">
##$SW= 369.568048894756
##$SWIBOX= (0..15)
0 1 3 0 0 0 0 0 0 0 0 0 0 0 0 0 
##$SW_h= 29940.119760479
##$TD= 32768
##$TD0= 1
##$TE= 0
##$TE2= 300
##$TE3= 300
##$TEG= 300
##$TL= (0..7)
0 120 53 12 22 120 120 120 
##$TP= (0..7)
150 150 150 150 150 150 150 150 
##$TP07= 0
##$TPNAME0= <>
##$TPNAME1= <>
##$TPNAME2= <>
##$TPNAME3= <>
##$TPNAME4= <>
##$TPNAME5= <>
##$TPNAME6= <>
##$TPNAME7= <>
##$TPOAL= (0..7)
0.5 0.5 0.5 0.5 0.5 0.5 0.5 0.5 
##$TPOFFS= (0..7)
0 0 0 0 0 0 0 0 
##$TUNHIN= 0
##$TUNHOUT= 0
##$TUNXOUT= 0
##$USERA1= <user>
##$USERA2= <user>
##$USERA3= <user>
##$USERA4= <user>
##$USERA5= <user>
##$V9= 5
##$VALIST= <valist>
##$VCLIST= <CCCCCCCCCCCCCCC>
##$VD= 0
##$VDLIST= <DDDDDDDDDDDDDDD>
##$VPLIST= <PPPPPPPPPPPPPPP>
##$VTLIST= <TTTTTTTTTTTTTTT>
##$WBST= 1024
##$WBSW= 4
##$XGAIN= (0..3)
0 0 0 0 
##$XL= 0
##$YL= 0
##$YMAX_a= 7677
##$YMIN_a= -7505
##$ZGOPTNS= <>
##$ZL1= 120
##$ZL2= 120
##$ZL3= 120
##$ZL4= 120
##$ABSF1= 182.463
##$ABSF2= -187.1042
##$ABSG= 5
##$ABSL= 3
##$ALPHA= 0
##$AQORDER= 0
##$ASSFAC= 0
##$ASSFACI= 0
##$ASSFACX= 0
##$ASSWID= 0
##$AUNMP= <proc_1d>
##$AZFE= 0.1
##$AZFW= 0.5
##$BCFW= 0
##$BC_mod= 2
##$BYTORDP= 0
##$COROFFS= 0
##$CY= -3
##$DATMOD= 1
##$DC= 0
##$DFILT= <>
##$DTYPP= 0
##$F1P= 0
##$F2P= 0
##$FCOR= 1
##$FTSIZE= 65536
##$FT_mod= 6
##$GAMMA= 0
##$GB= 0
##$INTBC= 1
##$INTSCL= 5.30512e-09
##$ISEN= 30
##$LB= 1
##$LEV0= 0
##$LPBIN= 0
##$MAXI= 10000
##$MC2= 0
##$MEAN= 0
##$ME_mod= 0
##$MI= 50
##$NCOEF= 0
##$NC_proc= -5
##$NLEV= 6
##$NOISF1= 182.463
##$NOISF2= 159.3651
##$NSP= 0
##$NTH_PI= 0
##$NZP= 0
##$OFFSET= 182.463
##$PC= 4
##$PHC0= -1662.718
##$PHC1= 770.6014
##$PH_mod= 1
##$PKNL= yes
##$PPARMOD= 0
##$PSCAL= 0
##$PSIGN= 0
##$REVERSE= no
##$SF= 81.0140089999434
##$SI= 65536
##$SIGF1= 159.3651
##$SIGF2= -187.1042
##$SINO= 113.3802
##$SIOLD= 16384
##$SREGLST= <1H.CDCl3>
##$SSB= 0
##$STSI= 65536
##$STSR= 0
##$SW_p= 29940.119760479
##$SYMM= 0
##$S_DEV= 0
##$TDeff= 32768
##$TDoff= 0
##$TI= <>
##$TILT= no
##$TM1= 0
##$TM2= 0
##$TOPLEV= 0
##$USERP1= <user>
##$USERP2= <user>
##$USERP3= <user>
##$USERP4= <user>
##$USERP5= <user>
##$WDW= 1
##$XDIM= 65536
##$YMAX_p= 415485796
##$YMIN_p= -3908208
$$ End of Bruker specific parameters
$$ ---------------------------------
##NTUPLES= NMR SPECTRUM
##VAR_NAME=  FREQUENCY,     SPECTRUM/REAL,   SPECTRUM/IMAG
##SYMBOL=    X,             R,               I
##VAR_TYPE=  INDEPENDENT,   DEPENDENT,       DEPENDENT
##VAR_FORM=  AFFN,          ASDF,            ASDF
##VAR_DIM=   65536,         65536,           65536
##UNITS=     HZ,            ARBITRARY UNITS, ARBITRARY UNITS
##FACTOR=    0.456856943014862, 1,           1
##FIRST=     14782.0589164792, 0,            0
##LAST=      -15158.0608439998, 0,           0
##MIN=       -15158.0608439998, -3908208,    0
##MAX=       14782.0589164792, 415485796,    0
$$ Real data points
##PAGE= N=1
##DATA TABLE= (X++(R..R)), XYDATA
$$ [...]
##PAGE= N=2
##DATA TABLE= (X++(I..I)), XYDATA
36759A083919l44203n40770l75361J73921P51789P35713M050o31889l60841M13024
36749I09352N46403j52755o26717k33436K54885m5210o39293m16614N65068J105698
36739A267381N81374l01332o10972k79026J79471M07544L34186L5408k00171m4297
36729A369566L35795K89494m27932j133672j029726k80468K39795J54298l0798
36720e13648J78662N25678M62045J809k87874n6101L81634M08157k14408j036498
36710a50544j262787n24856O15807J136536O75990n3048k10455J19657K57120
36701F03420L5312q2237P3981J10716j14315j85062L7379M4482l58906m96119
36691c31349P2398N99643K51351m24563k81196N28158P36487r281o42438m38084
$$ plain form
36759 1083919 739716 198946 -176415 -2494 749295 1485008 1489058 857169 496328 909352
36749 909352 1455755 1303000 676283 442847 697732 652522 13229 -403385 161683 1267381
36739 1267381 1848755 1547423 936451 657425 836896 1244440 1578626 1614034 1413863 1369566
36729 1369566 1705361 1994855 1566923 433251 -596475 -876943 -637148 -482850 -513648
36720 -513648 -334986 190692 652737 654546 366672 310571 692205 1100362 885954 -150544
36710 -150544 -1413331 -1938187 -1322380 -185844 490146 437098 226643 346300 603420
36701 603420 638732 556495 630476 741192 626877 441815 479194 523676 164770 -331349
36691 -331349 -258951 340692 592043 167480 -113716 414442 1150929 1141648 499210 61126
36681F1126j9544j09956l79432k17571K06940L77279K66115J12203p4552k47068
36671b4460j27299K31316K82242j46468m67203k76759M2155J55167L62240P34728
36661G65659O09788k28046p84417k85987M68996L34295l78538n91409k75401j65379
36651e30439k15641J32756N39222K12697m71623m22008K53988M59358J54574L61339
36641D74223J017731Q22631l53520r21594j89752M19725j78389q90238m17598
36632b16781N19840N58389J7455Q9951O19543M80840l70957r06837p80153n70087
36622e58797m42574K0109O63524P14421M6801n28989m14314J35574N84136O50418
36612H70309L10808j36835j79879J73499J29989p23427j457710r31091M79547
$$ plain form
36681 61126 41582 -68374 -447806 -665377 -458437 -81158 184957 297160 222608 -24460
36671 -24460 -151759 79557 361799 215331 -251872 -528631 -486476 -331309 30931 765659
36661 765659 1375447 1147401 362984 76997 545993 880288 501750 -89659 -365060 -530439
36651 -530439 -746080 -613324 -74102 138595 -333028 -755036 -501048 -41690 112884 474223
36641 474223 1491954 2314585 1961065 1039471 849719 1269444 1091055 200817 -216781
36632 -216781 303059 861448 878903 968854 1588397 2069237 1698280 791443 11290 -558797
36622 -558797 -1001371 -981262 -317738 396683 443484 -85505 -499819 -364245 219891 870309
36612 870309 1181117 1044282 864403 1037902 1167891 444464 -1013246 -1944337 -1464790
36603a464790J304746R29752J11077l11587k35884Q4519L14352J9230p58561j105944
36593a113090l62395O44012O08730k45753m99221K26049Q16342O01168K38511
36584I14353K68937K14222k59973n45815k04144J87578M2693l03556l54653k61431
36574c01789k22347L3569N13799O24806K38872J33333O21696P83535k5296r22711
36564A477467q64722l12760k67987m88191j43182M06824J49094o10626n31758
36555a185841N18060J147619O28002j25673k29364r4906l20638n06935q3716N37995
36545B84603N76864R4671k16103q6790J61238K17823k89m54028q19360n44039
36535g85410M08655J164747Q62137k27595j051012j082525o91830l00359J36463
$$ plain form
36603 -1464790 -160044 769708 880785 569198 333314 417833 732185 751415 -7146 -1113090
36593 -1113090 -1475485 -831473 -222743 -468496 -967717 -741668 74674 675842 914353
36584 914353 1183290 1397512 1137539 591724 387580 575158 617851 314295 -40358 -301789
36574 -301789 -524136 -490567 23232 648038 886910 1020243 1641939 2425474 2400178 1477467
36564 1477467 612745 299985 31998 -456193 -599375 -192551 -43457 -654083 -1185841
36555 -1185841 -667781 479838 1107840 982167 752803 657897 337259 -169676 -253392 284603
36545 284603 861467 956138 740035 653245 814483 1032306 1032017 577989 -241371 -785410
36535 -785410 -376755 787992 1650129 1422534 371522 -711003 -1402833 -1703192 -1566729
36526a566729O56863R12438O26139P5918k42657k36795j79437j81583m7910L20179
36516A36426O60177O31275K30400k04811l57024k02858M1954J68481J63090J87946
36506A455056L62129N61170N16795J58723k62709n00250o17163p72879q19216
36497H1656m38543K86176P80652O33432R4063k92455l49514l14382l62218l90840
36487b71973k70850n9925J01104J54678J24399M1705o4074j32284n7921K46283
36477a88858O98996R80095P68817J31803m52779n68674k70661O9088K09584J97770
36467A575181J50616M8296k13774o15877q97992p39683j54352L82877M07094L4607
36457b3007j93056m4054J51739Q0669q9336l9605K18727M68489O11172N67438
$$ plain form
36526 -1566729 -909866 2572 628711 704629 461972 225177 45740 -135843 -183753 136426
36516 136426 796603 1427878 1658278 1453467 1096443 893585 935539 1104020 1267110 1455056
36506 1455056 1817185 2378355 2895150 3053873 2791164 2290914 1673751 900872 81656
36497 81656 -356887 -70711 709941 1343373 1437436 1144981 795467 481085 118867 -271973
36487 -271973 -542823 -602748 -501644 -346966 -222567 -180862 -244936 -377220 -435141 -188858
36477 -188858 510138 1490233 2259050 2390853 1938074 1369400 1098739 1167827 1377411 1575181
36467 1575181 1725797 1774093 1560319 944442 46450 -693233 -847585 -464708 -57614 -23007
36457 -23007 -216063 -260117 -108378 -27709 -117045 -156650 62077 530566 1141738 1709176
36447A709176J51415n48543r13784m44628M33554P43376J59016o33757q45191
36438a89366l91391L05338Q38003R21108M26336l53250p92269o10843k05364j8689
36428g0387R0578M38383P75416N51184j69321o65897n42938k04489j32234j81486
36418a11191M5273M79785O56772L04238m49946j238998j526752q56358M85535
36409b211642J343635Q83856k38954o27228j231N44042K68227k11851r5506L53397
36399F745M59914K94146K92824L00123l7613l50811q1629L50507O1120p52120
36389E43206r83157l89068O1827j36681k74807J55382M86211O9219n48577n13346
36379a529791M0106M29274N02952M67220K60025q0602n0826M51605N55374k83836
$$ plain form
36447 1709176 1860591 1312048 398264 -46364 387190 1130566 1289582 655825 -189366
36438 -189366 -580757 -275419 562584 1483692 1910028 1556778 764509 153666 -51698 -70387
36428 -70387 20191 458574 1233990 1785174 1615853 949956 407018 202529 70295 -111191
36418 -111191 -65918 413867 1070639 1374877 924931 -314067 -1840819 -2697177 -2211642
36409 -2211642 -868007 15849 -223105 -850333 -851564 -307522 -39295 -251146 -346652 6745
36399 6745 466659 760805 1053629 1353752 1316139 965328 883699 1234206 1295326 543206
36389 543206 -439951 -829019 -767192 -903873 -1178680 -1023298 -537087 -467868 -1016445 -1529791
36379 -1529791 -1489685 -1060411 -557459 -90239 169786 89184 38358 489963 1045337 761501
36369G61501j056848n01655Q54528J347206O24533l3991J19033L12475j94908
36360B231874r11221j075437p79674m68431j56749K22742M05416L06587L10692
36351H5799N47623N47258J16913j67682N2724J87802l09460q99987p89135k33636
36341h61781l3563j53151N8405N20098M71083j20837l54597J44536O06171L97644
36331F74008l170N9704K84908N745n99360p46009k44953L17285M95703L73360
36321F17221P1792l85394o35798j73190P43963J091476M27385l90823m18014J6842
36311I65460m9403o10483p17142l8632N97535M64677j01904l85930k44720N1529
36301f9013L38643M50915J35718m28306n36729Q0888O94105N48549o9247l94635
$$ plain form
36369 761501 -295347 -797002 57526 1404732 2029265 1995274 2114307 2426782 2231874
36360 2231874 1320653 245216 -534458 -1002889 -1159638 -936896 -531480 -224893 85799
36351 85799 633422 1180680 1297593 1129911 1182635 1370437 1060977 160990 -628145 -861781
36341 -861781 -895344 -1048495 -990090 -469992 1091 -119746 -474343 -329807 276364 674008
36331 674008 670838 730542 1015450 1021195 421835 -324174 -569127 -251842 243861 617221
36321 617221 689013 303619 -332179 -505369 238594 1330070 1757455 1366632 948618 965460
36311 965460 916057 305574 -411568 -450200 147335 612012 510108 124178 -120542 -69013
36301 -69013 269630 720545 856263 427957 -108772 -27884 666221 1214770 1145523 750888
36291G50888l25655k26158m5992M13058O79233J42705p25768q22000j19513K40030
36281c9172j88357m10652L24388J187128R71504j21868q58029o83119j72368L3127
36271D2582n6246j28094l0611K25700N41294O96946M81346o8064o22079p59025
36261C23749k87368M49739P03941J10815p05656p83191q2743M69627L04199r5803
36251D07309q9306K11759L80692M24492N02024L59640k70832r80187j041306l67923
36241d63638L86882O28416L30626j49706m13074k62503R9812K23977l8851l36040
36231E901l39808j69490o0603J8879J21989Q3478j10704j08609K39184M90663
36221A70880K60370j25715j38973J50652L27257L14727K17599j30923p55443j028583
$$ plain form
36291 750888 425233 199075 153083 566141 1245374 1388079 662311 -159689 -279202 -39172
36281 -39172 -227529 -638181 -313793 873335 1844839 1722971 864942 181823 9455 42582
36271 42582 -13664 -141758 -172369 53331 594625 1291571 1772917 1704853 1082774 323749
36261 323749 36381 486120 1190061 1300876 595220 -187971 -270714 198913 503112 407309
36251 407309 318003 529762 910454 1334946 1836970 2196610 1925778 945591 -95715 -463638
36241 -463638 -76756 551660 882286 732580 319506 57003 156815 380792 341941 5901
36231 5901 -333907 -503397 -564000 -545121 -423132 -339654 -450358 -558967 -319783 170880
36221 170880 431250 305535 166562 317214 644471 959198 1176797 1045874 290431 -738152
36211g38152m07748N50707P91964K48488j75054m5257J46310O2476L7014K07219
36201F77967Q2273n15138q69590l73192M76139P41860L19844r6522p9416J10582
36191D74807J02971o9610j29142L9565K42250J91492j13808k94951o2855K90723
36181F71442K01630l45056o97137l88434K51759N73920M03650Q8442n6231p2880
36171F31105j96319n18322p99857o33559O5624P80684Q62345K99874k55823k96905
36161f1153P091J84747Q3750o4038r337K42069M30138K79299j48643m07608j86331
36150C49984K15973K44499j39016m21424k80048N3510K41849K45025J57100K3796
36140F91248m1924P4595J96761K4827l01464k94563N2596R8493m42222q74129
$$ plain form
36211 -738152 -1145900 -595193 196771 445259 270205 224948 371258 433734 470748 677967
36201 677967 760240 245102 -624488 -997680 -521541 220319 540163 443641 364225 474807
36191 474807 577778 508168 379026 418591 660841 852333 738525 443574 380719 671442
36181 671442 873072 528016 -169121 -557555 -305796 268124 671774 760216 703985 631105
36171 631105 434786 -83536 -883393 -1516952 -1451328 -670644 191701 491575 235752 -61153
36161 -61153 -54062 130685 214435 150397 141060 383129 813267 1092566 943923 536315 349984
36150 349984 565957 810456 671440 250016 -30032 23478 265327 510352 667452 691248
36140 691248 649324 723919 920680 945507 644043 349480 402076 500569 58347 -815782
36130h15782m43575M98196Q96495L97521k63323l10060J45717M13299J38003l47532
36120C08959n03209k28937P0493N3749j11513o0210J71418K13974j6328k05617
36110c07221k12926k69230m24820k99945K78574Q18754P70876K85335o8310r0211
36100D80876j6008M674K2303r719j89095l43031j52945L50478P15901N65612l544
36089A425502n06778m74827R2588N89419L73375l89134q07240m23253J71629K64051
36079C15332M3664Q1824K47075P272m54579m47069o3393j65670q35514r66746
36069b237804J6024J036626Q48782j08123m10626K31968P39301M44680m6154m7269
36059D67405J54375j0664l61591l09224J61110M92970L78972M8996k03056l33285
$$ plain form
36130 -815782 -1259357 -761161 135334 532855 269532 -40528 105189 518488 656491 308959
36120 308959 -194250 -423187 -352694 -298945 -410458 -470668 -299250 -85276 -101604 -307221
36110 -307221 -520147 -789377 -1214197 -1514142 -1235568 -416814 354062 639397 571087 480876
36100 480876 464868 469542 491845 482126 293031 -50000 -202945 147533 863434 1429046 1425502
36089 1425502 918724 443897 536485 1125904 1499279 1110145 302905 -120348 51281 315332
36079 315332 358996 440820 687895 695167 240588 -206481 -269874 -435544 -1271058 -2237804
36069 -2237804 -2221780 -1185154 -336372 -444495 -855121 -623153 116148 560828 514674 467405
36059 467405 621780 611116 249525 -59699 101411 594381 973353 1022349 819293 486008
36049D86008l58690k14770Q2652L37322L27593k394m62679o75281l83954J54414
36039g09779L14411j18408n46479k94302M49452Q78954O46862J71161j05217j74615
36029E12040r2084K34039O24621N74212j7665n40409m99145j95224j32715k11888
36019B55782r9618m443l46815q67787q32248j05118O40564Q39338N71168J50207
36009B01030k13616k63727J48974N86949L33777n47764j063675n63222L74743
36000a006531P88618N90657L87994L85489K01208k48269l73373K54566J092513
35991B072872J117777R9194j011807j178725n19043m2730k35371m94450k02992
35982c95275K71488K33388j53235j51025K84006M33089O7185j30061L10786Q72170
$$ plain form
36049 486008 127318 -87452 -4800 332522 660115 657721 195042 -480239 -864193 -709779
36039 -709779 -395368 -513776 -1060255 -1354557 -905105 -26151 620711 791872 686655 512040
36029 512040 419956 653995 1278616 1852828 1835163 1294754 795609 600385 467670 255782
36019 255782 156164 151721 -195094 -1062881 -1895129 -2000247 -1359683 -520345 50823 201030
36009 201030 -12586 -276313 -127339 459610 793387 245623 -818052 -1381274 -1006531
36000 -1006531 -217913 372744 760738 1146227 1347435 1099166 725793 980359 2072872
35991 2072872 3190649 3289843 2278036 1099311 580268 537538 302167 -192283 -395275
35982 -395275 -123787 109601 -43634 -194659 89347 522436 589621 459560 770346 1642516
35972A642516Q52347L30566j58477m17508n42662m86812k01707M8994j410j78594
35962H87253j25771J47206L13533K03748m4466k06570j59114K6875R5470r3909
35952A044255k68739o4445L73004N53394M03047K64496J04969m66297j170206
35943G73478j011861J85394J109633O52373m68491p78048j74052J74929k37219
35934B26136o63684m91812q6238O3879J15209L31891M73552K37941j47797k54571
35924a95494p8062N8553L9161M2853J69219K59377J55101j6721K2312K68967L37310
35913A062576j0863m14638l68260j5744M2879k60349l44305k0193J20610k49026
35903d57313n29880j80009L30960L12981K1260J41533N39460M97965k6053l35734
$$ plain form
35972 1642516 2494863 2825429 2666952 2249444 1706782 1219970 1018263 1067257 1065847 887253
35962 887253 761482 908688 1222221 1425969 1381503 1174933 1015819 1042694 1138164 1044255
35952 1044255 775516 711071 1084075 1637469 2040516 2305012 2409981 1943684 773478
35943 773478 -238383 -52989 1056644 1709017 1240526 462478 288426 463355 226136
35934 226136 -437548 -929360 -1015598 -951719 -836510 -504619 -31067 206874 59077 -195494
35924 -195494 -273556 -215003 -175842 -132989 36230 295607 450708 433987 456299 725266 1062576
35913 1062576 1051713 637075 268815 253071 295950 35601 -308704 -328897 -208287 -457313
35903 -457313 -987193 -1167202 -836242 -523261 -502001 -360468 178992 676957 650904 315170
35893C15170j27377J54343J23022j01572k90363l53613k08741R0126K14976L6415
35883a47614m1224K40895L95313l1681n43123m31096J5255P2839o5481K73747
35873b62170P84697N73780j23519j57678N10003O05148k81112r04520l94958L81501
35863G31172L27150k58816m75558k14317J28735M30343N33633O0382p16033p67547
35853b20856J27598P49463K60420m25947j98501M06206K78750k59765j27635M67844
35843A057577L56447m98021q83670l34052K77152L33635K90029N14227N25305
35834A638629o7880p86186r84508o74588k39743R7744K07560j7344l76893m59395
35824a662604k11132J3045O1250J64651M16975N85198N68082N62289O26865N15287
$$ plain form
35893 315170 187793 342136 465158 363586 73223 -280390 -489131 -399005 -184029 -147614
35883 -147614 -188838 52057 447370 415689 -127434 -558530 -543275 -470436 -535917 -262170
35873 -262170 522527 1096307 972788 815110 1325113 1930261 1649149 744629 349671 731172
35863 731172 1058322 799506 323948 109631 238366 668709 1202342 1262724 546691 -220856
35853 -220856 -93258 656205 916625 490678 292177 698383 977133 717368 589733 1057577
35843 1057577 1414024 916003 32333 -301719 -24567 309068 599097 1113324 1638629
35834 1638629 1570749 784563 -199945 -874533 -1114276 -1016532 -808972 -826316 -1203209 -1662604
35824 -1662604 -1873736 -1860691 -1799441 -1634790 -1217815 -632617 -64535 497754 1124619 1639906
35814A639906Q8184m51714q04189p56340k09703N84715R56279M89220l21272o15321
35804E99765k69054J26093K43948K58505J62027k86146p91068n86460L68873J025227
35794H51710N86982l60640o41952j2864O70777O08479q4924o41461n03314R2504
35784E65297L80130J1172m29297j92168N10800P24759J06955o01602o77623l46436
35774E1987k09933k78118j26778K89410N49570M11278J12816k854R6070J49095
35764A042543o7133m42179n86055k77171K05974L90962J83765j21405l24302m48896
35754d43897m24403r2845L70185M86867J16315l06157l51262p1109K65969N23771
35744G3434N77565K62593k66490m99297k24525J16717Q6357q5890O0918M09722
$$ plain form
35814 1639906 1728090 1276376 472187 -284153 -493856 90859 1047138 1536358 1215086 599765
35804 599765 330711 456804 700752 959257 1121284 835138 44070 -542390 -173517 851710
35794 851710 1438692 1078052 436100 423236 1094013 1702492 1617568 976107 472793 565297
35784 565297 945427 956599 527302 335134 845934 1570693 1677648 1076046 398423 51987
35774 51987 -157946 -436064 -562842 -273432 276138 687416 800232 797378 893448 1042543
35764 1042543 975410 533231 -52824 -329995 -124021 266941 450706 329301 4999 -443897
35754 -443897 -868300 -961145 -590960 -104093 12222 -293935 -645197 -716306 -450337 73434
35744 73434 650999 913592 647102 147805 -76720 39997 126354 40464 101382 511104
35734E11104M51859J40782l4524J40860K84983R5144j31068Q320L31736L24638
35724B123834o0801l32031k35477j47880m32099p79487o37409q2508K70765J90793
35714a22300Q5133K42623M16033L87897L43869L25829n5467q29035j190917n58528
35704i54863L84653N68511J03867k3657L76526M65006j23451o54460m99093j2090
35694c69051K20019J89950Q9997j16053k88570l1196M98809M74874l26661r25327
35684e83209n25345K42526L41314p2970j20667K22919K08261k45179l85162M3108
35674h74404L89061K36626m401M5789J55992J39388K75996N91728M71263l62477
35664A064561j103807q84043j07822J07528l73653n17427K60127J167211J167583
$$ plain form
35734 511104 962963 1103745 1069221 1210081 1495064 1590208 1459140 1467460 1799196 2123834
35724 2123834 2063033 1731002 1495525 1347645 915546 136059 -501350 -583858 -313093 -122300
35714 -122300 -37167 205456 621489 1009386 1353255 1679084 1623617 794582 -396335 -954863
35704 -954863 -570210 -1699 102168 78511 455037 920043 796592 142132 -356961 -369051
35694 -369051 -149032 40918 130915 14862 -273708 -304904 193905 668779 342118 -583209
35684 -583209 -1108554 -866028 -524714 -597684 -718351 -495432 -287171 -532350 -917512 -874404
35674 -874404 -485343 -248717 -253118 -207329 -51337 88051 364047 955775 1427038 1064561
35664 1064561 -39246 -923289 -1031111 -923583 -1297236 -1814663 -1554536 -387325 780258
35655G80258L92373j96955j73091L2477M0531K7780J64263J87100q2997k66041
35645I05698L7724N28831N76888J55969j50268m7950J22494K7004j99537l03843
35635A653010k67359j18727J49610K66916j85444r86996j169839k49041Q68282
35626c9588R16106k2078o37051k19830M76513M98006N5985j840L78484M02671
35616A807378k25856p26034l81822L31446L98756k58587p15537m39097M1448J29857
35606c8048P4090L31678O26323L92910k07429n21280m33797l50714k94022Q7855
35596c32434O20363O65141K19936K180J92236J01966m95923p58155j48174N39579
35586F06715M06979r5866K0282O14236O94526N1657n01961m42918j10207P1186
$$ plain form
35655 780258 1172631 975676 802585 835062 875593 903373 1067636 1254736 1171739 905698
35645 905698 943422 1472253 2049141 2205110 2054842 2006892 2129386 2156390 1956853 1653010
35635 1653010 1385651 1266924 1416534 1683450 1498006 511010 -658829 -907870 -39588
35626 -39588 876518 854440 217389 -2441 474072 972078 1028063 1026223 1404707 1807378
35616 1807378 1581522 855488 473666 805112 1203868 945281 229744 -209353 -167905 -38048
35606 -38048 36042 367720 994043 1386953 1179524 658244 224447 -126267 -420289 -332434
35596 -332434 287929 953070 1173006 1175186 1367422 1469388 973465 215310 67136 606715
35586 606715 1013694 917828 938110 1552346 2246872 2298529 1796568 1353650 1243443 1314629
35576A314629R4448P447k17303l48781r8748K58013J18914m73828p39277k41647
35566c26133M83833O45862J26537n32933p87584n70287k83934l23847n20553k96724
35556b385763M39871R90511Q28876L65352J90005J14166k34157m08266J68148
35547F8743Q86038O37146l07085n30781K72767P81553K22701m23908j88911K74802
35537A693065n3293p70775p99100j67915K59391L37018N94946R21733N99035l37511
35527B276594r32365p03888k43909j59293k47866q1331K65689M74489M94217M40087
35517A582424L13419R8701q9560j30907j8916J62081K19385o0033n43078o81804
35507H51712k09520L11624J73892m13882o06140j90939J86407J56811J51851M78698
$$ plain form
35576 1314629 1409077 1416524 1199221 850440 751692 1009705 1128619 654791 -84486 -326133
35566 -326133 157700 803562 930099 397166 -390418 -960705 -1244639 -1568486 -2089039 -2385763
35556 -2385763 -1945892 -955381 -126505 238847 428852 543018 308861 -99405 68743
35547 68743 954781 1591927 1284842 754061 1026828 1808381 2031082 1607174 1418263 1693065
35537 1693065 1639772 868997 69897 -98018 161373 498391 1093337 2015070 2614105 2276594
35527 2276594 1344229 640341 396432 237139 -10727 -92058 173631 648120 1142337 1582424
35517 1582424 1895843 1994544 1904984 1774077 1755161 1917242 2136627 2076594 1533516 851712
35507 851712 642192 953816 1127708 713826 107686 -83253 103154 259965 411816 890514
35497H90514O55558K21988l82587m18009M9261L03140M8566k93952l16412j05546
35487F52521P5047J62271K02319J54023n0977l55136n60188m65790r1820K30750
35477d6980J63591j88278l61237j63889Q4762J27105J95905N19222P41602L71537
35467A443340l64492o93527l22595K22790L68465J32762j38336k47342j60321
35458B40744R3329L23184K77514J9204r5909L0375P8020q1156l7642M92142R84722
35447B324527O38356m96087j397788j197571j27390P66761P02123j26733q35397
35438B50801p99323k55065J27627J21568O4123J65804K13301J16095J89863N36434
35428G31228O49116J48920m89123n39055n2669L28655L31798J59291j32921o00261
$$ plain form
35497 890514 1546072 1768060 1385473 967464 1016725 1319865 1368431 1074479 758067 652521
35487 652521 727568 889839 1092158 1246181 1195204 840068 279880 -185910 -277730 -46980
35477 -46980 116611 -71667 -432904 -596793 -512031 -384926 -189021 330201 1071803 1443340
35467 1443340 1078848 385321 62726 285516 653981 786743 648407 401065 240744
35458 240744 334073 657257 934771 953975 858066 888441 966461 885305 847663 1339805 2324527
35447 2324527 2962883 2466796 1069008 -128563 -255953 510808 1212931 1086198 250801
35438 250801 -548522 -803587 -675960 -554392 -490269 -324465 -111164 4931 194794 731228
35428 731228 1380344 1529264 1040141 501086 448417 777072 1108870 1268161 1135240 534979
35418E34979q71911m72680K91105N59025J32151k97951k53209L526K23243N69534
35408D17812R25207O83521k34915r08815n89078K41579N86438K08322l79702p17413
35398B32956o36431j53495L40670K44976l92244o96780j81289M74265M90646J68937
35388a07789J81388L15965m1751o28955o34530o4012L13300K58517K56400M59248
35378C07781M61296J75608r519j3744j16240k17890J7263L04203N5257m35648
35368E28367k95065L35900L19865n54831j054049m66190K69278K14582o8587K53168
35358e17562O79667L18164l98422l65562L34670O39081K82128Q70N8256r2299
35348I38991n38144n67034N7124N74847M58230K01833L21866M23918m912n55456
$$ plain form
35418 534979 -336932 -809612 -518507 40518 172669 -125282 -378491 -374965 -151722 417812
35408 417812 1343019 2026540 1791625 882810 293732 535311 1121749 1330071 950369 232956
35398 232956 -403475 -556970 -216300 28676 -363568 -1060348 -1241637 -767372 -276726 -107789
35388 -107789 73599 389564 347813 -281142 -915672 -979684 -666384 -407867 -151467 307781
35378 307781 769077 944685 935166 921422 805182 587292 604555 908758 964015 528367
35368 528367 233302 569202 889067 334236 -719813 -1186003 -916725 -702143 -770730 -517562
35358 -517562 162105 480269 81847 -283715 50955 690036 972164 973034 1031290 938991
35348 938991 400847 -166187 -109063 465784 924014 1125847 1447713 1871631 1866719 1311263
35338A311263n12917r0313j30681p21753r91862m23410L81258O00757L04508J62293
35328a10857L77793M96912K19537j32070j19557K00032L99388K02332l07318q19515
35318D06677r75082n91590R9966N86185N86004K83290l0386k63145l46636j45891
35308c90608J89965J93248k31726m78727o8965N63225O74028K68438p2202j22194
35298E24482p4509O4471L73706N27361K27945p2416K05382O16887K44145o93947
35288A943507j018295m75908j19443m77588p11833j90434L81349K15428k87106
35279g40323m17944l27895l58945j31071O42257J216002Q16869m4654l55434j24225
35269A74637l3823j09074R7591M09726K98552n1521p5791N4382k08807n68412
$$ plain form
35338 1311263 798346 708033 577352 -144401 -1136263 -1559673 -1178415 -577658 -273150 -110857
35328 -110857 266936 763848 983385 851315 731758 931790 1331178 1533510 1226192 406677
35318 406677 -568405 -1159995 -1060029 -473844 112160 395450 365064 101919 -244717 -390608
35308 -390608 -200643 -7395 -239121 -717848 -786813 -223588 450440 718878 646676 524482
35298 524482 449973 514444 888150 1415511 1643456 1571040 1776422 2393309 2637454 1943507
35288 1943507 925212 449304 329861 -147727 -859560 -1049994 -668645 -453217 -740323
35279 -740323 -1158267 -1486162 -1845107 -1976178 -1333921 -117919 698950 654296 298862 174637
35269 174637 140814 31740 129331 539057 837609 786088 710297 764679 555872 -12540
35259a2540k49373N31996P10880M3032n21176k95870L20496O61790N31042l683
35249A716594o99578r66031m48814K27005J94829k73028j89025M19740M91902
35240D73594k15723o27953j18951N16500M72350J45643J93850L90540K56693M448
35230A490991J8960Q8085p9345k07081o4673q0061n39721p89810j49983Q44990
35220E32352J083770M74561l5755P5228K96857J6226o44371j116331j060269n95355
35210i73087j17584O1380L7397J69334M96462N79103J54040l61647l68009J38948
35200a83663O19425O49147K52264k43335m47447k04638J61247J57148j69462k08974
35190C81712K95658P69530O09469L8098l22764l74749m72653o62407n95247j63067
$$ plain form
35259 -12540 -261913 270083 980963 1023995 502819 206949 527445 1189235 1720277 1716594
35249 1716594 1017016 50985 -397829 -170824 24005 -249023 -438048 -18308 473594
35240 473594 257871 -370082 -489033 27467 499817 645460 839310 1229850 1486543 1490991
35230 1490991 1509951 1598036 1518691 1311610 1246937 1166876 627155 -162655 -312638 532352
35220 532352 1616122 2090683 2054928 2130156 2427013 2443239 1798868 682537 -377732 -973087
35210 -973087 -1090671 -1029291 -991894 -822560 -326098 253005 407045 45398 -322611 -183663
35200 -183663 435762 1084909 1337173 1093838 646391 441753 603000 760148 590686 381712
35190 381712 677370 1446900 2056369 2094467 1771703 1396954 924301 261894 -333353 -496420
35180d96420K79183L92530K27420O9291J15250K93474L01491m4496m34828l37975
35170C64920K04019M55121k5873o66468o16075P6344N60301L37266k05997m34428
35160D9130k01853J63604L23171K32721R0849M2000k8666k70880m92665l34254
35150d26843J23119L45431J26977q4331N1265J78486r9945m39889k79584J75652
35140c29662K68263M0193K05634Q73064J154101M43137n96871r07924m38437R68
35130G12466L4972J08083N07409P40285L02027m36615p03777m42866k91613m77221
35120E3150m55760J07638O70322O00903J23775j16030m6915n7447j60178k1377
35110F98081K82485K88965m5068k47449j11511P0751J30443K19785K91049O1492
$$ plain form
35180 -496420 -217237 175293 402713 472004 587254 880728 1182219 1137723 702895 364920
35170 364920 568939 1024060 998187 331719 -284356 -208012 352289 689555 483558 49130
35160 49130 -152723 10881 334052 566773 657622 699622 670956 400076 -92589 -426843
35150 -426843 -303724 41707 168684 84353 135618 314104 214159 -225730 -505314 -329662
35140 -329662 -61399 -21206 184428 1057492 2211593 2654730 2057859 1149935 711498 712466
35130 712466 747438 855521 1362930 2103215 2405242 1968627 1264850 821984 530371 53150
35120 53150 -402610 -294972 375350 976253 1100028 983998 937083 879636 719458 698081
35110 698081 980566 1269531 1224463 977014 865503 936254 1066697 1286482 1577531 1639023
35100A639023l52706m51166j75906l3095j95264k12742J28898M05878L09165P5581
35090A137666j11829l65072m51675J49113J128494J302484L02796o77816n92756
35081A821405j8030J0074l06695j70318K16917L6546o04888q17119l82241R9604
35071a14745L58078O28812P85369L97609l26565o48234l90471m7339J56278M00624
35061A199416N28533J64670l91597l88422J59599M37863J45884j29993l9895K8478
35051A714536j46896j88355K8326q891n09544q61291n56604N5637M27405N56384
35041E10707N74456K53705m48678q76589m21802M89074P99361J56529o36158n95955
35031a95350K66508R41342O31072k09970m48544R9120L30968m20544j157131o32731
$$ plain form
35100 1639023 1286317 835151 659245 626150 430886 218144 347042 752920 1062085 1137666
35090 1137666 1025837 660765 209090 358203 1486697 2789181 3091977 2414161 1821405
35081 1821405 1803375 1813449 1506754 1336436 1553353 1589899 985011 167892 -214349 -114745
35071 -114745 243333 872145 1657514 2055123 1728558 1080324 689853 642514 798792 1199416
35061 1199416 1727949 1892619 1501022 1112600 1272199 1710062 1855946 1725953 1686058 1714536
35051 1714536 1567640 1379285 1407611 1398720 889176 27885 -528719 -473082 -45677 510707
35041 510707 1085163 1338868 890190 13601 -408201 80873 880234 1036763 400605 -195350
35031 -195350 71158 1012500 1643572 1433602 985058 1084178 1415146 994602 -162529 -795260
35021g95260O28186J010722K18618m24805j31854L47097K48480l1360P1866K55001
35011A396691N4242l08502m79495n73450o03566j48100P54587J213833P15471
35002B021711m6101k94689k94997n18229n56870P0445P51573O05195m3818k10295
34992A483925J17176J24900k74662l16497J88209M96024K09388j31706o3224P2203
34982A905736j85981o70595r29688q25738m85174m2446L40904N15300N11420M05014
34972E38752J03303l33205l46412M80449J484743J427317J41597j077613j123165
34963A295766m34694j44031m20806m67119P7410N96847N17678J48492P3166J97335
34953A440044J8732l79430l50636K03784M92518O831o13844n34461j7849J02466
$$ plain form
35021 -795260 -167074 843648 1062266 637461 505607 852704 1101184 1069824 1141690 1396691
35011 1396691 1450933 1142431 662936 89486 -514080 -662180 92407 1306240 2021711
35002 2021711 1975610 1680921 1385924 867695 310825 381270 1132843 1738038 1694220 1483925
34992 1483925 1601101 1726001 1451339 1134842 1323051 1819075 2028463 1896757 1833533 1905736
34982 1905736 1719755 1049160 119472 -706266 -1191440 -1233886 -892982 -377682 133738 538752
34972 538752 642055 308850 -37562 442887 1927630 3354947 3496544 2418931 1295766
34963 1295766 861072 717041 296235 -170884 -93474 503373 1021051 1169543 1242709 1440044
34953 1440044 1458776 1079346 728710 932494 1425012 1431843 817999 283538 265689 368155
34943C68155j20017Q8638O93654P36305k719m76926p1116L50587p5863p34259
34933G56439o05208K0279J64127r9934R2035P06900P89429J07603m65836l92478
34923A073356j46009j79606k48720j09174L1075J18550M48521Q84698P54306k8047
34913B598950n68620k63579L12425L80169P5353j05364k89939p97684j225674
34904A16037r21923j12463L43621K20700J09152L30370N03630L81250L49026O87016
34894B006416Q99851L43392p44294j376825r96232j40483K24342j56460n87503
34885e27796l30360M66621R55678O44527l4197l41740j57020L3250m7557r4940
34875E66466J66797L77435n502p31910q04939J95076J270033J101532j56277r50363
$$ plain form
34943 368155 248138 336776 1030430 1766735 1764016 1287090 1215974 1566561 1490698 756439
34933 756439 151231 171510 335637 235703 327738 1034638 1824067 1931670 1465834 1073356
34923 1073356 927347 747741 499021 389847 420922 539472 987993 1872691 2626997 2598950
34913 2598950 2030330 1766751 2079176 2459345 2534698 2429334 2139395 1341711 116037
34904 116037 -805886 -918349 -574728 -354028 -244876 85494 589124 970374 1319400 2006416
34894 2006416 2906267 3249659 2505365 1128540 132308 -8175 216167 59707 -527796
34885 -527796 -858156 -391535 564143 1208670 1174473 832733 675713 708963 661406 566466
34875 566466 733263 1110698 1105196 373286 -431653 -236577 1033456 2134988 1978711 1028348
34865A028348l92097N55243N31503k62378n34345J4059L02941k56372p26217j63968
34855I6717P59355P03394k83439q18693k30527N72901N85492R0972n6783J57855
34845A577244P7553l87542n98412k94479l9385k55093m77578r6295O09614Q14400
34835I30027L28295k04018k80341j07874m2033j7380J42716K77756J65170l0989
34825A161329o533J53758R8444k22065m84946m72247k86444q6117P6570J22674
34815E4423l6346k66491k73826l822K74241L88950M87264O49109N75704J0239
34805A859445o81002p80032j39878N30090N24220K8687j80751J91887O02241M47486
34795B402393j64120o54080p11615m81467j81338J17302L58735M36790K88043
$$ plain form
34865 1028348 636251 1191494 1722997 1460619 926274 940333 1243274 986902 260685 96717
34855 96717 856072 1559466 1276027 457334 226807 799708 1385200 1476172 1419389 1577244
34845 1577244 1654797 1267255 668843 374364 334979 79886 -397692 -493987 115627 930027
34835 930027 1258322 1054304 773963 666089 624056 606676 749392 1027148 1192318 1161329
34825 1161329 1154796 1308554 1406998 1184933 699987 227740 -58704 -144821 -68251 54423
34815 54423 18077 -248414 -522240 -526062 -251821 137129 624393 1273502 1849206 1859445
34805 1859445 1178443 398411 258533 788623 1312843 1341530 1160779 1352666 1954907 2402393
34795 2402393 2238273 1584193 872578 391111 209773 327075 685810 1122600 1410643
34786A410643q9123o04045r12010n52279M01914J087886P73501j12347m77605
34777I26535l3125M53516M40238L23288N39229P25873L54244l49050p40038o66181
34767A974529m72047l57455k41166q2629O8444J71572P5391l82793q83102p06367
34757h35623K53965J052496Q39947K6094l56276p6523K51376K86978L09878N10635
34747B262947O44402M52767m1135n97661p72471j86607P49757Q80922k14615j301015
34737A877291r93502K46622P93307K33323l21798k48106j88393n01834m69111
34728D27799K51668P02052J04272p80354q05974j37287K61156J80754J33650K22508
34718E60244J07935j56995k01819p5119q4496r1870K15140N23794K33797m76587
$$ plain form
34786 1410643 1321520 717475 -194535 -746814 -344900 742986 1516487 1404140 926535
34777 926535 893410 1346926 1787164 2110452 2649681 3375554 3729798 3380748 2640710 1974529
34767 1974529 1502482 1145027 903861 821232 889676 1061248 1136639 753846 -129256 -835623
34757 -835623 -581658 470838 1310785 1336879 980603 904080 1155456 1442434 1752312 2262947
34747 2262947 2907349 3360116 3318981 2721320 1948849 1762242 2511999 3392921 3178306 1877291
34737 1877291 883789 1130411 1923718 2157041 1835243 1587137 1398744 896910 427799
34728 427799 679467 1381519 1485791 705437 -100537 -237824 23332 204086 337736 560244
34718 560244 668179 511184 309365 234246 149750 57880 273020 796814 1030611 554024
34708E54024p73359l86465Q6411J72890M9255o5667k64705m49379j95726N08823
34698g63898R96511P96809K83296L5438J6574j42627m19954m82661k54648O4915
34688A29755L67264N96122N39613J21600k61378j94338R2299O5793k03844j63261
34678A089625J87562J98522k45967l23295L97258J020569N63160m64346p41522
34669A681566o9011N02002L67598L5455l8625j20193l42987k67603J81676L24679
34659B254557j12252l90845l7636K33262k18291o84455k32495O44913P94333K66599
34649B517690L4269K13216M2101m89980m95869J79579N59836R7686n60866p39692
34639A357970n64330k64511K77397Q47831P93885Q3835m45648l48819j53359k57078
$$ plain form
34708 554024 -219335 -605800 -519389 -346499 -297244 -362911 -627616 -1076995 -1272721 -763898
34698 -763898 232613 1029422 1312718 1348156 1364730 1222103 802149 319488 64840 129755
34688 129755 497019 1093141 1632754 1754354 1492976 1298638 1390937 1456730 1252886 1089625
34678 1089625 1277187 1475709 1229742 906447 1303705 2324274 2887434 2423088 1681566
34669 1681566 1612555 2114557 2482155 2517610 2478985 2358792 2015805 1748202 1929878 2254557
34659 2254557 2142305 1751460 1713824 1947086 1728795 1044340 811845 1456758 2251091 2517690
34649 2517690 2551959 2765175 2807276 2317296 1821427 2001006 2560842 2658528 2097662 1357970
34639 1357970 793640 529129 806526 1654357 2448242 2532077 2086429 1737610 1584251 1327173
34629A327173k51262J12240K86803n6229k92304J27370O96569O46690M0120n76048
34619B061122r21110q13735n8101Q73374R17701q4230q60489m93675K06371J03336
34609I30564m24508k76656M83539Q97413P54089O10784N24642R8129m30632m42850
34599B724514j68944l97694r81436q97626O3545Q57507P00804M620n00345o47520
34589G57425n20326q6473M74763P19917N12405J52500j51433m00020m27879p7353
34579I53526K92343K06155o1216J48271O60010N82831k19553p70523m16307K83743
34569A659280N10752K20689k14698o41771q97883o25835J31892O89752N70929
34560A403107J39630l4064N3603J26185J72622K21919M2774l94349n54849k4500
$$ plain form
34629 1327173 1075911 1188151 1474954 1418725 1126421 1253791 1950360 2597050 2637170 2061122
34619 2061122 1140012 326277 268176 1141550 2059251 1975021 1114532 620857 827228 930564
34609 930564 506056 229400 712939 1610352 2364441 2975225 3499867 3597996 3167364 2724514
34599 2724514 2555570 2157876 1176440 278814 342359 1199866 1900670 1905290 1404945 757425
34589 757425 237099 150626 625389 1345306 1857711 2010211 1858778 1458758 1030879 953526
34579 953526 1245869 1452024 1390808 1539079 2199089 2781920 2562367 1791844 1375537 1659280
34569 1659280 2170032 2390721 2176023 1534252 636369 10534 142426 832178 1403107
34560 1403107 1542737 1508673 1562276 1688461 1861083 2083002 2125776 1731427 1176578 1152078
34550A152078P27932Q65038L13828j58475O557M79812N44657K0974n08362m11606
34540C032433J56128L81232j17659o82130n14095J18827K58685k66464n78820
34531A788137j45679L94015K57857l01007m83699j72004M3112j21148k50345O5811
34521A075050O03377P90883M32955o0058k01242n8443j05288l93927l14434M35917
34511B204790J064712N89918o57044j322750q84016k44986j83507k30407K35412
34502E72122O88126K87834n46967o01685K48022P87071L00218l92120k52507M43877
34492A533991O49276J04645m88199o51769o21884n71808k01590M86595P19676
34483I58933k3018r53298q21977L05610J049145O28654j51182k50868J39000K01197
$$ plain form
34550 1152078 1880010 2745048 3058876 2900401 2906958 3386770 3931427 3952401 3444039 3032433
34540 3032433 3188561 3569793 3452134 2770004 2255909 2374736 2633421 2366957 1788137
34531 1788137 1642458 2036473 2294330 1993323 1509624 1337620 1380732 1259584 1009239 1075050
34521 1075050 1678427 2469310 2902265 2842207 2640965 2582522 2477234 2083307 1768873 2204790
34511 2204790 3269502 3859420 3202376 1879626 995610 750624 567117 336710 572122
34502 572122 1260248 1548082 1001115 399430 647452 1434523 1734741 1342621 1090114 1533991
34492 1533991 2183267 2287912 1799713 1147944 526060 -45748 -247338 239257 958933
34483 958933 935915 -17383 -839360 -533750 515395 1144049 992867 741999 880999 1082196
34473A082196j03451j60891J26327K48273N9764l5760Q2339M2664k41383l22226
34463G77852j284K86181K01015O2142K78180O43167O40900K01426k26704k40562
34453B622313J32751N25171N37331N1546o35641j037541q84506l05568L02999
34444A308855N24270K10481l13881n04971k20418J16304J25526p3761k45856m51024
34434D75525o90061n71520J19095Q67348J050474Q05085O38061N00282K7589n42595
34424B679283n92778j85905k2464l06535m91132k42476J41362L87060N40879M91816
34414B399110N472o05032o51592j19433K52934J51801J00785M16261O28879L57732
34404B936917m5387j88527k34196l35864k21135J47331K29677j79343m03698N3400
$$ plain form
34473 1082196 978745 817854 944181 1192454 1252218 1216458 1298797 1341461 1100078 777852
34463 777852 776568 1062749 1263764 1325906 1604086 2247253 2888153 3089579 2862875 2622313
34453 2622313 2755064 3280235 3817566 3869112 3233471 2195930 1311424 1005856 1308855
34444 1308855 1833125 2043606 1729725 1224754 1004336 1120640 1246166 1172405 926549 475525
34434 475525 -214536 -786056 -666961 200387 1250861 2055946 2694007 3194289 3221878 2679283
34424 2679283 2086505 1900600 1878136 1571601 1080469 837993 979355 1366415 1907294 2399110
34414 2399110 2404582 1799550 1147958 1028525 1281459 1433260 1534045 1950306 2579185 2936917
34404 2936917 2891530 2703003 2468807 2132943 1911808 2059139 2288816 2109473 1705775 1759175
34394A759175N47286K21949n80308p58765o3332O26674O25675K63747J74842L41349
34384C158292K40245k96874p62767o15422l4796K59672k7175l59120j58693L64732
34374A768094N77251L13983n7829k21242q8021L19302O78837M52590k69822n30667
34364B942476J32867P03125J17460r07876q94266k9406J27342p06098j056132
34355D29492k17365N92428L49287j64330R6280O56900M99784j98331n01753j87484
34345A354908K36935M46649M19906J39066k06862k35008j3859m9605l18832j73177
34335A600121M57710P83615M77849J68694J57321r7200o50569o27453J37321M54276
34325B861685k66995q57274l28485M24205K16726m05150k64174M10189O15067
$$ plain form
34394 1759175 2306461 2528410 1948102 1189337 1126005 1752679 2378354 2642101 2816943 3158292
34384 3158292 3398537 3101663 2338896 1723474 1688678 1948350 1921175 1562055 1403362 1768094
34374 1768094 2345345 2659328 2601499 2380257 2292236 2611538 3290375 3742965 3473143 2942476
34364 2942476 3075343 3778468 3895928 2988052 2093786 2064380 2191722 1485624 429492
34355 429492 212127 804555 1153842 989512 1085792 1742692 2242476 2044145 1542392 1354908
34345 1354908 1591843 2038492 2458398 2597464 2390602 2155594 2141735 2092130 1773298 1600121
34335 1600121 2057831 2841446 3319295 3487989 3645310 3548110 2897541 2270088 2407409 2861685
34325 2861685 2594690 1737416 1408931 1833136 2049862 1644712 1380538 1790727 2405794
34316B405794L43746J93773L7715m05804m86949L33056J112953P02479l05594
34307C931169n10736N2670K72242k4269j29041n5167l41212o36649k09124M50106
34297B799989K59295m68286m27272M49593R24229N69398K22018K63628J26598
34288D719190l19430m64826k58286l48550p32438o59181o4424K60535J04152J17680
34278B354422N04339P06087N29722L47456J29375m40518q89011l85859O88328
34269C544341J017632L17357l49049l38185j31800j37043j48635j57075l77397
34260C240146m07155K83187J028994O35269o14609j198999o81452j32600j04001
34251B048780L8215M75144M47712j31803l04365J78481L76994l8342j81350K90414
$$ plain form
34316 2405794 2749540 2943313 2981028 2575224 2088275 2421331 3534284 4236763 3931169
34307 3931169 3420433 3473103 3745345 3721076 3592035 3536868 3195656 2559007 2349883 2799989
34297 2799989 3059284 2590998 2163726 2613319 3537548 4106946 4328964 4592592 4719190
34288 4719190 4399760 3934934 3676648 3328098 2595660 1936479 1872055 2132590 2236742 2354422
34278 2354422 2858761 3564848 4094570 4442026 4571401 4130883 3241872 2856013 3544341
34269 3544341 4561973 4879330 4530281 4192096 4060296 3923253 3774618 3617543 3240146
34260 3240146 2832991 3116178 4145172 4780441 4165832 2966833 2285381 2152781 2048780
34251 2048780 2086995 2562139 3009851 2878048 2573683 2752164 3129158 3090816 2909466 3199880
34241C199880M92108K8579k59982M5819J86718j53148j28955N50767Q39519J84927
34231D986232m37884k68497R016k42906m31493r5978M0159m87252p96212j84774
34221B090411N71865N94241K86761K42870Q9309m15505m89387J98781N10131l10512
34211C368965j058639m09982Q14975R22165l9506o57084m56357j30103O0944M77553
34201B892931R02770O09406l45331j001190p39884J11741Q45657R71529M81079
34192D728708l7388R5008P01773Q52830J90296n76134q03563o76469m77150p2701
34182C925210M28514N06888J74523P6805K75657Q2333n34918p09696k68257p9497
34172C877562l22388p9933O92643O68568m55233j008991k8042J023292O96724
$$ plain form
34241 3199880 3691988 3720567 3460585 3506404 3693122 3539974 3411019 3961786 4801305 4986232
34231 4986232 4548348 4279851 4288867 4045961 3614468 3518490 3558649 3071397 2275185 2090411
34221 2090411 2662276 3256517 3543278 3786148 3875457 3459952 2970565 3169346 3679477 3368965
34211 3368965 2310326 1900344 2715319 3637484 3597978 2940894 2484537 2354434 2415378 2892931
34201 2892931 3795701 4405107 4059776 3058586 2318702 2430443 3276100 4247629 4728708
34192 4728708 4691320 4786328 5488101 6340931 6531227 5955093 5151530 4475061 3997911 3925210
34182 3925210 4353724 4860612 5035135 5111940 5387597 5469930 4935012 4225316 3957059 3877562
34172 3877562 3555174 3475241 4167884 4836452 4381219 3372228 3344186 4367478 5064202
34163E064202r5886O0145N51357Q2115q17758p70445j4000J81891k20197k91969
34153C729455k3838j01974l33807k2654N23056M34953j54857m05551j84279P7294
34143C537798L92147Q51045Q80240J05750o91740o73552k73838k80463m17081
34134C430306n2157N25779P42885P72266Q14073L87459n17714q06055m8372M65474
34124E713944j70808q22595l57369K55919j98927p95175j52628Q64490N89957
34115D926808m26754m04808N20508P13475J0809k26129L17873O02795K84374K7191
34105F346142J476j22944p3480M61036P78998L08722q7950L30882N15353m96966
34095G961269j372086n35636Q42098O14456o99379r43907p1905K02776k15709
$$ plain form
34163 5064202 4968316 5028461 5579818 5661933 4844175 4073730 4059730 4241621 4021424 3729455
34153 3729455 3705617 3603643 3269836 3247182 3770238 4205191 4050334 3644783 3460504 3537798
34143 3537798 3929945 4780990 5661230 5766980 5075240 4401688 4127850 3847387 3430306
34134 3430306 3378149 3903928 4646813 5419079 6233152 6620611 6102897 5296842 5248470 5713944
34124 5713944 5543136 4720541 4363172 4619091 4420164 3624989 3472361 4336851 4926808
34115 4926808 4500054 4095246 4615754 5329229 5340038 5113909 5431782 6034577 6318951 6346142
34105 6346142 6347618 6224674 6151194 6612230 7391228 7699950 7612000 7942882 8458235 7961269
34095 7961269 6589183 6053547 6895645 7510101 6810722 5866815 5794910 5997686 5781977
34086E781977O2724Q67233P06575k11184k70635M33875L15258n35191m91635L61145
34076G020142K78703p67647r12325J79347P77155K84060k4647K21125m6060p29955
34066F279898m23053P21054R18718m216k55354N82685Q36145q9584p58624n02109
34056G305560l03619l73872K66416J296371J136578m0446l24183M94206O08583
34047A0065594k82300m61272L06105K49700p53716o11260J004429J716027N84253
34038A1817560l48900J30367N36281r2276n23435k07033m19739j234653q11875
34029H846297R34104J503050Q5014r25041j98916M37108j53119k82764R03973
34020A1149706J366799o3167j338870q16713J10521R8570K16569J122557J240410
$$ plain form
34086 5781977 5844701 6711934 7418509 7207325 6936690 7370565 7685823 7150632 6658997 7020142
34076 7020142 7298845 6531198 5618873 5798220 6575375 6859435 6834788 7055913 7009853 6279898
34066 6279898 5856845 6577899 7496617 7492401 7237047 7819732 8655877 8566293 7807669 7305560
34056 7305560 7001941 6628069 6894485 8190856 9327434 9286988 8962805 9457011 10065594
34047 10065594 9783294 9322022 9628127 9877827 9124111 8512851 9517280 11233307 11817560
34038 11817560 11468660 11599027 12135308 12043032 11519597 11312564 10892825 9658172 8846297
34029 8846297 9780401 11283451 11368465 10443424 10244508 10681616 10528497 10245733 11149706
34020 11149706 12516505 12453338 11114468 10297755 10408276 10506846 10723415 11845972 13086382
34011A3086382q5091q97987j55324L86613k48085l28146R31304J489082L77417
34002A4556165k99924N36815P79072n92721j128561N77316J991633J048372l95027
33993A7073140k69224L30975J50435L11934J277336J205852k34504n66479P65125
33984B0044590R59491o69536r69489R32831J510299m39754j111244J117503K320062
33975B3694753M31963q03288P26610J335595p39602j116365K131866L664597N04865
33966B9830994j774919R28670L525188J392209q84442J347060L614551J277541
33958C9256852j030945J442452L868780J540893j12083L676135O303698K245352
33950E7191134o88128M484527R210461M932716P18583O555230J2498114O934989
$$ plain form
34011 13086382 13001291 12103304 11947980 12334593 12086508 11758362 12689666 14178748 14556165
34002 14556165 14256241 14793056 15572128 14979407 13850846 14428162 16419795 17468167 17073140
33993 17073140 16803916 17134891 17285326 17597260 18874596 20080448 19845944 19279465 20044590
33984 20044590 21004081 20334545 19365056 20297887 21808186 21368432 20257188 21374691 23694753
33975 23694753 24126716 23323428 24050038 25385633 24646031 23529666 25661532 29326129 29830994
33966 29830994 28056075 28984745 32509933 33902142 33017700 34364760 37979311 39256852
33958 39256852 38225907 39668359 43537139 45078032 44965949 48642084 54945782 57191134
33950 57191134 56503006 60987533 70197994 75130710 75849293 82404523 94902637 101837626
33942A01837626J442336J0114916J8975053J0602894M683679K6890855M4353917
33935B18901276o721908j15081828j77887763j25976153j6847548M3093387L0691309
33928a49829228O339802R548119J8874530J1481190J913635O343761J2813796
33921h2514395P774291P40220L273911P730741M332183m07603J885007N297276
33913e1888369K412779j133730J658898N454170L165578p52868N54133L638699
33905c6890710K345132n19641L68856K418770J007236j121799L93471K724027
33897b9274658J503837o32258N39422K497189J107356j178542j48827K018949
33889b3567532J146385q97799r1964J906921J235796n97442J15636J867444Q40753
$$ plain form
33942 101837626 103279962 113394878 132369931 142972825 147656504 174547359 218901276
33935 218901276 212179368 97097540 -80790223 -206766376 -223613924 -180520537 -149829228
33928 -149829228 -143489426 -133941307 -115066777 -103585587 -101671952 -95328191 -82514395
33921 -82514395 -74740104 -73999884 -70725973 -62995232 -58663049 -59070652 -57185645 -51888369
33913 -51888369 -49475590 -50609320 -48950422 -43496252 -40330674 -41083542 -40529409 -36890710
33905 -36890710 -34545578 -35065219 -34696363 -32277593 -31270357 -32392156 -31998685 -29274658
33897 -29274658 -27770821 -28403079 -27863657 -25366468 -24259112 -25437654 -25586481 -23567532
33889 -23567532 -22421147 -23318946 -23410910 -21503989 -20268193 -20865635 -20749999 -18882555 -18041802
33880a8041802j635115j479083O92351J128525j00386j3484J187861R46075k22876
33871a7537934K03281J535656J066837o41656p15507P50602J103981N558m83920
33862a4713102N7004K51906Q958J98052K71523n04455q17692M57699J518516N11028
33852a2760563p93342J05769J832832J455256l60551p48929K71162M13659l57599
33843a0942306k14759N40654O8792j089566p37595Q12490J179076J58823j99854
33834a0424245M79640N17521l80858p06790j79156n8224m50595k21805N09087
33825a0915425N61899J52206M64218J119792P55230k93901n43902r0280j29706
33816h919869l98485J46877Q00372J87306q10446k90832J106758J095252k54343
$$ plain form
33880 -18041802 -19676917 -21156000 -20463649 -19335124 -19435510 -19448994 -18261133 -17315058 -17537934
33871 -17537934 -17334653 -15798997 -14732160 -15373816 -16089323 -15338721 -14234740 -14229182 -14713102
33862 -14713102 -14656098 -14404192 -14395234 -14197182 -13925659 -14430114 -15247806 -14790107 -13271591 -12760563
33852 -12760563 -13553905 -13448136 -11615304 -10160048 -10520599 -11269528 -10998366 -10584707 -10942306
33843 -10942306 -11157065 -10616411 -10547619 -11637185 -12374780 -11562290 -10383214 -10224391 -10424245
33834 -10424245 -9944605 -9427084 -9807942 -10514732 -10693888 -10752112 -11202707 -11424512 -10915425
33825 -10915425 -10353526 -10201320 -9737102 -8617310 -7862080 -8155981 -8699883 -8790163 -8919869
33816 -8919869 -9318354 -9171477 -8371105 -8183799 -8994245 -9285077 -8178319 -7083067 -7337410
33807g337410p09755J72993O12287M1127k69765o2787l59511p91913P9821J582496
33797g042417J382168m75475j300640j65412P29074J4373p19096n3226Q73072
33788f757579O50304j24490l74133l36850m72300l33277K60784M86553k3192m18170
33778g442350j59475Q8429j83879m10548l1946O52147J108789J022818J44545
33769e211470j124678j353461J66398J761729J380214k15912n48344N88079R11556
33760c645889m26434j502090q85574K91426N22313K9833l32435m54612l71250
33751f774712Q6769M23384j20791r33194o12021N47860P42989k98707p76835Q2076
33741g633182P85312L18327k15563J76244O84602M85635K24911M47995M22319
$$ plain form
33807 -7337410 -8047165 -7874172 -7261885 -7220758 -7490523 -7553310 -7912821 -8704734 -8624913 -7042417
33797 -7042417 -5660249 -6135724 -7436364 -7601776 -6872702 -6858329 -7577425 -7630651 -6757579
33788 -6757579 -6107275 -6231765 -6605898 -6942748 -7415048 -7748325 -7487541 -7000988 -7024180 -7442350
33778 -7442350 -7601825 -7513396 -7697275 -8107823 -8139769 -7487622 -6378833 -5356015 -5211470
33769 -5211470 -6336148 -7689609 -7523211 -5761482 -4381268 -4597180 -5145524 -4557445 -3645889
33760 -3645889 -4072323 -5574413 -6459987 -6168561 -5646248 -5616415 -5948850 -6403462 -6774712
33751 -6774712 -6687943 -6264559 -6385350 -7318544 -7930565 -7382705 -6639716 -6938423 -7715258 -7633182
33741 -7633182 -6847870 -6529543 -6745106 -6568862 -5884260 -5398625 -5173714 -4725719 -4303400
33732d303400k22574n00452M8530L12286k89719n58624K12701O55513k93895j231646
33722f171280m77915J061080J340673L67444j88156J80322M21892N822m08338
33713c868456l37956j09755m6616l7326J9475K2518j04157l53062n89287m53675
33703e858297J93561P40655N08213q7684r3777L22982J41903n21847l76143P06795
33693d323639J115662M1372j107406q61488K21497P46156M66948o054l36461l10146
33683d353559L25848J019941O41100o45796j149315k06372O20086N6932p99162
33674d490297m09522O58439Q40992R9191m16039l55515k03320l7282K58279K09826
33664c845248m55470r26326m88627J81229J78170m5841L49167R05908O94854P7180
$$ plain form
33732 -4303400 -4525974 -5026426 -4977896 -4665610 -4955329 -5513953 -5301252 -4645739 -4939634 -6171280
33722 -6171280 -6649195 -5588115 -4247442 -3879998 -4068154 -3887832 -3465940 -3460118 -3868456
33713 -3868456 -4206412 -4316167 -4362783 -4400109 -4380634 -4358116 -4462273 -4815335 -5404622 -5858297
33703 -5858297 -5664736 -4924081 -4415868 -4503552 -4597329 -4274347 -4132444 -4654291 -5030434 -4323639
33693 -4323639 -3207977 -3166605 -4274011 -5135499 -4914002 -4167846 -3700898 -3706952 -4043413 -4353559
33683 -4353559 -4027711 -3007770 -2366670 -3012466 -4161781 -4368153 -3748067 -3691135 -4490297
33674 -4490297 -4899819 -4241380 -3400388 -3301197 -3717236 -4072751 -4276071 -4313353 -4055074 -3845248
33664 -3845248 -4300718 -5227044 -5715671 -5534442 -5356272 -5402113 -5052946 -4147038 -3452184 -3375004
33654c375004M2865M02567K46969k90804l28998R1470J74481q8276k6254K83988
33644b866996J35082l96313m72625J20572P39555R10967O21795j08286r50723
33635b266972j014685K1423J005032P31470k27344m26327K00050M63254k4521
33626a538620m68762m54249m05115m50435j97782K51035L00453o367l889L60827
33616b612904M23758K3855k48284j23812L2880N7954J54655J92174j70856o23522
33606b894102m62380K08659N01189O4781n16375p24779o25081l16908K35307P05317
33596c824372N60663j19203o35953n54651n8067M64143O40853K11930m99824o07514
33586d421995J64431Q41763N45876j45972j85557K59734L22853M0329M8971J81593
$$ plain form
33654 -3375004 -3332139 -2929572 -2682603 -2973407 -3302405 -3210935 -3036454 -3124730 -3150984 -2866996
33644 -2866996 -2731914 -3128227 -3600852 -3480280 -2740725 -1829758 -1207963 -1316249 -2266972
33635 -2266972 -3281657 -3260234 -2255202 -1523732 -1751076 -2177403 -1977353 -1514099 -1538620
33626 -1538620 -2007382 -2461631 -2866746 -3317181 -3514963 -3263928 -2963475 -2969842 -2973731 -2612904
33616 -2612904 -2189146 -2165291 -2413575 -2537387 -2504507 -2446553 -2291898 -2099724 -2270580 -2894102
33606 -2894102 -3356482 -3147823 -2646634 -2581853 -3098228 -3823007 -4448088 -4764996 -4529689 -3824372
33596 -3824372 -3263709 -3382912 -4018865 -4573516 -4631583 -4167440 -3526587 -3314657 -3814481 -4421995
33586 -4421995 -4257564 -3415801 -2869925 -3015897 -3201454 -2941720 -2618867 -2578538 -2529567 -2347974
33576b347974j19233m03588J19111Q38334M78573n86954p22426K06856N35928
33567b001373l61557j033549m71215L02039J82159k26463J178M18920K44353j18056
33557c063564O2754M28431K70681j13731m4111K42405R8596k82862k62136O1754
33547b601783J24566l2159K2126J58796m7147l77081k67062J43831K13125o7178
33537b729966p3498K99546M07871m3590m78194l55652L0201R1854j45371j62140
33527c158939K20842N80350M99536J05565j90144k76108l46370l95453j52994
33518c113715L29928M96315M7148m98526m96455j14110J8056j51289j13897K36457
33508c360088M34181L15906L30164P31046J066745P96382L19p78292j084249q14114
$$ plain form
33576 -2347974 -2467207 -2870795 -2751684 -1913350 -1434777 -2021731 -2744157 -2537301 -2001373
33567 -2001373 -2362930 -3396479 -3867694 -3565655 -3383496 -3609959 -3608781 -3189861 -2945508 -3063564
33557 -3063564 -3000810 -2572379 -2301698 -2415429 -2459540 -2217135 -2118539 -2401401 -2663537 -2601783
33547 -2601783 -2477217 -2509376 -2487250 -2328454 -2375601 -2752682 -3019744 -2875913 -2662788 -2729966
33537 -2729966 -2803464 -2503918 -2096047 -2139637 -2617831 -2973483 -2943282 -2851428 -2996799 -3158939
33527 -3158939 -2938097 -2357747 -1858211 -1752646 -1942790 -2218898 -2565268 -2960721 -3113715
33518 -3113715 -2783787 -2287472 -2240324 -2738850 -3235305 -3349415 -3331359 -3482648 -3596545 -3360088
33508 -3360088 -2925907 -2610001 -2279837 -1548791 -482046 314336 314655 -463637 -1547886 -2362000
33498b362000k63226K0941k14908n14244k49358M28057O77754J09968o50458p38787
33488c756261m6571P32038Q39519J80976n48824n56641J11810O10459M52439J39804
33478a841252K46221M54461J59686m63270p75795o63259m10293M305O13643Q81982
33468a793571M07228j85198j24094J52076k19707p81773l44422Q30516J145790
33459i13155J58517p22542m79649J48936K02520l3184P2190K96597J43401k70952
33449a397321n93671p16333m40620M21311J259023J054760m5196p11409l80285
33440a549741P5338O1371J34797N14679L60026n20793q51844K9394Q02384K63478
33430f80911o53044n62829j0371k85881r43954n94346N19526Q52337J50425k80004
$$ plain form
33498 -2362000 -2625226 -2604285 -2819193 -3333437 -3582795 -3154738 -2476984 -2367016 -3017474 -3756261
33488 -3756261 -3802832 -3070794 -2231275 -2050299 -2599123 -3155764 -3043954 -2433495 -1981056 -1841252
33478 -1841252 -1595031 -1140570 -980884 -1444154 -2219949 -2883208 -3293501 -3289196 -2675553 -1793571
33468 -1793571 -1386343 -1571541 -1695635 -1543559 -1763266 -2545039 -2889461 -2058945 -913155
33459 -913155 -754638 -1477180 -1956829 -1807893 -1605373 -1638557 -1566367 -1269770 -1126369 -1397321
33449 -1397321 -1990992 -2707325 -3147945 -2726634 -1467611 -412851 -458047 -1169456 -1549741
33440 -1549741 -1474403 -1413032 -1278235 -763556 -403530 -924323 -1776167 -1746773 -944389 -680911
33430 -680911 -1333955 -1896784 -1907155 -2193036 -3136990 -3731336 -3211810 -2359473 -2209048 -2489052
33420b489052J50774N94748M64424K20748J84268k3689m98543o90941l58975P0388
33410b375850K69387K82090L1354n35756q81189m28039L93112O30290K25787q0260
33400b469074r1380k36864m24055q1447O17724Q34004M64958K24263K24507j47299
33390a084663p23247m30524Q07192J475993N71390q94818j363175p14115J00302
33381b255665N44430O64557M40413p4679m11463k77486j05761l37047n96332l09793
33371b718826K55262L69665J2905j47361J15532K34651k13091p86873p25959M2149
33361c561946P40134O08374k00598p55067m17158M20735Q65635N87273L1482k75198
33351a956334k28119j7126J05185m6367l54057l95754l1787K31896l7893l94780
$$ plain form
33420 -2489052 -2338278 -1743530 -1279106 -1058358 -874090 -897779 -1396322 -2087263 -2446238 -2375850
33410 -2375850 -2106463 -1824373 -1793019 -2328775 -3209964 -3638003 -3244891 -2614601 -2388814 -2469074
33400 -2469074 -2560454 -2797318 -3221373 -3302820 -2685096 -1851092 -1386134 -1161871 -937364 -1084663
33390 -1084663 -1807910 -2238434 -1431242 44751 616141 -278677 -1641852 -2355967 -2255665
33381 -2255665 -1711235 -1046678 -606265 -680944 -1092407 -1369893 -1475654 -1812701 -2409033 -2718826
33371 -2718826 -2463564 -2093899 -2080994 -2228355 -2112823 -1878172 -2091263 -2878136 -3604095 -3561946
33361 -3561946 -2821812 -2213438 -2414036 -3169103 -3586261 -3165526 -2299891 -1712618 -1681136 -1956334
33351 -1956334 -2184453 -2201579 -2096394 -2142761 -2496818 -2892572 -2924359 -2692463 -2730356 -3125136
33341c125136j29869N05558N95904O3887j44661L78573P87749L51021l64878m29608
33331a511460L573P4089l44525m95954J4436N97743N16732j50155o83544o32066
33321b611131k45978j018N3175K07451M42929L26188k39013o31124l37730K23709
33311b812542L19081K2127k8568K04079J38897k71656l39045J72220N53150K64138
33301a778119k27695k31001J79479M78874M70586K38306k03970o85337p10936
33292b469813p5890O44127P19461J76607l32141l76291r3098J56856J61188k1164
33282a510158j22533L5231K64633K58346P2238j720J4452j26882k92703j09408
33272a518504K39508J37731l60616m23415K09352O70832L14328k40739j42500
$$ plain form
33341 -3125136 -3255005 -2749447 -2153543 -2089656 -2234317 -1855744 -1067995 -716974 -1081852 -1511460
33331 -1511460 -1507887 -1433798 -1778323 -2274277 -2259841 -1662098 -1145366 -1295521 -1979065 -2611131
33321 -2611131 -2857109 -2858127 -2804952 -2597501 -2154572 -1828384 -2067397 -2698521 -3036251 -2812542
33311 -2812542 -2493461 -2471334 -2499902 -2295823 -2156926 -2428582 -2767627 -2595407 -2042257 -1778119
33301 -1778119 -2005814 -2236815 -2057336 -1578462 -1107876 -869570 -1073540 -1758877 -2469813
33292 -2469813 -2545703 -1901576 -1182115 -1005508 -1337649 -1713940 -1807038 -1650182 -1488994 -1510158
33282 -1510158 -1632691 -1597460 -1332827 -1074481 -1002243 -1003963 -989511 -1116393 -1409096 -1518504
33272 -1518504 -1278996 -1141265 -1501881 -1925296 -1715944 -1045112 -730784 -971523 -1114023
33263a114023L49017M08444l5659m23968n76620o85874o20156j21379M97484O61019
33253a661715M07315K43803K80204J97125o7554k73397l79505m73910m05559j09819
33243b243012l030l35019n06651Q2488Q47640P67818R9742O1808P89354J013182
33233E74320J43355o99140m52176K51835J96031n32438q63353m38755Q8160K32403
33223a499758K02901K42422K15042J4242j55623j06344M2992M2242j81414m25538
33213a608836l67230P0477M72688L20074k65434n15068J0872P85503R79560M71689
33203C54295j72965m90272m78461l36206k31791k57096l27544k30241L2600J77106
33193a960575J32392K42551O22164P23981J00129p37420r01055l73347O8124P1874
$$ plain form
33263 -1114023 -765006 -356562 -392221 -816189 -1392809 -2078683 -2698839 -2820218 -2322734 -1661715
33253 -1661715 -1254400 -1010597 -730393 -533268 -600822 -874219 -1253724 -1727634 -2133193 -2243012
33243 -2243012 -2246042 -2581061 -3087712 -3005224 -2157584 -1389766 -1290024 -1228216 -438862 574320
33233 574320 717675 18535 -433641 -181806 14225 -518213 -1381566 -1820321 -1732161 -1499758
33223 -1499758 -1296857 -1054435 -839393 -825151 -980774 -1087118 -1044126 -1001884 -1183298 -1608836
33213 -1608836 -1976066 -1905589 -1432901 -1112827 -1378261 -1893329 -1882457 -1096954 -117394 354295
33203 354295 181330 -308942 -787403 -1123609 -1355400 -1612496 -1940040 -2170281 -2137681 -1960575
33193 -1960575 -1828183 -1585632 -963468 -239487 -139358 -876778 -1777833 -2151180 -2083056 -2011182
33183b011182M9433K42259K91880j6104l27319l62337l10765k50307J09513O72879
33173a912050P09068k0501n94259j92609N68419N32466k10986n57986j91538P4883
33163a795093j66842k69388J87580N57738K17448l64885m07883j9205J71326Q8392
33153a800812J04320K01221O8776j52302k1615L73926M86906K15206K7377Q9174
33143d07823k5845n11865q43691n00864K44447O50647L75471k40507n63469j94429
33133b017928O45342J156886P16891k91100p91041l34789L55444M54271J18720
33124A2696p330Q1392j06351m83683l49997M02630Q60376L24159o25369r10240
33114h01717m09206O9283O4320o7793k803J6371k03354l26606j08752M8645k39738
$$ plain form
33183 -2011182 -1961749 -1719490 -1427610 -1443714 -1771033 -2133370 -2444135 -2694442 -2584929 -1912050
33173 -1912050 -1202982 -1223483 -1817742 -2010351 -1441932 -909466 -1120452 -1678438 -1869976 -1795093
33163 -1795093 -1961935 -2231323 -2043743 -1486005 -1268557 -1633442 -2041325 -2060530 -1889204 -1800812
33153 -1800812 -1696492 -1495271 -1426495 -1578797 -1600412 -1226486 -739580 -524374 -496997 -407823
33143 -407823 -433668 -945533 -1789224 -2290088 -2045641 -1394994 -1019523 -1260030 -1823499 -2017928
33133 -2017928 -1372586 -215700 501191 210091 -580950 -915739 -560295 -106024 12696
33124 12696 5366 86758 -19593 -503276 -853273 -450643 409733 733892 108523 -801717
33114 -801717 -1210923 -1141640 -1077320 -1145113 -1147916 -1131545 -1334899 -1661505 -1770257 -1721612 -1961350
33103a961350n61711l11557K39020L26072q84O8688O63990Q72960K00499n65087
33093a029360n51040n7538J36456L7621J07796K05590r5227m41183p2461P92823
33083i66523J039953K97220n01487n27600j27441Q316n0923J20719L69304K13193
33073a25269k40840l66136K9655M11718L00127r9394k76622j45311p3744k61490
33063h47306m19167k24120J53053K98029J95954J81701K60245M6835m44488n90173
33053a389437j13290L69591K93512K9426J24602K61636q8838m79153j24032N65003
33043e50980M33535m44773o92143J73331Q87508M26922m39591m99124N6214K29551
33033d19550q6982j98258M9285J28472j29260l02289j65670M6621J77846L17542
$$ plain form
33103 -1961350 -2523061 -2834618 -2595598 -2269526 -2270410 -2201722 -1537732 -664772 -464273 -1029360
33093 -1029360 -1580400 -1637938 -1501482 -1463861 -1356065 -1150475 -1245702 -1686885 -1759346 -966523
33083 -966523 73430 370650 -130837 -658437 -785878 -777562 -828485 -707766 -338462 -125269
33073 -125269 -366109 -732245 -702590 -290872 9255 -90139 -366761 -512072 -585816 -847306
33063 -847306 -1266473 -1490593 -1337540 -1039511 -843557 -661856 -401611 -354776 -799264 -1389437
33053 -1389437 -1502727 -1133136 -839624 -810198 -685596 -423960 -512798 -991951 -1115983 -550980
33043 -550980 -117445 -562218 -1254361 -1081030 -193522 233400 -206191 -705315 -649101 -419550
33033 -419550 -506532 -704790 -655505 -527033 -656293 -958582 -1124252 -1077631 -899785 -582243
33023e82243M10487K30672k03903n87934o99672n20001r8262L85132N74497K98526
33013g92701j43330l32569k23098n6886q842j39515m28308o24552l94375J39105
33003c005071L96774J71208j1149K62462N78506L62268j60537k93878R1044M40826
32993a167547L19271j35628m63390l02858K56813N90505J75581n56377o16574
32984a900204P1460M40010l9524m44420L3520O18319K34819n50428l79622N69046
32974a347024P68488j91633r55972n42025L18116N46192K22107M964m085o6285
32964a247157j68725k48357m86752q21474p17339J6705O99141O47520J33517j25151
32954b318072l6084l8407j89833m4857N50537J085655R75918K50293m84773o57523
$$ plain form
33023 -582243 -171756 58916 -144987 -732921 -1432593 -1952594 -2050856 -1665724 -1091227 -792701
33013 -792701 -936031 -1268600 -1491698 -1548584 -1557426 -1696941 -2125249 -2749801 -3144176 -3005071
33003 -3005071 -2608297 -2437089 -2448238 -2185776 -1607270 -1245002 -1405539 -1699417 -1608373 -1167547
32993 -1167547 -848276 -983904 -1447294 -1750152 -1493339 -902834 -727253 -1283630 -1900204
32984 -1900204 -1828744 -1388734 -1428258 -1872678 -1839158 -1220839 -986020 -1536448 -1916070 -1347024
32974 -1347024 -578536 -770169 -1726141 -2268166 -1950050 -1403858 -1181751 -1176787 -1180872 -1247157
32964 -1247157 -1415882 -1664239 -2150991 -2972465 -3689804 -3673099 -2973958 -2326438 -2192921 -2318072
32954 -2318072 -2354156 -2392563 -2582396 -2627253 -2076716 -991061 -15143 235150 -249623 -907146
32944i07146k60423J93827K41185o5352l39372l89704l33123k46732l1106L16452
32934a821494N71557N56714L57049J45271o1014l32290n85860n62586j47621L23005
32924a557269L13162j93155n04371j26740M29158L64821j11952j17187L28656
32915a174877K31257n68541q37502Q0025J006129P22432j01211j40279L43092
32906d39475J27321p07561r20938k67919K16104R0120K6953K97989L07227o3851
32896a334030j24043K38017K42062k80693m59993M2814M02093J32954j20587N6407
32886a204999O4120l68699l94821M46371J143079P05736k71242o29898l53960
32877h64313j81934k76006l24506l47370m54916l54063J12187N10009N44888N29519
$$ plain form
32944 -907146 -1167569 -973742 -732557 -797909 -1137281 -1526985 -1860108 -2106840 -2137946 -1821494
32934 -1821494 -1249937 -693223 -336174 -190903 -251917 -584207 -1170067 -1732653 -1880274 -1557269
32924 -1557269 -1244107 -1437262 -1941633 -2068373 -1639215 -1274394 -1386346 -1503533 -1174877
32915 -1174877 -943620 -1512161 -2349663 -2269638 -1263509 -541077 -642288 -782567 -439475
32906 -439475 -312154 -1019715 -1940653 -2208572 -1992468 -1902348 -1875395 -1577406 -1270179 -1334030
32896 -1334030 -1458073 -1220056 -977994 -1258687 -1718680 -1675866 -1273773 -1140819 -1261406 -1204999
32886 -1204999 -1140879 -1509578 -1904399 -1458028 -314949 390787 119545 -510353 -864313
32877 -864313 -1046247 -1322253 -1646759 -1994129 -2449045 -2803108 -2690921 -2180912 -1636024 -1106505
32867a106505N51262J28861o24734o51997L20145R15665J47384q62709o23660
32858a806288L41242N16860p4143k14480K29844L01025p8618j2874N41311O27439
32848C71318P7495k13248M252m9456n50671o18394L9528M61734J5349o06119o02814
32837a671026j99522N9216J69548K36226P0525k26711j10776M57200O97689J55602
32827c62029n82984p79642m39065Q1076O00492Q62457N48366k5101m5643M97786
32817C55713N49528l92602j297136j031394p697N20301K36624j21194n9290J97005
32807a050142L73949M80561M70095K10800j47309k53480n6616J28021P1692j22404
32797A05167k31003j73184o4048q8796k65133l54947j79862N7664O4026k8839
$$ plain form
32867 -1106505 -555243 -426382 -1051116 -1703113 -1382968 -467303 -319919 -1182628 -1806288
32858 -1806288 -1465046 -948186 -1022329 -1236809 -1006965 -705940 -784558 -797432 -256121 371318
32848 371318 448813 235565 239817 190361 -360310 -978704 -939176 -477442 -462093 -1068212 -1671026
32837 -1671026 -1870548 -1811332 -1641784 -1405558 -1335033 -1561744 -1672520 -1215320 -517631 -362029
32827 -362029 -945013 -1724655 -2163720 -2082644 -1482152 -619695 -71329 -96430 -142073 355713
32817 355713 905241 512639 -784497 -1815891 -1823588 -1303287 -1066663 -1187857 -1247147 -1050142
32807 -1050142 -676193 -195632 274463 485263 337954 84474 27858 155879 227571 105167
32797 105167 -125836 -299020 -363068 -451864 -716997 -1071944 -1251806 -1194142 -1130116 -1158955
32787a158955J30678M35705L95064n2234l84328l12942j54834j60318q6509K20754
32777a127919L89624R5200l91842o45183o55960n67565k56872L64686R63653J129423
32767g02755Q53477L55417k35578p21046p64285l64511j5465J458O7658N23153
32757a002477R51816P51625Q2609l80840m11846l29045l07221k24621j22514k08229
32747a200743l84148l09921K0300K53428K82506L75186N76936M83952j25055p99224
32737h26783q91441l41332K92287M96597K80773K663q4384p005J11127K15652
32727g51846K39693M9097l18514m96842j97740K74167L19762q2880k73571J11800
32717a126874N32276L09465l62125o99128m30964n5456q746j05007L8439M04422
$$ plain form
32787 -1158955 -1028277 -592572 -197508 -249742 -634070 -947012 -1101846 -1262164 -1348673 -1127919
32777 -1127919 -738295 -643095 -1034937 -1680120 -2336080 -2903645 -3160517 -2795831 -1832178 -702755
32767 -702755 150722 506139 270561 -450485 -1214770 -1579281 -1594746 -1593288 -1525630 -1002477
32757 -1002477 -50661 700964 783573 402733 -9113 -338158 -645379 -870000 -992514 -1200743
32747 -1200743 -1584891 -1894812 -1874512 -1621084 -1338578 -963392 -386456 97496 -27559 -826783
32737 -826783 -1718224 -2059556 -1767269 -1270672 -989899 -987236 -1071620 -1078625 -967498 -751846
32727 -751846 -512153 -463056 -781570 -1278412 -1476152 -1201985 -882223 -965103 -1238674 -1126874
32717 -1126874 -594598 -285133 -647258 -1346386 -1777350 -1832806 -1841552 -1946559 -1908120 -1503698
32707a503698O41469N11808Q6075l74464n95622m61617j26694J17296J53679J29546
32697a422222J75578J82068q068k96189m20026l08230j22936N0911K78030M50773
32687a440311K51477k90702n31585L3481R32958J201965O49312J0347k26867l99296
32677A90779p83638r13134l76667K99494L30874j40842l33928p6288M8224k35825
32667a990951m63711k13139L01051O35767O66856N20421K92514J6065k80494n35429
32657a051050n77344k37793L03653N64301L93568K17067L37524M30014J55595
32648E35535k10576k99298k82968l69650k35411K77064N10198j1767n44030k09413
32638h40316M48327L35473k74447k74128J88539j2865p22942n54779N40309Q61983
$$ plain form
32707 -1503698 -862229 -350421 -264346 -638810 -1234432 -1696049 -1822743 -1705447 -1551768 -1422222
32697 -1422222 -1246644 -1064576 -1072644 -1368833 -1788859 -2097089 -2220025 -2169114 -1891084 -1440311
32687 -1440311 -1188834 -1479536 -2011121 -1977640 -1044682 157283 806595 816942 590075 190779
32677 190779 -592859 -1505993 -1882660 -1583166 -1252292 -1393134 -1727062 -1803350 -1755126 -1990951
32667 -1990951 -2454662 -2667801 -2366750 -1730983 -1064127 -543706 -251192 -235127 -515621 -1051050
32657 -1051050 -1628394 -1866187 -1562534 -998233 -604665 -387598 -50074 379940 535535
32648 535535 324959 25661 -257307 -626957 -862368 -585304 -75106 -86873 -630903 -840316
32638 -840316 -391989 -56516 -330963 -605091 -416552 -429417 -1152359 -1707138 -1166829 -304846
32628c04846k21180j082667m81522M81965L67749k87354k06242L90056M37461
32619i06580l9876k39339j01382q3395l3864L72921O59493K80141k29669q4631
32609d06181L38995J93179k95764l02812N5902K7770l16024k92610J6362n3943
32599a035126m15746l81465K2583J71451J22577M99374J169827J291698O79377
32590B124550k1069m88936r34435j206674q57402j04985L46164M14778N28661
32581a99348N67166J05334m30890j81129N87503O93364o8916n92927k52204K48782
32571D76735J55008l41262p29763q26667n49859L9755L92633R9340k36414J66384
32561a354110P93347N51250k62669l50211K89728L22666m70423p18152N8009N29768
$$ plain form
32628 -304846 -526026 -1608693 -2090215 -1608250 -1240501 -1527855 -1734097 -1344041 -906580
32619 -906580 -946456 -1185795 -1287177 -1370572 -1404436 -1031515 -372022 -91881 -321550 -406181
32609 -406181 -67186 125993 -169771 -472583 -416681 -388911 -704935 -997545 -981183 -1035126
32599 -1035126 -1450872 -1832337 -1809754 -1638303 -1515726 -1016352 153475 1445173 2124550
32590 2124550 2103481 1614545 680110 -526564 -1383966 -1488951 -1142787 -728009 -199348
32581 -199348 367818 473152 42262 -138867 448636 1142000 1073084 480157 227953 476735
32571 476735 631743 290481 -439282 -1265949 -1815808 -1776053 -1383420 -1284080 -1520494 -1354110
32561 -1354110 -560763 -9513 -272182 -622393 -332665 -9999 -480422 -1198574 -1140565 -610797
32551f10797m2676m79751J29042P28604J66955q08783r24321m24419k30848k12256
32541b709250J65867M72251J39763k12415J77863O48812J73842p01521o43827
32532b488615K34626N95515P2683l29972J0173N81478P93405O07423R3080n89084
32522d19288q12444j32954P48240P03040j82650p02098k57290M96711P84812N48285
32512G74364N3683m66693o53477k60222L26305M44328N5599l05947l80085l26979
32502g39124j78619J37724L50436J44377k02417j95486J4422r3420m20674l56024
32492a538805K01458P14020Q51660P27596L90227j42666m52452j50554L31123
32483I31607K13665m26287p75191n41773k07065n8316Q1798J55196j08901l98802
$$ plain form
32551 -610797 -653473 -1133224 -1004182 -275578 -108623 -917406 -1841727 -2266146 -2496994 -2709250
32541 -2709250 -2543383 -2071132 -1931369 -2143784 -1965921 -1317109 -1143267 -1844788 -2488615
32532 -2488615 -2253989 -1658474 -1585791 -1915763 -1905590 -1324112 -530707 76716 169796 -419288
32522 -419288 -1231732 -1364686 -616446 86594 -96056 -798154 -1055444 -558733 226079 774364
32512 774364 828047 361354 -292123 -552345 -226040 218288 273887 -32060 -412145 -739124
32502 -739124 -917743 -780019 -429583 -285206 -487623 -683109 -668687 -762107 -1182781 -1538805
32492 -1538805 -1337347 -623327 228333 955929 1346156 1203490 751038 600484 931607
32483 931607 1145272 718985 -56206 -597979 -805044 -863360 -781562 -626366 -735267 -1134069
32473a134069p6631O23626P25745Q8364k68077J66170N13477j8122p61747o02129
32463g43393L03379P90592L59049l02512m27954j16717L4315j69699l28577j11627
32453g13144J89253P2774l31264l76256L9617K25528j24895l09866J68443N92012
32443e67798K00381l78332j41740M53377K29919n18049l85131O25630Q98335r4777
32433C21815q30389k53526N48036L06016l80065l37047J40238Q2542l10250k14991
32423i27621J44269l7040m96120k87465M58075O63986J15275k76107p3315J42786
32413e73277J8475l2825J46041M4447m55178o33037j08709M21384K65347j85629
32403a092961j82578J52903J33375k92054m48649O49N67672O51639K71302j29559
$$ plain form
32473 -1134069 -1210700 -587074 138671 227035 -41042 125128 638605 620483 -141264 -743393
32463 -743393 -440014 350578 709627 407115 -20839 -137556 -103241 -272940 -601517 -713144
32453 -713144 -523891 -451117 -782381 -1158637 -1119020 -893492 -1018387 -1328253 -1159810 -567798
32443 -567798 -367417 -745749 -887489 -434112 -204193 -722242 -1107373 -481743 416592 321815
32433 321815 -508574 -762100 -214064 91952 -288113 -625160 -484922 -402380 -712630 -927621
32423 -927621 -783352 -820392 -1316512 -1603977 -1145902 -481916 -366641 -642748 -716063 -573277
32413 -573277 -554802 -587627 -441586 -397139 -852317 -1485354 -1594063 -1172679 -907332 -1092961
32403 -1092961 -1275539 -1122636 -989261 -1281315 -1729964 -1729315 -1161643 -510004 -238702 -368261
32393c68261k99941l34221l39010k21630J22454N56122P68945N88040J47565k47972
32383C72091l84741l00092k30880l31546m01473o7251O30258J072753P75244N1195
32373A185558m16166m72013m48939l89226j5891M86412M58810j79658n97885k24044
32363f13042L66233K91344l93462r01042q03115l19964K15202O01674O50171L34517
32353e71484k8860j35715q3734r9514j31607n8919J499k7257N1602K52025J54759
32342f77205l53130n70325O5200R20641R36247J83345k92872o4149K44565J42238
32332E34555j13899k88322n78783r15380p57552o1488L74157R8871k03432J96849
32322a714424Q54222Q45574K22094j50535K1502J37762k09840o06065m74901J73938
$$ plain form
32393 -368261 -668202 -1002423 -1341433 -1563063 -1440609 -884487 -115542 472498 620063 372091
32383 372091 -12650 -312742 -543622 -875168 -1276641 -1343892 -713634 359119 1134363 1185558
32373 1185558 769392 297379 -151560 -540786 -556677 -70265 388545 208887 -388998 -613042
32363 -613042 -246809 44535 -348927 -1249969 -2053084 -2373048 -2157846 -1556172 -906001 -571484
32353 -571484 -600344 -736059 -819793 -919307 -1050914 -1109833 -1108334 -1135591 -1083989 -831964 -677205
32342 -677205 -1030335 -1600660 -1535460 -614819 321428 504773 211901 147752 392317 534555
32332 534555 420656 132334 -446449 -1361829 -2119381 -2180869 -1806712 -1707841 -1911273 -1714424
32322 -1714424 -860202 -14628 207466 56931 78433 216195 6355 -599710 -1074611 -900673
32312i00673Q65700J130048P36923j31524q31123p88368k20020Q7546j51544l77840
32302e80875j51274J35216N82k02081J27287O52473M68401l59422o61854Q3708
32292d87839Q48945N74174k18158k85139L95941O84165Q9894o12516p12807m69938
32282a93278l62872l34290k28535k23120l32547j55116L76376O32141K30046k62397
32272h53592j82737K25295L12757J1584l36811o07536o58160q5562R37486J240064
32262B788J77676r76412n40388R97423J496656K92809q79269n66539L93474M67461
32252H65679k54379n61466j28021K60044J08347k53922m41573m64585m03373k45909
32242a519158n7055J01678L12830N36327M60826k764m05614l77850j94218k07086
$$ plain form
32312 -900673 -34973 1095075 1831998 1700474 869351 80983 -139037 -51491 -203035 -580875
32302 -580875 -732149 -596933 -596351 -798432 -671145 -18672 449729 90307 -571547 -487839
32292 -487839 361106 935280 717122 431983 827924 1512089 1601983 989467 276660 -193278
32282 -193278 -556150 -890440 -1118975 -1342095 -1674642 -1829758 -1453382 -821241 -591195 -853592
32272 -853592 -1036329 -811034 -498277 -486693 -823504 -1431040 -2089200 -2174762 -1237276 2788
32262 2788 180464 -795948 -1336336 -338913 1157743 1450552 571283 4744 398218 865679
32252 865679 611300 49834 -78187 181857 290204 36282 -405291 -869876 -1273249 -1519158
32242 -1519158 -1576213 -1474535 -1161705 -625378 -164552 -167316 -572930 -950780 -1144998 -1352084
32232a352084j33505L94206R14436O49671k06299o36663k92739P2387j06921l72387
32222a069898j54609K36614J97334j19740r1895L09257M81276J60087k41195l53420
32212f46189l15425k97232j01276L59677N94408J16024o64278p46673J41460J070534
32202d88970J045202K13703m64491m69977j23977J34639K75774L67338K66119
32193G55360p4992l42521k59762l6861p5604l40100l71047O0069N91403O76445
32183E82390K06973l78375n67866k90011P2407J52534j7676j62524j79104k11624
32173g92876l49057m60218l69640n3050L49100N89795M61337O8325j62169j0542
32163g28995J50101r5812m18412j22140O66228R40615K35469o18685o65856j29385
$$ plain form
32232 -1352084 -1485589 -1091383 -176947 472724 266425 -370238 -662977 -590590 -697511 -1069898
32222 -1069898 -1224507 -987893 -790559 -910299 -1002194 -692937 -211661 -51574 -292769 -646189
32212 -646189 -961614 -1258846 -1360122 -1000445 -406037 -290013 -954291 -1700964 -1559504 -488970
32202 -488970 556232 769935 305444 -164533 -288510 -153871 121903 489241 755360
32193 755360 680368 337847 78085 41224 -34380 -374480 -745527 -685458 -94055 582390
32183 582390 789363 410988 -156878 -446889 -374482 -221948 -239624 -402148 -581252 -792876
32173 -792876 -1141933 -1602151 -1971791 -2024841 -1675741 -1085946 -624609 -556284 -718453 -728995
32163 -728995 -578894 -674706 -1093118 -1215258 -549030 391585 627054 8369 -657487 -786872
32153g86872J27866m3649r9627R8921J02808k24677m36218k69292P210K03209
32143a320321N00242Q53141P37089n3332q29483p79907n8696M09250J20944m38457
32133h59530m74923J48762P49263N52070m46957j374052j326358l22988P33332
32124b621381J041058O47972J80887O9404J89157J55803j57299m12246j91799
32115a098444L69519N96573J59202l59718k50540K33798K76485j42692k12927
32106d28744K38756L04914m57478j055878n21393M64776N46200k25997n73626
32097a708470m6275M47822K80499j6856Q2502J96968q5980l58679j35705K80466
32087a063708L82881K90892L15369K81605p225k01284m8348k1854m56051o63707
$$ plain form
32153 -786872 -659006 -702655 -802282 -703361 -600553 -825230 -1261448 -1530740 -1523530 -1320321
32143 -1320321 -820079 33062 770151 716819 -112664 -892571 -951267 -542017 -421073 -859530
32133 -859530 -1334453 -1185691 -436428 115642 -331315 -1705367 -3031725 -3354713 -2621381
32124 -2621381 -1580323 -932351 -751464 -682060 -492903 -337100 -494399 -906645 -1098444
32115 -1098444 -728925 -132352 26850 -332868 -583408 -349610 -73125 -215817 -428744
32106 -428744 -189988 114926 -342552 -1398430 -1919823 -1455047 -908847 -1134844 -1708470
32097 -1708470 -1754745 -1306923 -1026424 -1043280 -960778 -763810 -849790 -1208469 -1344174 -1063708
32087 -1063708 -680827 -389935 -74566 207039 199814 -1470 -49818 -71672 -527723 -1191430
32077a191430J8464Q25203N07077o12477r81742k20824L51628q1289o16474k98972
32067b300836L26639L02698j52893k39449K2595Q8784J2822J87570M05394K37169
32057a109507O089L27105R28167R84982M51270o114k57213p39220j256130r99482
32047a670053p01O21891K80054k76957k48046J32698L48309M52837N03447R5836
32037B39315p09164q88887R9454J129663Q26767l80469r08070l72665R2652j66633
32027a038037m30104k7635N75200O95443M65246K91930Q1125k91975l97820P1400
32017e227N33221K51049m85560p51873l78827r6408k85207m30965o0888M87233
32007a223452O25755L30860k9926k95460m89066m79092j34139L13834M64624K51200
$$ plain form
32077 -1191430 -1172966 -347763 159314 -453163 -1434905 -1655729 -1304101 -1385390 -2001864 -2300836
32067 -2300836 -1974197 -1671499 -1824392 -2063841 -2041246 -1952462 -1939640 -1752070 -1346676 -1109507
32057 -1109507 -1103418 -776313 151854 1136836 1588106 1581992 1324779 585559 -670571 -1670053
32047 -1670053 -1670754 -1048863 -768809 -1045766 -1293812 -1161114 -812805 -359968 143479 239315
32037 239315 -469849 -1358736 -1259282 -129619 697148 316679 -591391 -964056 -871404 -1038037
32027 -1038037 -1468141 -1495776 -920576 -225133 240113 532043 613168 321193 -76627 -5227
32017 -5227 527994 779043 293483 -458390 -837217 -933625 -1218832 -1649797 -1710685 -1223452
32007 -1223452 -597697 -266837 -296763 -592223 -1081289 -1560381 -1694520 -1380686 -916062 -664862
31997f64862n3757k30517k17470K4741L89349N01502J46024k93650l03170l1097
31987g32907j3594j75203J01824P84213R69244K60876n05917n27520k05665k60025
31977c04674m27153r1430L88485K35590k46894j14115M57465L59875m12379n55586
31967g10816K81243O92723j74894j053897n43811N86615O27603m10109j028000
31958a733343o47796j22498L549J52285M93213N05550J07412j3169L63797N09322
31948c81678R53n16650l83600J18930M36197N81040P09749N83733J05676k42609
31938A011741j50164o5377l67764n76071j84296K82099K2707o20043n94880J56718
31928a085330N66217J35778l07097K3020O40775N89744j15112n83360l15374K91990
$$ plain form
31997 -664862 -718619 -949136 -1166606 -1141865 -752516 -251014 -104990 -398640 -701810 -732907
31987 -732907 -746501 -921704 -819880 -35667 933577 1194453 688536 161016 -44649 -304674
31977 -304674 -731827 -823257 -434772 -199182 -446076 -560191 -102726 257149 -155230 -710816
31967 -710816 -429573 263150 88256 -965641 -1509452 -922837 -295234 -705343 -1733343
31958 -1733343 -2381139 -2503637 -2500088 -2347803 -1854590 -1349040 -1241628 -1254797 -891000 -381678
31948 -381678 -380725 -897375 -1280975 -1162045 -725848 -144808 564941 1148674 1254350 1011741
31938 1011741 861577 796200 428436 -147635 -331931 -49832 -27125 -647168 -1242048 -1085330
31928 -1085330 -519113 -383335 -690432 -667412 -26637 563107 447995 -135365 -450739 -158749
31918a58749O42519N78788K36349k67112p44825q44068l86379K70764N23125K37524
31908H7936p0452O4449M01977L44715j59599m79138j80818L24131L27919j99085
31898D62035n74249l20445K35952M22437N7080l74181l23367J86037N83361L72336
31888G26996l27347r01566q81412l72841J71299M64656N26254L97336J735n74582
31878g69472q79391m96241L36545Q38908O10769J66962K22609O48183O33999j23304
31868A189567r65185j183988q53368m23026n395M31446N90723K29960k29638j68504
31858a387408K70018L64183p8383m90532m64267k02677N2571L34045N13845K85291
31848h03314j69289k33090J16548J46869l34925m36787L61675J067131N03947
$$ plain form
31918 -158749 483770 1062558 1298907 1031795 286970 -557098 -943477 -672713 -149588 87936
31908 87936 17484 81933 483910 828625 669026 189888 9070 333201 661120 462035
31898 462035 -112214 -432659 -196707 225730 282810 -91371 -414738 -228701 354660 726996
31888 726996 399649 -501917 -1383329 -1756170 -1584871 -1120215 -593961 -196625 -194890 -769472
31878 -769472 -1648863 -2145104 -1808559 -969651 -358882 -191920 30689 678872 1312871 1189567
31868 1189567 224382 -959606 -1812974 -2236000 -2241395 -1809949 -1219226 -989266 -1218904 -1387408
31858 -1387408 -1117390 -753207 -831590 -1322122 -1786389 -1989066 -1936495 -1602450 -1088605 -803314
31848 -803314 -972603 -1205693 -1089145 -942276 -1277201 -1713988 -1352313 -285182 218765
31839B18765q17358j338514o51252J48136K51841R5681K78975N77844N17144J62992
31829e55746j54036l38069l28832O8669P17457R80254M98687k15094m24592j17499
31819A31199J42817Q3724l6386L8213K00438J88967p9839m06629m46069o1884
31809b45449L84725L37120k18145o03064k98578L25693N02692J09120k37411j11114
31799e4411J27762j38467r03375j422333r82532K76441J361807J353852L81112
31790a44m75307l71093L71881P37264K75647m45343o69251l67725j03397j92987
31780a240455l51745j97718J84444M05284L56820L07898L50833J12185o57879
31771g30333j419756j275900j41473R80834J154443N68724P5289k9659j90797
$$ plain form
31839 218765 -598593 -1937107 -2588359 -2440223 -2188382 -2092701 -1813726 -1235882 -718738 -555746
31829 -555746 -709782 -1047851 -1376683 -1308014 -590557 389697 888384 673290 248698 131199
31819 131199 274016 357740 321354 359567 560005 748972 669133 262504 -183565 -245449
31809 -245449 139276 476396 258251 -344813 -643391 -317698 184994 294114 56703 -54411
31799 -54411 73351 -65116 -968491 -2390824 -3373356 -3096915 -1735108 -381256 -144
31790 -144 -475451 -846544 -474663 262601 538248 92905 -576346 -944071 -1047468 -1240455
31780 -1240455 -1592200 -1789918 -1605474 -1200190 -843370 -535472 -184639 -72454 -730333
31771 -730333 -2150089 -3425989 -3567462 -2586628 -1432185 -863461 -788172 -817831 -1008628
31762a008628o22004p93506j98831P76394J213639P69034K3904k97876j22862
31753b60736J08391J05490j7604n6901n593K7120n730q2855j61584j59463j5534
31742e24999J61246J63106L521k7413K04772M03897K66235j7402o3968L2472j54605
31731D46862n63518n75208k389M34046Q8655n85241o27373M0836N19758K30350
31721e93222l60855n28375k33521Q4599K48514M00646N33980M35579Q1262k60954
31711a92347l68179k67865r1869N3763O2762r2788k17744o7726K56902L45796
31701e79295M8961k42498j27182J98792K06290j87179n01942m09549j52166m3414
31691a789182P5205M85463R27384Q10648J10847m52383l54170L2986M1175k94418
$$ plain form
31762 -1008628 -1630632 -2424138 -2622969 -1846575 -632936 136098 160002 -137874 -260736
31753 -260736 -152345 -46855 -64459 -121360 -126953 -99833 -105563 -188418 -350002 -509465 -524999
31742 -524999 -363753 -200647 -197126 -224539 -19767 384130 650365 632963 568995 601467 446862
31731 446862 -116656 -691864 -694253 -260207 -171552 -756793 -1384166 -1343330 -823572 -593222
31721 -593222 -954077 -1482452 -1715973 -1631374 -1382860 -982214 -448234 -12655 68607 -192347
31711 -192347 -560526 -828391 -920260 -866497 -803735 -896523 -1114267 -1181993 -925091 -579295
31701 -579295 -530334 -772832 -900014 -701222 -494932 -682111 -1184053 -1593602 -1745768 -1789182
31691 -1789182 -1713977 -1228514 -301130 509518 620365 167982 -186188 -153202 -112027 -406445
31681d06445l55438M6218L64330J82291j45960r2308J88078J28511k88172m50247
31671h29142q0599K92925J33140k89673l31762O2028L73709L64889L18497L76312
31661C90324K47839j63376m00224j58762R6189j81927o37319m77233J79427L13678
31651g91384m00766r01445k37294R27630J202863M83746J3995M36895Q80911M20527
31641B035678m74964p16536k17276J61570l884k76667k78669j85835j65910p1074
31631a93567Q3099K3087j42502P9297N87803N39084k74981p75498j84317N41113
31621B82618P0784j070058j156241K8942Q29821L60212j97774K58078Q54913L07198
31611E68493p81850q16973K23880Q29518L91775n1968K42750N51651Q7821o00616
$$ plain form
31681 -406445 -761883 -715665 -351335 -169044 -315004 -407312 -219234 -90723 -378895 -829142
31671 -829142 -909741 -616816 -483676 -773349 -1105111 -1043083 -669374 -304485 14012 390324
31661 390324 638163 474787 74563 -84199 11990 -169937 -807256 -1284489 -1105062 -791384
31651 -791384 -1192150 -2093595 -2330889 -1403259 -200396 283350 297345 734240 1615151 2035678
31641 2035678 1560714 844178 626902 788472 784588 507921 229252 43417 -122493 -193567
31631 -193567 -110468 -87381 -229883 -150586 437217 976301 701320 -74178 -258495 282618
31621 282618 353402 -716656 -1872897 -1843955 -1014134 -653922 -851696 -593618 261295 568493
31611 568493 -213357 -1030330 -806450 23068 414843 362875 605625 1157276 1245097 644481
31601F44481n43744Q7309K74757l19036r04520o26490L93637J158716Q21785l40108
31591F46787j081544o03701L75644N45251j29895l62877M36547J139379N49105
31582A514696p74582j302060o38074J87632L25114J2344j64692o5998J64357M02672
31572c38591M44787J08436l62793m56379j30159O7712j75388m69825l86430j36285
31562a834915j40982k48477M1184O45171P98574J24966o36704m68554N00223J006151
31552b13363L13803o99069p13545J38334M81779j71520o09061J85810J293539
31543F707J091182l19227j213868p17910J13751N7263n53016n96205Q8673O30249
31533a412401M77888J8902j48689K1770J45178j4542k37501q6478N22072J055182
$$ plain form
31601 644481 100737 188046 462803 143767 -760753 -1387243 -993606 165110 986895 646787
31591 646787 -434757 -1038458 -662814 -117563 -247458 -610335 -173788 965591 1514696
31582 1514696 740114 -561946 -1200020 -1012388 -687274 -674930 -839622 -905620 -741263 -338591
31572 -338591 106196 214632 -148161 -604540 -734699 -666987 -842375 -1312200 -1698630 -1834915
31562 -1834915 -1975897 -2224374 -2183190 -1538019 -739445 -614479 -1251183 -1719737 -1219514 -213363
31552 -213363 100440 -598629 -1312174 -1173840 -692061 -863581 -1472642 -1286832 6707
31543 6707 1097889 778662 -435206 -1153116 -1039365 -982102 -1535118 -2131323 -2042650 -1412401
31533 -1412401 -934513 -915611 -1064300 -1042530 -897352 -911894 -1149395 -1235873 -713801 341381
31523C41381R08721J90406m06082n41096n49158o70120n73358m2358M30879L26307
31513e84478m8450o1342J89543R5382l39228m26736P9955N75176N42300K27901
31503B50023N1181n3804k80956m42385l23718j78813l30944n30456k64054M14202
31493a689724Q83263P74700L40036k9186k14083k09673K3619L40721L60699j07445
31483D72927p66476j141569j031968n34334J41331O85874P83910M95564L38035
31474e56706O13367Q25043K69746q22978j349998p40179K64062O33216L77671
31465d86756K44111M03498K50156m58569j052738q97952l15455n3097k14504k86185
31455b867491m2000J82191J41910P5856K48561N07191N85070N65797O81715P85724
$$ plain form
31523 341381 1250102 1440508 1034426 493330 -55828 -725948 -1299306 -1341664 -910785 -584478
31513 -584478 -632928 -694270 -504727 -409345 -748573 -1175309 -1095354 -520178 22122 250023
31503 250023 301204 247400 -33556 -475941 -799659 -978472 -1309416 -1839872 -2103926 -1689724
31493 -1689724 -806461 -31761 308275 279089 65006 -144667 -121048 219673 580372 472927
31483 472927 -293549 -1435118 -2467086 -3001420 -2860089 -2174215 -1390305 -894741 -556706
31474 -556706 56661 881704 1151450 328472 -1021526 -1761705 -1497643 -864427 -486756
31465 -486756 -242645 160853 411009 -47560 -1100298 -1998250 -2313705 -2366802 -2581306 -2867491
31455 -2867491 -2909491 -2727300 -2585390 -2509534 -2260973 -1753782 -1168712 -602915 78800 864524
31445H64524M37648m07137j133616j124964m99359P9342K22218J21704O4537N9558
31435a315545Q7301K63349M39274J12021p25817j072542j04574J322513J451057
31426D57037O7369j009690m63850O38658N35383n79603j026243k94527M03470
31417a271996K83847P6172M34869O97762J53274n46439l81508L46854N19009k0545
31407B91299l60501o7443K65811J28612j80293k00101L0422K38388K84773N7799
31397D88766m65142q60129n34287L67623Q76973L83084n53494r65894o64756k03078
31387b130334L2633J54753L06303L66305K29347O4036J08089L12986L47977K0036
31377a87869l79847l48011J43554N09622L37731n269J9620K14385P429m47393
$$ plain form
31445 864524 1302172 895035 -238581 -1363545 -1862904 -1783562 -1561344 -1439640 -1375103 -1315545
31435 -1315545 -1228244 -964895 -525621 -413600 -1139417 -2211959 -2316533 -994020 457037
31426 457037 524406 -485284 -949134 -310476 224907 -354696 -1380939 -1675466 -1271996
31417 -1271996 -988149 -911977 -477108 220654 373928 -172511 -554019 -207165 311844 291299
31407 291299 -69202 -136645 129166 257778 77485 -122616 -92194 146194 430967 488766
31397 488766 23624 -836505 -1370792 -1003169 -126196 256888 -296606 -1262500 -1927256 -2130334
31387 -2130334 -2097701 -1942948 -1636645 -1270340 -1040993 -976957 -868868 -555882 -207905 -187869
31377 -187869 -567716 -915727 -772173 -262551 75180 69911 89531 303916 311345 -136048
31367a36048m09272J36730K74840l69562q96514m93849K99173N16489K65323L00278
31357e12412N89505M40473j63940m87319k91746j02079r7443K02328Q35948R86146
31347A399461J90521q20134j076452n60519Q4609M71792N41159K22184l52660
31338I9961o55304l55688J69667L96925L82832M14556L02195k94766j034293j108194
31328a682109l18838O28248R97090P46960L12275N1655L5701J03267K4217k44085
31318F54381m80848n03529m02979l04969j20275J99236L93771K49520K8684J32693
31308a54315M67002N64335K55257j95129n44365p37377o62731k10530L70373N77452
31298b70028K43276k40873l59730K8335N71673O66775K5071q14590q92070o4390
$$ plain form
31367 -136048 -545320 -408590 -133750 -503312 -1399826 -1893675 -1594502 -1078013 -812690 -512412
31357 -512412 77093 517566 353626 -133693 -425439 -527518 -624961 -422633 413315 1399461
31347 1399461 1589982 769848 -306604 -867123 -782514 -310722 230437 452621 99961
31338 99961 -555343 -911031 -741364 -344439 38393 452949 755144 460378 -573915 -1682109
31328 -1682109 -2000947 -1372699 -375609 371351 683626 735281 770982 874249 898466 654381
31318 654381 173533 -329996 -732975 -1037944 -1158219 -958983 -565212 -315692 -287008 -154315
31308 -154315 312687 877022 1132279 937150 392785 -344592 -1007323 -1217853 -847480 -270028
31298 -270028 -26752 -267625 -627355 -599020 -27347 639428 664499 -150091 -1042161 -1106551
31288a106551O17167K84750m83399n44491Q2279L88922P1432j26731J59015L45067
31278c12540J03583J2071M39127P67949M35472q4577j13988J12107j4389l78329
31268I66486m27273j28523J48532L38896N15936L80426k83343r25227q16441j33395
31258c63926K99178J82181p3909j81969k47534l07206k91913l26723m08874m7967
31248a768662R46028J596842P85348r06433j587236n47448P93777R07550N9778
31239B79544n02441l75332r7320J171Q7282J95617J19828q3825q7239J57410L00030
31228e275J24336j17772n2685K80378M11252L5193m58466l59249L30394O65918
31218H54024J787r27533q75783J66503R33388O08173k59926p23753n13432R1570
$$ plain form
31288 -1106551 -489384 -204634 -688033 -1232524 -1150245 -761323 -689891 -816622 -657607 -312540
31278 -312540 -208957 -196886 242241 1010190 1445662 1361085 1247097 1359204 1344815 966486
31268 966486 539213 410690 559222 898118 1414054 1794480 1511137 585910 -230531 -363926
31258 -363926 -64748 117433 43524 -138445 -385979 -693185 -985098 -1311821 -1720695 -1768662
31248 -1768662 -822634 774208 1559556 653123 -934113 -1481561 -687784 219766 279544
31239 279544 -222897 -598229 -695549 -694378 -607096 -411479 -291651 -375476 -462715 -305305 -5275
31228 -5275 119061 1289 -51396 228982 640234 675427 216961 -142288 188106 854024
31218 854024 855811 -71722 -947505 -781002 152386 760559 500633 -223120 -736552 -644982
31208f44982O76341P01926r3384r95681q76755J83318P89237K28807m84308k78642
31198g94123L48292L71229n5833j58396l7076k32748l70781K62312J119332R36810
31188A389018j73242p13071p8215O02501L25260l96728o05563k75309P3383K72536
31178D20570L45800J31526l32748o04118m78214l03147k99807j80399K17441N77636
31168e05460P22431Q58274Q62270J85586j027945j629394r82526P223K04700j32929
31158a437770j904O54021R67325N57764p4335m29648m46590j71485K45286L32739
31148A95403j96701q20522p65061q8708M50397M68824K07716j35108n37687o98214
31138a919661k85702L10854L05257k78898n27043m581N55558L42348l65756o35270
$$ plain form
31208 -644982 31359 733285 639901 -355780 -1232535 -1049217 -259980 -31173 -515481 -794123
31198 -794123 -445831 -74602 -130435 -288831 -325907 -558655 -929436 -667124 452208 1389018
31188 1389018 1215776 502705 424490 1026991 1352251 955523 349960 74651 148034 420570
31178 420570 766370 897896 565148 -38970 -517184 -820331 -1120138 -1300537 -1083096 -505460
31168 -505460 216971 1075245 1937515 2123101 1095156 -534238 -1516764 -1509541 -1304841 -1437770
31158 -1437770 -1439674 -785653 181672 739436 665101 235453 -211137 -382622 -137336 195403
31148 195403 -1298 -821820 -1586881 -1675589 -1225192 -756368 -548652 -683760 -1221447 -1919661
31138 -1919661 -2205363 -1894509 -1589252 -1868150 -2395193 -2399774 -1844216 -1501868 -1867624 -2502894
31128b502894j25250N70558P21324L07076O847L38876Q95101P69292j48824q68141
31118c6035o75145j66666j92545l99799Q6973R45986R67282L4284n91651k28896
31108b56212L04770K12527q8970K02J41540j62329n53636m98040k56540k91290
31098a447978l49895m9380K18961o3624m82264k79671L54997N85719K69018M1695
$$ plain form
31128 -2502894 -2628144 -2057586 -1336262 -1029186 -1022339 -683463 211638 980930 832106 -36035
31118 -36035 -711180 -877846 -1070391 -1470190 -1383217 -437231 530051 564335 -27316 -256212
31108 -256212 48558 261085 172115 172317 313857 151528 -402108 -900148 -1156688 -1447978
31098 -1447978 -1797873 -1847253 -1628292 -1691916 -2174180 -2453851 -2098854 -1513135 -1244117 -1202422
$$ [...]
##END NTUPLES=NMR SPECTRUM
##END=
