##TITLE=31Pdec_LY-TMF-1.70.3
 D2O, 24 sc
 25.2.2020
##JCAMPDX= 6.0         $$ Bruker NMR JCAMP-DX V2.0
##DATA TYPE= NMR SPECTRUM
##DATA CLASS= NTUPLES
##ORIGIN= UXNMR, Bruker Analytische Messtechnik GmbH
##OWNER= root
$$ XWIN-NMR		Version 3.5
$$ Tue Feb 25 14:01:39 2020 Russian Standard Time (UT+4h)  she@DPX200
##.OBSERVE FREQUENCY= 81.013821
##.OBSERVE NUCLEUS= ^31P
##.ACQUISITION MODE= SIMULTANEOUS
##.ACQUISITION SCHEME= undefined
##.AVERAGES= 24
##.DIGITISER RES= 17
##SPECTROMETER/DATA SYSTEM= spect
##.PULSE SEQUENCE= zgpg30
##.SOLVENT NAME= CDCl3
##.SHIFT REFERENCE= (INTERNAL, CDCl3, 0, 182.463)
##AUDIT TRAIL= $$ (NUMBER, WHEN, WHO, WHERE, WHAT)
$$ ##TITLE= Audit trail, XWIN-NMR		Version 3.5
$$ ##JCAMPDX= 5.01
$$ ##ORIGIN= Bruker BioSpin GmbH
$$ ##OWNER= she
$$ F:/spectra/data/she/nmr/P31/1/pdata/1/auditp.txt
$$ ##AUDIT TRAIL=  $$ (NUMBER, WHEN, WHO, WHERE, WHAT)
(   1,<2020-02-25 14:00:04.96 +0400>,<she>,<DPX200>,
      <created by zg, POWCHK disabled, PULCHK disabled
       configuration hash MD5:
       00 E9 B6 7A A2 85 ED C7 34 08 36 98 17 FE 4E 26
       data hash MD5: 32K
       99 EF 44 F3 7D CC D1 42 60 D6 7B F2 9B B6 DD B7>)
(   2,<2020-02-25 14:00:07.40 +0400>,<she>,<DPX200>,
      <Start of raw data processing
       efp BC_mod = 2 LB = 1 FT_mod = 6 PKNL = 1 PHC0 = -1411.443 PHC1 = 256.8013 SI = 64K 
       data hash MD5: 64K
       E9 EA E7 95 A3 BE 5D 6E CE CB 16 09 85 B8 14 13>)
(   3,<2020-02-25 14:00:33.09 +0400>,<she>,<DPX200>,
      <pk PHC0 = 5.561293 PHC1 = -11.2 
       data hash MD5: 64K
       A7 86 2B 60 14 55 1E 13 25 CC 6D E8 97 C9 05 BC>)
(   4,<2020-02-25 14:00:36.20 +0400>,<she>,<DPX200>,
      <abs ABSG = 5 
       data hash MD5: 64K
       E4 23 52 A4 1D 7C CC E5 60 67 5D 9D 78 D4 11 5F>)
(   5,<2020-02-25 14:00:52.67 +0400>,<she>,<DPX200>,
      <pk PHC0 = -5.20067 PHC1 = 0 
       data hash MD5: 64K
       64 6B 5A E0 8E 0B B8 10 74 5E B5 0B F9 04 77 76>)
(   6,<2020-02-25 14:00:56.20 +0400>,<she>,<DPX200>,
      <abs ABSG = 5 
       data hash MD5: 64K
       C8 12 28 33 B7 79 22 4D 1A 9E 53 D1 34 38 CE 55>)
$$ ##END=
$$ 
$$ hash MD5
$$ 14 DE D0 37 50 98 68 0A 4E D6 7F 91 52 AA 95 10
##$RELAX= 
##$RELAX= 
##$RELAX= 
##$RELAX= 
##$RELAX= 
##$RELAX= 
##$RELAX= 
##$RELAX= 
$$ Bruker specific parameters
$$ --------------------------
##$DU= <F:/spectra>
##$EXPNO= 1
##$NAME= <P31>
##$PROCNO= 1
##$TYPE= <nmr>
##$USER= <she>
##$AMP= (0..31)
100 100 100 100 100 100 100 100 100 100 100 100 100 100 100 100 100 100 
100 100 100 100 100 100 100 100 100 100 100 100 100 100 
##$AQSEQ= 0
##$AQ_mod= 1
##$AUNM= <au_zg>
##$AUTOPOS= <>
##$BF1= 81.014009
##$BF2= 200.13
##$BF3= 200.13
##$BF4= 200.13
##$BF5= 200.13
##$BF6= 200.13
##$BF7= 200.13
##$BF8= 200.13
##$BYTORDA= 1
##$CFDGTYP= 0
##$CFRGTYP= 5
##$CHEMSTR= <none>
##$CNST= (0..31)
1 1 145 1 1 1 1 1 1 1 1 1 1 1 1 1 1 1 1 1 1 1 1 1 1 1 1 1 1 1 1 1 
##$CPDPRG= <waltz16>
##$CPDPRG1= <>
##$CPDPRG2= <waltz16>
##$CPDPRG3= <>
##$CPDPRG4= <mlev>
##$CPDPRG5= <mlev>
##$CPDPRG6= <mlev>
$$ [...]
##$SUBNAM3= <"">
##$SUBNAM4= <"">
##$SUBNAM5= <"">
##$SUBNAM6= <"">
##$SUBNAM7= <"">
##$SUBNAM8= <"">
##$SUBNAM9= <"">
##$SW= 369.568048894756
##$SWIBOX= (0..15)
0 1 3 0 0 0 0 0 0 0 0 0 0 0 0 0 
##$SW_h= 29940.119760479
##$TD= 32768
##$TD0= 1
##$TE= 0
##$TE2= 300
##$TE3= 300
##$TEG= 300
##$TL= (0..7)
0 120 53 12 22 120 120 120 
##$TP= (0..7)
150 150 150 150 150 150 150 150 
##$TP07= 0
##$TPNAME0= <>
##$TPNAME1= <>
##$TPNAME2= <>
##$TPNAME3= <>
##$TPNAME4= <>
##$TPNAME5= <>
##$TPNAME6= <>
##$TPNAME7= <>
##$TPOAL= (0..7)
0.5 0.5 0.5 0.5 0.5 0.5 0.5 0.5 
##$TPOFFS= (0..7)
0 0 0 0 0 0 0 0 
##$TUNHIN= 0
##$TUNHOUT= 0
##$TUNXOUT= 0
##$USERA1= <user>
##$USERA2= <user>
##$USERA3= <user>
##$USERA4= <user>
##$USERA5= <user>
##$V9= 5
##$VALIST= <valist>
##$VCLIST= <CCCCCCCCCCCCCCC>
##$VD= 0
##$VDLIST= <DDDDDDDDDDDDDDD>
##$VPLIST= <PPPPPPPPPPPPPPP>
##$VTLIST= <TTTTTTTTTTTTTTT>
##$WBST= 1024
##$WBSW= 4
##$XGAIN= (0..3)
0 0 0 0 
##$XL= 0
##$YL= 0
##$YMAX_a= 16989
##$YMIN_a= -17798
##$ZGOPTNS= <>
##$ZL1= 120
##$ZL2= 120
##$ZL3= 120
##$ZL4= 120
##$ABSF1= 182.463
##$ABSF2= -187.1042
##$ABSG= 5
##$ABSL= 3
##$ALPHA= 0
##$AQORDER= 0
##$ASSFAC= 0
##$ASSFACI= 0
##$ASSFACX= 0
##$ASSWID= 0
##$AUNMP= <proc_1d>
##$AZFE= 0.1
##$AZFW= 0.5
##$BCFW= 0
##$BC_mod= 2
##$BYTORDP= 0
##$COROFFS= 0
##$CY= -3
##$DATMOD= 1
##$DC= 0
##$DFILT= <>
##$DTYPP= 0
##$F1P= 0
##$F2P= 0
##$FCOR= 1
##$FTSIZE= 65536
##$FT_mod= 6
##$GAMMA= 0
##$GB= 0
##$INTBC= 1
##$INTSCL= 5.30512e-09
##$ISEN= 30
##$LB= 1
##$LEV0= 0
##$LPBIN= 0
##$MAXI= 10000
##$MC2= 0
##$MEAN= 0
##$ME_mod= 0
##$MI= 50
##$NCOEF= 0
##$NC_proc= -4
##$NLEV= 6
##$NOISF1= 182.463
##$NOISF2= 159.3651
##$NSP= 0
##$NTH_PI= 0
##$NZP= 0
##$OFFSET= 182.463
##$PC= 4
##$PHC0= -1411.083
##$PHC1= 245.6013
##$PH_mod= 1
##$PKNL= yes
##$PPARMOD= 0
##$PSCAL= 0
##$PSIGN= 0
##$REVERSE= no
##$SF= 81.0140089999434
##$SI= 65536
##$SIGF1= 159.3651
##$SIGF2= -187.1042
##$SINO= 113.3802
##$SIOLD= 16384
##$SREGLST= <1H.CDCl3>
##$SSB= 0
##$STSI= 65536
##$STSR= 0
##$SW_p= 29940.119760479
##$SYMM= 0
##$S_DEV= 0
##$TDeff= 32768
##$TDoff= 0
##$TI= <>
##$TILT= no
##$TM1= 0
##$TM2= 0
##$TOPLEV= 0
##$USERP1= <user>
##$USERP2= <user>
##$USERP3= <user>
##$USERP4= <user>
##$USERP5= <user>
##$WDW= 1
##$XDIM= 65536
##$YMAX_p= 452323561
##$YMIN_p= -4690724
$$ End of Bruker specific parameters
$$ ---------------------------------
##NTUPLES= NMR SPECTRUM
##VAR_NAME=  FREQUENCY,     SPECTRUM/REAL,   SPECTRUM/IMAG
##SYMBOL=    X,             R,               I
##VAR_TYPE=  INDEPENDENT,   DEPENDENT,       DEPENDENT
##VAR_FORM=  AFFN,          ASDF,            ASDF
##VAR_DIM=   65536,         65536,           65536
##UNITS=     HZ,            ARBITRARY UNITS, ARBITRARY UNITS
##FACTOR=    0.456856943014862, 1,           1
##FIRST=     14782.0589164792, 0,            0
##LAST=      -15158.0608439998, 0,           0
##MIN=       -15158.0608439998, -4690724,    0
##MAX=       14782.0589164792, 452323561,    0
$$ Real data points
##PAGE= N=1
##DATA TABLE= (X++(R..R)), XYDATA
$$ [...]
36943E3207J63396M15455K85358k47467o18184m24922J3326J35322q3333k13667
$$ 53207 216603 632058 917416 669949 51765 -373157 -359831 -224509 -307842 -521509
36933e21509q2706N1231K1566M429J27152K10878J03341l6646j3130R7509J39808
$$ -521509 -604215 -552984 -531418 -526989 -399837 -188959 -85618 -122264 -135394 -37885 101923
36922A01923J52821J99754J43865j01834k82681j21471J80401J57698k20401m65725
$$ 101923 254744 454498 598363 496529 213848 92377 272778 430476 210075 -255650
36912b55650k61453J29477K96939K06699Q3171K7482j905j2226j7418j08402k63850
$$ -255650 -517103 -387626 -90687 116012 199183 226665 224760 212534 195116 86714 -177136
36901a77136k52750K1316K43525Q1466k63100k84618Q4002L83761L29108J47950
$$ -177136 -429886 -408570 -165045 -83579 -346679 -631297 -547295 -163534 165574 313524
36891C13524P9128j3282k51926l79634j62141J51363J93965O6758R9221K17246
$$ 313524 392652 379370 127444 -252190 -414331 -262968 -69003 -2245 96976 314222
36881C14222Q3478k22066k35731J32914M19889L12256L7060j32336k67815m28418
$$ 314222 397700 175634 -60097 72817 492706 804962 842022 709686 441871 13453
36871A3453l74067Q349L61550L25705O3690n2271j6643n6918j47318q7236Q2465
$$ 13453 -360614 -352265 9285 334990 398680 346409 329766 272848 125530 38294 120759
36860A20759J60172J74717K83278L54488R4195m03384o52060m23900o4607j4990
$$ 120759 280931 455648 738926 1093414 1187609 784225 132165 -291735 -356342 -371332
36850c71332k63716m26419k23364K27981N31776M10383J9432k15577j22354M3736
$$ -371332 -635048 -1061467 -1284831 -1056850 -525074 -114691 -95259 -310836 -433190 -389454
36840c89454M8869K4038J31366J85005k8170k73705j52193K71182N45617M58225
$$ -389454 -340585 -316547 -185181 -176 -28346 -302051 -454244 -183062 362555 820780
36830H20780J78597j16686l37643l08889J8952K75655J00042k30728j82130J15803
$$ 820780 999377 882691 545048 236159 255111 530766 630808 400080 217950 333753
36820C33753M3827l99923n01658l2826L12967P3102k12803M4040M72309M09104
$$ 333753 377580 -22343 -524001 -556827 -243860 -170758 -383561 -339521 132788 541892
36810E41892K6480k7220K42172K33393k18946o21937o04349k94494P7128L98296
$$ 541892 568372 541152 783324 1016717 797771 175834 -428515 -723009 -645881 -247585
36800b47585M97976K68914j9019q586J56651M3677k83810k87266J36788L88830
$$ -247585 250391 519305 500286 491700 648351 692028 408218 120952 257740 646570
36790F46570P7111l41992k39615K50915M46508P3789m27176n38956k55774O1789
$$ 646570 723681 381689 142074 392989 839497 913286 486110 -52846 -308620 -246831
36780b46831J88968K10238K59295K78567J40571q6367j70888l0902J48000J59576
$$ -246831 -57863 152375 411670 690237 830808 744441 573553 542651 690651 850227
36770H50227L879j72393k12607k0998K95377L69036l5938n59763n87610j33341
$$ 850227 854106 681713 469106 448108 743485 1112521 1076583 516820 -70790 -204131
36760b04131J37811m4451j24705K73472N91905K41515l16940k61107K21759K46442
$$ -204131 -66320 -110771 -235476 37996 629901 871416 554476 293369 515128 761570
36750G61570k79900n40780k12023Q0423n7713j55610J41442L53530K8945l93894
$$ 761570 481670 -59110 -271133 -190710 -248423 -404033 -262591 90939 119884 -274010
36740b74010k75410K00449L81987J57567n4422p1742q1192j37883q0966Q3320
$$ -274010 -549420 -348971 33016 190583 136161 64419 -16773 -154656 -235622 -152302
36730a52302J47904O0289q116N0159J51593J68191O1541p4520n8231J49617K73629
$$ -152302 -4398 55891 47775 97934 249527 417718 479259 404739 346508 496125 769754
36719G69754M9564k99643l09978j7183O3976j97205l21945q9114N0668j83426
$$ 769754 819318 519675 209697 192514 256490 59285 -262660 -351774 -301106 -484532
36709d84532l29136p85L48236J75094j79886p6307K92519K42378j94859l37960
$$ -484532 -813668 -814453 -466217 -291123 -471009 -547316 -254797 -12419 -207278 -545238
36699e45238k8723J60154o9216l32517k80871k9169K48750N15017N72242K12690
$$ -545238 -573961 -413807 -483023 -815540 -1096411 -1125580 -876830 -361813 210429 423119
36689D23119k52402k60185J21511K56248k2798j86210Q118J06621j55522l37662
$$ 423119 170717 -89468 32043 288291 265493 79283 87401 194022 38500 -299162
36679b99162r7140J82873Q3300j25513k024L13850M17318K98760J71038J1118
$$ -299162 -396302 -213429 -130129 -255642 -257666 56184 473502 772262 943300 954418
36669I54418k30840l22230j34142J2573j32316k51693l362L14926K30448j06535
$$ 954418 723578 401348 267206 279779 147463 -104230 -107592 207334 437782 331247
36659C31247k26010j50347k11516k90798j3464M09857L46883k03904m92123j25069
$$ 331247 105237 -45110 -256626 -547424 -560888 -151031 195852 -8052 -500175 -625244
36649f25244L81002M18556O6234k66723m60004n61669m40117J6689N62125P89736
$$ -625244 -244242 174314 240548 -26175 -486179 -1047848 -1487965 -1471276 -909151 -119415
36639a19415N71684J10368l12808m94898l73383q2210J51178K32481K19135J39028
$$ -119415 452269 562637 249829 -245069 -618452 -700662 -549484 -317003 -97868 41160
36629D1160q070r3837K5159K28383K55613J22518P8808J33143L7782j71798j20493
$$ 41160 33090 -60747 -35588 192795 448408 570926 649734 782877 820659 648861 528368
36618E28368K16225K94358j59037n80664l76340J00818O0427m51820n74800L4283
$$ 528368 744593 1038951 879914 299250 -77090 23728 84155 -367665 -942465 -908182
36608i08182O49949N48774K730k44236l5667K00159K32510K25976K48141J33183
$$ -908182 -258233 290541 293271 49035 13368 213527 446037 672013 920154 1053337
36598A053337r6510j47476M3388J23128j32025m18580l45110j6659J51935L9288
$$ 1053337 956827 809351 852739 975867 843842 425262 80152 63493 215428 254716
36588B54716j07526j04697m848J17962K36742K34635J3803k37230j95953J21805
$$ 254716 147190 42493 37645 155607 392349 626984 640787 403557 207604 329409
36578C29409L44449K69455R3811J9631m3612k17502l86680l93943k73761j21506
$$ 329409 673858 943313 1037124 1056755 1013143 795641 408961 15018 -258743 -380249
36568c80249M5127J51983N9390j57869k09953l7384P4755K1240J07264M53931
$$ -380249 -335122 -183139 -123749 -281618 -491571 -528955 -454200 -432960 -325696 128235
36558A28235O03072J64275m90276o99813m26404j47434m4275J00670L05022L03679
$$ 128235 731307 895582 405306 -294507 -720911 -868345 -912620 -811950 -506928 -203249
36548b03249P9673o7574l8105k8667p2768K7388K43253K75499O6720q6452l1260
$$ -203249 -123576 -191150 -229255 -257922 -330690 -303302 -60049 215450 282170 195718 164458
36537A64458N4905N3845N2678M0137q8797j77313L8576L61480K91942j34227k96708
$$ 164458 219363 273208 325886 366023 277226 99913 138489 499969 791911 657684 360976
36526C60976L2967L27302J96540k9841o752O099k49692m00563n6294M10950L92577
$$ 360976 393943 721245 917785 887944 881192 887291 637599 237036 180742 591692 984269
36515I84269J2511j20260J02209K29161O3313j03774o3063K8285k3325k19129
$$ 984269 996780 876520 978729 1207890 1271203 1167429 1104366 1132651 1109326 890197
36505H90197m61665n78135l58407J24324M04517J82625k08138k71180m9373Q0827
$$ 890197 428532 -149603 -508010 -383686 20831 203456 -4682 -275862 -325235 -244408
36495b44408P2705J36045J94531Q170k70085k52871J9792J57540J20757K28281
$$ -244408 -171703 -35658 158873 167043 -103042 -355913 -336121 -178581 -57824 170457
36485A70457M44534L11111k66452p52211p09066l04385R4932L56609M26765K17706
$$ 170457 614991 926102 659650 -92561 -801627 -1106012 -1011080 -654471 -227706 -10000
36475a0000j14799k07332l0854P008k75323m89022k73435J39483K83057Q5816
$$ -10000 -124799 -332131 -362985 -355977 -631300 -1120322 -1393757 -1254274 -971217 -885401
36465h85401j58036k12495l7244K82153N15858M07504J1394k81892k20798J3550
$$ -885401 -1043437 -1255932 -1293176 -1011023 -495165 -87661 -76267 -358159 -578957 -565407
36455e65407J31530J18207J28721K10681K86278K51012K5044l01839l97835o4768
$$ -565407 -433877 -315670 -186949 23732 310010 561022 586066 284227 -113608 -178376
36445a78376L42765K86069j57654l68525j37958M6629j21436k49444J4535L15668
$$ -178376 164389 450458 292804 -75721 -213679 -167050 -288486 -537930 -523395 -207727
36435b07727J89762j52575k27463q2674p1378j17593J06043M31299L28454k11584
$$ -207727 -17965 -170540 -398003 -480677 -552055 -669648 -563605 -132306 196148 -15436
36425a5436n56475l11779J82046L90144K19927n3570j89881j38991M676Q4824
$$ -15436 -571911 -883690 -701644 -311500 -91573 -145143 -335024 -474015 -469339 -384515
36415c84515L3494m5377l8223J5774N7698J58445L38770M02689K05298n6856j02878
$$ -384515 -351021 -396398 -434621 -418847 -361149 -202704 136066 538755 744053 687197 584319
36404E84319J4000L5954p7392j68132k09229k89363l54856k74459p9689J23838
$$ 584319 598319 634273 556881 388749 179520 -109843 -464699 -739158 -818847 -695009
36394f95009L32380M57966K32360l04050n26604j7680O19702M82825k24034l96129
$$ -695009 -362629 95337 327697 23647 -502957 -520637 99065 581890 357856 -38273
36384c8273K68632P45332K53355n46127n99250j8907K61244j8343k23550L714
$$ -38273 230359 975691 1229046 682919 83669 64762 326006 307663 84113 87827
36374H7827K33314P7070j71354p3632K55001L86545K31540N8499J2136j6840p1639
$$ 87827 321141 398211 226857 153225 408226 794771 1026311 1084810 1096946 1080106 1008467
36363A008467k3236J29044J41884r8675l10636j96444N9026L3334k43858l03143
$$ 1008467 985231 1114275 1256159 1157484 846848 650404 709430 742764 498906 195763
36353A95763l5280M6175l37924o10254j36283O89403Q83152K97970j69191O6791
$$ 195763 160483 206658 -131266 -741520 -877803 -188400 694752 992722 823531 890322
36343H90322M60592K47243m21052p76162n06794l7K95703K80092O1625j94061
$$ 890322 1350914 1598157 1177105 400943 -105851 -105888 189815 469907 531532 337471
36333C37471k85129j29653R8349J71783Q0687n4431j90297k78641j57290J93111
$$ 337471 52342 -77311 21038 192821 273508 219077 28780 -249861 -407151 -214040
36323b14040M27098K08003k63130m35755j33918K25672K07589j19916l54743k62073
$$ -214040 213058 421061 157931 -277824 -411742 -186070 21519 -98397 -453140 -715213
36313g15213K5517K13499J63594K9233O2981K71677L77242K10693j3929p091J50426
$$ -715213 -689696 -476197 -312603 -283370 -220389 51288 428530 639223 625294 618203 768629
36302G68629J34718j13229l02101k33117o0314l0918j74716l33933l36814r0240
$$ 768629 903347 790118 488017 254900 194586 163668 -11048 -344981 -681795 -772035
36292g72035L26910O14619M84442J5180l89990m60422k92571q2191J29706L14140
$$ -772035 -445125 169494 653936 669116 279126 -181296 -473867 -556058 -426352 -112212
36282a12212L04714K1982l03444l66812j63191P1736K02737K56093K16028K9063
$$ -112212 192502 214484 -88960 -455772 -618963 -547227 -344490 -88397 127631 156694
36272A56694j89141k12057k3311J50566J93773K31655K90579J24735l57444p30939
$$ 156694 -32447 -244504 -267815 -117249 76524 308179 598758 723493 366049 -364890
36262c64890n08051J28748M66486J86045k60560l58457k11608k00991k95354j74363
$$ -364890 -872941 -744193 -277707 -91662 -352222 -710679 -922287 -1123278 -1418632 -1592995
36252a592995J27704K37741J10350J44633M73211O38634L02746j37195j03089
$$ -1592995 -1465291 -1227550 -1117200 -972567 -499356 139278 442024 304829 201740
36243B01740K63927L04027j53623n48030m43536j18679m2913j61100q2013K29057
$$ 201740 465667 769694 616071 68041 -375495 -494174 -537087 -698187 -780200 -551143
36233e51143L57853L9712m48326n97691k29401L34728O06379M03504J712j95582
$$ -551143 -193290 -153578 -601904 -1199595 -1428996 -1094268 -487889 -84385 -82673 -278255
36223b78255j03196L0860L4579L0230J55924K84903K11216l7556k73921l94469
$$ -278255 -381451 -350591 -316012 -285782 -129858 155045 366261 328705 54784 -339685
36213c39685l41428j4344M69988O24430J51070m54491m21241J61249L85252j08066
$$ -339685 -681113 -695457 -225469 398961 550031 95540 -325701 -164452 220800 112734
36203A12734n34468j92967L93772K98214l27634m97860O6140N79937M55188N4780
$$ 112734 -421734 -614701 -220929 77285 -250349 -748209 -682069 -102132 353056 407836
36193D07836p0692K9166M9346j7982n9443j01549p8192J88904M90850K77035m26305
$$ 407836 337144 366310 415656 397674 338231 236682 158490 347394 838244 1115279 688974
36182F88974p58986k18073M74542L74980k92224n43148j06237L64878L93592J75338
$$ 688974 -70012 -288085 186457 561437 269213 -273935 -380172 -15294 378298 553636
36172E53636n649j17968j05370Q6401J88308p4491l82364k05175K61742L06250
$$ 553636 547987 430019 324649 411050 599358 524867 142503 -62672 199070 505320
36162E05320j46007m20455k36980p1450j56836n4510L95550N90877J57739l64299
$$ 505320 359313 -61142 -298122 -369572 -526408 -580918 -185368 405509 563248 198949
36152A98949m05454k01485j37368M349M15791N83051R5914m38395k32526L80845
$$ 198949 -206505 -407990 -545358 -541009 -125218 457833 553747 115352 -117174 263671
36142B63671M75300J7653k19492l9593k5187l48890m32956j7301L31935J22026
$$ 263671 738971 756624 537132 497539 472352 123462 -309494 -326795 5140 127166
36132A27166l59080n73760m19769j06305J82055K82110J33549o561J51009L96366
$$ 127166 -231914 -805674 -1225443 -1331748 -1149693 -867583 -734034 -740595 -589586 -193220
36122a93220K78556j02186j79570J43287L40580J90696J07107K85801K95130q1113
$$ -193220 85336 -16850 -196420 -53133 287447 478143 585250 871051 1166181 1085068
36112A085068l29543p3218K04910m7654m84713m18437N6504K76560J06753M3366
$$ 1085068 755525 682307 887217 839563 354850 -63587 -7083 269477 376230 419596
36102D19596K87041M29284J54845l07114n74809n35680k71632P5876K79864J88537
$$ 419596 706637 1135921 1290766 983652 408843 -126837 -398469 -322593 -42729 145808
36092A45808j7296j7671J60414J70445q0848k40849m7050K48062K30614q7115
$$ 145808 128512 110841 271255 441700 360852 120003 72953 321015 551629 464514
36082D64514l06094k08486l2807r9299l23105k98672J20879N36055M70135P040
$$ 464514 158420 -50066 -82873 -182172 -505277 -803949 -683070 -147015 323120 330160
36072C30160l10959k12359p020n6598k45924k29900L769J30735k2526k56485k78818
$$ 330160 19201 -193158 -200178 -256776 -502700 -732600 -728831 -598096 -620622 -877107 -1155925
36061a155925k3774L36569N71075N43992K71273j20538m67317n99752m09745r627
$$ -1155925 -1179699 -843130 -272055 271937 543210 422672 -44645 -644397 -1054142 -1063769
36051a063769K62797J97175J0775N3257K67891K78126Q593j86641j11938j8966
$$ -1063769 -800972 -603797 -593022 -539765 -271874 6252 14845 -171796 -283734 -302700
36041c02700j16503k01749n0007J91811L00824L29886L53554K14383j18680k94295
$$ -302700 -419203 -620952 -670959 -479148 -178324 151562 505116 719499 600819 306524
36031C06524j01523R5373p2049l08208j41317K06298J32491l18088m87540j48156
$$ 306524 205001 300374 228325 -79883 -221200 -14902 117589 -200499 -688039 -836195
36021h36195K17235K64954K11040K22474P8668k58211l53864J9233M17367L69959
$$ -836195 -618960 -354006 -142966 79508 158176 -100035 -453899 -434666 -17299 352660
36011C52660P4189l365J17178N1259k83311n66740n44554k57589J12700L68063
$$ 352660 426849 423484 540662 591921 308610 -258130 -802684 -1060273 -947573 -579510
36001e79510L60242J53913J8508R2656K09094J91990J01179J3333j52372l55870
$$ -579510 -219268 -65355 -46847 45809 254903 446893 548072 561405 409033 53163
35991E3163l03308P4405L09179k386n01135m69490J62110P09405O45494J68879
$$ 53163 -250145 -175740 133439 131053 -370082 -839572 -677462 31943 677437 846316
35981H46316k18839l07226k04044p1526p175j7434k4076n240p4629k48326k72885
$$ 846316 627477 320251 116207 44681 37506 20072 -4004 -9244 -83873 -332199 -605084
35970f05084J5252K96645J57509k02159j75852K89113N31482J86649k32535j52163
$$ -605084 -589832 -293187 -135678 -337837 -513689 -224576 306906 493555 261020 108857
35960A08857J78631J62427j55916k18483R6337L06011J21678j61656k08966j01435
$$ 108857 287488 449915 293999 75516 171853 477864 599542 437886 228920 127485
35950A27485m6490k1903M4028L5618j44345l36757l24208j19622J15323K86890
$$ 127485 80995 59092 103120 138738 -5607 -342364 -666572 -786194 -670871 -383981
35940c83981L51626K54427N1334p4465q3308j67336l72980l78411M4091N42935
$$ -383981 -32355 222072 273406 198941 115633 -51703 -424683 -803094 -759003 -216068
35930b16068N68248J43193j84373j57999j04201k79365m02287j49354K42697K95461
$$ -216068 352180 495373 311000 153001 48800 -230565 -632852 -782206 -539509 -244048
35920b44048K5340q5010J72020M23750K72032j51348l86628k33969O6584J79777
$$ -244048 -218708 -303718 -131698 292052 564084 412736 26108 -207861 -141277 38500
35910C8500L4082j66692j81110N0279L63151N16441M04467J37649r2275k06974
$$ 38500 72582 -94110 -275220 -224941 138210 654651 1059118 1196767 1104492 897518
35900H97518k66049l14721k92827j54421j4310m8050k26555k80583l0695L28030
$$ 897518 631469 316748 23921 -130500 -144810 -192860 -419415 -699998 -730693 -402663
35890d02663M14783J28557k10180k29164Q1663L88736L79949M4381l60387n38487
$$ -402663 12120 140677 -69503 -298667 -217004 171732 551681 596062 235675 -302812
35880c02812l74894j6855K32395J65009j24433l10379j84740Q3693J51038k2937
$$ -302812 -677706 -694561 -462166 -297157 -421590 -731969 -916709 -833016 -681978 -704915
35870g04915q0165K15451N51051M44981l9700l40665j84451R1067J51261J49701
$$ -704915 -785080 -569629 -18578 426403 386703 46038 -138413 -47346 103915 253616
35860B53616K90399L26139l1066m94289n49470k45114o3312j09801n4163J46135
$$ 253616 544015 870154 839088 344799 -204671 -449785 -513097 -622898 -677061 -530926
35850e30926J45552n9958l873M02737N69252J54137l16690k56933P8403R1400
$$ -530926 -385374 -445332 -449205 -46468 522784 676921 360231 103298 181701 273101
35840B73101j67316j73205J51115L53135K00304o1901j88402j88335r5620R3511
$$ 273101 105785 -67420 83695 436830 637134 575233 386831 198496 102876 196387
35830A96387K39047J68475l7034j64718j99334k25567j47345J19111L14085J28662
$$ 196387 435434 603909 566875 402157 202823 -22744 -170089 -50978 263107 391769
35820C91769k70122m40886k98695j05131M7304K40797L39058J59667l4704J58803
$$ 391769 121647 -319239 -617934 -723065 -675761 -434964 -95906 63761 29057 187860
35810A87860N17572M21126j14158l79681j09384J10680j39810m50465l65550j42832
$$ 187860 705432 1126558 1012400 632719 523335 634015 494205 43740 -321810 -464642
35800d64642j81064k71975m3259L03168L30607J11946L7236J44274K00751K13621
$$ -464642 -645706 -917681 -960940 -657772 -327165 -215219 -177983 -33709 167042 380663
35790C80663L02083K76160q7303n04545m85808q0061K10734J90568J26083J81424
$$ 380663 682746 958906 871603 367058 -118750 -198811 11923 202491 328574 509998
35780E09998K01665Q2648p8764k21937l28890k38392J32153M40346K66298k15521
$$ 509998 711663 794311 715547 493610 164720 -73672 58481 498827 765125 549604
35770E49604m14158j94034l5998k29632m50503l54635j08062k6243o6465n224
$$ 549604 135446 -58588 -94586 -324218 -774721 -1129356 -1237418 -1263661 -1330126 -1335350
35760a335350J50394K33074K16941K07306K53900L28964L67625K56540l7315k84102
$$ -1335350 -1184956 -951882 -734941 -527635 -273735 55229 422854 679394 642079 357977
35750C57977j91894J40064K68735K8044k18474j32507J02782J06032j30268l00305
$$ 357977 166083 306147 574882 602926 384452 251945 354727 460759 330491 30186
35740C0186k65152j74848j73303k14996j67526L0662K82356L61706J59021p6683
$$ 30186 -234966 -409814 -583117 -798113 -965639 -934977 -652621 -290915 -131894 -208577
35730b08577L2695M32562N90046K02299l32839m51024j99663r6462l20554m69690
$$ -208577 -175882 256680 846726 1049025 716186 265162 65499 -30963 -351517 -821207
35720h21207j82750L38393N94013L78012n5697l27280l07240j66880j13279j33032
$$ -821207 -1003957 -665564 -71551 306461 250764 -76516 -383756 -550636 -663915 -796947
35710g96947o0470J35810K84925K68523J71798R4724j280j26506j41803J277Q2854
$$ -796947 -857417 -721607 -436682 -168159 3639 98363 97083 -29423 -171226 -169949 -87095
35699h7095p4922k77314k31420k5322J7257j07428p2139K11540M17017L16607
$$ -87095 -162017 -439331 -670751 -696073 -678816 -786244 -858383 -646843 -229826 86781
35689H6781J03528J7742j6142j35331k13154q7122J01981J14789r31m5174n0235
$$ 86781 190309 208051 191909 56578 -156576 -243698 -141717 -26928 -27859 -73033 -123268
35678a23268j75543l05591j56714K02887L43545R3805j93903j73939J9876P4752
$$ -123268 -298811 -604402 -761116 -558229 -214684 -120879 -314782 -488721 -468845 -394093
35668c94093J891L0060J72079K26408J34969M6397M5645O8289P2106P0487J6037
$$ -394093 -392202 -362142 -190063 36345 171314 217711 263356 331645 403751 474238 490275
35657D90275j18563j71929K3001K88892K52105r4402l05809j07943K01356J85219
$$ 490275 371712 199783 222784 511676 763781 669379 363570 255627 456983 642202
35647F42202j54591m76989n61503m06971o9462K96175L94005J18665j84706j29115
$$ 642202 487611 10622 -550881 -957852 -1027314 -731139 -337134 -218469 -403175 -532290
35637e32290J49912K16623L6861m467K05998L13986J26103o8352m8652o0762l09313
$$ -532290 -382378 -165755 -128894 -133361 72637 386623 512726 444374 395722 334960 25647
35626B5647m75877k14993J95835K52135M7944Q9838L80781L62171j39448n48325
$$ 25647 -450230 -665223 -469388 -217253 -169309 -79471 301310 663481 524033 -24292
35616b4292l77376R9748L41732K58428O8566j55474l58676k61201K35745O41584
$$ -24292 -401668 -301920 39812 298240 366806 211332 -147344 -408545 -172800 468784
35606D68784M26551j68190m31564k00913K4606l0469q6689K0627K5725j48889
$$ 468784 895335 727145 295581 94668 119274 88805 2116 22743 48468 -100421
35596a00421j13504K46766L56002j76326p62661n93024J58138O02808M19931J23427
$$ -100421 -213925 32841 388843 212517 -550144 -1143168 -985030 -382222 37709 161136
35586A61136J10250J86161J44600J39059K44509K03681j05388l87769l83917k31363
$$ 161136 271386 457547 602147 741206 985715 1189396 1084008 696239 312322 80959
35576H0959j45625j01316n2264j07189k47781k18276N8797K87937K55947J37093
$$ 80959 -64666 -165982 -218246 -325435 -573216 -791492 -732695 -444758 -188811 -51718
35566e1718J07209L5895j53942k19258l1844J09303j2778j04080J09420L14119
$$ -51718 55491 91386 -62556 -281814 -313658 -204355 -217133 -321213 -211793 102326
35556A02326J26427j61255r252M22177M68596J7587l37198k34450J7371O1571
$$ 102326 228753 67498 58246 480423 949019 966606 629408 394958 412329 473900
35546D73900l8753j26629k15555k28859L7139M59905N46225J04925m15029n20004
$$ 473900 435147 308518 92963 -135896 -98757 361148 907373 1012298 597269 77265
35536G7265k69996l2423M5499N1159N8079J14343K63872L92111K92385M6153K7600
$$ 77265 -192731 -225154 -179655 -128496 -70417 43926 307798 699909 992294 1038447 1066047
35525A066047L12919M20642l8858p25088r57641n80226o5849J53368J09370N3548
$$ 1066047 1378966 1799608 1760750 1035662 78021 -502205 -568054 -414686 -305316 -251768
35515b51768R0027J40970J06273k5873j66670k07582j28364J6252J96681L71842
$$ -251768 -161741 -20771 85502 59629 -107041 -314623 -442987 -426735 -230054 141788
35505A41788L67978J6416n03488o91003k85892L34599N27264J04319m71989o10357
$$ 141788 509766 526182 22694 -668309 -954201 -619602 -92338 11981 -460008 -1070365
35495a070365k04139K99397M09671J25817j22169o2605Q7554J6798j85719k13998
$$ -1070365 -1274504 -975107 -565436 -439619 -561788 -624393 -536839 -520041 -705760 -919758
35485i19758n6363M4658M2549Q4142J11817o3105k83387j62963K30286L61815
$$ -919758 -976121 -931463 -888914 -804772 -692955 -756060 -1039447 -1202410 -972124 -610309
35475f10309P9530j00583J49078L98471J85138j86949j31031K90479N06785K97121
$$ -610309 -530779 -631362 -482284 -83813 101325 -85624 -216655 73824 580609 877730
35465H77730m8045k90094m37144m38657j83487J75243L05120J52443r840r178
$$ 877730 829685 539591 102447 -336210 -519697 -344454 -39334 113109 103269 94091
35455I4091M7178K5980o6236j71119k11173q1958J76130K93928R5900k10405l13171
$$ 94091 141269 167249 101013 -70106 -281279 -363237 -187107 106821 202721 -7684 -320855
35444c20855k11759p5987J10249L96279N40325K96074q6348j36233J10187J72101
$$ -320855 -532614 -608601 -498352 -102073 438252 734326 647978 511745 621932 794033
35434G94033q0050k44794j10863L45j60440l28976k15542j3937l0612j29172R241
$$ 794033 713983 469189 358326 358671 198231 -130745 -346287 -360224 -390836 -520008 -510767
35423e10767K76818K65821n1336k16630M3611L97890L65528k9963l27198k58184
$$ -510767 -233949 31872 -19464 -236094 -192483 205407 570935 540972 213774 -44410
35413d4410k4867J08780K13361M49081O15728L33092l19539p41306n69159j77462
$$ -44410 -69277 39503 252864 701945 1317673 1650765 1331226 589920 20761 -156701
35403a56701j39678m29511n13503j30447L77011N33629K76296n1558j14738O7441
$$ -156701 -296379 -725890 -1239393 -1369840 -992829 -459200 -182904 -234462 -349200 -281759
35393b81759J75920K4150j33292P2840N25055O92863L89381L4402m0037q3024
$$ -281759 -105839 -81689 -214981 -142141 382914 1075777 1465158 1499560 1459523 1376499
35383A376499l73422o23113m35465j6116J46138N5081O3391J52725J2142k73644
$$ 1376499 1003077 379964 -55501 -71617 74521 129602 192993 345718 357860 84216
35373H4216k92100m2829N4107o6488J25L44602N00137K03753j85371k96950k58106
$$ 84216 -207884 -250713 -196606 -263094 -262969 81633 581770 785523 600152 303202 45096
35362D5096k96529k98703r1633J93763L26569K59595L2407k93242m76028k50393
$$ 45096 -251433 -550136 -641769 -448006 -121437 138158 170565 -122677 -598705 -849098
35352h49098K21934M45494K63992L0744R767Q5371J73620L57903M54193Q2355
$$ -849098 -627164 -181670 82322 113066 122833 208204 381824 739727 1193920 1276275
35342A276275n69848p34329j90084K76620L0171m58387m38341o0343M1650j14190
$$ 1276275 706427 -27902 -217986 58634 88805 -369582 -807923 -868266 -826616 -940806
35332i40806j5596L13464L26789n6317k74326k1804L35014L90383K11652N0707
$$ -940806 -956402 -642938 -316149 -372466 -646792 -668596 -333582 56801 268453 319160
35322C19160k7687n7462l0728J8646J0877m8891j04992j65193k03567q6034J77997
$$ 319160 291473 234011 203283 221929 232806 183915 78923 -86270 -289837 -375871 -197874
35311a97874K88475N2237k48078k17813P1432K19401P8305j54488k97471k97521
$$ -197874 90601 142838 -105240 -323053 -251621 -32220 46085 -108403 -405874 -703395
35301g03395j17351J59662K73072J50288R6363K69808K95521j19338n29910l51748
$$ -703395 -820746 -661084 -388012 -237724 -141361 128447 423968 304630 -225280 -577028
35291e77028J64850L11397Q6316J24336N03501N52499J2673m93833m73022k36101
$$ -577028 -412178 -100781 -14465 109871 613372 1165871 1178544 684711 211689 -24412
35281b4412j63581l9391L52381O04328K89847k68047m48487k14772K7114J61349
$$ -24412 -187993 -227384 124997 729325 1019172 751125 302638 87866 114980 276329
35271B76329L58708N23727L33515j97621o44730o82677l65340M9179K79014J34105
$$ 276329 635037 1158764 1492279 1294658 649928 -32749 -398089 -348910 -69896 64209
35261F4209k53406m24013j13905L29476L68876O774k56819j39795J11828J55777
$$ 64209 -189197 -613210 -727115 -397639 -28763 -21989 -278808 -418603 -306775 -150998
35251a50998j8951j87175j96467r0630k8025q8071j18095J02278M63555N30338
$$ -150998 -169949 -357124 -553591 -644221 -672246 -760317 -878412 -776134 -312579 217759
35241B17759J45913k32810j39892J90459J73624k12172m12867j89320P2341Q3249
$$ 217759 363672 130862 -9030 181429 355053 142881 -269986 -459306 -386965 -303716
35231c03716R4405L11447M00400M6921l87629l36463Q2067K43645p329j76078
$$ -303716 -209311 102136 502536 549457 161828 -174635 -92568 151077 143748 -32330
35221c2330L3243K74231J73464j04375k04676j07007K2592J71515L21480K42846
$$ -32330 913 275144 448608 344233 139557 32550 55142 226657 548137 790983
35211G90983j56642n15640m64412j74992l0727K4368K65317N08225L32554q2877
$$ 790983 634341 118701 -345711 -520703 -551430 -527062 -261745 246480 579034 496157
35201D96157j14616K18973J52676n42176r88853m65413M44515O66098J17858l71336
$$ 496157 381541 600514 753190 211014 -777839 -1243252 -798737 -132639 -14781 -386117
35191c86117l14912J5422K57118L35041K32657r547j13893Q1823K03630j54179
$$ -386117 -701029 -685607 -428489 -93448 139209 129662 15769 97592 301222 147043
35181A47043o50626o04268q3743J81567r354p1783K74011N12771K68998n8818
$$ 147043 -503583 -1107851 -1191594 -1010027 -1019381 -1091164 -817153 -304382 -35384 -94202
35171i4202n9851n027k19744l69851l7254M46404M49079L4392j70244N2977K95162
$$ -94202 -154053 -159080 -378824 -748675 -785929 -339525 109554 143946 -26298 26679 321841
35160C21841K34637K5364p9622p5622q7394j73254k91205l00967p0030K77507
$$ 321841 556478 581842 502220 426598 339204 165950 -125255 -426222 -496252 -218745
35150b18745L83552J17491j87236j88481o839L0395j05458k06482j93265r2529
$$ -218745 164807 282298 95062 -93419 -100258 -69863 -175321 -381803 -575068 -667597
35140f67597J49896M84098N80251K25265k68492m42063l15435k21770j92651o084
$$ -667597 -517701 -33603 546648 771913 503421 61358 -254077 -475847 -668498 -674582
35130f74582K59732K61797j9667k22673j64861p414J55083L77867N04395K62494
$$ -674582 -414850 -153053 -172720 -395393 -560254 -567668 -412585 -34718 469677 732171
35120G32171j71189k59622O2707K17361q7420l35809l7633M29209L80489j20580
$$ 732171 560982 301360 364067 581428 494008 158199 120566 549775 930264 809684
35110H09684m06306k26048P922k1947j28584r8580p1276j85455k28679L1228L94874
$$ 809684 403378 177330 185252 163305 34721 -63859 -135135 -320590 -549269 -518041 -123167
35099a23167M47955J27697k24515l49618l29456l03751j92840J17614M73101N70514
$$ -123167 324788 452485 227970 -121648 -451104 -754855 -947695 -830081 -356980 213534
35089B13534L57498J05409L8912O9864R89j46233j66729J7803K31207K43933K0356
$$ 213534 571032 676441 715353 785217 786206 639973 473244 491047 722254 966187 986543
35078I86543k57678l80561l16345k19178k07282j84176M654K66976L10602M9845
$$ 986543 728865 348304 31959 -187219 -394501 -578677 -574023 -307047 3555 53400
35068E3400k39655k89840j66180o1453L3893K10276L41712K15013j02849l11585
$$ 53400 -186255 -476095 -642275 -703728 -669835 -459559 -117847 97166 -5683 -317268
35058c17268k75452j16355O7051K76592L91732K03252k07392m12919j61144K53646
$$ -317268 -592720 -709075 -642024 -365432 26300 229552 22160 -390759 -551903 -298257
35048b98257L50176N3388k72949k96575k6697L02543M76883M14879J80134n0222
$$ -298257 51919 105307 -167642 -464217 -490914 -188371 288512 703391 883525 833303
35038H33303r8499N3941K20590J80186o6706k56318j64257P8677J28685q2342
$$ 833303 734804 788745 1009335 1189521 1122815 866497 702240 780917 909602 827260
35028H27260k11390M451L27205L35422K5343k13871j76872o7824j11247k40499
$$ 827260 615870 620321 947526 1282948 1308291 1094420 917548 849724 738477 497978
35018D97978k80740j98306m9255J14692J85743N7156j47215j25032J75171L94601
$$ 497978 217238 18932 -30323 84369 270112 327268 180053 55021 230192 624793
35008F24793K23594j68010l77941k94681j32689n7263l6682k5130m7475q3148
$$ 624793 848387 680377 302436 7755 -124934 -182197 -218879 -244009 -291484 -374632
34998c74632n4045L6913R4984Q5478Q0871J36153K06472J99077N2713j99537l91510
$$ -374632 -428677 -391764 -296780 -211302 -130431 5722 212194 411271 463984 264447 -127063
34987a27063l32319n2069J55018P2945j35964j45054R1793L12157L20037J64765
$$ -127063 -459382 -511451 -356433 -283488 -419452 -564506 -472713 -160556 159481 324246
34977C24246l9504k23033k66457o9843K05939K40035J4736j07130N6832J82054
$$ 324246 284742 61709 -204748 -274591 -68652 171383 186119 78989 135821 317875
34967C17875l9762l37462k46772J14524J71040k26699n64579m32794m5940K25208
$$ 317875 278113 -59349 -306121 -191597 -20557 -247256 -811835 -1244629 -1290569 -1065361
34957a065361L80290N13287M27137m233l86818k69139J16111J61278j29566j19368
$$ -1065361 -685071 -171784 255353 251120 -135698 -404837 -288726 -127448 -257014 -376382
34947c76382L82990O93309K55428m63998o04120j05111K97598J48792k09410k62872
$$ -376382 6608 699917 955345 491347 -112773 -217884 79714 228506 19096 -243776
34937b43776j3432J74247J27188j0377r8206j86169l17821l20824P120N06633
$$ -243776 -257208 -82961 44227 33850 -64356 -250525 -568346 -889170 -882050 -375417
34927c75417O87657L21758j80247k64368J6056J30166r1660k43114q3505M0302
$$ -375417 312240 633998 453751 189383 205439 335605 243945 831 -82674 -42372
34917d2372j79710m37038l05211O0207K28042K13751L15994M31980J95154k57187
$$ -42372 -222082 -659120 -964331 -904124 -676082 -462331 -146337 285643 480797 223610
34907B23610l31886R6711M27639K12564k41173m24976l18000j83571o7665J07570
$$ 223610 -108276 -11565 416074 628638 387465 -37511 -355511 -539082 -606747 -499177
34897d99177K26753J50043K5706Q8810K62416K61555K3950k17571k53938r7717
$$ -499177 -272424 -122381 -96675 -7865 254551 516106 540056 322485 68547 -29170
34887b9170R9777J86140J12478m246m097P9480N7695q7075j42690m3679l2637
$$ -29170 70607 256747 369225 364979 360882 440362 498057 410982 268292 224613 191976
34876A91976k54457m59845l77002j34143J1356J43406M75520Q11207P01509J49678
$$ 191976 -62481 -522326 -899328 -1033471 -1022115 -878709 -403189 408018 1109527 1259205
34866A259205l00307k96154r6682p6481j77638j37741J1119K6567j00640j39353
$$ 1259205 958898 662744 566062 489581 311943 174202 185321 211888 111248 -28105
34856b8105j9961P8882P9702J26782K35098J24929l36060p45918n90651J7773
$$ -28105 -48066 30816 110518 237300 472398 597327 261267 -484651 -1075302 -1057529
34846a057529M20293K84293j538J5632K00536J76405k335j3067Q1953q1316m47368
$$ -1057529 -637236 -352943 -354481 -338849 -138313 38092 35757 22690 104643 23327 -424041
34835d24041m98294q5880K51423R5880k16873j78517Q8303J22469o3868n5027
$$ -424041 -922335 -1008215 -756792 -660912 -877785 -1056302 -967999 -845530 -909398 -964425
34825i64425K10462L46135K04893J08311K51653L71902K39539O1124Q4887J41663
$$ -964425 -753963 -407828 -202935 -94624 157029 528931 768470 829594 914481 1056144
34815A056144n2186l69116m51673k93659k26642l38725l08006O6665M93548N54832
$$ 1056144 1003958 634842 183169 -110490 -337132 -675857 -983863 -917198 -423650 131182
34805A31182K36878j27482l09570l41379k91448j42707O5849J83411J42634Q3424
$$ 131182 368060 240578 -68992 -410371 -701819 -844526 -778677 -595266 -452632 -369208
34795c69208J65352L32521L78008K07698n5441k21817k18876j22412n7333q0377
$$ -369208 -203856 128665 506673 714371 658930 437113 218237 95825 38492 -41885
34785d1885j38770j35990l1750J30580K59598K41561n6l62591n38872l10969J31728
$$ -41885 -180655 -316645 -348395 -217815 41783 283344 283288 -79303 -618175 -929144 -797416
34774g97416L69687K84127J72860K45100K84849L6280l10339l35348J4288L46640
$$ -797416 -427729 -143602 29258 274358 559207 595487 285148 -50200 -35912 310728
34764C10728L21181m782l07002k91063Q3173M95301M83346j5153m62719l35980
$$ 310728 631909 627127 320125 29062 112235 607536 1090882 1075729 613010 277030
34754B77030J73856M14494J57451j70666j69766K4258N7221j28330k90781k28502
$$ 277030 450886 865380 1022831 852165 682399 706657 763878 635548 344767 116265
34744A16265M846J34406o7946m29595m42558O4535N21001L05737l06941m68637
$$ 116265 121111 255517 187571 -242024 -684582 -620047 -99046 206691 -100250 -568887
34734e68887J775L71141J39979k52075k13173J18319K60337J73468J11875N0526
$$ -568887 -567112 -195971 -55992 -308067 -521240 -402921 -142584 30884 142759 193285
34724A93285j53765k69389M7193N94446P66082L53578k15440m63086l28875l2153
$$ 193285 39520 -229869 -182676 411770 1177852 1531430 1315990 852904 524029 491876
34714D91876K01261K14556j1920k82365l37786j30025J44859K53516J02478j87832
$$ 491876 693137 907693 895773 613408 275622 145597 290456 543972 646450 458618
34704D58618l22544j05705K56041L39012P3322j59033j21297n5184j91431l06721
$$ 458618 136074 30369 286410 625422 698744 539711 418414 363230 171799 -134922
34694a34922j15310K05531K72509N0670k07170l53553l42004q9125K90596L93678
$$ -134922 -250232 -44701 227808 278478 71308 -282245 -624249 -713374 -422778 -29100
34684b9100Q5344j50201J02529M60567K90365k67289n06281k44237K7522M8800
$$ -29100 56244 -93957 8572 469139 759504 492215 -14066 -258303 -230781 -181981
34674a81981R4229K74524K57912p7994l36314k33548k2145J5228K6154K15199
$$ -181981 -87752 186772 444684 366690 30376 -203172 -225317 -210089 -183935 31264
34664C1264L99310K81678j00075m65896o05034m20335O1882N48673O33519K84493
$$ 31264 430574 712252 612177 146281 -458753 -879088 -817206 -268533 364986 649479
34654F49479p7529j43446o9998j03248j70181r0996O3614J02848L1513k22N5970
$$ 649479 571950 428504 358506 255258 85077 -5919 57695 160543 192056 191834 247804
34643B47804J31670J83588K19629K42830K23318Q0458k41900n73047n48674q6956
$$ 247804 379474 563062 782691 1025521 1248839 1329297 1087397 514350 -34324 -121280
34633a21280L35372K32586j94651l35220m4394K46082K52943J31169J5816j44966
$$ -121280 214092 446678 252027 -83193 -127587 118495 371438 502607 518423 373457
34623C73457k14749O1045M61126M04001j24240m27542j84454L9429j99734m27457
$$ 373457 158708 219753 680879 1084880 960640 533098 348644 388073 188339 -239118
34613b39118r6987L91687L14297j74492l21076q82K02428N9674o336K23815L71729
$$ -239118 -336105 55582 369879 195387 -125689 -126571 75857 135531 129195 353010 724739
34602G24739J61052j02833p5406O5160m3725l49328m64644k09885J80424L61354
$$ 724739 885791 782958 707552 772712 728987 379659 -84985 -294870 -114446 246908
34592B46908K61763J46002K78425N32440M90068L0763l99816l44195L4391J95810
$$ 246908 508671 654673 933098 1465538 1955606 1986369 1586553 1242358 1276749 1472559
34582A472559l2433l26178m10184l29945j79398K8189J50782m504k60988j51129
$$ 1472559 1440126 1113948 703764 373819 194421 222610 373392 368888 107900 -43229
34572d3229L58976O31395J95719n01543o51122j83205K25663K00101J16121L23419
$$ -43229 315747 947142 1142861 641318 -9804 -193009 32654 232755 348876 672295
34562F72295M91642J69559l98956n99314l97537l26787n28091m89003L9921N13639
$$ 672295 1163937 1333496 934540 335226 -62311 -389098 -917189 -1406192 -1366271 -852632
34552h52632M08782M5358J9915K14176O5736l90794n15739r3823L39153L45896
$$ -852632 -443850 -398492 -378577 -164401 -98665 -489459 -1005198 -1099021 -759868 -413972
34542d13972J45968R6242J48889J17897N0678L1757l4251j69569j58770J09781
$$ -413972 -268004 -171762 -22873 95024 145702 177459 143208 -26361 -185131 -75350
34532g5350L97585M22971J92511j00639k62792j35048K28065L97282J7045n54981
$$ -75350 322235 745206 937717 837078 574286 439238 667303 1064585 1081630 526649
34522E26649n93996p3010K61331M9481j86536l7215J00171j40086l03786R7919
$$ 526649 -67347 -140357 120974 170455 -16081 -53296 46875 -93211 -396997 -299078
34512b99078O14523N17976P075j44445J36708K13497j15526l44415j76821N9948
$$ -299078 315445 833421 840496 696051 832759 1046256 930730 586315 409494 469442
34502D69442N6131o0100r3648n5672L5125J68651J40615j93013m88132k83175
$$ 469442 525573 465473 371825 316153 351278 519929 660544 467531 -20601 -303776
34492c03776K13071L14774r7948l76898j20583K40963J83299j26854j89793N3267
$$ -303776 -90705 224069 126121 -250777 -371360 -130397 52902 -73952 -263745 -210478
34482b10478K22242Q6457j73440k29719K8363L56750L76170K5319l02106k59177
$$ -210478 11764 98221 -75219 -304938 -276575 80175 456345 481664 179558 -79619
34472g9619k7232L219j34608r3163J48500K48694J02719j9952P634P982n3495
$$ -79619 -106851 -103632 -238240 -331403 -182903 65791 168510 148558 156192 164174 110679
34461A10679L7379K49472K05815j90132m75512k64793J97447M10840K50328m0279
$$ 110679 148058 397530 603345 413213 -62299 -327092 -129645 281195 531523 491244
34451D91244k23616j96395K2973K21739J31912j77357k93095l1429K46594J27415
$$ 491244 267628 71233 94206 315945 447857 270500 -22595 -54024 192570 319985
34441C19985k67775m48355j69177L30637O10714M17596j02749m92393m08502r220
$$ 319985 52210 -396145 -565322 -234685 376029 793625 690876 198483 -210019 -219239
34431b19239K47928J93358P8260R0970P8516r7777k40273j01402K01855L13810
$$ -219239 28689 222047 300307 391277 469793 372016 131743 30341 232196 546006
34421E46006R8320k07193k69931j9292K47050J46993l05576o10663l74813J18087
$$ 546006 644326 437133 167202 147910 394960 541953 236377 -374286 -749099 -631012
34411f31012K45414r1846l35580o3709M64625P10667M84571m395m47197n88749
$$ -631012 -385598 -477444 -813024 -876733 -412108 298559 783130 778735 331538 -257211
34401b57211l20482J63896M61002L71045R5867o4906m6791L7870R8018Q5248j7497
$$ -257211 -577693 -413797 47205 418250 514117 449211 402420 440290 538308 623556 606059
34390F06059j14448m6977J75808L26196K30386j0011j46613p4982M6163l1168
$$ 606059 491611 444634 620442 946638 1177024 1167013 1020400 945418 991581 960413
34380I60413l03794m00113j8356N13512M96667j57782o70265m60478J1820J5822
$$ 960413 656619 256506 238150 751662 1248329 1090547 420282 -40196 -28376 -12554
34370a2554k90399k28293J79280K74470l1507q8316L26408N97316L32464j0504
$$ -12554 -302953 -531246 -351966 -77496 -109003 -197319 129089 726405 1058869 1048365
34360A048365J4278J04384j38114m46079l71430n1438Q6144J3552l3781o9724
$$ 1048365 1062643 1167027 1028913 582834 211404 159966 246110 259662 225881 156157
34350A56157k18031l09279j07329K30104L39636J79787L0646P2908K27872L07986
$$ 156157 -61874 -371153 -478482 -248378 91258 271045 301691 374599 602471 910457
34340I10457J57935j97199m49933l00802Q7094K61604J59567J49634K97873J81287
$$ 910457 1068392 871193 421260 120458 207552 469156 628723 778357 1076230 1257517
34330A257517l13636o23847l49086R1976J35701q1946j07646J9977l4876j96504
$$ 1257517 943881 320034 -29052 62924 198625 116679 9033 29010 -5866 -202370
34320b02370r5303K59543M72468L49334O6480j56594k08047m6067J81891J69090
$$ -202370 -297673 -38130 434338 783672 850152 693558 485511 439444 621335 790425
34310G90425j18045k92800j29517M0181j13460l18481j35179L09384N37021M29830
$$ 790425 672380 379580 250063 290244 176784 -141697 -276876 32508 569529 999359
34300I99359K14914l2805l23473l83994L6025N81167O05013O7807m07095m03880
$$ 999359 1214273 1181468 857995 474001 510026 1091193 1696206 1764013 1356918 953038
34290I53038j47190M143K5542L8158L0271l3548o5497J6411J45215J86085Q9213
$$ 953038 805848 809991 835533 873691 903962 870414 804917 821328 966543 1152628 1241841
34279A241841o5552j47471j25245j14290j78468j77814k9043J6519k63026n27185
$$ 1241841 1176289 1028818 903573 789283 610815 433001 403958 420477 157451 -369734
34269c69734k59890L21653M48346K9852j18818L56772O32573J3909q00518o75948
$$ -369734 -629624 -307971 140375 170227 51409 408181 1040754 1054663 254145 -421803
34259d21803K36136P34710L00092l70800n41807k91302l5414J06122K02027K35084
$$ -421803 -185667 549043 849135 478335 -63472 -354774 -390188 -284066 -82039 153045
34249A53045J86965J32600J17253J02706M9497o4266k23128k97267j75149k2822
$$ 153045 340010 472610 589863 692569 742066 677800 454672 157405 -17744 -40566
34239d0566r3313k24177O109N00177O21190J93504j48435K1631K68862J50848
$$ -40566 -133879 -358056 -351947 148230 769420 962924 814489 836120 1104982 1255830
34229A255830j9072J10597J84315j24609l33997j610K94511j42017p91788o47694
$$ 1255830 1236758 1347355 1531670 1407061 1073064 1071454 1365965 1223948 432160 -215534
34219b15534J13798M20200M4630j94193N7351K06101q1277k91018j6840L83646
$$ -215534 -101736 318464 363094 168901 226252 432353 351076 60058 43218 426864
34209D26864M55624K87427J67769J27578N2310j23565l93455n60825l25735J74070
$$ 426864 882488 1169915 1337684 1465262 1517572 1394007 1000552 439727 113992 288062
34199B88062L01238j23047l39768J86764P39140M03761m05957o05022j61317Q8735
$$ 288062 589300 466253 126485 313249 1052389 1456150 1050193 445171 283854 372589
34189C72589N589J57677M64208K69722k54549k28773L25400M30337j10328l72233
$$ 372589 378178 535855 1000063 1269785 1015236 786463 1111863 1542200 1431872 1059639
34179A059639L676K48997K514n7289L26680L32933l92226q53765k70149O09210
$$ 1059639 1063315 1312312 1314826 1257537 1584217 1917150 1524924 671159 401010 1010220
34169A010220O94070J24143k66535k59964j61411o3219L0494p8391l27216k58409
$$ 1010220 1704290 1828433 1561898 1301934 1140523 1077304 1107798 1029407 702191 443782
34159D43782J64859L18420k6254k12906J81086N74431L66646j02438k52190j73514
$$ 443782 608641 927061 900807 687901 868987 1443418 1810064 1707626 1455436 1281922
34149A281922j62343n9128K54464L76687Q4539j37868P4886K73926n758m04250
$$ 1281922 1119579 1060451 1314915 1691602 1776141 1638273 1713159 1987085 1981327 1577077
34139A577077l94594j77238k10099l82963l33833j12643N6199K02734L18150J71136
$$ 1577077 1182483 1005245 795146 412183 78350 -34293 21906 224640 542790 713926
34129G13926j47633j22439L12978N00406J17358k57425j55038K1393j55943l39380
$$ 713926 566293 443854 756832 1257238 1374596 1117171 962133 983526 827583 488203
34119D88203j22494J99329K61068K91825M89263M78730O8971k07994J762J96008
$$ 488203 365709 565038 826106 1117931 1607194 2085924 2154895 1946901 1948663 2144671
34109B144671p0478l85753l08256j72021l00070k53234K91673P15731M02646k19077
$$ 2144671 2074193 1688440 1380184 1208163 908093 654859 946532 1662263 2064909 1845832
34099A845832m37306l33634k66707n8290M12345N73306O2567m53631k89667J49899
$$ 1845832 1408526 1074892 808185 749895 1162240 1735546 1798113 1344482 1054815 1204714
34089A204714J81304O446J10691K48886L3135j76891L8019K73306O3876j93923
$$ 1204714 1386018 1392464 1503155 1752041 1785176 1608285 1646304 1919610 1983486 1789563
34079A789563k8552J77266J059j23731J63781K40947l72309r03929n48310J17914
$$ 1789563 1761011 1938277 1939336 1815605 1979386 2220333 1848024 944095 395785 513699
34069E13699K03036N4636L73557O84782K15971m78251l50467L16338M52027K197
$$ 513699 716735 771371 1144928 1829710 2045681 1567430 1216963 1533301 1985328 1987525
34059A987525k74949k53551k70855j20172L91659N69362n1850n01504J47134R46206
$$ 1987525 1712576 1459025 1188170 1067998 1459657 2029019 1977169 1475665 1622799 2569005
34049B569005N06623n31140m78526N27234P77381j53010q97582o39829o5837J52808
$$ 2569005 3075628 2544488 2065962 2593196 3370577 3217567 2319985 1680156 1614319 1767127
34039A767127J75756J50781l5002j23713J76083M04501O1886l11529N291N43911
$$ 1767127 1942883 2093664 2058662 1934949 2111032 2515533 2577419 2265890 2271181 2815092
34029B815092M52980R670n5608L2669j86446k04916L70070N89971k30540q68252
$$ 2815092 3268072 3277742 3222134 3254803 3068357 2863441 3233511 3823482 3592942 2724690
34019B724690j28749Q29007L58957p31467o33612K39223K41776l38166n5093O59074
$$ 2724690 2595941 3424948 3783905 3052438 2418826 2658049 2899825 2561659 2506566 3165640
34009C165640L21827n13164j81364P67710M68168o51515n85770M39683M36596
$$ 3165640 3487467 2974303 2792939 3560649 4028817 3377302 2791532 3231215 3667811
34000C667811m87523m15582N56361N54436k78388j06903P30288K58718r43258
$$ 3667811 3180288 2764706 3321067 3875503 3597115 3490212 4220500 4479218 3535960
33991C535960m34620J301659J347681l06459p19061M78979N85375p06855o59341
$$ 3535960 3101340 4402999 5750680 5444221 4725160 5204139 5789514 5082659 4423318
33982D423318R74715J239656k46748m33472J134163J286486m60029p02541J186837
$$ 4423318 5398033 6637689 6390941 5957469 7091632 8378118 7918089 7215548 8402385
33973H402385J615151k21642o13383J334379J748645l09863p24337J505450K048417
$$ 8402385 10017536 9795894 9182511 10516890 12265535 11955672 11231335 12736785 14785202
33964A4785202P3828M44813L812323M399709J573213K432375Q037328R931524
$$ 14785202 14859030 15303843 19116166 23515875 25089088 27521463 35558791 45490315
33956D5490315O605426Q295351J7079724K1094296K1963527M4640105R4015005
$$ 45490315 52095741 60391092 77470816 98565112 120528639 165168744 259183749
33949B59183749J21157046P1982766l3974016j12540813j10950590o1339212k5463825
$$ 259183749 380340795 452323561 418349545 305808732 194858142 133518930 108055105
33942A08055105j9890983k0273818j2948042p659374r423011r266255l708872
$$ 108055105 88164122 67890304 54942262 47282888 37859877 28593622 24884750
33935B4884750p74322l563971m992073j869975K9729k046375l118901q04232M45862
$$ 24884750 24110428 20546457 15554384 13684409 13714138 11667763 8548862 7744630 8190492
33926H190492j436661k236827O5186J447425l50049j804098n22263O86944k78840
$$ 8190492 6753831 4517004 4582190 6029615 5679566 3875468 3353205 4040149 3761309
33917C761309j053207N1910P54213m36938j242976j53095O98525k22142j017779
$$ 3761309 2708102 2760012 3514225 3077287 1834311 1681216 2379741 2157599 1139820
33908A139820k17294N27824q5833n78658J07621M97988k85029o52728K53128P52853
$$ 1139820 922526 1450350 1364517 785859 893480 1391468 1106439 453711 706839 1459692
33898A459692j19275p21822N166N37200k11186q19584j66287N02483J10527l16146
$$ 1459692 1340417 618595 623761 1160961 949775 130191 -36096 466387 576914 260768
33888B60768K2386O4044p31201r54018Q8758Q16047K00918l43182L20221R06901
$$ 260768 283154 347198 -384003 -1338021 -1249263 -433216 -232298 -575480 -255259 651642
33878F51642J87588p04395m24729K25258O0537k99795P3592N10792J57349l40034
$$ 651642 839230 134835 -289894 -64636 -4099 -303894 -230302 280490 437839 97805
33868I7805k29106j08524m58122m33706L46149O14319l36201j076620l82563O36724
$$ 97805 -131301 -239825 -697947 -1131653 -785504 -171185 -507386 -1584006 -1966569 -1329845
33858a329845N51879J4627K15977N83408Q4172o09959l67687K25915K388n70286
$$ -1329845 -777966 -763339 -547362 36046 120218 -489741 -857428 -631513 -629125 -1199411
33848a199411l25920L91686M30485o6778j31401J68487R3063j88669l1065K90874
$$ -1199411 -1525331 -1133645 -703160 -769938 -901339 -732852 -639789 -828458 -859523 -568649
33838e68649J45435j36563M6530K65323j09452n22841j59022M82997M21378j09509
$$ -568649 -423214 -559777 -513247 -247924 -357376 -880217 -1039239 -556242 -134864 -244373
33828b44373k58478j32848k94252m16521L2180M92375K43231j18537K61147P37219
$$ -244373 -502851 -635699 -929951 -1346472 -1314292 -821917 -578686 -697223 -436076 301143
33818C01143K38345o26031m75108L84685M67094k79430m84355J26376L43007k34912
$$ 301143 539488 -86543 -561651 -176966 290128 10698 -473657 -347281 -4274 -239186
33808b39186n35074l9567L60812R2323j58199J30052L84322J30530j40318P048
$$ -239186 -774260 -813827 -453015 -360692 -518891 -388839 -4517 126013 -14305 -7257
33798g257J55907o7161k61030o1497J52656j7531k73285j89410Q6750J92244J10031
$$ -7257 148650 81489 -179541 -241038 -88382 -105913 -379198 -568608 -481858 -289614 -179583
33787a79583p960j41460k38776j49634Q6609K45091K72553K62450J31932k06432
$$ -179583 -187543 -329003 -567779 -717413 -630804 -385713 -113160 149290 281222 74790
33777G4790m51944k48121J82682L18949J53684J09677K45914K16271m4530k53285
$$ 74790 -377154 -625275 -442593 -123644 30040 139717 385631 601902 557372 304087
33767C04087l34873m08803l38177K3399K89083J3689m32129l17826K26949M02252
$$ 304087 -30786 -439589 -777766 -754367 -465284 -451595 -883724 -1201550 -974601 -572349
33757e72349J13284Q9618M97064N48474j22823p20033m77517K19017N27780L24969
$$ -572349 -459065 -369447 127617 676091 553268 -166765 -644282 -425265 102515 427484
33747D27484O5295l1372n0273J2255J76391K32913j1227l91538n75764m49136
$$ 427484 492779 461407 411134 423389 599780 832693 821466 429928 -145836 -594972
33737e94972j31288K03438L84784L25279J43168K4763m9505k09992l69962l06602
$$ -594972 -726260 -522822 -138038 187241 330409 355172 305667 95675 -274287 -580889
33727e80889m9936J44192J94519K25735K35678J06225q4575j52025j67413l18069
$$ -580889 -630825 -486633 -292114 -66379 169299 275524 190949 38924 -128489 -446558
33717d46558m60536k84366J03459K62957J05817j8799L5888K5543j44363k26708
$$ -446558 -907094 -1191460 -1088001 -825044 -719227 -738026 -702138 -676595 -820958 -1047666
33707a047666j22815n4279q7678K581K11980J74949j82147l60362j1846M75008
$$ -1047666 -1170481 -1224760 -1312438 -1309857 -1097877 -922928 -1105075 -1465437 -1477283 -1002275
33697a002275N18030J58361q2248L3770K34139K04552l5242k43230k45197o7483
$$ -1002275 -484245 -325884 -408132 -374362 -140223 64329 29087 -214143 -459340 -526823
33687e26823J25254J84416Q4731r2055k19002j72900N4560K64377K37469O2349
$$ -526823 -401569 -217153 -132422 -224477 -443479 -616379 -561819 -297442 -59973 2376
33677B376M6920K28491K81084N6709j45511q7261J4186q3615k06402j42342q5252
$$ 2376 49296 277787 558871 615580 470069 382808 396994 313379 106977 -35365 -120617
33666a20617k33319l04310L278L74343L01274j02962l25484k64509j85011p7530
$$ -120617 -353936 -658246 -654968 -280625 20649 -82313 -407797 -672306 -857317 -934847
33656i34847K35190N01372K94395j99429l74150j58238m3211j55432p8705K86630
$$ -934847 -699657 -198285 96110 -103319 -477469 -635707 -678918 -834350 -913055 -626425
33646f26425M47469J26925k92590l76770j56730J38576L66400L68358Q7581j45859
$$ -626425 -178956 -52031 -344621 -721391 -878121 -739545 -373145 -4787 82794 -63065
33636f3065K3789L21429J62443l57771n17600j09876K36588P8261k45755l13600
$$ -63065 -39276 282153 444596 86825 -430775 -540651 -304063 -225802 -471557 -785157
33626g85157k15475j28154M9920K94645K94103K7345p1897J57746L03287J11646
$$ -785157 -1000632 -1128786 -1078866 -784221 -490118 -462773 -534670 -376924 -73637 38009
33616C8009q9952m7157k4260k11929l02100p7227J51826J17717M1015R5335K9126
$$ 38009 -51943 -99100 -123360 -335289 -637389 -714616 -562790 -445073 -404058 -308723 -279597
33605b79597k38512k75588J01700L51495O0202l29468k65285K6612Q0767M7372
$$ -279597 -518109 -793697 -691997 -340502 -280300 -609768 -875053 -848441 -767674 -720302
33595g20302K40574L60853L8183k89826n633M96203K81118n93243j060310o18069
$$ -720302 -479728 -118875 -80692 -370518 -376151 120052 401170 -192073 -1252383 -1870452
33585a870452O5887L33220L90306N84532O28704J59221m52829n16898k4921L40603
$$ -1870452 -1804565 -1471345 -1081039 -496507 132197 291418 -161411 -678309 -703230 -362627
33575c62627J74177j52057j03430K38559L23901m7219m22286l47442m246J24808
$$ -362627 -188450 -340507 -443937 -205378 118523 71304 -350982 -698424 -702670 -577862
33565e77862J2404M7137L03592L79947O8909l01812m02635l40909l19788k50767
$$ -577862 -565458 -518321 -214729 165218 234127 -67685 -470320 -811229 -1131017 -1381784
33555a381784P151L35322N34555N51981L78981M4429j99384j08754N8323j67550
$$ -1381784 -1374633 -1039311 -504756 47225 426206 470635 271251 162497 220820 53270
33545E3270n85146m57157K38674N54440L3071m65488j12238N38741M93019m9567
$$ 53270 -531876 -989033 -750359 -195919 -162848 -628336 -740574 -201833 291186 241619
33535B41619j32416L01301L99924q3484m31141k17333Q7662J2355k53556l75428
$$ 241619 109203 410504 810428 726944 295803 78470 166132 178487 -75069 -450497
33525d50497l65498k92173p8160J89197K55146J53300J64463K37890J9374m32740
$$ -450497 -815995 -1108168 -1186328 -997131 -741985 -588685 -424222 -186332 -166958 -599698
33515e99698n59872j23396M23931N83689L46546o0919m47748n30575q6035N69097
$$ -599698 -1159570 -1282966 -859035 -275346 71200 10281 -437467 -968042 -1054077 -484980
33505d84980P73273L92947k1950j21490j78579l83240l95695j7485L09372J97345
$$ -484980 288293 681240 659290 537800 359221 -24019 -419714 -437199 -127827 69518
33495F9518j3733J39147M08885K68306j46883k33844R2754K92665O7033k69682
$$ 69518 55785 194932 603817 872123 725240 491396 584150 876815 943848 674166
33485F74166l72911l06293k40391j42528K2434J10638M6166P457J40889K69553
$$ 674166 301255 -5038 -245429 -387957 -365523 -254885 -208719 -201262 -60373 209180
33475B09180J31987j86438l07706n2981L16911M29697K35692n772r5633q7929
$$ 209180 341167 154729 -152977 -205958 110953 540650 776342 770570 674937 587008
33465E87008j05982j30306p0331N0215J05849L8831p2035r9761J9472K23239L33810
$$ 587008 481026 350720 280389 330604 436453 475284 403249 303488 322960 546199 880009
33454H80009J99564j22242l89343m23217k64692p4602K001j24409l95861n27996
$$ 880009 1079573 957331 567988 144771 -119921 -194523 -192522 -316931 -712792 -1240788
33444a240788k63030K28586M77927L54042K24866K95736K08718l21330q35999
$$ -1240788 -1503818 -1275232 -797305 -443263 -218397 77339 286057 -35273 -871272
33435h71272o51648J21780O53342M78841O204j61170L4614K27092J70285n4653
$$ -871272 -1522920 -1401140 -747798 -268957 -262753 -423923 -389309 -162217 8068 -46585
33425d6585k15795j70035P815J10673N7249k2920l0841m3192q8451k4536J57533
$$ -46585 -262380 -432415 -424600 -313927 -256678 -279598 -310439 -353631 -442082 -466618 -309085
33414c09085J91815k7659j86696p3773j776k37154l86685j66N21031M23414j46040
$$ -309085 -117270 -144929 -331625 -405398 -407174 -644328 -1031013 -1031179 -510148 -86734 -232774
33403b32774k87640K21467N77240K56959k09696j82451J51355K95470K50645K26499
$$ -232774 -520414 -298947 278293 535252 325556 143105 294460 589930 840575 1067074
33393A067074Q8974k82773n11115k31755K13502K16652j75159l73032j50234J35864
$$ 1067074 1156048 873275 362160 130405 343907 560559 385400 12368 -137866 -2002
33383b002J80132O3575q2510k78056m42385l20010J46438N95115N89336J09964
$$ -2002 178130 241705 159195 -118861 -561246 -881256 -734818 -139703 449633 559597
33373E59597l99103m77376j23119K11843J51240j57052k66675l1508K63477L45012
$$ 559597 160494 -316882 -440001 -228158 -76918 -233970 -500645 -532153 -268676 76336
33363G6336K29723L0652j93608l21842k28402n6081r3947k81291k21666J65369
$$ 76336 306059 336711 143103 -178739 -407141 -463222 -557169 -838460 -1060126 -894757
33353h94757M47450L57531K03820K74949K94428o6220m95793m32959M8223L03442
$$ -894757 -447307 -89776 114044 388993 683421 617201 121408 -311551 -263328 40114
33343D0114K6447l81636m01364P69M38176N48340L21308R2752J55597L33511J63240
$$ 40114 66561 -315075 -716439 -715670 -277494 270846 592154 684906 840503 1174014 1337254
33332A337254l84626p08817l80018J86475K79356j15531l65225j42406J74775
$$ 1337254 952628 243811 -136207 50268 329624 214093 -151132 -293538 -118763
33323a18763J26781k06676l86500j85654J82990L33142J29094j67404k22939n7288
$$ -118763 8018 -198658 -585158 -770812 -587822 -254680 -125586 -292990 -515929 -573217
33313e73217L5616m1598r7407n6446o8547j13405M0847L00201K07305k50504l95143
$$ -573217 -537601 -579199 -676606 -733052 -801599 -915004 -874157 -573956 -366651 -617155 -1012298
33302a012298J00579N30436J96573l99480k92570L86852O22983J53444j91140
$$ -1012298 -911719 -381283 -184710 -584190 -876760 -489908 133075 286519 95379
33293I5379Q4101M10070K19432j59520k03011p3202j94516m68998n14660l20194
$$ 95379 179480 589550 808982 649462 446451 373249 178733 -290265 -804925 -1125119
33283a125119j21839Q2443L89184N91568M21592N0120r5638O4145K11146J27531
$$ -1125119 -1246958 -1164515 -775331 -183763 237829 287949 192311 256456 467602 595133
33273E95133p3454j83023j06442J23951L39868L13300L1385k05934j58885L911
$$ 595133 521679 338656 232214 356165 696033 1009333 1040718 834784 675899 679810
33263F79810m0568k78042l86142k04830P6673K04233J22609n8742j90885j57626
$$ 679810 639242 361200 -24942 -229772 -153099 51134 173743 115001 -75884 -233510
33253b33510L4191K13401K00653J9239j24298o0568J90932M40806M51887J36089
$$ -233510 -199319 14082 214735 233974 109676 49108 240040 680846 1132733 1268822
33243A268822k86317m30449j76999J31171Q0210k87805n23881l40193O1218K91930
$$ 1268822 982505 552056 375057 506228 586438 298633 -225248 -565441 -504223 -212293
33233b12293K51461J59862J88211K35456J34809n0127j04128r338l045j93947
$$ -212293 39168 199030 387241 622697 757506 707379 603251 593913 590868 396921
33223C96921l28710j54738J31463J05997k51988m96389l54553q7862k2720k8974
$$ 396921 68211 -86527 44936 150933 -101055 -597444 -951997 -1039859 -1062579 -1091553
33213a091553K10613N93789O59354K55953j96877k47921L0699K19338J24250o5298
$$ -1091553 -880940 -287151 372203 628156 431279 183358 214057 433395 557645 492347
33203D92347j42221j37941j30159k9585K26122M05987K16828k07954l75523r9794
$$ 492347 350126 212185 82026 52441 278563 684550 901378 693424 317901 218107
33193B18107K09515J32197j73537k78358j46096p9179j32025n6682J65126K18176
$$ 218107 427622 559819 386282 107924 -38172 -117351 -249376 -306058 -140932 77244
33183G7244L860j45913j0133J55405O1419j41290j52163j3824L8724J7032R7167
$$ 77244 81104 -64809 -74942 80463 141882 592 -151571 -165395 -126671 -109639 -12472
33172a2472K36760K36003R0151n8015k23035m60747n33143j57506L86893M22089
$$ -12472 224288 460291 550442 492427 269392 -191355 -724498 -882004 -495111 -73022
33162g3022j66806o14717k68756M79716P23800K76479j65990o4253L02944L90737
$$ -73022 -239828 -854545 -1123301 -643585 80215 356694 190704 126451 429395 820132
33152H20132J54866o1515j21482j76320k67724k33005l0378J54723K06485K12425
$$ 820132 974998 913483 792001 615681 347957 114952 84574 239297 445782 658207
33142F58207J95745r376m24658p04347n17891k3549L14796L06936J55709M4186
$$ 658207 853952 844576 419918 -284429 -802320 -825869 -511073 -204137 -48428 -4242
33132d242p0608j99034j74866O2443K75067K25355J3418r1696m2991m661j1123
$$ -4242 -74850 -273884 -448750 -386307 -111240 114115 127533 35837 -7154 -11815 -22938
33121b2938R1792L12913L73359P9428l04626l09725J04993M17982J89752l39906
$$ -22938 68854 381767 755126 834554 529928 220203 325196 743178 932930 593024
33111E93024n53958k78082L7021J7713j17711K004K49606K03709j30480k81481
$$ 593024 39066 -239016 -201995 -184282 -301993 -299989 -50383 153326 22846 -258635
33101b58635l4712K51825K26742M8304K9061R4158k2202k25351j44414K46564
$$ -258635 -293347 -41522 185220 233524 262585 356743 334541 109190 -35224 211340
33091B11340M92279K67993j63120k94966m847L54389L94299O3725l67188n64918
$$ 211340 703619 971612 808492 513526 508679 863068 1257367 1321092 953904 388986
33081C88986m02954p6416Q5129K304l5226K24037N53291M67732r4459o00799n83761
$$ 388986 -13968 -90384 -5255 -2951 -38177 185860 739151 1206883 1112424 511625 -72136
33070g2136k21091j8525j12095k12059j35842k3698j0307k5394k418R605L1877
$$ -72136 -293227 -311752 -423847 -635906 -771748 -795446 -805753 -831147 -833565 -823960 -792083
33059g92083J67668L40713L31966J79738J85007L69176L38364o9538m31327l74634
$$ -792083 -624415 -283702 48264 228002 413009 782185 1120549 1051011 619684 245050
33049B45050j49102j22097j12743J90181M82594K38460l31213m87673j02770J94645
$$ 245050 95948 -26149 -138892 51289 533883 772343 441130 -46543 -149313 45332
33039D5332R6722K7838K26007K16152l29534q67705p27653j14046K59207K11499
$$ 45332 142054 169892 395899 612051 282517 -585188 -1312841 -1426887 -1167680 -956181
33029i56181J40771K26309K18899o215k27904k79304k51659k10275n3219K29791
$$ -956181 -815410 -589101 -370202 -376417 -604321 -883625 -1135284 -1345559 -1398778 -1168987
33019a168987M26071L62081J27592o1037j11461j03749j45366k04165r6806K76981
$$ -1168987 -742916 -380835 -253243 -314280 -425741 -529490 -674856 -879021 -975827 -698846
33009f98846O88325P35924L24114j89691m29147l91137k72908j32566N5632J81382
$$ -698846 -10521 725403 1049517 859826 430679 39542 -233366 -365932 -310300 -128918
32999a28918J06703q2275j58674n0089J18334K18708K06013P3364j28813k69877
$$ -128918 -22215 -104490 -263164 -313253 -194919 23789 229802 303166 174353 -95524
32989i5524k41261m9083K13940L86735K67969j44853m56524k56192K36534L31459
$$ -95524 -336785 -385868 -171928 214807 482776 337923 -118601 -374793 -138259 193200
32979A93200j48860n20864k07800L95960N14228R6103k43321j80074J8090P1336
$$ 193200 44340 -476524 -684324 -288364 225864 321967 78646 -101428 -83338 -12002
32969a2002J7826m5500r1389k0706K03957L23716J03291j91186j24318J65115
$$ -12002 5824 -39676 -131065 -151771 52186 375902 479193 288007 163689 328804
32959C28804J33380k48905l99094p9855K10440Q0055j45836o0649J15194k2458
$$ 328804 462184 213279 -185815 -265670 -55230 24825 -121011 -181660 -66466 -88924
32949h8924l04395k44031J70371M68562L87280J18616r3655k15624k57708j67577
$$ -88924 -393319 -637350 -466979 1583 388863 507479 413824 198200 -59508 -227085
32939b27085L0659J87062J76963J1146j78213k04274R245K55667K13045j04856
$$ -227085 -196426 -9364 167599 178745 532 -203742 -194497 61170 274215 169359
32929A69359k91320j15434J10395Q829k49635j97546J92732M48031K71833r7902
$$ 169359 -121961 -237395 -127000 -118171 -367806 -565352 -372620 75411 347244 249342
32919B49342k85505k15403m3564Q7316J04529K6451J4453J94940L70343J83130
$$ 249342 -36163 -251566 -295130 -207814 -103285 -76834 -62381 132559 502902 686032
32909F86032l13467n63809k26800K86634L34226p5635l33899j17318K11721K05946
$$ 686032 372565 -191244 -418044 -131410 202816 127181 -206718 -324036 -112315 93631
32899I3631m8872j67529n6813M3723l349o3894l002J08324J26004L4563n1861
$$ 93631 44759 -122770 -179583 -135860 -139209 -203103 -206105 -97781 28223 62786 10925
32888A0925l7538J8779q0622m21711p24033n55041O0251N06565L42637m1709L6091
$$ 10925 -26613 -7834 -88456 -510167 -1234200 -1789241 -1728990 -1222425 -879788 -921497 -885406
32877h85406N20679O95837K78798k05711l08649k57242l31283k66693J77687N58765
$$ -885406 -364727 331110 609908 404197 95548 -161694 -492977 -759670 -581983 -23218
32867b3218L32918k18132l57227o826K29034R2224k4139J15118J85179m7737k75301
$$ -23218 309700 91568 -265659 -272485 -43451 48773 24634 139752 324931 277194 1893
32856A893j82139L6028M4315j00739j32914j4767J04968J55521J30003J7495o8804
$$ 1893 -180246 -144218 -99903 -200642 -333556 -348323 -243355 -87834 42169 59664 -9140
32845i140N4861K89366K58593j10544l47248q7083L33358L25123j09625m05151
$$ -9140 45721 335087 593680 483136 135888 48805 382163 707286 597661 192510
32835A92510k21175J81062L63290K07069p1905k00105q1600J25976J67065j5434
$$ 192510 -28665 152397 515687 722756 650851 450746 369146 495122 662187 646753
32825F46753k11829k40095j72160j54456j59241p9097N7649J40881J51228J27586
$$ 646753 434924 194829 22669 -131787 -291028 -370125 -312476 -171595 -20367 107219
32815A07219O0013n3611j55543k40276l61632m22810j99076K43882M27872O8718
$$ 107219 167232 113621 -41922 -282198 -643830 -1066640 -1265716 -1021834 -593962 -525244
32805e25244m10749l67604J77222N66443M07992L0762o4890J45546L09434K01956
$$ -525244 -935993 -1303597 -1126375 -559932 -151940 -121178 -186068 -40522 268912 470868
32795D70868q4008l24892l65031j84788J04134L37280M18117L51164J76936n2483
$$ 470868 386860 61968 -303063 -487851 -383717 -46437 371680 722844 899780 847297
32785H47297k38457k75737j71030o2868p4116j62110j50950O5714L59483M59703
$$ 847297 608840 333103 162073 99205 25089 -137021 -287971 -222257 137226 596929
32775E96929K53352p6227k94602m05947n34963o07306m15500p424K87637L04463
$$ 596929 850281 774054 479452 73505 -461458 -1068764 -1484264 -1491688 -1204051 -899588
32765h99588K29109K23723J71150k0179j60250q4742N0496Q0522J74625M89370
$$ -899588 -670479 -446756 -275606 -295785 -456035 -540777 -490281 -409759 -235134 254236
32755B54236O98549L53917l65957p63057n22028o0039J41221J29660J84598K73308
$$ 254236 952785 1306702 940745 177688 -344340 -404379 -263158 -133498 51100 324408
32745C24408J42583k11027m72181l85649j4837L63153M81913K35175k35430n70356
$$ 324408 466991 255964 -216217 -601866 -616703 -253550 228363 463538 228108 -342248
32735c42248m53026N4547N02437M94210J16828j91441j90619o5563m1891l2514
$$ -342248 -795274 -740727 -238290 255920 372748 181307 -9312 -74875 -116766 -149280
32725a49280J17007K51779J21679j46892j90062J7706J45688Q1990O5198J55136
$$ -149280 -32273 219506 341185 194293 4231 21937 167625 249615 314813 469949
32715D69949P8843k05594l06092n0960J44416n0888k94922j25121K75396L79916
$$ 469949 548792 343198 37106 -13854 130562 79674 -215248 -340369 -64973 314943
32705C14943R9765k37818m39174m83033k75179J17510K57966p0915l41017J2874
$$ 314943 414708 176890 -262284 -745317 -1020496 -902986 -645020 -715935 -1056952 -1044078
32695a044078O15153O31281N1940l40848k28266q0853j54555q1534K81065M50615
$$ -1044078 -428925 202356 254296 -86552 -314818 -395671 -550226 -631760 -350695 99920
32685I9920J63263j10890N4330L65921L63244R9439j53345l56041m44121j57939
$$ 99920 263183 152293 206623 572544 935788 1035227 881882 525841 81720 -76219
32675g6219M04367N92512Q6414n08655n02067r1555J10454Q5102K23863M58135
$$ -76219 328148 920660 1007074 498419 -3648 -95203 15251 100353 324216 782351
32665G82351L51036q2761l62725l04976j75382j06865L5177J88944Q1768k30761
$$ 782351 1133387 1050626 687901 382925 207543 100678 135855 324799 406567 175806
32655A75806l28963o3354K13546J80134o8716k81156l45465k27118O1596L23892
$$ 175806 -153157 -216511 -2965 177169 108453 -172703 -518168 -745286 -683690 -359798
32645c59798L05478N3645j13446n7259L1712p445p5880l2006R3790J84420J60261
$$ -359798 -54320 -675 -114121 -171380 -139668 -147113 -222993 -254999 -161209 23211 183472
32634A83472n254k27094l02139j48965L0219M7617M4631K00640K96741J5189m17154
$$ 183472 178218 -48876 -351015 -499980 -469761 -422144 -377513 -176873 119868 135057 -282097
32623b82097m18391P1742M34771K43641j90577l49180j44947K09768N55799P13268
$$ -282097 -700488 -628746 -193975 49666 -140911 -490091 -635038 -425270 130529 843797
32613H43797M39058j80845n96393m22200K9857J94167P417j51292q8505M9574
$$ 843797 1282855 1102010 505617 83417 113274 307441 314858 163566 75061 124635
32603A24635J44143K14451J96717o280k41066k19102L7430J91437R8780p793M6528
$$ 124635 268778 483229 679946 673666 432600 213498 250928 442365 541145 533352 579880
32592E79880R4314k5820j30824R379K33694J77347j90407n25655n80508m18209
$$ 579880 674194 648374 517550 526929 760623 937970 747563 221908 -358600 -776809
32582g76809j55127J72716L97305K46139j85325l21688J62870P41099O35083q3593
$$ -776809 -931936 -759220 -361915 -115776 -301101 -622789 -459919 281180 916263 832670
32572H32670n41704k66993K26742K91224M3121j9144J05513J495l79259n89547
$$ 832670 290966 23973 250715 541939 585060 565916 671429 672924 293665 -295882
32562b95882l66589K2961K22498K08174J35625N0394p8404k05109k23046p2084
$$ -295882 -662471 -639510 -417012 -208838 -73213 -22819 -101223 -306332 -529378 -601462
32552f01462J76054K88186N0122l85610n20523j27249L46505L42169q532j06439
$$ -601462 -425408 -137222 -87100 -472710 -993233 -1120482 -773977 -431808 -440340 -546779
32542e46779J80554L56199J21193j97929k33050r3280l1785r467J00576K02374
$$ -546779 -366225 -10026 111167 -86762 -319812 -413092 -444877 -454344 -353768 -151394
32532a51394J68638P8146K0810o5024j59439q9161R2722L2137l38176n32849k00477
$$ -151394 17244 95390 116200 51176 -108263 -197424 -104702 -72565 -410741 -943590 -1144067
32521a144067L00240M42146K97660K63206L24779J91390m4613j9698K08454J99782
$$ -1144067 -843827 -401681 -104021 159185 483964 675354 630741 611043 819497 1019279
32511A019279j18636l14818j52361Q2792Q6843p2378k03929k42868j42288J13883
$$ 1019279 900643 585825 433464 516256 603099 530721 326792 83924 -58364 55519
32501E5519L09307J83199j22595k11931o7534n1783k06778j34381K40883M06726
$$ 55519 364826 548025 425430 213499 145965 94182 -112596 -246977 -6094 400632
32491D00632Q8465k43311j35835J00276l4616l46004k99535L7483J30281p8424
$$ 400632 489097 245786 109951 210227 175611 -170393 -469928 -432445 -302164 -380588
32481c80588q4395K77729N23658L03959n9775j17924N0762P1793j15477k30450
$$ -380588 -464983 -187254 336404 640363 580588 462664 513426 585219 469742 239292
32471B39292r8531J60595L47700L80431K75013P5890j55322l43643m37818m47016
$$ 239292 140761 301356 649056 1029487 1304500 1380390 1225068 881425 443607 -3409
32461c409m14926l23110o4693L77822P58948P65271M14106L0759k24174m82969
$$ -3409 -418335 -741445 -806138 -428316 330632 1095903 1510009 1540768 1316594 833625
32451H33625o95734m74590K23955O76427K41646o11018q15881j81234L99520L03745
$$ 833625 137891 -336699 -112744 563683 805329 194311 -621570 -802804 -403284 -99539
32441i9539l2912n942K01561R7166k19951k91299j07815l3249j01705l1147J29343
$$ -99539 -132451 -138393 63168 160334 -59617 -350916 -458731 -491980 -593685 -624832 -495489
32430d95489N050l75169m52228K8643N40607M77725Q085j74577J95765O36707
$$ -495489 -490439 -865608 -1317836 -1289193 -748586 -270861 -262776 -437353 -241588 395119
32420C95119N81840Q3594l05280k30550P7738J59652q1805l11276k52889m0037
$$ 395119 976959 1060553 755273 524723 602461 762113 680308 369032 116143 76106
32410G6106K0548j28363k64721j98593K8541K22008K21880M7794j05773q9875
$$ 76106 96654 -31709 -296430 -495023 -466482 -244474 -22594 25200 -80573 -170448
32400a70448j1258p1338k04686j36183J41303K75884J07630m1902R6442K60306
$$ -170448 -181706 -253044 -457730 -593913 -452610 -176726 -69096 -110998 -14556 245750
32390B45750R5776k16347k54185o4817l9287j96743j77291O3792J53197j2097
$$ 245750 341526 125179 -129006 -193823 -233110 -429853 -607144 -543352 -390155 -402252
32380d02252n4409K01010L60648Q6054l44563m48610j98848O6853J61450J61866
$$ -402252 -456661 -255651 104997 191051 -153512 -602122 -800970 -734117 -572667 -410801
32370d10801J62987J72262J55179M9574j41328k28038l1891K62957K64697m9839
$$ -410801 -247814 -75552 79627 129201 -12127 -240165 -272056 -9099 255598 205759
32360B05759k73743j86875k5570Q843M4798J20762k4886m08553n37297j34695
$$ 205759 -67984 -254859 -280429 -271586 -226788 -106026 -130912 -539465 -1076762 -1211457
32350a211457L02205J94666k26039k93404R6993M58645M97311L41995J19791j36628
$$ -1211457 -909252 -714586 -940625 -1234029 -1137036 -678391 -181080 160915 280706 144078
32340A44078k36659k3138K38049J61601j32109k02908j6060P3624o009l34O4100
$$ 144078 -92581 -115719 122330 283931 151822 -51086 -67146 6478 469 135 64235
32329F4235j06523l88220k67276K66657N32993J53186l79200m68738k07197K485
$$ 64235 -42288 -430508 -697784 -431127 101866 255052 -124148 -592886 -800083 -797598
32319g97598J09336K42931K92274J44398K7281J42036K17891p7861m78935l81727
$$ -797598 -688262 -445331 -153057 -8659 18622 160658 378549 300688 -178247 -559974
32309e59974K82762Q75514Q04802J63912m46936n56929k45955m845j50441m10938
$$ -559974 -277212 598302 1403104 1567016 1120080 563151 317196 312351 161910 -249028
32299b49028k78359K39322N40218K11674m37661q06550o56633j52343M17994P22127
$$ -249028 -527387 -288065 252153 463827 26166 -780384 -1437017 -1589360 -1171366 -449239
32289d49239N23909L5089j80825O0536K77329Q0294k05585j30779Q7298k0934
$$ -449239 74670 109759 -71066 -10530 266799 347093 141508 10729 98027 77093
32279G7093k87086j62659K89831M37900J16790j30663P502J47794n0307l19235
$$ 77093 -209993 -372652 -82821 355079 471869 341206 348708 496502 446195 126960
32269A26960l15546j78149j50641j11713P6959J64133n8844k66779q4167K22376
$$ 126960 -188586 -366735 -517376 -629089 -552130 -387997 -446841 -713620 -797787 -575411
32259e75411J46774j57139q2170L68859M92887L7006l06700L1797N69414N17856
$$ -575411 -428637 -585776 -667946 -299087 193800 230806 -75894 -44097 525317 1043173
32249A043173J9711j17295K73153M77258M1979n70163p35476m89557k27471n9941
$$ 1043173 1062884 945589 1218742 1696000 1737979 1167816 432340 -57217 -284688 -344629
32239c44629J01854J86308J34031J43788L20528L60099L2726l17877k78963p3875
$$ -344629 -242775 -56467 77564 221352 541880 901979 934705 616828 337865 263990
32229B63990j40984k86631k8504M06356L45247j00048r2438M65044O07619j12662
$$ 263990 123006 -163625 -192129 214227 559474 459426 366988 832032 1439651 1326989
32219A326989p72146m87527K20800L40196q9792l14699j87726j20111j02684J61274
$$ 1326989 554843 67316 288116 628312 538520 223821 36095 -84016 -186700 -25426
32209b5426L92604P6025m55242l51458L26743N93804J05464l27230j10888K48287
$$ -25426 367178 443203 -12039 -363497 -36754 557050 662514 335284 224396 472683
32199D72683J24713k35785l03149j34263l5255O2324K69252K87157q5551m27947
$$ 472683 597396 361611 58462 -75801 -111056 -48732 220520 507677 422126 -5821
32189e821l02438l607n3616k88745j67392K41814L47660M2516j21122J56030M88175
$$ -5821 -308259 -311866 -365482 -654227 -821619 -579805 -232145 -189629 -310751 -154721 333454
32178C33454M78991K70352J45172L4123k38161n21481n11545k02455J11541K06337
$$ 333454 812445 1082797 1227969 1262092 1023931 502450 -9095 -211550 -100009 106328
32168A06328R1977j22984l27736l90160k27521N4982K14098J19503j11436k70781
$$ 106328 198305 75321 -252415 -642575 -870096 -815114 -601016 -481513 -592949 -863730
32158h63730k78100j83859m2946J00790J66615J31052J36417L05880M57022K69267
$$ -863730 -1141830 -1325689 -1368635 -1267845 -1101230 -970178 -833761 -527881 -70859 198408
32148A98408j94601m49470k37021J07875J92552J36794K38466L70616K12701j09175
$$ 198408 3807 -445663 -682684 -574809 -382257 -245463 -6997 363619 576320 467145
32138D67145j74677K0068P2922j10982j92202m1336O7279K1913N6351K03296J52640
$$ 467145 292468 312536 385458 274476 82274 40938 108217 130130 186481 389777 542417
32127E42417j25610k15759J0144J14003j01660j66507J88633L84193j13754p85068
$$ 542417 416807 201048 211192 325195 223535 57028 245661 629854 516100 -268968
32117b68968p50272j14720K48274O8781o1927J86693L72871J25857k14963j79210
$$ -268968 -1019240 -1133960 -885686 -816905 -878832 -692139 -319268 -193411 -408374 -587584
32107e87584J19662K45427Q9117r9242j37142p6745l0626k2897O538J21126K87050
$$ -587584 -467922 -222495 -133378 -232620 -369762 -446507 -477133 -500030 -493492 -372366 -85316
32096h5316L69965K89156J12385p3118k61265l91296k92226M5041L09621K30953
$$ -85316 284649 573805 686190 613072 351807 -39489 -331715 -286674 22947 253900
32086B53900l4919j36096k4954M6031n9669k22647k94036k37945r9297P121j9829
$$ 253900 218981 82885 57931 103962 44293 -178354 -472390 -710335 -809632 -802511 -822340
32075h22340p4852N6270K76092J85812k57439n05318k01939K26670K54359R3652
$$ -822340 -897192 -840922 -564830 -379018 -636457 -1141775 -1343714 -1117044 -862685 -769033
32065g69033K11878L95893J18455l98323m04740J43421M96408L35059J60722K58401
$$ -769033 -557155 -161262 -42807 -441130 -845870 -702449 -206041 129018 289740 548141
32055E48141K01233k36238n32841l05806l280j25760l87471k91784q198J0090
$$ 548141 749374 513136 -19705 -325511 -328791 -454551 -842022 -1133806 -1142004 -1131914
32045a131914j36169m2189K14813K35131N4234P7876L38088M15058J25897k01433
$$ -1131914 -1268083 -1310272 -1095459 -860328 -806094 -728218 -390130 24928 150825 -50608
32035e0608k24684l732J53906M3242k42571l45451j0086M75979N05019M879l26923
$$ -50608 -275292 -279024 -125118 -81876 -324447 -669898 -679984 -204005 301014 305893 -21030
32024b1030R892N37352N04969K7413j58860J05853K05560k00121o23774n07531
$$ -21030 -11138 526214 1031183 1058596 899736 1005589 1211149 1011028 387254 -120277
32014a20277j8896K50149P3360k24976k31035J08086M43134L85976k8982l25613
$$ -120277 -139173 110976 184336 -40640 -271675 -163589 279545 665521 636539 310926
32004C10926j62589K07557K83785j3955l29106m28012m03719l31539j11154K40516
$$ 310926 148337 355894 639679 625724 296618 -131394 -535113 -866652 -977806 -737290
31994g37290M51270L16855j8402k24901j29017J43128K78356P7794k58686k77428
$$ -737290 -286020 30835 12433 -212468 -341485 -198357 79999 157793 -100893 -378321
31984c78321J40475N10560L20006k77794o50789m62876N5854N11624O73203M76490
$$ -378321 -237846 272714 592720 314926 -335863 -798739 -742885 -231261 441942 918432
31974I18432P2605j74909q8957O243k47146n85216m50248Q5541L43521O9081k02713
$$ 918432 991037 816128 727171 733414 486268 -98948 -549196 -463655 -120134 -51053 -253766
31963b53766m1081K30670J54296r9774o5690K60984M75830L74447J05274j50193
$$ -253766 -294847 -64177 90119 -9655 -75345 185639 661469 1035916 1141190 990997
31953I90997l12477l22576k01475j02076r6867m2015J64273L55289L25337J18704
$$ 990997 678520 355944 154469 52393 -44474 -86489 77784 433073 758410 877114
31943H77114r6850k58020l25199k03243L4337Q1689j73355l90983k49519M8214
$$ 877114 780264 522244 197045 -6198 28139 109828 -63527 -454510 -704029 -655815
31933f55815R1936r8241j51839M9418K59630L13426K89552K21661J4486k84442
$$ -655815 -563879 -662120 -813959 -764541 -504911 -191485 98067 319728 334214 49772
31923D9772m38519l36457j15378P8931K22627K72527J50484n9301j27122J6107
$$ 49772 -388747 -725204 -840582 -761651 -539024 -266497 -116013 -175314 -302436 -286329
31913b86329J76311J75473N8233n1211j24316j69269j42435k4422J02087J25610
$$ -286329 -110018 65455 123688 72477 -51839 -221108 -363543 -387965 -285878 -160268
31903a60268J8326j25452j19574J69126N95274P51882M00959j75133m74275l88661
$$ -160268 -141942 -267394 -386968 -217842 377432 1129314 1530273 1355140 880865 492204
31893D92204k56924l01736l35026j41660J36396K24379J31469Q6901J56807J78981
$$ 492204 235280 -66456 -401482 -543142 -406746 -182367 -50898 36003 192810 371791
31883C71791O8497m1567l4176n738r6513k28493j90141L0517J86113J20281K276
$$ 371791 440288 398721 364545 358807 262294 33801 -156340 -125823 60290 180571 182847
31872A82847M7755J51931O2791j52846j55229J13498K79142R8153j63148j61964
$$ 182847 230602 382533 445324 292478 137249 250747 529889 628042 464894 302930
31862C02930n214j9280k10784l22252k84193k37391j85315P564K96892M71063
$$ 302930 297716 278436 67652 -254600 -538793 -776184 -961499 -953935 -657043 -185980
31852a85980M69879L90113K21446q3897l23888k23466R3545K13532N4066m9141
$$ -185980 283899 674012 895458 811561 487673 264207 357752 571284 625350 576209
31842E76209M5751N1085k05236m45188m02418k35047j92305k00457q2114R3284
$$ 576209 621960 673045 467809 22621 -379797 -614844 -807149 -1007606 -1089720 -996436
31832i96436J70961J70714J24059o5790l20169k62181K35133O69175N17380R02
$$ -996436 -825475 -654761 -530702 -596492 -916661 -1178842 -943709 -274534 242846 243748
31822B43748k46357j11634o2154l06939m57170j64531L36905N54153L32906n8421
$$ 243748 -2609 -114243 -176397 -483336 -940506 -1105037 -768132 -213979 118927 60506
31812F0506k70655j68571R5450K24696P6003j81654k83375j74541P982J42482
$$ 60506 -210149 -378720 -283270 -58574 17429 -164225 -447600 -622141 -614159 -471677
31802d71677J52439k3942k82782l27977n6632J90111Q2361j54626o4088K88591
$$ -471677 -319238 -343180 -625962 -953939 -1010571 -820460 -738099 -892725 -956813 -668222
31792f68222L89081R9513j24995K5365K62556K22877J4667o1626j5211o1736k37330
$$ -668222 -279141 -179628 -304623 -279258 -16702 206175 220842 159216 144005 82269 -155061
31781a55061l93893m18980k58462R9930M86216N95711L68642J27664J55114L32235
$$ -155061 -548954 -967934 -1226396 -1126466 -640250 -44539 324103 451767 606881 939116
31771I39116L68592J70214j85353n76888p56398m59768J33980L86696q47m80603
$$ 939116 1307708 1477922 1292569 715681 -40717 -500485 -366505 20191 19344 -461259
31761d61259l79555J36042L45786N1137k32610j36670R7923J35020J7665o3594
$$ -461259 -840814 -704772 -358986 -307849 -540459 -677129 -579206 -444186 -426521 -490115
31751d90115p4061j4382J55233K96252J44893k22407l28607N0772M96287N04077
$$ -490115 -564176 -578558 -423325 -127073 17820 -204587 -533194 -482422 13865 517942
31741E17942J56903j05845j59036k28040l75568l73083j09820J95488K75809R4472
$$ 517942 674845 569000 409964 181924 -193644 -566727 -676547 -481059 -205250 -110778
31731a10778k05616m44658m62527k14924J27282L07648K48556P9389p8811k01643
$$ -110778 -316394 -761052 -1223579 -1438503 -1311221 -1003573 -755017 -675628 -754439 -956082
31721i56082k49591j64895j0516P7361J13392K29120L65369K73795l4692j42786
$$ -956082 -1205673 -1370568 -1381084 -1303723 -1190331 -961211 -595842 -322047 -356739 -499525
31711d99525J97380N84237M52386r4007l96395j94825L8553j05167l30141j64360
$$ -499525 -302145 282092 734478 640471 244076 49251 87804 -17363 -347504 -511864
31701e11864K30260K90481o3732l10775j11313K62692M05894K78576M2437k39140
$$ -511864 -281604 8877 -54855 -365630 -476943 -214251 191643 470219 512656 273516
31691B73516m83911m75758j73072Q8894J9889j74981j01754J96469K96403L3682
$$ 273516 -210395 -686153 -859225 -770331 -750442 -925423 -1027177 -830708 -534305 -500623
31681e00623k87239l57991k02720L0064K86707M78079M26902J58539J3356K10861
$$ -500623 -787862 -1145853 -1348573 -1318509 -1031802 -553723 -126821 31718 45074 255935
31671B55935M59602K93201k65081o62399m84509O5139M53170M07010P9575k41044
$$ 255935 715537 1008738 743657 81258 -403251 -338112 115058 522068 601643 360599
31661C60599l80909k78054L5191L54671L80906M1434l44183l91986j11316J31898
$$ 360599 -20310 -298364 -263173 91498 472404 513838 169655 -222331 -333647 -201749
31651b01749R3046r8018j85449r3963Q3849K36148K77899J86345N7454q415r2773
$$ -201749 -108703 -206721 -392170 -486133 -402284 -166136 111763 298108 355562 347147 254374
31640B54374l21266n25641l65688J00151L41543R2164k05427m3939L75825M73454
$$ 254374 -66892 -592533 -958221 -858070 -516527 -424363 -629790 -673729 -297904 175550
31630A75550J68771q6820n8481J2699r0561k57369l00485j45391K26663O47631
$$ 175550 344321 257501 199020 211719 121158 -136211 -436696 -582087 -355424 292207
31620B92207O47450l3075q35407q73656j17632N19013M38650O3644p599J12673
$$ 292207 939657 906582 71175 -802481 -920113 -401100 37550 101194 93595 206268
31610B06268L8291j17747k1143J92011J24879j77647k92242p6052K03468L13580
$$ 206268 244559 126812 105669 297680 422559 244912 -47330 -123382 80086 393666
31600C93666K35210L828k56051k71464K1556K16888m3203m47387m09510K3236
$$ 393666 628876 632704 376653 105189 126745 343633 300430 -146957 -556467 -533231
31590e33231K22984m6758k91086p7349L29605M01083P0680k63646k72639q863
$$ -533231 -310247 -357005 -648091 -725440 -395835 5248 75928 -187718 -460357 -469220
31580d69220K20265J77850n1708j48315K1235J80820L6583k43611k41526R2778
$$ -469220 -248955 -71105 -122813 -271128 -249893 -69073 -32490 -276101 -517627 -424849
31570d24849L70739L12613M9731j47509j57411L126K09159K37861L599k46764
$$ -424849 -54110 258503 308234 160725 3314 6440 215599 453460 457059 210295
31560B10295k47987j43381k41451m30267l00079J48368M31043L18787J44099J91777
$$ 210295 -37692 -181073 -422524 -852791 -1152870 -1004502 -573459 -254672 -110573 81204
31550H1204K68448J34792o9633j41002j78051l10826l84000k38317k8703N6766
$$ 81204 349652 484444 414811 273809 95758 -215068 -599068 -837385 -866088 -809322
31540h09322J31920L42662N13466M16692J87378J07072J35817K2214k33026l74955
$$ -809322 -677402 -334740 178726 595418 782796 889868 1025685 1047899 814873 439918
31530D39918l00230j58351o9955k608P3368J08170O2391m7668j66918k04097j14654
$$ 439918 139688 -18663 -88618 -91226 -17858 90312 152703 105035 -61883 -265980 -380634
31519c80634j5904n1891j20058Q743K49344K40259m4314j43954J71487M67397
$$ -380634 -396538 -448429 -568487 -559744 -310400 -70141 -114455 -258409 -86922 380475
31509C80475L08690l3260l6666K06683J66595k44852n58148m86376k48549r7974
$$ 380475 689165 655905 619239 825922 992517 747665 189517 -296859 -545408 -643382
31499f43382R919J67564L01470L25930K41680L5986k61927m37187k90119K2784
$$ -643382 -633463 -465899 -164429 161501 403181 439167 177240 -259947 -550066 -527282
31489e27282J36495l2855k12715j67519Q5574L89267N13010K36934l06427n42066
$$ -527282 -390787 -423642 -636357 -803876 -718302 -329035 183975 420909 114482 -427584
31479d27584j28815M30255L80312j86088m51962j02912K69327J61530j29265j25732
$$ -427584 -556399 -126144 254168 68080 -383882 -486794 -217467 -55937 -185202 -310934
31469c10934Q0204J32340K3500m0848n9411j04952n2500J79553L48755K01538
$$ -310934 -230730 -98390 -74890 -115738 -175149 -280101 -332601 -153048 195707 397245
31459C97245j30444l45666l73552k88461p5891K12569L22713J42345n4310l0342
$$ 397245 266801 -78865 -452417 -740878 -816769 -604200 -281487 -139142 -193452 -223794
31449b23794R212j90329m00631k29291K09113M19882K35676l6049j14236k553
$$ -223794 -214582 -404911 -805542 -1034833 -825720 -405838 -170162 -206211 -320447 -323000
31439c23000J90479L20467J81335k16700m62710k54357N8145m8019l74519k44942
$$ -323000 -132521 187946 369281 152581 -310129 -564486 -506341 -554360 -928879 -1173821
31429a173821L58626O50817K44284k31437j21339K66908K35546j90412l85678
$$ -1173821 -815195 -164378 79906 -151531 -272870 -5962 229584 39172 -346506
31420c46506j35492J18185J4581k63761l45295j15717K60776M94674L43334j02766
$$ -346506 -481998 -363813 -349232 -612993 -958288 -1074005 -813229 -318555 24779 -77987
31410g7987l52153n3411M34411M10290j96625o71223m82189L5297K51815J14497
$$ -77987 -430140 -483551 -49140 361150 164525 -506698 -988887 -953590 -701775 -587278
31400e87278L2634J49188K14090J02938L207L7167P6799K8107k2901n6272j98093
$$ -587278 -554644 -405456 -191366 -88428 -85221 -48054 28745 56852 33951 -22321 -220414
31389b20414m07262l83694j228M13968M76488K24748j1987n1478N9427K15824
$$ -220414 -627676 -1011370 -1012598 -598630 -122142 102606 90619 39141 98568 314392
31379C14392K66704M8880l21975m08256k5848L64312K56042j29065k07258q721
$$ 314392 581096 629976 308001 -100255 -126103 238209 494251 365186 157928 149207
31369A49207r4591m97395n34581P1128O28530M81688m2719k47580j09733n7929
$$ 149207 54616 -442779 -977360 -906232 -277702 203986 161267 -86313 -196046 -253975
31359b53975j03588N8762L08704K31935o5542k6231L94464N42349P1905m76233
$$ -253975 -357563 -298801 9903 241838 176296 150065 544529 1086878 1158783 682550
31349F82550m54670M771K85938J44318j36039k55060k06270j36429j48334k38648
$$ 682550 227880 232651 518589 662907 526868 271808 65538 -70891 -219225 -457873
31339d57873l06090k48351r1518N7855J82091L22536L95745K62726R967q8059
$$ -457873 -763963 -1012314 -1103832 -1045977 -863886 -541350 -145605 117121 127088 39029
31329C9029M4235J82898J73262J27204J31901N3383j77308l44018k58827r1628
$$ 39029 83264 266162 439424 566628 698529 751912 574604 230586 -28241 -119869
31319a19869j13772k54703k00261J25418M30859M26127J46099j35034k12131j25518
$$ -119869 -233641 -488344 -688605 -563187 -132328 293799 439898 304864 92733 -32785
31309c2785m4064o133J14218L11753L08966m2424l75661k27628K04421K30544
$$ -32785 -76849 -82982 31236 342989 651955 609531 233870 6242 210663 441207
31299D41207l00425o77445l19393L88995O63527L54137m9107j73152n3686J43198
$$ 441207 140782 -536663 -856056 -467061 196466 550603 501496 328344 274658 417856
31289D17856K49417R0777k54038l69529p1115J92211j2399l32329j62737K68518
$$ 417856 667273 758050 504012 134483 63368 255579 243180 -89149 -251886 16632
31279A6632J85025l94463n40442J07765O66604L42378l30172l34491K67085M95510
$$ 16632 201657 -192806 -733248 -625483 41121 383499 53327 -281164 -14079 481431
31269D81431l5182o21722n60824m1434L08580K77199J23841O1253M3652M768K1962
$$ 481431 446249 -175473 -736297 -777731 -469151 -191952 -68111 -6858 36794 41562 63524
31258F3524J45595K10621N528l60124m69351j41022K28450J66525j56207j38425
$$ 63524 209119 419740 425268 65144 -404207 -545229 -316779 -150254 -306461 -444886
31248d44886L20784O21243L65499n8979j38958r981r2352l11987k65383L9689
$$ -444886 -124102 497141 862640 803661 664703 654722 562370 250383 -15000 24689
31238B4689J99662R5336O567N5151N5367l7080l2807M4396q7565m20774n37210
$$ 24689 224351 319687 326254 381405 436772 399692 366885 411281 323716 -97058 -634268
31227f34268k43822J03981J59603O6585R3695J54783M5674j23739j12567K5096
$$ -634268 -878090 -774109 -614506 -547921 -454226 -299443 -253769 -377508 -490075 -464979
31217d64979M7325p0267j45076j07454l6043N3182K12595M06781N26998M95086
$$ -464979 -417654 -487921 -632997 -740451 -776494 -723312 -510717 -103936 423062 918148
31207I18148K51453j88130n42435m04913J92848O37922M75834K7369j30632l2928
$$ 918148 1169601 981471 439036 34123 226971 864893 1340727 1368096 1237464 1204536
31197A204536j29018l94018l28081J12211K93018j13067n36877l48557J79145
$$ 1204536 1075518 681500 353419 465630 758648 645581 108704 -239853 -60708
31188f0708K95250j14757m23926k02234K64739M72553L00895k9432k91668l61573
$$ -60708 234542 119785 -304141 -506375 -241636 230917 531812 502380 210712 -150861
31178a50861k05322O0035K27206K43978K59884L22974K28964j27717m33669l08909
$$ -150861 -356183 -296148 -68942 175036 434920 757894 986858 859141 425472 116563
31168A16563Q3255J58460k66447o46182m48321Q3103K92145O4127p0936J98959
$$ 116563 199818 358278 91831 -554351 -1002672 -919569 -627424 -563297 -634233 -435274
31158d35274M95321L51728r3682l25689j33714K45635N00639M61332Q4727m55001
$$ -435274 60047 411775 318093 -7596 -141310 104325 604964 1066296 1151023 696022
31148F96022p41901m97826M0627L85113L78642K43191J32411l494j27578q2570
$$ 696022 -45879 -543705 -503078 -117965 260677 503868 636279 632785 505207 422637
31138D22637Q9253J50758P5850Q7302J89886Q0631k84369m57364j49094K40793
$$ 422637 511890 662648 738498 825800 1015686 1096317 811948 354584 205490 446283
31128D46283J49320l31435o00563l93508m9623O1853o13K1664J67870K32122O1033
$$ 446283 595603 264168 -336395 -729903 -779526 -717673 -718286 -696622 -528752 -296630 -235597
31117b35597k22719l07533l8077L44778M51895K59430J49431L27284M71194K03808
$$ -235597 -458316 -765849 -803926 -459148 -7253 252177 401608 728892 1200086 1403894
31107A403894l10468n67700l99029j07592J3985k0480q1414j18386j10954m6719
$$ 1403894 1093426 525726 126697 19105 33090 12610 -68804 -187190 -298144 -344863
31097c44863P935j2313k8068O7599J84841J45328j7619j09012j04739j62830k81562
$$ -344863 -336928 -349241 -377309 -309710 -124869 20459 2840 -106172 -210911 -373741 -655303
31086f55303k38338L4000K65837K01827l7793j07738J32660M55210N09578J96182
$$ -655303 -893641 -859641 -593804 -391977 -429770 -537508 -404848 50362 559940 756122
31076G56122k13927l70255k30612j9625J76661M70424P28983N01987k74762q89914
$$ 756122 542195 171940 -58672 -78297 98364 568788 1297771 1799758 1524996 635082
31066F35082o82007J4675L35649R7703j36866r5025q8848k08572o3019L99968
$$ 635082 -46925 -32250 303399 401102 264236 169211 80363 -128209 -191228 208740
31056B08740N92008K16720j79165p5789K12342J52767j31389k25963j91802k94724
$$ 208740 800748 1017468 838303 762514 974856 1127623 996234 770271 578469 283745
31046B83745l56796p9985K79335K56021m1682j67635j19061j85321k58799p2748
$$ 283745 -73051 -153036 126299 382320 340638 173003 53942 -131379 -390178 -462926
31036d62926Q5421k20904n97555k44833O25098Q77472J79037m56358k70571J45056
$$ -462926 -377505 -598409 -1195964 -1440797 -815699 61773 240810 -215548 -486119 -341063
31026c41063J3566l12879r3418M39878M66762o7799m38703k97438o814J10168
$$ -341063 -327497 -640376 -733794 -293916 172846 105047 -333656 -631094 -637908 -527740
31016e27740J20467Q0913p2637k05977j01785J06785J27950P8476K88313N84369
$$ -527740 -407273 -326360 -398997 -604974 -706759 -599974 -472024 -393548 -105235 479134
31006D79134M32978j33678m19209r6244K99957K23139j05693j79738p696M2513
$$ 479134 912112 778434 359225 262981 562938 786077 680384 500646 492950 535463
30996E35463j03285j90600q8101R1188K04430J49549j25534m48890m58981p2871
$$ 535463 432178 241578 153477 244665 449095 598644 473110 24220 -434761 -507632
30986e07632K97885K96999J53916K82054N50095M49189p5572m77026l78883n4349
$$ -507632 -209747 87252 241168 523222 1073317 1522506 1446934 969908 591025 536676
30976E36676L9287j58039m00171m98788l61707N5920N48142O35181J12707m98131
$$ 536676 575963 417924 17753 -481035 -842742 -786822 -238680 396501 509208 11077
30966A1077m59708K10768O79877L52408l66139o35787k51998K35545L58699K29422
$$ 11077 -448631 -237863 442014 794422 428283 -207504 -459502 -223957 134742 364164
30956C64164J19210j8984l08284n18081k99986K20548M83686K06932k36317k91725
$$ 364164 483374 464390 156106 -361975 -661961 -441413 42273 249205 12888 -278837
$$ [...]
##END NTUPLES=NMR SPECTRUM
##END=
