##TITLE=31Pdec_LY-TMF-1.40.3
 D2O, 24 sc
 25.2.2020
##JCAMPDX= 6.0         $$ Bruker NMR JCAMP-DX V2.0
##DATA TYPE= NMR SPECTRUM
##DATA CLASS= NTUPLES
##ORIGIN= UXNMR, Bruker Analytische Messtechnik GmbH
##OWNER= root
$$ XWIN-NMR		Version 3.5
$$ Tue Feb 25 13:53:40 2020 Russian Standard Time (UT+4h)  she@DPX200
##.OBSERVE FREQUENCY= 81.013821
##.OBSERVE NUCLEUS= ^31P
##.ACQUISITION MODE= SIMULTANEOUS
##.ACQUISITION SCHEME= undefined
##.AVERAGES= 24
##.DIGITISER RES= 17
##SPECTROMETER/DATA SYSTEM= spect
##.PULSE SEQUENCE= zgpg30
##.SOLVENT NAME= CDCl3
##.SHIFT REFERENCE= (INTERNAL, CDCl3, 0, 182.463)
##AUDIT TRAIL= $$ (NUMBER, WHEN, WHO, WHERE, WHAT)
$$ ##TITLE= Audit trail, XWIN-NMR		Version 3.5
$$ ##JCAMPDX= 5.01
$$ ##ORIGIN= Bruker BioSpin GmbH
$$ ##OWNER= she
$$ F:/spectra/data/she/nmr/P31/1/pdata/1/auditp.txt
$$ ##AUDIT TRAIL=  $$ (NUMBER, WHEN, WHO, WHERE, WHAT)
(   1,<2020-02-25 13:52:27.43 +0400>,<she>,<DPX200>,
      <created by zg, POWCHK disabled, PULCHK disabled
       configuration hash MD5:
       00 E9 B6 7A A2 85 ED C7 34 08 36 98 17 FE 4E 26
       data hash MD5: 32K
       94 FF 6F 73 0D A0 68 E4 D2 9A 1B E3 36 A4 83 0A>)
(   2,<2020-02-25 13:52:31.37 +0400>,<she>,<DPX200>,
      <Start of raw data processing
       efp BC_mod = 2 LB = 1 FT_mod = 6 PKNL = 1 PHC0 = -1363.123 PHC1 = 190.4013 SI = 64K 
       data hash MD5: 64K
       88 3C F0 40 0E F0 4B 0A 73 59 77 B8 34 DB 31 19>)
(   3,<2020-02-25 13:53:01.12 +0400>,<she>,<DPX200>,
      <pk PHC0 = -48.31944 PHC1 = 66.40001 
       data hash MD5: 64K
       68 DE A4 5E 01 68 AA E3 03 98 11 37 E2 E0 24 78>)
(   4,<2020-02-25 13:53:04.15 +0400>,<she>,<DPX200>,
      <abs ABSG = 5 
       data hash MD5: 64K
       13 5A AF 90 91 89 39 2A 2D 10 75 4B 41 1C A3 B2>)
$$ ##END=
$$ 
$$ hash MD5
$$ F5 8D 43 AB 62 E8 05 B7 07 73 17 04 A6 59 27 00
##$RELAX= 
##$RELAX= 
##$RELAX= 
##$RELAX= 
##$RELAX= 
##$RELAX= 
##$RELAX= 
##$RELAX= 
$$ Bruker specific parameters
$$ --------------------------
##$DU= <F:/spectra>
##$EXPNO= 1
##$NAME= <P31>
##$PROCNO= 1
##$TYPE= <nmr>
##$USER= <she>
##$AMP= (0..31)
100 100 100 100 100 100 100 100 100 100 100 100 100 100 100 100 100 100 
100 100 100 100 100 100 100 100 100 100 100 100 100 100 
##$AQSEQ= 0
##$AQ_mod= 1
##$AUNM= <au_zg>
##$AUTOPOS= <>
##$BF1= 81.014009
##$BF2= 200.13
##$BF3= 200.13
##$BF4= 200.13
##$BF5= 200.13
##$BF6= 200.13
##$BF7= 200.13
##$BF8= 200.13
##$BYTORDA= 1
##$CFDGTYP= 0
##$CFRGTYP= 5
##$CHEMSTR= <none>
##$CNST= (0..31)
1 1 145 1 1 1 1 1 1 1 1 1 1 1 1 1 1 1 1 1 1 1 1 1 1 1 1 1 1 1 1 1 
##$CPDPRG= <waltz16>
##$CPDPRG1= <>
##$CPDPRG2= <waltz16>
##$CPDPRG3= <>
##$CPDPRG4= <mlev>
##$CPDPRG5= <mlev>
##$CPDPRG6= <mlev>
##$CPDPRG7= <mlev>
##$CPDPRG8= <mlev>
##$CPDPRGB= <>
##$CPDPRGT= <>
##$D= (0..31)
0 1 0 0 0 0 0 0 0 0 0 0.03 2e-05 3e-06 0 0 0 0 0 0 0 0 0 0 0 0 0 0 0 0 
0 0 
##$DATE= 1582624346
##$DBL= (0..7)
120 120 120 11 120 120 24 19 
##$DBP= (0..7)
150 150 150 150 150 150 150 150 
##$DBP07= 0
##$DBPNAM0= <>
##$DBPNAM1= <>
$$ [...]
##$SUBNAM3= <"">
##$SUBNAM4= <"">
##$SUBNAM5= <"">
##$SUBNAM6= <"">
##$SUBNAM7= <"">
##$SUBNAM8= <"">
##$SUBNAM9= <"">
##$SW= 369.568048894756
##$SWIBOX= (0..15)
0 1 3 0 0 0 0 0 0 0 0 0 0 0 0 0 
##$SW_h= 29940.119760479
##$TD= 32768
##$TD0= 1
##$TE= 0
##$TE2= 300
##$TE3= 300
##$TEG= 300
##$TL= (0..7)
0 120 53 12 22 120 120 120 
##$TP= (0..7)
150 150 150 150 150 150 150 150 
##$TP07= 0
##$TPNAME0= <>
##$TPNAME1= <>
##$TPNAME2= <>
##$TPNAME3= <>
##$TPNAME4= <>
##$TPNAME5= <>
##$TPNAME6= <>
##$TPNAME7= <>
##$TPOAL= (0..7)
0.5 0.5 0.5 0.5 0.5 0.5 0.5 0.5 
##$TPOFFS= (0..7)
0 0 0 0 0 0 0 0 
##$TUNHIN= 0
##$TUNHOUT= 0
##$TUNXOUT= 0
##$USERA1= <user>
##$USERA2= <user>
##$USERA3= <user>
##$USERA4= <user>
##$USERA5= <user>
##$V9= 5
##$VALIST= <valist>
##$VCLIST= <CCCCCCCCCCCCCCC>
##$VD= 0
##$VDLIST= <DDDDDDDDDDDDDDD>
##$VPLIST= <PPPPPPPPPPPPPPP>
##$VTLIST= <TTTTTTTTTTTTTTT>
##$WBST= 1024
##$WBSW= 4
##$XGAIN= (0..3)
0 0 0 0 
##$XL= 0
##$YL= 0
##$YMAX_a= 14009
##$YMIN_a= -14188
##$ZGOPTNS= <>
##$ZL1= 120
##$ZL2= 120
##$ZL3= 120
##$ZL4= 120
##$ABSF1= 182.463
##$ABSF2= -187.1042
##$ABSG= 5
##$ABSL= 3
##$ALPHA= 0
##$AQORDER= 0
##$ASSFAC= 0
##$ASSFACI= 0
##$ASSFACX= 0
##$ASSWID= 0
##$AUNMP= <proc_1d>
##$AZFE= 0.1
##$AZFW= 0.5
##$BCFW= 0
##$BC_mod= 2
##$BYTORDP= 0
##$COROFFS= 0
##$CY= -3
##$DATMOD= 1
##$DC= 0
##$DFILT= <>
##$DTYPP= 0
##$F1P= 0
##$F2P= 0
##$FCOR= 1
##$FTSIZE= 65536
##$FT_mod= 6
##$GAMMA= 0
##$GB= 0
##$INTBC= 1
##$INTSCL= 5.30512e-09
##$ISEN= 30
##$LB= 1
##$LEV0= 0
##$LPBIN= 0
##$MAXI= 10000
##$MC2= 0
##$MEAN= 0
##$ME_mod= 0
##$MI= 50
##$NCOEF= 0
##$NC_proc= -4
##$NLEV= 6
##$NOISF1= 182.463
##$NOISF2= 159.3651
##$NSP= 0
##$NTH_PI= 0
##$NZP= 0
##$OFFSET= 182.463
##$PC= 4
##$PHC0= -1411.443
##$PHC1= 256.8013
##$PH_mod= 1
##$PKNL= yes
##$PPARMOD= 0
##$PSCAL= 0
##$PSIGN= 0
##$REVERSE= no
##$SF= 81.0140089999434
##$SI= 65536
##$SIGF1= 159.3651
##$SIGF2= -187.1042
##$SINO= 113.3802
##$SIOLD= 16384
##$SREGLST= <1H.CDCl3>
##$SSB= 0
##$STSI= 65536
##$STSR= 0
##$SW_p= 29940.119760479
##$SYMM= 0
##$S_DEV= 0
##$TDeff= 32768
##$TDoff= 0
##$TI= <>
##$TILT= no
##$TM1= 0
##$TM2= 0
##$TOPLEV= 0
##$USERP1= <user>
##$USERP2= <user>
##$USERP3= <user>
##$USERP4= <user>
##$USERP5= <user>
##$WDW= 1
##$XDIM= 65536
##$YMAX_p= 350981007
##$YMIN_p= -2666041
$$ End of Bruker specific parameters
$$ ---------------------------------
##NTUPLES= NMR SPECTRUM
##VAR_NAME=  FREQUENCY,     SPECTRUM/REAL,   SPECTRUM/IMAG
##SYMBOL=    X,             R,               I
##VAR_TYPE=  INDEPENDENT,   DEPENDENT,       DEPENDENT
##VAR_FORM=  AFFN,          ASDF,            ASDF
##VAR_DIM=   65536,         65536,           65536
##UNITS=     HZ,            ARBITRARY UNITS, ARBITRARY UNITS
##FACTOR=    0.456856943014862, 1,           1
##FIRST=     14782.0589164792, 0,            0
##LAST=      -15158.0608439998, 0,           0
##MIN=       -15158.0608439998, -2666041,    0
##MAX=       14782.0589164792, 350981007,    0
$$ Real data points
##PAGE= N=1
##DATA TABLE= (X++(R..R)), XYDATA
$$ [...]
36945i13828K5018J65996K76065L10838J80140K6221Q8875L05814L73937K07571
$$ -913828 -888810 -722814 -446749 -135911 44229 70450 159325 465139 839076 1046647
36935A046647J3351r2423j91181k57295j27927J22270J47804j55595m22639l06441
$$ 1046647 1059998 967575 776394 519099 391172 513442 661246 505651 83012 -223429
36925b23429N7624K76915J90037m7914k10712j94807r0221j08949k98144l65786
$$ -223429 -165805 111110 301147 253233 42521 -152286 -242507 -351456 -649600 -1015386
36915a015386m3013M35279N70557L08583P5080O6857K1169j72483j96289Q2968
$$ -1015386 -1058399 -623120 -52563 256020 331100 397957 419126 246643 50354 133322
36905A33322K59661L7363k27914q7759K68462L29789L3741k40080k35694J0739
$$ 133322 392983 430346 202432 114673 383135 712924 746665 506585 270891 281630
36895B81630L45517M90442J44981n22422q04683l24659L43825M31469M1204j37958
$$ 281630 627147 1117589 1262570 740148 -64535 -389194 -45369 386100 427304 289346
36885B89346O6035J84307j6864k24694j88560n5720K242K8948O4159O9560R8307
$$ 289346 355381 539688 522824 298130 109570 53850 56092 85040 149199 218759 317066
36874C17066J94267J79386r0971l69910l26893p9082L1807K3679J22691K17702
$$ 317066 511333 690719 599748 229838 -97055 -176137 -144330 -120651 2040 219742
36864B19742P3170q1468J23525M02986J44432m89621o52954j24894L43340K25078
$$ 219742 292912 211444 334969 737955 882387 392766 -260188 -385082 -41742 183336
36854A83336r1353j46609j18952k31958k04611J54583M34297K71296k5408m7024
$$ 183336 91983 -54626 -173578 -405536 -610147 -455564 -21267 250029 224621 177597
36844A77597L7642o1480j30180R7136L09673J11180k35486k32594K282Q963j57206
$$ 177597 215239 153759 23579 120715 430388 541568 306082 73488 75770 84733 -72473
36833g2473q0479J75976J52734j37870j82922J18041K24074j49620n12830l10560
$$ -72473 -152952 23024 175758 37888 -145034 -26993 197081 47461 -465369 -775929
36823g75929K77994O09573L93969o5549l25927k67225j12877r6613j67180r5070
$$ -775929 -497935 111638 505607 440058 114131 -153094 -265971 -362584 -529764 -624834
36813f24834J29429J99279p4253m18242m14614l8633L50968M76683L72270K01398
$$ -624834 -495405 -296126 -370379 -788621 -1203235 -1241868 -890900 -414217 -41947 159451
36803A59451N8073n0641j52484k41167k37749j10238k994m4906o8522J47683L68101
$$ 159451 217524 166883 14399 -226768 -464517 -574755 -577749 -622655 -691177 -543494 -175393
36792a75393J26210m21432m85952J78384P28603M20667k28804k40042K92554M19926
$$ -175393 -49183 -470615 -956567 -778183 -49580 371087 142283 -97759 194795 614721
36782F14721o9914l26670J33198O38517M46626j43517l63157j38702j4942j91574
$$ 614721 544807 218137 351335 989852 1436478 1292961 929804 791102 776160 584586
36772E84586l00821j15977P1711o2815l87269n27571l67282j06224P7934J91322
$$ 584586 283765 167788 239499 176684 -210585 -738156 -1105438 -1211662 -1133728 -942406
36762i42406K48531J76389O878l8891J42058L09058K18446L4025M6431J19618
$$ -942406 -693875 -517486 -510608 -549499 -407441 -98383 120063 154088 200519 320137
36752C20137r2662m25467l19077K20574M52066R89n13572m18319L3211K03517
$$ 320137 227475 -197992 -517069 -296495 155571 156560 -357012 -775331 -742120 -538603
36742e38603R0056J14691K88084L17821K56750L08829K47236j98392o02777l52999
$$ -538603 -448547 -333856 -45772 272049 528799 837628 1084864 886472 283695 -69304
36732f9304K50043L24348j99654m94327k22352J3650j48008k18106J39660M27693
$$ -69304 180739 505087 305433 -188894 -411246 -397596 -545604 -763710 -624050 -196357
36722a96357K13602r4721k8398Q6488k16552o07736m71373N8123L51361K89738
$$ -196357 17245 -77476 -105874 -19386 -235938 -843674 -1315047 -1256924 -905563 -615825
36712f15825K62152L37339J80566k32433m64775k66662J07356L13933K83763J17211
$$ -615825 -353673 -16334 164232 -68201 -532976 -799638 -692282 -378349 -94586 22625
36702B2625p6766j97300k23433k45209k67423j21466K29348M84194L61103o595
$$ 22625 -54141 -251441 -474874 -720083 -987506 -1108972 -879624 -395430 -34327 -40922
36692d0922k76601l19484k00464K4254K19989J48425j49265k29595J15851M05954
$$ -40922 -317523 -637007 -837471 -813217 -593228 -444803 -594068 -823663 -707812 -301858
36682c01858J27860m24675n40657j26618K72270L75457M15057M76066K91032j39896
$$ -301858 -173998 -598673 -1139330 -1265948 -993678 -618221 -203164 272902 563934 424038
36672D24038l55206j30129J56053J48477L6957J03699J83987R212k39061j98214
$$ 424038 68832 -61297 94756 243233 280190 383889 567876 577088 338027 139813
36662A39813M9594J03973p5726r0158K28841M71371K04183l61481n51879n3836
$$ 139813 189407 293380 217654 127496 356337 827708 1031891 670410 118531 64695
36652F4695O75862R25558N16476q7784l93559l66574k59972k04786j62782j24645
$$ 64695 740557 1666115 2182591 2094807 1701248 1334674 1074702 869916 707134 582489
36642E82489j18603r7130j8942K6717k0480o57K38263M84281L54283j27854m63251
$$ 582489 463886 366756 347814 374531 354051 353394 591657 1075938 1430221 1302367 839116
36631H39116l03561J16207L24194J80474q1687k26066k17239j26756k8672k630
$$ 839116 535555 651762 975956 1156430 1074743 848677 631438 504682 476010 473380
36621D73380j08969k91378l58515j64244J53855K25936r9340m20040j84347N09803
$$ 473380 364411 73033 -285482 -449726 -295871 -69935 -169275 -589315 -773662 -263859
36611b63859Q76641M38209k84344m68691j08715J08096r5143k60861o3325J58248
$$ -263859 612782 1050991 766647 297956 189241 297337 202194 -58667 -121992 36256
36601C6256M2414j56323k2335L05548L80585J78244N5826Q5520l8542l71477m85623
$$ 36256 78670 -77653 -99988 205560 586145 764389 820215 905735 867193 495716 10093
36590A0093r7291M13526M34225p2841n01105l52125J78259M91849L28319M047
$$ 10093 -87198 326328 760553 687712 186607 -165518 12741 504590 832909 836956
36580H36956q8776J7494L3969q6461j12305L1586J11549k5876j87642j47379j1420
$$ 836956 748180 765674 799643 713182 600877 632463 744012 718136 530494 383115 371695
36569C71695k7733j71811k00763o5619M638j32649l05005k55479K7522K99020
$$ 371695 343962 172151 -28612 -94231 -89593 -222242 -527247 -782726 -755204 -456184
36559d56184L14360N8762k30030k62538K0054L65385M67523K87152M8197n3528
$$ -456184 -141824 -83062 -313092 -575630 -555576 -190191 277332 564484 612681 559153
36549E59153l6378k8715q7138j62820j83459j22692j6112O9552R5686P5446K8329
$$ 559153 522775 494060 406922 244102 60643 -62049 -78161 -8609 87077 162523 190852
36538A90852n2413j55533k22016k14010j74248j59313j58949j45671j43799j61220
$$ 190852 138439 -17094 -239110 -453120 -627368 -786681 -945630 -1091301 -1235100 -1396320
36528a396320j23363J994R0466N0778O4489L65270P57510O96943M0187n88151
$$ -1396320 -1519683 -1517689 -1427223 -1376445 -1311956 -946686 -189176 507767 547954 -40197
36518d0197n12710R0696M23205J41126k55172k23358Q0273J61375m4495j82139
$$ -40197 -552907 -462211 -39006 102120 -153052 -376410 -296137 -134762 -179257 -361396
36508c61396q9498L6751O1531R1132J63652J23113n9012j53162m4818M5291o1297
$$ -361396 -450894 -414143 -352612 -261480 -97828 25285 -33727 -186889 -231707 -186416 -247713
36497b47713j65931k7867J79386J09818j77738k79633o6833J48019J38495Q2509
$$ -247713 -413644 -441511 -262125 -152307 -330045 -609678 -676511 -528492 -389997 -307488
36487c07488J70540K21575j1570l52128l67930L829L12217J66175k61967m62983
$$ -307488 -136948 84627 73057 -279071 -647001 -643172 -330955 -164780 -426747 -889730
36477h89730k11754K08660L87102K31656k8027j67677j59252o9937O7819K20127
$$ -889730 -1101484 -892824 -505722 -274066 -302093 -469770 -629022 -698959 -631140 -411013
36467d11013K87051J71500j04577l81950m42926j59196L19400N61880K61104l07546
$$ -411013 -123962 47538 -57039 -438989 -881915 -1041111 -721711 -159831 101273 -206273
36457b06273m88233m8674M78139M89748R8042j35246n4010k2082k24542l76030
$$ -206273 -694506 -743180 -265041 224707 322749 187503 133493 111411 -113131 -489161
36447d89161k62762j06164j18840q3061K53873O21410N03360j01534n91365m95676
$$ -489161 -751923 -858087 -976927 -1059988 -806115 -184705 318655 217121 -374244 -869920
36437h69920j2701L06265K17477k7181p4740J01205K27199J26271m6575m8876
$$ -869920 -882621 -576356 -358879 -386060 -460800 -359595 -132396 -6125 -52700 -101576
36427a01576Q2388J04006k9674r4900N781M8354j41752l52702k70133M6771K45804
$$ -101576 -19188 84818 55144 -39756 -33975 14379 -127373 -480075 -750208 -703437 -457633
36416d57633J68411r359j05986j42902j70591j14963P5808K69198K73748Q2328
$$ -457633 -289222 -298581 -404567 -547469 -718060 -833023 -757215 -488017 -214269 -131941
36406a31941j04597j00802O4232J83955J09908q0646j87116j26918o48P0065O8961
$$ -131941 -236538 -337340 -273108 -89153 20755 -59891 -247007 -373925 -374573 -304508 -235547
36395b35547M3715M7315J25202K34109J89401j14568m25748l41673J23604M71417
$$ -235547 -191832 -144517 -19315 214794 404195 289627 -136121 -477794 -354190 117227
36385A17227L66125M3040j43810k35981l90657m09339m2475M25894M58150P4514
$$ 117227 483352 526392 382582 146601 -244056 -653395 -695870 -269976 188174 262688
36375B62688j69887n1301M8522j26948k70097p6381K32236K99641J58831K242
$$ 262688 92801 41500 90022 -36926 -307023 -383404 -151168 148473 307304 309546
36365C09546k04852m70145m69413P491N49590N98130K63285J08468K26470J70308
$$ 309546 104694 -365451 -834864 -827373 -277783 320347 583632 692100 918570 1088878
36355A088878j69721l10828k1629K18800j791l31841k65399l0309j98357o34850
$$ 1088878 919157 608329 586700 805500 803709 471868 206469 176160 -22197 -657047
36345f57047o01088N7098N62917L36347j53371j42274K77613L94523L5031k20267
$$ -657047 -1258135 -1201037 -638120 -301773 -455144 -597418 -319805 74718 109749 -110518
36335a10518j1834K75323K19869L9024J31074L48281K60831q1156k20395n8141
$$ -110518 -122352 152971 372840 411864 542938 891219 1152050 1070894 850499 792358
36325G92358J3572j94765l74287k80140j02113k9806Q9268L20041L02413j89791
$$ 792358 805930 611165 236878 -43262 -145375 -175181 -85913 234128 536541 346750
36315C46750o84179n58561M2665M13213L01144J19614J48135J59694j1254j28593
$$ 346750 -337429 -895990 -853325 -440112 -138968 -19354 128781 288475 277221 148628
36305A48628m5740j0201j50989j50943J66167L77834J03451k80534j83979K09863
$$ 148628 102888 92687 -58302 -209245 -43078 334756 438207 157673 -26306 183557
36295A83557K14042k18661l96742l0306K87401N1082l53818l05029P8209J99113
$$ 183557 397599 178938 -217804 -248110 39291 90373 -263445 -568474 -490265 -291152
36285b91152m9028j89002L9947L32601L44959J44784q384j7166P3694K06770K73688
$$ -291152 -340180 -529182 -489235 -156634 188325 333109 324725 307559 381253 588023 861711
36274H61711J48700j00491k18018j16371m1513j99470l87146k53163J51494L66665
$$ 861711 1010411 909920 691902 575531 534018 334548 -52598 -305761 -154267 212398
36264B12398J12452l34452m71219j53643K67759L47766j319m47750n84740l18091
$$ 212398 324850 -9602 -480821 -634464 -366705 -18939 -20258 -468008 -1052748 -1370839
36254a370839J00381L95116N08848M77915K56624j15149l03077k751N04875N37693
$$ -1370839 -1270458 -875342 -366494 111421 368045 252896 -50181 -52932 451943 989636
36244I89636n8959n68785l41024K61039L54612k05827o71043n05444m4555J45773
$$ 989636 930677 361892 20868 281907 636519 430692 -240351 -745795 -790350 -644577
36234f44577K8678j08762j90334k78927k69311n8119J76969K22803J85139K74997
$$ -644577 -615899 -724661 -914995 -1193922 -1463233 -1521352 -1344383 -1121580 -936441 -661444
36224f61444M18948M07746K53390P1404j80788m80643n00058n4253M13016L30499
$$ -661444 -242496 165250 418640 490044 309256 -171387 -671445 -725698 -312682 17817
36214A7817j55892m11177k72603j37829j37580M6158M32550N46864K11901j27795
$$ 17817 -138075 -549252 -821855 -959684 -1097264 -1051106 -618556 -71692 140209 12414
36204A2414j60627j54007l15137l41404l1240K42464J53936n572J13786K91294
$$ 12414 -148213 -302220 -617357 -958761 -990001 -747537 -593601 -599173 -485387 -194093
36194a94093K10166Q2969J99141K83779k9546m50913m45501r4799J24399J34794
$$ -194093 16073 99042 298183 581962 552416 101503 -343998 -438797 -314398 -179604
36184a79604J45925M5014l35676n97926k60463L14006L50046r3540k34019J04734
$$ -179604 -33679 11335 -324341 -922267 -1182730 -868724 -518678 -612218 -846237 -741503
36174g41503K57741o7765l24832j32897J57724K45949L71824O28354N91519J13811
$$ -741503 -483762 -551527 -876359 -1009256 -851532 -605583 -233759 394595 986114 1099925
36164A099925k47388j07738J10927m2022k77590j59071J19832J66771Q8376J31584
$$ 1099925 852537 744799 855726 813704 536114 377043 496875 663646 752022 883606
36154H83606R5719k46824n46520l54644J17304L33805K34883J14947J0689j84412
$$ 883606 979325 732501 185981 -168663 -51359 282446 517329 632276 642965 458553
36144D58553k82426r9930O4737j22180l58740j41086L54953N25908L08727J70052
$$ 458553 176127 76197 140934 18754 -339986 -481072 -126119 399789 708516 878568
36134H78568K24558J15365k11170l32706p4848K14170K66433K25924K14338O5510
$$ 878568 1103126 1218491 1007321 674615 599767 813937 1080370 1306294 1520632 1586142
36124A586142k96371o04859n82530k67740Q8469K49711J33116p9115p6281J31937
$$ 1586142 1289771 684912 102382 -165358 -76889 172822 305938 226823 150542 282479
36114B82479J44637j85545m09195j99075K5342k01120m91851k18913L11949K73715
$$ 282479 427116 241571 -167624 -366699 -341357 -542477 -1034328 -1253241 -941292 -667577
36104f67577k58960l76868J39482M69393J59315j89819n2313J88951Q5776o1396
$$ -667577 -926537 -1303405 -1163923 -694530 -535215 -725034 -777347 -588396 -502620 -564016
36094e64016J32559L83387L01873R6632Q0056M5013k25506l74352p6794K69394
$$ -564016 -431457 -48070 253803 350435 430491 475504 249998 -124354 -201148 68246
36084F8246J78157n4452J16078M69660L82379p2843k55478m6762M8916j26972
$$ 68246 246403 191951 308029 777689 1160068 1087225 831747 784985 833901 706929
36074G06929j56199R0412J28103l19871p92480p39915k60883J55141L00479L22662
$$ 706929 550730 641142 769245 449374 -343106 -1083021 -1343904 -1188763 -888284 -565622
36064e65622L22833K09333o7043l30834l18658J5194L83167M42141J78483j10421
$$ -565622 -242789 -33456 -100499 -431333 -749991 -734797 -351630 90511 268994 158573
36054A58573j99872j02614J24103M17811N26921K09131k52451k20017L46818O24225
$$ 158573 -41299 -143913 -19810 398001 924922 1134053 881602 661585 1008403 1632628
36044A632628L6423q25812r62922l06323L23232L87784J27167m3719n2161l6161
$$ 1632628 1669051 843239 -119683 -426006 -102774 285010 412177 368458 316297 280136
36034B80136j09075k76083l29087N805N36074N67547j41281p83126n12976K78756
$$ 280136 171061 -105022 -434109 -428304 107770 675317 534036 -249090 -762066 -483310
36024d83310N13802K1890l53839j87675K5562l6272L9698M63965O67257K48721
$$ -483310 30492 52382 -301457 -489132 -463570 -499842 -460144 3821 671078 919799
36014I19799k39952j31335L04014L40561p7423l92711l60230k62480l10847l79526
$$ 919799 679847 548512 852526 1193087 1115664 722953 362723 100243 -210604 -590130
36004e90130l25505j75737J979J39218J29888l1604j63825j17991L6575J57136
$$ -590130 -915635 -1091372 -1089393 -950175 -820287 -851891 -1015716 -1133707 -1097132 -939996
35994i39996J76588M5342j98864k55065J44730O65945O16888k7715m38302j11737
$$ -939996 -763408 -718066 -916930 -1171995 -1027265 -361320 255568 227853 -210449 -322186
35984c22186L81854L43802K9502P8866L56758K30698k70404m75729j78711R9047
$$ -322186 59668 403470 432972 511838 868596 1099294 828890 353161 174450 273497
35974B73497l320k49802l37512k23468J23813O56877R08466M24425l90935o15387
$$ 273497 270177 20375 -317137 -540605 -416792 240085 1148551 1572976 1182041 566654
35964E66654j27751K15965o1201l97718k61462P345j8688m0237K77432M97259
$$ 566654 438903 654868 593667 195949 -65513 -58168 -76856 -117093 160339 657598
35954F57598J35637l63228k96681P9422p435m67796m68105J52296O21837M95220
$$ 657598 793235 430007 133326 212748 205313 -262483 -730588 -578292 43545 538765
35944E38765K02298J20193J4695k51234l03875r769J18752j98577m15683o3461
$$ 538765 741063 861256 875951 624717 320842 311073 429825 231248 -184435 -247896
35934b47896L73702K28070k01434j33853L54207L97542k80084r06285p69585j20932
$$ -247896 125806 353876 152442 18589 372796 770338 490254 -416031 -1185616 -1306548
35924a306548L27602L17213J31058R0900K63054M94501N44617K81453j61368n00179
$$ -1306548 -978946 -661733 -530675 -439775 -176721 317780 862397 1143850 982482 482303
35914D82303n58479l16105J58302O08365N96026k6352p26977p93789k35773K25997
$$ 482303 -76176 -392281 -233979 374386 970412 944060 217083 -576706 -812479 -586482
35904e86482J28538k04206k48663J6647K45051K46825J13030J8524J02043L65040
$$ -586482 -457944 -662150 -910813 -894166 -649115 -402290 -289260 -270736 -168693 196347
35894A96347N54740L64993j16920m15395k76000r504k7614k75758l73524j53354
$$ 196347 751087 1116080 999160 583765 307765 298261 270647 -5111 -378635 -531989
35884e31989J72918K99042J35349r6224o1810K48056L65889o3366o27678n78391
$$ -531989 -359071 -60029 75320 -20904 -82714 165342 531231 467865 -159813 -738204
35874g38204N5705M12739O9864l13575o4515M32852M00134p4685k42415Q7582
$$ -738204 -682499 -269760 -199896 -513471 -577986 -145134 255000 180315 -62100 25482
35864B5482L50131K02290n3894j28506j68580l19284l88430k10508L2790Q9172
$$ 25482 375613 577903 524009 395503 226923 -92361 -480791 -691299 -658509 -569337
35854e69337l4698j72881j99831m4073K66490N15122M70027J72161j43891l58663
$$ -569337 -604035 -776916 -976747 -1020820 -754330 -239208 230819 402980 259089 -99574
35844i9574m63458l70551o1194J84843J10510m0122J78723O59097P91570L44456
$$ -99574 -563032 -933583 -994777 -809934 -699424 -739546 -560823 98274 889844 1234300
35834A234300k11939m11624l51495l22424l04240j30663J32576K63339J74696
$$ 1234300 1022361 610737 259242 -63182 -367422 -498085 -365509 -102170 72526
35825G2526l9806k09849j66125J04568L58455L54896J82878P4102q421k26101
$$ 72526 32720 -177129 -343254 -238686 119769 474665 657543 731645 723224 497123
35815D97123m09339k39249J34630K11592o1760j94144J1359J39627o5183k19158
$$ 497123 87784 -151465 -16835 194757 132997 -61147 -49788 89839 24656 -194502
35805a94502L1934L80734L45905R17k21619j58455K8409J74063J84728L4641q9629
$$ -194502 -162568 218166 564071 564988 343369 184914 213323 387386 572114 606755 517126
35794E17126N5979L05519J86148l10453n72556k80656P7147M519k40553j93337
$$ 517126 573105 878624 1064772 754319 181763 -98893 -21746 -17227 -257780 -451117
35784d51117J6271J3532r3097K0742K35194K32299J17174J68730K39291L6779
$$ -451117 -434846 -421314 -514411 -493669 -258475 -26176 90998 259728 499019 535798
35774E35798k50578k64045j56117k69459l82098n5942M37453L94312j69514m97437
$$ 535798 285220 21175 -134942 -404401 -786499 -842441 -404988 -10676 -180190 -677627
35764f77627k69207L4781O7715Q3238K39338K26911o4951k05826N5369L19827
$$ -677627 -946834 -912053 -844338 -761100 -521762 -294851 -359802 -565628 -510259 -190432
35754a90432K07439j9096N7771L16228L35778L9648k79825l70082j94731R6050
$$ -190432 17007 -2089 55682 371910 707688 747336 467511 97429 -97302 -1252
35744a252K16028R943k52556j81021J04205J08585j93172k41055J73489M92314
$$ -1252 214776 224719 -27837 -208858 -104653 3932 -189240 -430295 -256806 235508
35734B35508K81740o4538j9238K07105J08936k05881k52949o7960j34546m90259
$$ 235508 517248 452710 433472 640577 749513 543632 290683 222723 88177 -402082
35724d02082o03814k36282J78994K26020Q4388J15839K31931O8774l51606n21220
$$ -402082 -1005896 -1242178 -1063184 -837164 -752776 -636937 -405006 -336232 -687838 -1209058
35714a209058r6657N84965Q49931M90337j2662j49929k4650q6327m00278n67400
$$ -1209058 -1305715 -720750 129181 619518 606856 456927 432277 345950 -54328 -621728
35704f21728l58343k8572J13133J03044J13722J43703J30254J37077K12818K45952
$$ -621728 -980071 -1008643 -895510 -792466 -678744 -535041 -404787 -267710 -54892 191060
35694A91060J48996K3530j4917o940q656K8285R9749P7546n7929j21780j5845
$$ 191060 340056 363586 348669 341729 333073 361358 461107 538653 480724 358944 343099
35683C43099R0548K6364j38224k57352k98421k30654J7906L27843L85327J14997
$$ 343099 433647 460011 321787 64435 -233986 -464640 -446734 -118891 266436 381433
35673C81433j37911p0355J76301K83810J78168k2168k15501k67590m3148K92900
$$ 381433 243522 173167 349468 633278 811446 789278 573777 306187 263039 555939
35663E55939L26418j0381k55699j15638P2083m5529j97779J984K85172J21254
$$ 555939 882357 871976 616277 500639 572722 527193 329414 331398 616570 737824
35653G37824l50017m79885j23225J80421P3014j79392k21804o6210J33785L21691
$$ 737824 387807 -92078 -215303 -34882 38132 -141260 -363064 -429274 -295489 26202
35643B6202M00553K30070j05959l37593l78704l56159k75099k5729K73134L50764
$$ 26202 426755 656825 550866 213273 -165431 -521590 -796689 -822418 -549284 -198520
35633a98520K37374K14419K76401J22338k30136l52171j13683L4474k16959m91428
$$ -198520 38854 253273 529674 652012 421876 69705 -43978 -9504 -226463 -717891
35623g17891k87650K63643O14184N35524K58826L0672j18886k27213k88523k87477
$$ -717891 -1005541 -741898 -127714 407810 666636 697308 578422 351209 62686 -224791
35613b24791k05960m8341P6807L4098j16413j50491j859J53367K04606K47007
$$ -224791 -430751 -479092 -402285 -368187 -484600 -635091 -636950 -483583 -278977 -31970
35603c1970L11091K35604k5491k31303j84735q221R6411J35483J80425J72812
$$ -31970 279121 514725 489234 257931 73196 64975 161386 296869 477294 650106
35593F50106Q5744N4931J23920Q2475j90932m35227l33435L2459L18113L59359
$$ 650106 735850 790781 914701 997176 806244 371017 37582 70041 388154 747513
35583G47513K28186K393k50115l79448l03201j57350j03226j14155j21961j73098
$$ 747513 975699 978092 727977 348529 45328 -112022 -215248 -329403 -451364 -624462
35573f24462k38790j21441J95319L82181K58356J36410K77534L44299n3147n48193
$$ -624462 -863252 -984693 -789374 -407193 -148837 -12427 265107 609406 556259 8066
35563H066m55929J11535L41139l2075l59116j64458J63747J50918K7086K02254
$$ 8066 -447863 -336328 4811 -27264 -386380 -550838 -387091 -236173 -209087 -6833
35553f833M69212L61918j1606j25085J27467L09781J28802k13909l79761k55569
$$ -6833 462379 824297 812691 687606 815073 1124854 1253656 1039747 659986 404417
35543D04417M9259K83102J64167l06334o91912n71415r2283K25663J83197N4708
$$ 404417 453676 736778 900945 594611 -97301 -668716 -760999 -535336 -352139 -297431
35533b97431O8248J20092Q5055N3229J01922J12242p460j21823o2531J19411K27941
$$ -297431 -229183 -109091 -24036 29193 131115 243357 235897 114074 51543 170954 398895
35522C98895J52242m5613j83743j00007J41759K40518L6099j93826r8984J62338
$$ 398895 551137 505524 321781 221774 363533 604051 640150 446324 347340 509678
35512E09678J10787k81459m93414k66487K537m0478j12968J61806N18947M21482
$$ 509678 620465 339006 -154408 -420895 -418358 -458836 -571804 -409998 108949 530431
35502E30431o5633l52026j86824Q7812J47809O1263j7273r6323j76353j74090
$$ 530431 464798 112772 -74052 13760 161569 222832 205559 109236 -67117 -241207
35492b41207j11351q4807k1702K01136L95511K31005j90199l83860k06197l1215
$$ -241207 -352558 -437365 -459067 -257931 137580 368585 178386 -205474 -411671 -442886
35482d42886n1194L5188L42445L91624j24156o49669m82645J32858L36112o1014
$$ -442886 -494080 -458892 -116447 275177 151021 -498648 -981293 -848435 -512323 -573337
35472e73337l44707k7235M68016N05438R9097k79647l98305l73326k78381l0006
$$ -573337 -918044 -945279 -477263 28175 127272 -152375 -550680 -924006 -1202387 -1232393
35462a232393L41617N74856M34567P822l29960k80019L9932J97790l8513l88890
$$ -1232393 -890776 -315920 118647 126469 -203491 -483510 -443578 -245788 -284301 -673191
35452f73191m10543p1446K46124K87200K11219K75877M60658N30266L29785q2306
$$ -673191 -1083734 -1155180 -909056 -621856 -410637 -134760 325898 856164 1185949 1103643
35442A103643m82969o09381l71889l309J48248L2795o5776K3483J04055l1719
$$ 1103643 620674 11293 -360596 -363905 -215657 -182862 -248638 -225155 -121100 -152819
35432a52819k07783j05113K09791L20722N6483k39927j82591J19321K14804p4900
$$ -152819 -360602 -465715 -255924 64798 121281 -118646 -301237 -181916 32888 -42012
35422d2012m23567m27636r7720K01302K20029Q3222O2688K06177K79195O3146
$$ -42012 -465579 -893215 -990935 -789633 -569604 -486382 -423694 -217517 61678 124824
35412A24824l41896n60628l30294J71535M84408L87053J30110M6755J02232N8367
$$ 124824 -217072 -777700 -1107994 -936459 -452051 -64998 65112 111867 214099 272466
35402B72466n4205M663J67912M6851m05221o40283k52644L55464M71494M1698
$$ 272466 218261 222924 390836 437687 32466 -607817 -860461 -504997 -33503 8195
35392H195l18969k11149J20498K89446K70152K36107K18324J41183P326j25877
$$ 8195 -310774 -521923 -401425 -111979 158173 394280 612604 753787 761113 635236
35382F35236k28529k46033q9047K22796M96525N15329K08709k94762o89351o56687
$$ 635236 406707 160674 71627 294423 790948 1306277 1514986 1220224 530873 -125814
35372a25814k03398K22614J88653j79715l69659j67538J44178K90878L23619L18116
$$ -125814 -329212 -106598 82055 -97660 -467319 -634857 -490679 -199801 123818 441934
35362D41934J50114j92417l96364k22462J13393K47969J64371Q4493N2995l0369
$$ 441934 592048 399631 3267 -219195 -105802 142167 306538 391031 444026 413657
35352D13657r3850J6010J80424J19993j25160j98748j114J05670j39181m34816
$$ 413657 319807 335817 516241 636234 511074 312326 311212 416882 277701 -157115
35342a57115l22491J37187M39999L38898J17348Q1839J04176r7448m30316n11076
$$ -157115 -479606 -342419 97580 436478 553826 635665 739841 642393 212077 -298999
35332b98999k35379O0720R0524j4103Q634J27075J31298K1697q807P0383P1643
$$ -298999 -534378 -473658 -383134 -397237 -388603 -261528 -130230 -108533 -117340 -46957 24686
35321B4686q3196k15028j44917O7776K23168K05801O4797n0276k5575Q3528J05704
$$ 24686 -58510 -273538 -418455 -350679 -127511 78290 143087 92811 67236 150764 256468
35310B56468O960l7083N4248P6917j18527k97221j86541J8180n2125k38400k1591
$$ 256468 263428 226345 280593 357510 238983 -58238 -244779 -226599 -278724 -517124 -538715
35299e38715N47846P21339J25832n98155o62771j94766R6971O61o8746J04652
$$ -538715 9131 730470 856302 258147 -404624 -599390 -502419 -501758 -570504 -465852
35289d65852K13408K9795j79235q7091J81124K64188J04611k0938L8565Q7222
$$ -465852 -252444 -222649 -401884 -488975 -307851 -43663 60948 40010 78575 165797
35279A65797q4089l25481k99394J4617K29296O1392k79203l94836k15526L3666
$$ 165797 81708 -243773 -543167 -528550 -299254 -237862 -517065 -911901 -1127427 -1093761
35269a093761K22999L63256L74260J72582o7221j13183q1960k23935l70126j36939
$$ -1093761 -870762 -507506 -133246 39336 -27885 -141068 -223028 -446963 -817089 -954028
35259i54028L12655L66573l7166k19028J38856M30576J49404k16034J2042N39357
$$ -954028 -641373 -274800 -311966 -530994 -392138 38438 187842 -28192 -16150 523207
35249E23207N47286l8271n30853n43010l02445k9705K51286L26806m0587n14703
$$ 523207 1070493 1032222 501369 -41641 -344086 -373791 -122505 204301 163714 -350989
35239c50989m53195J25417N01981L17665J3849R683R5960l2237k14299j97165
$$ -350989 -804184 -678767 -176786 140879 154728 164411 260371 228134 13835 -183330
35229a83330j18756k01255k99330j49944J69230L69702L57027K37977R3691k5873
$$ -183330 -302086 -503341 -802671 -952615 -783385 -413683 -56656 181321 275012 249139
35219B49139l1374R2541K18283K22746Q1043j80986m18178l26584J68775N46852
$$ 249139 217765 310306 528589 751335 832378 651392 233214 -93370 75405 622257
35209F22257K19523n33201p69461k07242L34736J74730k43000j80625J73752J27655
$$ 622257 841780 308579 -460882 -668124 -333388 -158658 -401658 -582283 -408531 -280876
35199b80876k58263k67679K18905M91042J74413j93762r2698J65988L8045l43060
$$ -280876 -539139 -806818 -587913 -96871 77542 -116220 -208918 -42930 -4885 -347945
35189c47945m30934j41516J12875J31848J28032K21561K31378R0053L4449J67733
$$ -347945 -778879 -920395 -807520 -675672 -547640 -326079 -94701 -4648 29801 197534
35179A97534J94750j03641m14816k96766J32501L32392J13258j55941j52907Q919
$$ 197534 392284 288643 -126173 -422939 -290438 41954 155212 -729 -153636 -144717
35169a44717J20100J93615K43598J33210r5408j12747J54860K47480j48597n93658
$$ -144717 -24617 168998 412596 545806 450398 337651 492511 739991 591394 -2264
35159b264m93350k5235J51889o6802j78204P815J27465K6881L8566K72060L08996
$$ -2264 -495614 -520849 -368960 -435762 -613966 -606151 -478686 -451805 -413239 -141179 167817
35148A67817n2852l49575j64837K09773K84445J13819M6435Q9089K8832q3432
$$ 167817 114965 -234610 -399447 -189674 94771 208590 255025 344114 372946 289514
35138B89514o8871k9669j52025k84016j73154M2565O2711k436J81456M91998M36873
$$ 289514 220643 190974 38949 -245067 -418221 -375656 -312945 -315381 -133925 358073 794946
35127G94946k9605l43129j62628J34674Q2907j58297j25306J67913K47554n8291
$$ 794946 765341 422212 259584 394258 477165 318868 193562 361475 609029 550738
35117E50738l26519j78857J26956Q5219k53449l24771N6598L45250R3632l09107
$$ 550738 224219 45362 172318 257537 4088 -320683 -264085 81165 174797 -134310
35107a34310k28324K00122L09256J3443r6478J63494K18865k28613n91973l30445
$$ -134310 -362634 -162512 146744 160187 63709 227203 446068 217455 -374518 -704963
35097g04963J62233K26218l5820j03446K612j11828l50232k37592J94467L82540
$$ -704963 -542730 -316512 -352332 -455778 -453166 -564994 -915226 -1152818 -958351 -575811
35087e75811J14877k05155k33311n2479J72379L63782L37233r943l06194r0601
$$ -575811 -460934 -666089 -899400 -951879 -779500 -415718 -78485 -88428 -394622 -485223
35077d85223L95488M53954J9943k32415k9269P1919k68398m92568p3016N37664
$$ -485223 -89735 364219 384162 151747 122478 194397 -74001 -566569 -639585 -101921
35067a01921N73458J11500j53092R227K01201J58571K1468r9719k53269l33437
$$ -101921 471537 583037 429945 439172 640373 798944 820412 720693 467424 133987
35057A33987j55262J11720O7783k61020l47046P4283N46129M62992j40425o42659
$$ 133987 -21275 90445 158228 -102792 -449838 -375555 170574 633566 493141 -149518
35047a49518n69018o3867L43148L06861k7644k41675j07180K27507M86445N41419
$$ -149518 -718536 -782403 -439255 -132394 -160038 -401713 -508893 -281386 205059 746478
35037G46478L82338J9654m06273n84781l56259J5741J50472O4277Q8576K94124
$$ 746478 1128816 1148470 742197 157416 -198843 -183102 -32630 31647 120223 414347
35027D14347L40799L386m54255o18559m29229j41254O1134J92249K88927L17778
$$ 414347 755146 758532 304277 -314282 -743511 -884765 -823631 -631382 -342455 -24677
35017b4677K57679J39271l879j41967k30440k54104k48901k21359j17826N7312
$$ -24677 233002 372273 368394 226427 -4013 -258117 -507018 -728377 -846203 -788891
35007g88891J92465K28739K38998K21707O72m32316o55940k87139L59537N53914
$$ -788891 -596426 -367687 -128689 93018 93690 -338626 -994566 -1281705 -922168 -368254
34997c68254J62515j36543J21089M77021L07761j51763j85189K38736M09742l187
$$ -368254 -205739 -342282 -221193 255828 563589 411826 226637 465373 875115 871928
34987H71928m71519m52500j26593L3637k7941n3342M5652J69088K54029K13702
$$ 871928 400409 -52091 -178684 -145047 -172988 -226330 -180678 -11590 242439 456141
34977D56141j06086o04370q04633m06751K35091N37826M26501K85273L12096L18815
$$ 456141 350055 -254315 -1058948 -1465699 -1230608 -692782 -266281 18992 331088 649903
34967F49903J29156j69984l83544l75936j32333J46973J44388j51463l10302m8754
$$ 649903 779059 609075 225531 -150405 -282738 -135765 8623 -142840 -453142 -501896
34957e01896K65488J05996l93533o03313k91306J58567L98166M57336L92086J32216
$$ -501896 -236408 -130412 -523945 -1127258 -1418564 -1259997 -861831 -404495 -12409 119807
34947A19807j82591k12524M7955J93440N5803l2424J37919K42217j4947l39016
$$ 119807 -62784 -275308 -227353 -33913 21890 -10534 127385 369602 354655 15639
34937A5639k83153N0771K08603R5639M2104K30185M45968M15665J04799l32415
$$ 15639 -267514 -216743 -8140 87499 129603 359788 805756 1221421 1326220 993805
34927I93805o80308p37058m58680m8916K21797K75389K16985J41246O8472O145
$$ 993805 313497 -423561 -882241 -931157 -709360 -433971 -216986 -75740 -7268 -1123
34917a123m9952j23815j74709q7371J44204L11618K08182r8668l27559k82942
$$ -1123 -51075 -174890 -349599 -436970 -292766 18852 227034 128366 -199193 -482135
34907d82135j1009K89152M13077K55019j13682m45481m70521j26589L34403N17924
$$ -482135 -493144 -203992 209085 464104 350422 -95059 -565580 -692169 -357766 160158
34897A60158K64304j41591k65097m4913J66629J38223N3308J12972J76428Q7712
$$ 160158 424462 282871 17774 -27139 139490 277713 331021 443993 620421 708133
34887G08133L2563J57867J47221k70991o46955l48641L42117M86711r9960n52390
$$ 708133 740696 898563 1045784 774793 127838 -220803 121314 608025 508065 -44325
34877d4325l04619J20704J03196r4580M3942L34880L03505O9898O3241J89593
$$ -44325 -348944 -228240 -125044 -219624 -175682 159198 462703 532601 595842 785435
34867G85435M2200k83991l26970p7268L2568j10959k10338j87622k48194l06134
$$ 785435 827635 543644 216674 139406 171974 61015 -149323 -336945 -585139 -891273
34857h91273k5720M59520N35896L7024m11288k76410J50967K75862N7929o1497
$$ -891273 -916993 -457473 78423 115447 -295841 -572251 -421284 -145422 -87493 -148990
34847a48990J34629L85311L42874j9384l93608m50749j90781N6007O6745L7333
$$ -148990 -14361 370950 713824 694440 300832 -149917 -340698 -284691 -217946 -180613
34837a80613K42063N23283M70104N1135l28450m23004l87280l40244j28170K77062
$$ -180613 61450 584733 1054837 1105972 777522 354518 -32762 -373006 -501176 -224114
34827b24114N25467L22285j34037l96688k70315J09081M78257N52530J66659m59697
$$ -224114 301353 623638 489601 92913 -177402 -68321 409936 962466 1129125 669428
34817F69428p95891n81257j66340l5199j56497j14208K10833M35642K08965k99978
$$ 669428 -126463 -707720 -874060 -909259 -1065756 -1179964 -969131 -533489 -324524 -624502
34807f24502n81764l46642J97487N87958N59090K40585n1899j43110p4398N0015
$$ -624502 -1206266 -1552908 -1355421 -767463 -208373 32212 -19687 -162797 -237195 -187180
34797a87180J55608J66653M0004j42767k39182k21561j68436q1460J16291L52214
$$ -187180 -31572 135081 175085 32318 -206864 -428425 -596861 -678321 -562030 -209816
34787b09816L65951L4919l80757m78341j66661K36205L65799J87580l3879r3408
$$ -209816 156135 191054 -189703 -668044 -834705 -598500 -232701 -45121 -79000 -172408
34777a72408o3334r4783j22252L0415K78881K98466J2666k32407j75860l0222
$$ -172408 -235742 -330525 -452777 -422362 -143481 154985 167651 -64756 -240616 -270838
34767b70838o6387r5014J97170N80138M99844m9490m22177k23256J70509K13684
$$ -270838 -337225 -432239 -235069 345069 844913 795423 373246 149990 320499 534183
34757E34183r2703l66220l95331k27463M1803K75113K87698J02215K8443K33694
$$ 534183 441480 75260 -320071 -547534 -505731 -230618 57080 159295 187738 421432
34747D21432M25768K63030q5920j55756J13824K71126M042m25380n58523l38254
$$ 421432 847200 1110230 1024310 868554 982378 1253504 1257546 832166 273643 -64611
34737f4611j15138j38144k56782j90974N7678K36841K36903K13674K40326J10582
$$ -64611 -179749 -317893 -574675 -765649 -707971 -471130 -234227 -20553 219773 330355
34727C30355k73903n53883l33528J69980L60482J43921N7635L74597O10369K60622
$$ 330355 56452 -497431 -830959 -660979 -300497 -156576 -98941 275656 886025 1146647
34717A146647l90793o48003l22549J67096M39461M55473K86783J6489j49598o3206
$$ 1146647 755854 107851 -214698 -47602 391859 847332 1134115 1150604 1001006 937800
34707I37800O0155j24472n20975o27119k29677K86017M66343L13081Q8107j11164
$$ 937800 997955 873483 352508 -274611 -504288 -218271 248072 561153 649260 538096
34697E38096l06892l80833j97441P5314P8864k42995m94482l04800J79684M53688
$$ 538096 231204 -149629 -347070 -271756 -192892 -435887 -930369 -1235169 -1055485 -601797
34687f01797K77190l4444l3495K75474M65565K78573n5246j96843j73391k38247
$$ -601797 -324607 -359051 -392546 -117072 348493 627066 571820 374977 201586 -36661
34677c6661l95692l84430j28473J16061J63787J60226K57099K84432L8272k62524
$$ -36661 -432353 -816783 -945256 -829195 -665408 -505182 -248083 36349 74621 -187903
34667a87903j76765K95055N90251K73562l90953p55686n35342l8002K66553K05728
$$ -187903 -364668 -69613 520638 794200 403247 -352439 -887781 -925783 -659230 -453502
34657d53502n0432k15096j09626K07331M68693M24713Q4814k93920m53118l34860
$$ -453502 -503934 -719030 -828656 -621325 -152632 272081 356895 62975 -390143 -725003
34647g25003q4692P7561L8303q2198n0168J51769K43572N1802j65259p3582J70025
$$ -725003 -809695 -732134 -693831 -776029 -826197 -674428 -430856 -379054 -544313 -617895 -447870
34636d47870R5255l35726n91896l17478J92787M84174N30597N24588M12452N5472
$$ -447870 -352615 -688341 -1280237 -1597715 -1404928 -920754 -390157 134431 546883 602355
34626F02355l44035m07852j08735K04139K63491R5169j55756l37738l03803p4859
$$ 602355 258320 -149532 -258267 -54128 209363 304532 148776 -188962 -492765 -567624
34616e67624P8360l6986k22209j52636J63312M57946N87138N35366K20209l17784
$$ -567624 -489264 -526250 -748459 -901095 -737783 -279837 307301 842667 1062876 745092
34606G45092o79105n10930o3840J15958j3772j036L04715N08589L14314p7875
$$ 745092 65987 -444943 -508783 -392825 -406597 -407633 -102918 405671 719985 642110
34596F42110l50886m18872k84024K6112K65877J46293j81678k44844N5380L17594
$$ 642110 291224 -127648 -411672 -385560 -119683 26610 -155068 -399912 -344532 -26938
34586b6938K93424J54274J4105k23621m00077j51147L42519L81156j25553l25218
$$ -26938 266486 420760 434865 211244 -188833 -339980 2539 383695 258142 -67076
34576f7076K59903Q43604N38256k36774m20241N5080K92082r5100n15050m51951
$$ -67076 192827 1036431 1574687 1337913 917672 972752 1264834 1169734 654684 202733
34566B02733j37730J2814l1442j30544k25445k01731N0014L21711K70748p798
$$ 202733 65003 77817 46375 -84169 -309614 -511345 -461331 -139620 131128 123330
34556A23330n7864K06461L56191J73114j5490L0767J2891l54586p40638o09523
$$ 123330 65466 271927 628118 801232 785742 816509 829400 474814 -265824 -875347
34546h75347j6620M40892L93060O8083j07822j0475J49879J29324j02564l53097
$$ -875347 -891967 -451075 -58015 10068 -97754 -108229 41650 170974 68410 -284687
34536b84687l95776j82360J19422K88069K37167O2811o9505q7066n1988k5136
$$ -284687 -680463 -862823 -743401 -455332 -218165 -155354 -224859 -311925 -363913 -389049
34526c89049M6627K08370L28752K37190J0277j03713o2357o5126j59861j34118
$$ -389049 -342422 -134052 194700 431890 442167 338454 276097 210971 51110 -83008
34516h3008P1582J82361L1459j38789q5088L6669M702k4130J91869M55084L47804
$$ -83008 -11426 170935 202394 63605 -21483 15186 19888 -4242 187627 642711 990515
34505I90515j25577n21719n41622k95186l3640P5747l0232k26078k10179J20906
$$ 990515 864938 343219 -198403 -493589 -527229 -451482 -481714 -707792 -917971 -797065
34495g97065M20221L07802q5958l18133k46663r0478J0069J06276J82792J58344
$$ -797065 -376844 -69042 -155000 -473133 -719796 -810274 -800205 -693929 -511137 -352793
34485c52793J00455J08259O2176j64411l50101j76365K39451M56169L01489q645
$$ -352793 -252338 -144079 -81903 -246314 -596415 -772780 -533329 -77160 224329 215684
34475B15684k48779l03325m7367M43825O98974L68532j71054k74324J5090Q3825
$$ 215684 -33095 -336420 -383787 60038 759012 1127544 956490 682166 697256 781081
34465G81081k29365m33373k61285k7437M8525J67627L59312K51737k23139n20989
$$ 781081 551716 118343 -142942 -170379 -121854 45773 405085 656822 433683 -87306
34455h7306k94381L8690r899k18823q6461L27955N19332K76464j27191l41822
$$ -87306 -381687 -342997 -352896 -571719 -658180 -330225 189107 465571 338380 -3442
34445c442k29701J04725L47355K24821j15760k35143m3873M4457k07148m40534
$$ -3442 -233143 -128418 218937 443758 327998 92855 48982 93439 -113709 -554243
34435e54243k54301K02365N19141N73605M56783J74941k10621m26854l27080j39086
$$ -554243 -808544 -606179 -87038 486567 943350 1118291 907670 480816 153736 14650
34425A4650p3581J7031K64730M10142K07063r4653j16969L9086J0508k01853k85830
$$ 14650 -58931 -41900 222830 632972 840035 745382 628413 667499 678007 476154 190324
34414A90324j54342L032R5442J66300J62003L1405o0507L2578J28187r430k43683
$$ 190324 35982 39014 134456 300756 462759 494164 433657 466235 594422 584992 341309
34403C41309k83369j49981l6314R9942L52521M82756K46433o9529l5952J29379
$$ 341309 57940 -92041 -128355 -28413 324108 806864 1053297 983768 947816 1077195
34393A077195j30717o50404o11203J39763O72380L04298l68469l97406J00723
$$ 1077195 946478 296074 -315129 -175366 497014 801312 432843 35437 136160
34384A36160K33662k32144n62080k19318L81638N59397K80823O881m9925q6101
$$ 136160 369822 137678 -424402 -643720 -262082 297315 578138 585019 535094 448993
34374D48993k56051m41966m79716l32392j2606M07461O61515M59722o5835l63141
$$ 448993 192942 -249024 -728740 -1061132 -1073738 -666277 -4762 454960 389125 25984
34364B5984j35844K17769J47353k50660l78687j9529L72792L53320N8151j05720
$$ 25984 -109860 107909 255262 4602 -374085 -393614 -20822 332498 390649 284929
34354B84929l3237P8407J00937P9631O8910P7922J22624J72451J03955j44377
$$ 284929 251692 330099 431036 510667 579577 657499 780123 952574 1056529 912152
34344I12152m13198m59600k52299k2130J4445q2275o0814J63140L34551J82080
$$ 912152 498954 39354 -212945 -235075 -220630 -302905 -363719 -200579 133972 316052
34334C16052j44081k11597O7676K72018J06397j39975q6374J10263O5902j33029
$$ 316052 171971 -39626 28050 300068 406465 266490 180116 290379 356281 223252
34324B23252q7426J82485K39919m4550l22569l71478l45766l43728k31745j7836
$$ 223252 135826 318311 558230 513680 191111 -180367 -526133 -869861 -1101606 -1119442
34314a119442P1747M609o091Q1326J31612K29276N06610O09687Q5498o33578n30098
$$ -1119442 -1047695 -1043086 -1049177 -967851 -836239 -606963 -100353 509334 594832 -38746 -568844
34303e68844M46225J061127N11702m20648n92101r3597J88514J827j89247j68989
$$ -568844 -122619 938508 1450210 1029562 437461 343864 532378 534205 344958 175969
34293A75969j44271j46956j1329J58426J11761o0079p3421M7135P1347j0422p0448
$$ 175969 31698 -115258 -126587 31839 143600 83521 10100 57235 128582 118160 47712
34282D7712j18997j27723Q6125M09746L18555k99175p08898l45256K47177K48776
$$ 47712 -71285 -199008 -112883 296863 615418 316243 -392655 -737911 -490734 -241958
34272b41958j25399n9875M56913O66256L19628o2124j82968k85450m12156k54021
$$ -241958 -367357 -427232 29681 695937 1015565 953441 770473 485023 72867 -181154
34262a81154J16978J92692j01815k47859m4878O4983j66011l49094j73147Q8221
$$ -181154 -64176 128516 26701 -221158 -266036 -201053 -367064 -716158 -889305 -801084
34252h01084J41956J71681L82921N50357M23371J80073Q9761N5560j31481l44236
$$ -801084 -659128 -487447 -104526 445831 869202 1049275 1139036 1194596 1063115 718879
34242G18879k97142k0354J63740R0008n6866l3120J15223J15497j05899k44114
$$ 718879 421737 401383 565123 655131 598265 565145 680368 795865 689966 445852
34232D45852p8444O5970k29305o43510m11036M25341Q59610L91475j92472j02866
$$ 445852 367408 433378 204073 -439437 -850473 -425132 434478 825953 633481 530615
34222E30615K32280P6012k61019o2746L80949K43316l32161m78809j49914r7336
$$ 530615 762895 838907 577888 515142 896091 1139407 807246 328437 178523 81187
34212H1187l70075j92854N15737Q20162K86885l55875m71968l44454l18475j51698
$$ 81187 -288888 -481742 33995 854157 1141042 785167 313199 -31255 -349730 -501428
34202e01428K74113N14319L40662J40040J16711n5809l90215l17038K59217N58031
$$ -501428 -227315 287004 627666 767706 884417 828608 438393 121355 380572 938603
34192I38603J40418l45409k43564J17078J55714k3508j00157j97166l86456k59992
$$ 938603 1079021 733612 490048 607126 762840 739332 639175 442009 55553 -204439
34182b04439K93772N93303J93313k84931j64030J30445j42901o74655n79538J23014
$$ -204439 89333 682636 875949 591018 426988 557433 414532 -260123 -839661 -716647
34172g16647N44225K92642j08637j45018J06947L39273L47204R098n56754q57288
$$ -716647 -172422 120220 11583 -133435 -26488 312785 659989 669087 112333 -744955
34162g44955n04161K23639O76875N96268K41269p7768k38687k17752q3657J7124
$$ -744955 -1249116 -1025477 -348602 247666 488935 411167 172480 -45272 -128929 -111805
34152a11805O1961J66347K88859K22468j2378j55139j88517l39361m74791j39619
$$ -111805 -49844 116503 405362 627830 615452 460313 271796 -67565 -542356 -681975
34142f81975N50990P65276J24908o30242o61835j41796K07780J61967P11q7587
$$ -681975 -130985 634291 759199 128957 -532878 -674674 -466894 -304927 -304216 -391803
34132c91803n1301J93731M92466M06689j15718m74245k61032J18310J38097n7904
$$ -391803 -443104 -249373 243093 649782 534064 59819 -201213 -82903 55194 -2710
34122b710q3891j0246o3929j07516J5140P1192p8229p2813L09449O15134M10116
$$ -2710 -86601 -96847 -160776 -268292 -253152 -181960 -260189 -333002 -23553 591581 1001697
34111A001697J0366r5551m7136j87099l40929k16939n6944j69782k54675P1031
$$ 1001697 1012063 916512 869376 682277 341348 124409 67465 -102317 -356992 -285961
34101b85961M71831L82037m4564k14633m2861P7353N495q3397j49390k47241k61506
$$ -285961 185870 567907 523343 308710 265849 343202 348697 265300 115910 -131331 -392837
34090c92837j30452l9288k8008J64659N14434N32623Q4979k50325j09628P0883
$$ -392837 -523289 -562577 -590585 -425926 88508 621131 706110 455785 346157 417040
34080D17040q4707k09468K6263K30762M9036j64685r0680m1957j68580k223M91504
$$ 417040 332333 122865 149128 379890 428926 264241 173561 131604 -36976 -39199 452305
34069D52305M76501k86779o99299p4972N76123K41361l37536n9807N29170L07725
$$ 452305 928806 642027 -57272 -132244 443879 685240 347704 287897 817067 1124792
34059A124792l30591k69742K48843K09262j84090m342M63398K39469l47631j73462
$$ 1124792 794201 524459 773302 982564 798474 794132 1257530 1496999 1149368 975906
34049I75906N03927M18400l58821n18599R9178K83947k85068n74192k15640n1531
$$ 975906 1479833 1898233 1539412 1020813 1119991 1403938 1118870 544678 329038 277507
34039B77507l38802k70743L11896M97318K7928k17354J03984K51615n4716j34422
$$ 277507 -61295 -332038 -20142 477176 505104 287750 391734 643349 588633 454211
34029D54211J77608J12848n02990p90154l51181J29132K12938K67780L83091J33584
$$ 454211 631819 744667 241677 -548477 -899658 -770526 -557588 -289808 93283 226867
34019B26867k85022r8004O05945Q68060M70495J24297j7297m64620r62893o60354
$$ 226867 -58155 -156159 449786 1317846 1788341 1912638 1895341 1430721 467828 -192526
34009a92526J86010M14928k5600p5743L56185K65320l70637m44156J34808K47661
$$ -192526 -6516 408412 382812 307069 663254 928574 557937 113781 248589 496250
33999D96250k25055j73329M79251N30541j44943l03853K39753K80153l13482k93802
$$ 496250 271195 97866 577117 1107658 962715 658862 898615 1178768 865286 571484
33989E71484L94660L64082m48683n18476K76195L25459m98784m43200O43949P87284
$$ 571484 966144 1330226 881543 363067 639262 964721 465937 22737 666686 1453970
33979A453970l15050n22483O59965R64108l55255r84752J15757P92532q4272n12912
$$ 1453970 1138920 616437 1276402 2240510 1885255 900503 1016260 1808792 1724520 1211608
33969A211608N15448R13435k68251p39047N32585J136461L9515j53326J513711
$$ 1211608 1727056 2640491 2372240 1633193 2165778 3302239 3341754 3188428 4702139
33960D702139J959619N8228n86497J615531K857833J359565J327156M688688O619906
$$ 4702139 6661758 6719986 6133489 7749020 10606853 11966418 13293574 17982262 24602168
33951B4602168N192927O504330J2752501J6374485J7247970L2399673O8836747
$$ 24602168 29795095 36299425 49051926 65426411 82674381 115074054 183910801
33944A83910801R5776859P1293347r16678o6470512q1233879n6533713l1950389
$$ 183910801 279687660 350981007 350064329 283593817 202359938 145826225 113875836
33937A13875836k3878157k0509984j3201802p844289q075157p936230m257926
$$ 113875836 89997679 69487695 56285893 48441604 40366447 32430217 28172291
33930B8172291j930759l399295m096566j599361N1707j592133l018308j624204
$$ 28172291 26241532 22842237 18745671 17146310 17198017 15605884 12587576 10963372
33922A0963372p4016o99938j520552p78943k00206r75482j206291P9817O84495
$$ 10963372 10889356 10189418 8668866 7889923 7689717 6714235 5507944 5587761 6272256
33913F272256n56408j363437k20757P87724j61642j384445q78923K58491J89278
$$ 6272256 5715848 4352411 4131654 4919378 4757736 3373291 2494368 2752859 2942137
33904B942137m71055k96899K56610R4139l69367k86623o1085k91255m80043j74488
$$ 2942137 2471082 2174183 2430793 2524932 2155565 1868942 1807857 1516602 1036559 862071
33894H62071N1076j05660O7706P18247P64784j51102p56828k69747K72229p4218
$$ 862071 913147 807487 875193 1593440 2358224 2207122 1450294 1180547 1452776 1378558
33884A378558n80878l80622J720j14678k50867R9417L63887P1828j34493K41317
$$ 1378558 797680 417058 418778 304100 53233 152650 516537 588365 453872 695189
33874F95189N25603J63314j95150O0541L55068N6717l80644l85612k68286l28352
$$ 695189 1220792 1384106 1188956 1249497 1604565 1661282 1280638 895026 626740 298388
33864B98388j12652N07000O87520J8594n82112l70114r533k59410n82553k33346
$$ 298388 185736 692736 1380256 1398850 816738 446624 437091 177681 -404872 -638218
33854f38218L15954K64345j06756j08668Q2000j5107j10793K15500M98381J46779
$$ -638218 -322264 -57919 -164675 -273343 -191343 -206450 -317243 -101743 396638 543417
33844E43417l93011l44046P3466R6498k62040l73611r9137J88803L58288M86167
$$ 543417 150406 -193640 -120174 -23676 -285716 -659327 -758464 -569661 -211373 274794
33834B74794M14242N3608k30375j58702k7585r7707n9557K85602M46780M0985
$$ 274794 689036 742644 512269 353567 325982 228275 168718 454320 901100 942085
33824I42085m52551m71415k87233l67926m39163m7121M73092M87253J01940j14555
$$ 942085 489534 18119 -269114 -637040 -1076203 -1123324 -650232 -162979 -61039 -175594
33814a75594o0963K3598J96990N29133N89107M9966n48532m81047J9575J37670
$$ -175594 -236557 -212959 -15969 513164 1102271 1152237 603705 122658 142233 279903
33804B79903k43062m70912k13494J58755K60135J42324M3836J14135L24736L88283
$$ 279903 36841 -434071 -647565 -488810 -228675 -86351 -42515 71620 396356 784639
33794G84639J4178n30424n62921J4284M40348K35255o5380J14038L86933J42368
$$ 784639 798817 268393 -294528 -280244 160104 395359 329979 444017 830950 973318
33784I73318l38750l98004j38869j12831k49498p0394K92568K59923j50760l40430
$$ 973318 634568 236564 97695 -15136 -264634 -335028 -42460 217463 66703 -273727
33774b73727j21522J19973J96787K76038L14340J06080j31870J2099L28786J75470
$$ -273727 -395249 -275276 -78489 197549 511889 617969 486099 498198 826984 1002454
33764A002454m45319p54377l22988L41932N77445L56788M3692j57072k13458r5252
$$ 1002454 557135 -197242 -520230 -178298 399147 755935 799627 642555 429097 333845
33754C33845J28665K43720J37515m1918q3533J6779L2600k38790o34103o39360
$$ 333845 462510 706230 843745 801827 718294 735073 767673 528883 -105220 -744580
33744g44580k3152O40981N83053k6316k38971J91317L57577k88114q70251l87768
$$ -744580 -767732 -126751 456302 429986 191015 382332 739909 451795 -418456 -806224
33734h06224O31702Q62774J52083m02046j98704J71893J02640j65923j72592M2971
$$ -806224 -174522 688252 840335 438289 239585 411478 514118 348195 175603 218574
33724B18574K10108K61185J95734n2137l83991n28753l97874j38929J74406N34402
$$ 218574 428682 689867 885601 833464 449473 -79280 -477154 -616083 -441677 92725
33714I2725P15564M51595p9922l81921k86329r0271m7355j17168j96140j97411
$$ 92725 808289 1259884 1179962 798041 511712 421441 374086 256918 60778 -136633
33704a36633L8129M79969O58873J96945m86386n89113n0870L57327J52765k78496
$$ -136633 -98504 381465 1040338 1237283 750897 161784 110914 468241 621006 342510
33694C42510m06259k59058j03751O4030L19838M60318K55092j38094l22116j44169
$$ 342510 -63749 -322807 -426558 -362528 -42690 417628 672720 534626 212510 68341
33684F8341J55854K37182K0555k14080j36915J68404K17941k35287p87863q68820
$$ 68341 224195 461377 481932 267852 130937 299341 517282 281995 -505868 -1374688
33674a374688m37500J03352M76058O41204N58029K78149J15362K61879L91588
$$ -1374688 -1812188 -1708836 -1232778 -591574 -33545 244604 359966 621845 1013433
33665A013433J28831k73753k98815l5535m003k04559j29241K36263K71585j83866
$$ 1013433 1142264 868511 569696 534161 530158 325599 196358 432621 704206 520340
33655E20340m17200M6897O14672M68388k57275p36280n61954m9950L54173M69545
$$ 520340 103140 150037 764709 1233097 975822 239542 -322412 -372362 -18189 451356
33645D51356K95719l5611k53221k03514q0857j52007l19586k36927J53575M67652
$$ 451356 747075 711464 458243 254729 173872 21865 -297721 -534648 -381073 86579
33635H6579L58973k2350k05470Q794K89773K06494j91885m42086l10966q2189
$$ 86579 445552 423202 217732 226526 516299 722793 530908 88822 -222144 -304333
33625c04333o3049j07993Q0228L93604M31921R0611k90556l55556p6200K93443
$$ -304333 -367382 -475375 -395147 -1543 430378 520989 230433 -125123 -201323 92120
33615I2120M22550J55164k74573m22668j85298O0872L9696n1461j7214p1703l34749
$$ 92120 514670 669834 395261 -27407 -212705 -151833 -112137 -163598 -180812 -252515 -587264
33604e87264l67639J72814P73620O82954M2951l57364k74724j28786n1929K40066
$$ -587264 -954903 -782089 -8469 674485 717436 360072 85348 -43438 -95367 144699
33594A44699N99272M48576j57939m11651j8063K92366l9918n21064m73883p7509
$$ 144699 743971 1192547 1034608 622957 604894 897260 857342 336278 -137605 -215114
33584b15114R4398k271o1646o6190j29486q8744J74474L61885K37822J02848K40217
$$ -215114 -120716 -122987 -184633 -250823 -380309 -469053 -294579 67306 305128 407976 648193
33573F48193L04090q0795m80059k08031M83538O36555J5767n15797k71687L03829
$$ 648193 952283 871488 391429 183398 666936 1303491 1319258 803461 531774 835603
33563H35603L54745j92370o33867m71641L8930L18260J47077j95463l42290k18496
$$ 835603 1190348 997978 364111 -107530 -68600 249660 396737 201274 -141016 -359512
33553c59512P109J94701L12035L21910J88162j6231j81335l16084m46751m33013
$$ -359512 -352403 -157702 154333 476243 664405 648174 466839 150755 -295996 -729009
33543g29009j56726J68925K29891J21880K08759M57151M28881N6208j51625O1139
$$ -729009 -885735 -716810 -486919 -365039 -156280 300871 729752 785960 634335 695474
33533F95474K35358k7075l55328k30145J09785N4252l33297l76250J47871O55710
$$ 695474 930832 903757 548429 318284 428069 482321 149024 -227226 -79355 576355
33523E76355N98620J37638k17748k58184j40949p0461j15839k06837j98585l5795
$$ 576355 1174975 1312613 1094865 836681 695732 625271 509432 302595 104010 68215
33513F8215J33058J32793K1409r484L0986o6010l31823m77213k48717K26741N85974
$$ 68215 201273 334066 355475 345991 376977 310967 -20856 -498069 -746786 -520045 65929
33502F5929O20661M01475Q5397k35958m72838m76878j90450J81561L16339J42217
$$ 65929 686590 1088065 1173462 937504 464666 -12212 -202662 -21101 295238 437455
33492D37455p7116j06737k7581k1173m1708O1207K07593J63448p7389k59859k32604
$$ 437455 360339 253602 226021 204848 163140 224347 431940 595388 517999 258140 25536
33481B5536j06997k5677Q261L9122Q2941J52355J98254Q5456j86452l50378k07769
$$ 25536 -81461 -107138 -98877 -59755 23186 175541 373795 459251 272799 -77579 -285348
33470b85348L4720O8728k6837K1009J51174J07919p195J17996L55919K58844j34572
$$ -285348 -250628 -181900 -208737 -187728 -36554 71365 64170 182166 538085 796929 662357
33459F62357k74327n798J80019J3444j33273k618O5703j61684k76249N9223M16899
$$ 662357 388030 382232 562251 575695 442422 439804 505507 343823 67574 126797 543696
33448E43696K46306k17502l27012Q905L36668M01303L07317J17803j70795l71870
$$ 543696 790002 572500 245488 254393 591061 992364 1299681 1417484 1246689 874819
33438H74819k88109n1831P7076R2768Q7522m4230l53344n38188l42183k6913J1537
$$ 874819 586710 534879 611955 704723 792245 748015 394671 -143517 -485700 -512613 -501076
33427e01076j09126J3635L55121M95686K78975l1812k04304k29789j24497P0643
$$ -501076 -610202 -596567 -241446 254240 533215 501403 297099 67310 -57187 13456
33417A3456J42559q1806m16979n13569l02604N29K02891K21918P4551l549K69842
$$ 13456 156015 74209 -342770 -856339 -1158943 -1158414 -955523 -733605 -659054 -662603 -392761
33406c92761O86803O08558q1844n87734k83069L12475L35619q3885j54869J95096
$$ -392761 294042 902600 820756 233022 -50047 262428 598047 514162 359293 554389
33396E54389K59127j76977m70922k01457K21435K96298R4348j08233k76026l89735
$$ 554389 813516 636539 165617 -35840 185595 481893 576241 468008 191982 -197753
33386a97753k66838R6644L82935L70858J80688p133j33245j13079R5219K47510
$$ -197753 -464591 -367947 14988 385846 566534 559401 426156 313077 408296 655806
33376F55806O7720k44680k40522M0228J08464j45178k71316m7125J75422J23030
$$ 655806 723526 478846 238324 278552 387016 241838 -29478 -76603 98819 221849
33366B21849J6804O2224P1407q8411j68127K58J60973R1477k3474j2878q0476
$$ 221849 238653 300877 372284 283873 115746 116004 276977 368454 344980 332102 251626
33355B51626l50629m56082m9870N62029P68058M38675m5930l91721n98109o58044
$$ 251626 -99003 -555085 -604955 -42926 725132 1163807 1117877 726156 128047 -529997
33345e29997m60586n0159K85652K96297M0071j69104q2120J96796K99264N5094
$$ -529997 -990583 -1040742 -755090 -458793 -418722 -587826 -669946 -473150 -173886 -118792
33335a18792k52075k70111p6440l941q6370n4585J61609L37395L62996L35938
$$ -118792 -370867 -640978 -717418 -721359 -807729 -862314 -700705 -363310 -314 335624
33325C35624K29354p1912l53357k08779K61113M17864m312m54661l65477L5986
$$ 335624 564978 493066 139709 -69070 192043 609907 605595 150934 -214543 -178557
33315a78557J32915j67315l70211j16501L82766O22077L41309j85410l77985R771
$$ -178557 -45642 -212957 -583168 -699669 -316903 305174 646483 461073 83088 92859
33305I2859N25440N28787J5493l98232k96428J17285M41377M89441K16601l07368
$$ 92859 618299 1147086 1162579 764347 467919 585204 1026581 1516022 1732623 1425255
33295A425255p18879n96642m9247L28657K31251l3600j16298o1499p864P8853
$$ 1425255 706376 109734 60487 389144 620395 586795 470497 408998 401134 479987
33285D79987J70357J11253l3893j8341P2253j16650m79461m31558J21955M84878
$$ 479987 650344 761597 727704 709363 781616 664966 185505 -246053 -124098 360780
33275C60780K16794j89898j57510R5209R8592k4288O2615J60984r2004m42019
$$ 360780 577574 387676 230166 325375 423967 399679 462294 623278 531274 89255
33265H9255l37394J69432M95027L73496O7269j64170k98274l25614k17715o3013
$$ 89255 -248139 -78707 416320 789816 857085 692915 394641 69027 -148688 -211701
33255b11701N6679J87385K94318K07571j6257o6480N8726k5809l17732k33240
$$ -211701 -155022 32363 326681 534252 517995 451515 510241 484432 166700 -66540
33245f6540L61903O65031J42264m97766l90437P6806j2443m89400m24734K15316
$$ -66540 295363 960394 1102658 604892 214455 291261 278818 -210582 -635316 -420000
33235d20000N11550J58133j28951P8889L13740J79978n5817j64518l50511o08261
$$ -420000 91550 249683 120732 199621 513361 693339 637522 473004 122493 -485768
33225d85768n19033n4774J99760L146j25524J57384M25696K88627O5963J22770
$$ -485768 -1004801 -1059575 -859815 -856669 -982193 -824809 -399113 -110486 -44523 78247
33215G8247J90032n3407k94733j19401K39969L15809J74590J64342K39428J52497
$$ 78247 268279 214872 -79861 -199262 40707 356516 531106 695448 934876 1087373
33205A087373L1407J40310K83522P0325l67263n28770l47074k43133l63650l40218
$$ 1087373 1118780 1259090 1542612 1612937 1245674 716904 369830 126697 -236953 -577171
33195e77171L9164L97248K72585k33662n75627l95882J32345N38127N29451K49775
$$ -577171 -538007 -140759 131826 -101836 -677463 -1073345 -941000 -402873 126578 376353
33185C76353Q0546J93310L64361K80224o2656l63910l74975j48658N6485N4132
$$ 376353 456899 650209 1014570 1294794 1232138 868228 493253 344595 401080 455212
33175D55212j01297k11701j85349j27028j39201j36936J3968K46377L44032K25101
$$ 455212 353915 142214 -43135 -170163 -309364 -446300 -432332 -185955 158077 383178
33165C83178L1044o0403l81J23329J52912N911j64515r7297J69350K28959j39614
$$ 383178 414222 353819 353438 476767 629679 635590 471075 373778 543128 772087 632473
33154F32473n60964n08629o509M40273M93328K33429j13580l52885l21720n8558
$$ 632473 71509 -437120 -443629 -3356 489972 723401 609821 256936 -64784 -123342
33144a23342J24407M2903o6104P944K618l21976n54904j80045M75408O32543K74884
$$ -123342 1065 43968 -22136 -14192 -11574 -333550 -888454 -1068499 -593091 39452 314336
33133C14336Q6953K10763O8408m29363n69317r7653K39510l7708l07318K5786
$$ 314336 401289 612052 680460 251097 -318220 -415873 -176363 -214071 -521389 -495603
33123d95603M62418L31214K589J73887N44249L14545l75682o45200l20150q5027
$$ -495603 -33185 298029 300618 474505 1018754 1333299 957617 312417 -7733 -92760
33113i2760k04055j54584K96023O07101L81317j7063j31005n8482o0565p1410
$$ -92760 -296815 -451399 -155376 451725 833042 815979 684974 626492 565927 494517
33103D94517J1730j096k45241m72370m12971j83143l4448L4927J32335J76894
$$ 494517 506247 505151 259910 -212460 -625431 -808574 -843022 -808095 -675760 -498866
33093d98866N7987q6855m3244J31075J71832k1910k61533k99378q1098K22949
$$ -498866 -440879 -527734 -570978 -439903 -268071 -289981 -551514 -850892 -931990 -709041
33083g09041L95880L92445L43207L06748J54302j52996l39113j52450J67429J34251
$$ -709041 -313161 79284 422491 729239 883541 730545 391432 238982 406411 540662
33073E40662k65078m94674k33144J71445K38181J9921q9088N068K4913j72274
$$ 540662 275584 -219090 -452234 -280789 -42608 -22687 -111775 -106707 -81794 -254068
33063b54068l62614k93358j0926K52686L59532L18733J77392K935p3772M4496
$$ -254068 -616682 -910040 -920966 -668280 -308748 9985 187377 190312 116540 161036
33053A61036K45405K59000j5693l22823l26217l2781K21882K13459P3249L2155
$$ 161036 406441 665441 649748 326925 708 -32073 189809 403268 476517 508672
33043E08672R4971R4699m2536k16326k75992j44662J17477L24655L22261J58616
$$ 508672 603643 698342 655806 439480 163488 18826 136303 460958 783219 941835
33033I41835m491j35949l01714l96009k00905J95350L65460J18398j96254k06176
$$ 941835 937344 801395 499681 103672 -97233 98117 463577 581975 385721 179545
33023A79545l8431l642m4873P2633K31056J20927j59822j87072R0093K34871K5269
$$ 179545 141114 137472 92599 165232 396288 517215 357393 170321 260414 495285 520554
33012E20554k00877j26160K5397j23970m65373n27250j51430K73696L08442k001
$$ 520554 319677 193517 218914 94944 -370429 -897679 -1049109 -775413 -466971 -468972
33002d68972k04347q21L82400M77570J68504j88779k81074k21920k45378k67321
$$ -468972 -673319 -674140 -291740 185830 354334 165555 -115519 -337439 -582817 -850138
32992h50138o9452K39952L36188J95348J11043J75182J34432j28645l23765j44121
$$ -850138 -919590 -679638 -343450 -148102 -37059 138123 272555 143910 -179855 -323976
32982c23976L19046P10417P63496M23192j53336o03586n96909k03767J56679K28156
$$ -323976 -4930 705487 1468983 1892175 1738839 1135253 538344 334577 491256 719412
32972G19412J57950J43964J25072q855j53305j58101q2147p8625j63435k54764
$$ 719412 877362 1021326 1146398 1137543 984238 826137 743990 665365 501930 247166
32962B47166l05064k70327j07814R1267J55341J03367J19528J78019L2730k73505
$$ 247166 -57898 -328225 -436039 -344772 -189431 -86064 33464 211483 244213 -29292
32952b9292l11262M9792K98122L8775l17593j84642K16331K07722k00408l23167
$$ -29292 -340554 -290762 7360 46135 -271458 -456100 -239769 -32047 -232455 -555622
32942e55622L8944K87965Q1248j08550J16259L47895J01322l07759k99095j3401
$$ -555622 -516678 -228713 -147465 -256015 -139756 208139 309461 1702 -297393 -310794
32932c10794Q334j41268J24513P61292R59840L33184m81080p32428m87541k58796
$$ -310794 -302460 -443728 -319215 442077 1401917 1735101 1254021 521593 34052 -224744
32922b24744j94278j10229K2701J18557K68855N32072O00003J45889n71960q97048
$$ -224744 -419022 -529251 -506550 -387993 -119138 412934 1012937 1158826 586866 -310182
32912c10182n70472J9499L79320L56425N1365l35316n04345k57622J88913L77797
$$ -310182 -880654 -861155 -481835 -125410 -74045 -409361 -913706 -1171328 -982415 -604618
32902f04618J87737l9522k7648R6379J23224J05799J82666K98686L04146J59030
$$ -604618 -416881 -456403 -484051 -387672 -264448 -158649 24017 322703 626849 785879
32892G85879r4704l72749m74995k42629R9968R7268k60611l94028L5864N28228
$$ 785879 691175 318426 -156569 -399198 -299230 -201962 -462573 -856601 -820737 -292509
32882b92509M13311j58964m38487j45753K42782K88597J21339J9442o1556k47591
$$ -292509 120802 -38162 -476649 -622402 -379620 -91023 30316 49758 -11798 -259389
32872b59389l61512j39569L06238N51886L78476J2962j90406j58923r0756j07993
$$ -259389 -620901 -760470 -454232 97654 476130 489092 298686 139763 49007 -58986
32862e8986q5338R8577K76112J67360j83063l98414k73993m4259j0444j39848
$$ -58986 -144324 -45747 230365 397725 214662 -183752 -457745 -502004 -512448 -652296
32852f52296k27635k30025j87630j7753L17636N88574N54702L24097J43859k1438
$$ -652296 -879931 -1109956 -1297586 -1315339 -997703 -409129 145573 469670 613529 592091
32842E92091l19086n41937l24547J93909M15875J23004k06519j35915J08959P9222
$$ 592091 273005 -268932 -593479 -399570 16305 139309 -67210 -203125 -94166 -14944
32832a4944j78982k53044k0965K20918K32339R7741l948l7850m3388o320Q6445
$$ -14944 -193926 -446970 -467935 -247017 -14678 83063 79115 41265 -2123 -8443 78002
32821G8002J45665M1247k17727m18238l42277n7517R7584p2317l17107k39394
$$ 78002 223667 264914 47187 -371051 -713328 -770845 -673261 -745578 -1062685 -1302079
32811a302079J53051M34452L32836O4389j6392J21127K52609K69286K50121K23371
$$ -1302079 -1149028 -714576 -381740 -317351 -333743 -212616 39993 309279 559400 782771
32801G82771P5735k51333n99289p05563m62052m1386K44276K35439P2416J3438
$$ 782771 858506 607173 7884 -697679 -1159731 -1201117 -956841 -721402 -648986 -635548
32791f35548J24614K30464J79109M8434J7314J04705J48849M5254j00059j27384
$$ -635548 -510934 -280470 -101361 -52927 -35613 69092 217941 263195 163136 35752
32781C5752p3628j32108l33409m17698j61489K65687M58704K53242j42248m50658
$$ 35752 -37876 -169984 -503393 -921091 -1082580 -816893 -358189 -104947 -247195 -697853
32771f97853n23939k60855L39781R47881J051193N31503j45994m82537m35282
$$ -697853 -1221792 -1482647 -1142866 -194985 856208 1387711 1241717 759180 323898
32762C23898k13999O4924K65461J24746l58344o84557m20127J77215M93584L55762
$$ 323898 109899 174823 440284 565030 206686 -477871 -897998 -720783 -227199 128563
32752A28563Q4866q7159j90359j99212k4210J84712J58737l7387n2345K25804
$$ 128563 213429 126270 -64089 -263301 -287511 -102799 55938 18551 -33794 192010
32742A92010N30353O07601M34265Q2364l05201m63918k72067Q147P7891M0301
$$ 192010 722363 1329964 1764229 1846593 1541392 1077474 805407 813554 891445 931746
32732I31746J18642J61693o6775l16477j82079J44782J30742j93363l12487j50621
$$ 931746 1050388 1212081 1145306 828829 646750 791532 922274 728911 416424 265803
32722B65803j06563j69162R9509N76313N30667j53610o36396l87011Q9409K31669
$$ 265803 159240 -9922 89587 665900 1196567 1042957 406561 19550 108959 340628
32712C40628K39058L68566K92911j71242m83308k49037N3916m5440j48968J72509
$$ 340628 579686 948252 1241163 1069921 586613 337576 391492 346052 197084 369593
32702C69593M20080J5797n41742m47077K9807P9470j77902o329M68742M21942
$$ 369593 789673 805470 263728 -183349 -153542 -74072 -251974 -258303 210439 632381
32692F32381j41326l37914M0495K06156j77062m44052j81085R8756j1414j28014
$$ 632381 491055 153141 193636 399792 222730 -221322 -402407 -303651 -315065 -443079
32682d43079N7546J68305m3385j42722J30242K77772m1636l20321j34287K0507
$$ -443079 -385533 -217228 -260613 -403335 -273093 4679 -36957 -357278 -491565 -471058
32672d71058l29974n89247j2717Q69700R06438J02954m19048j68679J48636l4785
$$ -471058 -801032 -1390279 -1402996 -533296 373142 476096 57048 -111631 37005 2220
32662B220l17230k16045O944n0109j78800q657K93432L58760K63687K51731J35977
$$ 2220 -315010 -531055 -524111 -574220 -753020 -761677 -468245 -109485 154202 405933 541910
32651E41910l49466q01951n15716L81349Q96607N06475j35142k03725J54476K41361
$$ 541910 192444 -609507 -1125223 -743874 152733 659208 524066 320341 474817 716178
32641G16178n6906k42511j11682K2974j970J6997J01163l6893l62704l71891J09585
$$ 716178 659272 416761 305079 328053 326083 343080 444243 407350 44646 -327245 -217660
32630b17660N25471L87996p116j19899J5761L8976m4536j0395J6170k30277n40850
$$ -217660 307811 695807 688691 568792 584553 623529 578993 568598 584768 354491 -186359
32619a86359m46229K2192L47755K76477L5990j57996k98443l09845r3817J41557
$$ -186359 -632588 -610396 -262641 13836 49826 -108170 -406613 -716458 -810275 -668718
32609f68718J01221n3492Q6168M26863M38573M4887j92987K8798K91128J69958
$$ -668718 -567497 -620989 -534821 -107958 330615 375502 182515 211313 502441 672399
32599F72399j24828j90698o8474m3644j40758j87028j52076j21239r6703l9026
$$ 672399 547571 356873 288399 244755 103997 -83031 -235107 -356346 -453049 -492075
32589d92075L5665J10983J56991N5663k04888l09972K8724N26548O00374K03329
$$ -492075 -456410 -345427 -188436 -132773 -337661 -647633 -618909 -92361 508013 711342
32579G11342j49794k30385l20822m61598k37582L53405N79292M6657n63533m73414
$$ 711342 561548 331163 10341 -451257 -688839 -335434 243858 290515 -273018 -746432
32569g46432L6830J90791j2991N4327M74094O23869K09612k87569l48666m3170
$$ -746432 -709602 -518811 -531802 -477475 -3381 620488 830100 542531 193865 150695
32559A50695K50603L22945J76677p7198k41749j79037K0969J76390K33082J66885
$$ 150695 401298 724243 900920 823722 581973 402936 423905 600295 833377 1000262
32549A000262j25200n39005o16784j25609M15703L30130k09454l90026J3733L13468
$$ 1000262 875062 336057 -280727 -406336 9367 339497 130043 -259983 -246250 67218
32539F7218K1230l72095j74464M31605O61129K43578k84541l73248q5829J65970
$$ 67218 88448 -283647 -458111 -26506 634623 878201 593660 220412 134583 300553
32529C00553J63290k4287k50417l74829k54637J15155M69850M86432J72662j23989
$$ 300553 463843 439556 189139 -185690 -440327 -325172 144678 631110 803772 679783
32519F79783j63629q4218j02031j48337l9392J38027J19183j07274k61760j77573
$$ 679783 516154 431936 329905 181568 142176 280203 399386 292112 30352 -147221
32509a47221K7593J92875K53087J40162j38652l17257j32233J96769J74238j97857
$$ -147221 -119628 73247 326334 466496 327844 10587 -121646 75123 249361 51504
32499E1504l51627m9289J94139o4186m46274l34596J65390M24407K37805n326
$$ 51504 -300123 -349412 -155273 -219459 -665733 -1000329 -834939 -410532 -172727 -178053
32489a78053j6867P0769J06332J63771K61960K05399j19546n03328o08798l20295
$$ -178053 -194920 -124151 -17819 145952 407912 613311 493765 -9563 -618361 -938656
32479i38656J33813L59849J68761j78783k36714N5868K93345J97144j7784p2396
$$ -938656 -804843 -444994 -276233 -455016 -691730 -635862 -342517 -145373 -163157 -235553
32469b35553p5183k16126l15389j07595K32351L03695R1737p6250r5949j55461
$$ -235553 -310736 -526862 -842251 -949846 -717495 -413800 -322063 -398313 -494262 -649723
32459f49723k74948k28754K2245K06068J33974p9583k44005k75617j39948J21042
$$ -649723 -924671 -1153425 -1131180 -925112 -791138 -870721 -1114726 -1390343 -1530291 -1409249
32449a409249K98675K15980J0035l9167P1982J05522L543m1475N0863J20788N0012
$$ -1409249 -1110574 -894594 -884559 -923726 -851744 -746222 -742679 -784154 -733291 -612503 -562491
32438e62491q5398j78462j79601k2062K97386N62951N14529J96769q6574j67050
$$ -562491 -647889 -826351 -1005952 -1028014 -730628 -167677 346852 543621 457047 289997
32428B89997j43301j28396r4825r87R9430J03510n5493k94240l21978P2577N82144
$$ 289997 146696 18300 -76525 -77512 21918 125428 69935 -224305 -546283 -473706 108438
32417A08438N74947m8273n74493l98168J64071M22515K93281J54652O1195j94718
$$ 108438 683385 635112 60619 -337549 -173478 249037 542318 696970 758165 563447
32407E63447m49388l48978n9808m8103k15447n4013L46005L37035j16069k52980
$$ 563447 114059 -234919 -294727 -342830 -558277 -612290 -266285 70750 -45319 -298299
32397b98299J97617M87956R0111m03645k81041J26170Q3379k92581l10007R5588
$$ -298299 -100682 387274 477385 73740 -207301 -81131 2248 -290333 -600340 -504752
32387e04752L24305J54104l55R2853J36089n2898j61763O9842L80141L83527J28620
$$ -504752 -180447 -26343 -26698 66155 202244 149346 -12417 57425 437566 821093 949713
32376I49713n5610o2237m5550p7328p2528l5501q5459j71390n1112K76044L97293
$$ 949713 894103 831866 786316 708988 636460 600959 515500 344110 292998 569042 966335
32365I66335N7575l29286k09990J94512J35528m46990p07097k07305L29605J78285
$$ 966335 1023910 694624 484634 679146 814674 367684 -339413 -546718 -217113 -38828
32355c8828j97467J1463M73990K09784o74474r78203k48381N37459N01918N6940
$$ -38828 -236295 -224832 249158 458942 -215532 -1193735 -1442116 -904657 -402739 -345799
32345c45799O000L06646M14011K37195N8106p3675k43683k92550p4434J63608
$$ -345799 -339799 -33153 380858 618053 676159 602484 358801 66251 -8183 155425
32335A55425J21412p4711j33460r1725j57690k84203k66514r4575Q0866J67348
$$ 155425 276837 202126 68666 -23059 -180749 -464952 -731466 -826041 -745175 -577827
32325e77827J19922o5676k04464n7656K61519L69571J96838N0563N351k01660
$$ -577827 -457905 -523581 -728045 -785701 -524182 -154611 42227 92790 98141 -103519
32315a03519n09953m43936L1634K68720m7436l36478p7514L57605M18054K65481
$$ -103519 -613472 -1057408 -1025774 -757054 -804490 -1140968 -1218482 -860877 -442823 -177342
32305a77342K68338K21044j46803m15428r0892M41342M50483J5649k11486j05233
$$ -177342 90996 312040 165237 -250191 -341083 100259 550742 566391 354905 249672
32295B49672m7924n9032J41986L63071J49927l06634l66602k0556J07048j38500
$$ 249672 201748 142716 284702 647773 797700 491066 124464 103908 210956 72456
32285G2456k24831N7719K25617k3268l12415k51884J0701J66223J65519P4278
$$ 72456 -152375 -94656 130961 107693 -204722 -456606 -445905 -279682 -114163 -39885
32275c9885n1866n4214J40960K40640k9346l58282k52689J19329J75827q9871
$$ -39885 -91751 -145965 -5005 235635 206289 -151993 -404682 -285353 -109526 -199397
32265a99397j57964L0871K0951j87858p2103L51112L85001j17263l68593N5488
$$ -199397 -357361 -326490 -305539 -493397 -565500 -214388 170613 53350 -315243 -259755
32255b59755M69596K23003k34544j45779L48583N48888K76017p6735k35444k08306
$$ -259755 209841 432844 198300 52521 401104 949992 1226009 1149274 913830 705524
32245G05524l3246J64242J26126j55267l12698j52694N7913J13028J79071K89760
$$ 705524 672278 836520 962646 807379 494681 341987 399900 512928 691999 981759
32235I81759J19292l39987m91997m0770M07412K34082k45647l77439k02481j73821
$$ 981759 1101051 761064 269067 228297 635709 869791 624144 246705 44224 -129597
32225a29597k62639j21236J67610K48603J65377J87211K00123m8993l34065k73311
$$ -129597 -392236 -513472 -345862 -97259 68118 255329 455452 406459 72394 -200917
32215b00917n1251r8228k59361o1587L47387L61430l7033k24169L1538K76315
$$ -200917 -252168 -350396 -609757 -671344 -323957 37473 440 -223729 -192191 84124
32205H4124K13678Q6919P3211J1125q8193N5701L70619L71495m7062l88222l53395
$$ 84124 297802 384721 457932 469057 380864 436565 807184 1178679 1131617 743395 390000
32194C90000k22966j89258p312L36063L07470l16034q71183o70565K3839M65823
$$ 390000 167034 -22224 -29536 306527 613997 297963 -573220 -1243785 -1219946 -754123
32184g54123M66429L71222L21761J79903l58k1045M0892k1834q2032J28826M30819
$$ -754123 -287694 83528 405289 585192 584834 563789 604681 582847 500815 629641 1060460
32173A060460L40828j61318n22294l94166q2133k1314j62804j38336J75688M99926
$$ 1060460 1401288 1239970 717676 323510 241377 220063 57259 -81077 94611 594537
32163E94537M88425J01412l29249m01333p4535K53128K12219r1485k75977k18496
$$ 594537 1082962 1184374 855125 453792 379257 632385 844604 753119 477142 258646
32153B58646j18432p8089M0709K79646M16231K76920j0204k10001k35351j08919
$$ 258646 140214 62125 102834 382480 798711 1075631 1065427 855426 620075 511156
32143E11156J05288K17097J7239l59496m49953q6879K53856P1825l95608m65861
$$ 511156 616444 833541 850780 491284 41331 -45548 208308 280133 -115475 -581336
32133e81336J4600M61351L78948m5340l49642m11732l74318k48088M5580L67356
$$ -581336 -566736 -105385 273563 228223 -121419 -533151 -907469 -1155557 -1109977 -742621
32123g42621M42798K50652O9796R6854K13766K01292L2085j44365k19523k19464
$$ -742621 -299823 -49171 20625 117479 331245 532537 564622 420257 200734 -18730
32113a8730j97522j35550k0651L7459q9867l04436l24706q8241J02900N4066N3133
$$ -18730 -216252 -351802 -372453 -334994 -424861 -729297 -1054003 -1142244 -1039344 -985278 -932145
32102i32145L94289P26981M55620k43279m96545j7528M00766Q9410m66931m36915
$$ -932145 -537856 189125 644745 401466 -95079 -112607 288159 377569 -89362 -526277
32092e26277N6490K47297K048j11246Q8103J41095j21763k36423N1449L15485
$$ -526277 -469787 -222490 -220442 -331688 -243585 -102490 -224253 -460676 -409227 -93742
32082i3742J73226j07203j13029Q0734J70142J14037P094j79658l88119l41208
$$ -93742 79484 -27719 -140748 -60014 110128 224165 231259 51601 -336518 -677726
32072f77726L3071L55753L14422J29851J60730L29281L15966Q8014j37582k59869
$$ -677726 -644655 -288902 25520 155371 316101 645382 961348 1049362 911780 651911
32062F51911k83007j44522R8960J14533l01872q13346q97780m99276K925L40673
$$ 651911 368904 224382 323342 437875 136003 -677343 -1575123 -2074399 -2071474 -1730801
32052a730801N15008N14514K71521q7427k53977o7103L24730O09044N23020N8659
$$ -1730801 -1215793 -701279 -429758 -517185 -771162 -838265 -513535 95509 618529 677188
32042F77188m18747m49606m1477K71443J18480k26841l00095q2537J40852K79092
$$ 677188 258441 -191165 -232642 38801 157281 -69560 -369655 -452192 -311340 -32248
32032c2248L94700L93279J81291m0599o2798p3082l28230n92209m34664J0705
$$ -32248 362452 755731 937022 896423 833625 760543 432313 -159896 -594560 -583855
32022e83855J76923l5306r7360K50294N14800J96075m02008n41587n1824M43963
$$ -583855 -406932 -442238 -539598 -289304 225496 421571 19563 -522024 -573848 -129885
32012a29885L35910k08883m77505j36473L28592K73898k01326m04899o6081L06014
$$ -129885 206025 -2858 -480363 -616836 -288244 -14346 -215672 -620571 -686652 -380638
32002c80638K35511o8223j83651j12547j8888K04332N68007O03507J0426o25791
$$ -380638 -145127 -213350 -397001 -509548 -528436 -324104 243903 847410 857836 232045
31992B32045n10623J52188M11149m0474n12844m28942l7038J79550J64472J04680
$$ 232045 -278578 -126390 284759 244285 -268559 -697501 -734539 -554989 -390517 -285837
31982b85837Q3184J35638K62849K82949N6718j52950k4585J83904m2766n38431
$$ -285837 -202653 -67015 195834 478783 535501 382551 357966 541870 499104 -39327
31972c9327n75391k6561L69531J43419k53830k67540j4595J51046K12375K07752
$$ -39327 -614718 -641279 -271748 -128329 -382159 -649699 -664294 -513248 -300873 -93121
31962i3121k9665m10126m31483N5430M69302L53739N9044O6495K01808J15390
$$ -93121 -122786 -532912 -964395 -908965 -439663 -85924 -26880 39615 241423 356813
31952C56813P270J81076L26502J064n05228n45962j31816J53380Q4996m5527q9558
$$ 356813 364083 545159 871661 872725 367497 -178465 -310281 -156901 -71905 -117432 -206990
31941b06990j83179k80292j64888Q0879J70893J43617K59803M20584K58468j83596
$$ -206990 -390169 -670461 -835349 -754470 -583577 -439960 -180157 240427 498895 315299
31931C15299m20262k36228N9324J56243P6597o0855j82390j36567J51322L90299
$$ 315299 -104963 -341191 -281867 -125624 -49027 -109882 -292272 -428839 -277517 112782
31921A12782K14586k34479m52388k85613l7672J17038K91189M22257K30838k21576
$$ 112782 327368 92889 -359499 -645112 -682784 -565746 -274557 147700 378538 156962
31911A56962m69165l17616q9133j2907J07036L68143M32777P2204l67647m27883
$$ 156962 -312203 -629819 -718952 -731859 -624823 -256680 176097 248301 -119346 -547229
31901e47229j52452R9392J77066J47923L4876j30617j98520j23168q5948j43736
$$ -547229 -699681 -600289 -423223 -275300 -240424 -371041 -569561 -692729 -778677 -922413
31891i22413k2303M19692P80463N78688l5321m54521m20636k40495k07066k19430
$$ -922413 -944716 -525024 255439 834127 798806 344285 -76351 -316846 -523912 -743342
31881g43342r2207Q9779J21819j0721j49812j84056j18023K944J20890J58066
$$ -743342 -835549 -745770 -623951 -634672 -784484 -968540 -1086563 -1083619 -962729 -804663
31871h04663Q6226L462N6626K48523L81386K68483j3649j78953o8380J58104K29043
$$ -804663 -718437 -714975 -658349 -409826 -28440 240043 226394 47441 -20939 137165 366208
31860C66208Q0164j17476j79092o4404J24583K14982R4704j49256l02271k84259
$$ 366208 446372 328896 149804 85400 209983 424965 519669 370413 68142 -216117
31850b16117j99589p4807J91070M61809L01788l68441q63549n10345L38701O87388
$$ -216117 -415706 -490513 -299443 162366 464154 95713 -767836 -1278181 -939480 -252092
31840b52092K54775k27616j89737L5058l3417k06421j00151J06900M3686r0827
$$ -252092 2683 -224933 -414670 -379612 -413029 -619450 -719601 -612701 -569015 -659842
31830f59842J51392N84214N64992L2228l41061j63641J37959N9248k37867k83655
$$ -659842 -508450 75764 640756 672984 331923 168282 306241 365489 127622 -156033
31820a56033k2204K17847K38522J10960n0209j60311j22597M8020J60675J06516
$$ -156033 -178237 39610 278132 389092 338883 178572 55975 103995 264670 371186
31810C71186M7831J39719K23339P1656j85724k12987L286J08620j03173m14955
$$ 371186 419017 558736 782075 853731 668007 455020 458306 566926 463753 48798
31800D8798m96825k63373J27173M14694L61044j8917l36353k28501J05927J38043
$$ 48798 -448027 -711400 -584227 -169533 191511 172594 -163759 -392260 -286333 -148290
31790a48290j74850k83853N9178L46296J24313k47488k00588R6653R4122j20519
$$ -148290 -323140 -606993 -547815 -201519 -77206 -324694 -525282 -428629 -334507 -455026
31780d55026J6591M53474M84072o1328m56151k38303P3350p8545l49744j68779
$$ -455026 -438435 15039 499111 437783 -18368 -256671 -183321 -261866 -611610 -780389
31770g80389K15241J62781k35146l10371O6349L41487K49393J51339K65938K74729
$$ -780389 -565148 -402367 -637513 -947884 -881535 -540048 -290655 -139316 126622 401351
31760D01351k7544k92670j94436L6086N1862k7179Q0903K36200J06663j84046
$$ 401351 373807 81137 -113299 -77213 -25351 -52530 28373 264573 371236 187190
31750A87190j70017J98512M06013J31211k55203k29465J36048L24215J28635j45324
$$ 187190 17173 215685 621698 752909 497706 268241 404289 728504 857139 711815
31740G11815k31615k40288l02688k75547q1240k516k31322l91804m0570N19420
$$ 711815 480200 239912 -62776 -338323 -419563 -422079 -653401 -1045205 -1085775 -566355
31730e66355N58091L8373k74381K5453M15797L55776Q7880N9972J42455J7618
$$ -566355 -8264 30109 -244272 -218819 196978 552754 640634 700606 843061 860679
31720H60679j34923m693J77617J8477k98315l41626k12281k51062k50536J81402
$$ 860679 725756 721063 898680 917157 618842 277216 64935 -186127 -436663 -255261
31710b55261O76100N05824j25946k51851K85085N19066n4568o56986n29671q9986
$$ -255261 420839 926663 800717 548866 833951 1353017 1298449 641463 111792 21806
31700B1806n8663k48398q9389K47300J84224j93096k97549m2214J45737J69927
$$ 21806 -36857 -285255 -374644 -127344 56880 -136216 -433765 -475979 -330242 -160315
31690a60315L21023N34694L85649q0496k35782J76459N78062L68005k55521o43294
$$ -160315 160708 695402 1081051 1000555 764773 941232 1519294 1887299 1631778 988484
31680I88484n52184k85968j47992j05282l427J33569J56142O7427P8774K91722
$$ 988484 436300 150332 2340 -102942 -106369 27200 183342 250769 329543 621265
31670F21265M47688K17873k85511n74889m31284j70406j14901j35198J2768J86072
$$ 621265 1068953 1286826 1001315 426426 -4858 -175264 -290165 -425363 -412595 -226523
31660b26523P8494k21005l06896n6918K13500K42790J60217K05849L24465K27450
$$ -226523 -148029 -369034 -675930 -732848 -519348 -276558 -116341 89508 413973 641423
31650F41423j74703n39728m19798J52819N80261L94972r8980k12258J64671M27576
$$ 641423 466720 -73008 -492806 -339987 240274 635246 536266 324008 488679 916255
31640I16255J61425l10571m99035m12113l18402k35234n3680J17606J35520J25812
$$ 916255 1077680 767109 268074 -144039 -462441 -697675 -751355 -633749 -498229 -372417
31630c72417K41577L35681K18743J3140r6640k07029m08631m42764j03695K70319
$$ -372417 -130840 204841 423584 436724 340084 133055 -275576 -718340 -822035 -551716
31620e51716K27859o8678r4584J98845L66061K14407N574p7170j24437j34909
$$ -551716 -323857 -392535 -487119 -288274 77787 292194 297768 220598 96161 -38748
31610c8748L2210K70436K61038j7989k31962k00263p3405L0269J55055K44943
$$ -38748 -6538 263898 524936 506947 274985 74722 1317 31586 186641 431584
31600D31584J64258J5728L6333J63734J17528j02215k38121k55274l03600k62380
$$ 431584 595842 611570 647903 811637 929165 826950 588829 333555 29955 -232425
31590b32425Q2770M27455K04423m61454p75524m28166P398Q4583J12687L82181
$$ -232425 -149655 277800 482223 20769 -754755 -1182921 -1175523 -1090940 -978253 -596072
31580e96072N25679K17657j34440m9367K05141J32376r9377k3626K09932Q7168
$$ -596072 -70393 147264 12824 -36543 168598 300974 201597 177971 387903 475071
31570D75071k99117l35780P9728L45189J13235j98541r8274K69271M07595J60622
$$ 475071 175954 -159826 -80098 265091 378326 179785 81511 350782 758377 918999
31560I18999j64961k37562p2716J9002j86221n18775n92735l01590O1395K37259
$$ 918999 754038 516476 443760 462762 276541 -242234 -834969 -1136559 -1075164 -837905
31550h37905K73791K36785J3403l32885l76321J03846O49533O66175K31239j00974
$$ -837905 -564114 -327329 -313926 -646811 -1023132 -919286 -269753 396422 627661 526687
31540E26687j23239r1327j29522p4889Q1639J12235j7846q2426l0614o5179k03878
$$ 526687 403448 312121 182599 107710 189349 301584 283738 201312 170698 105519 -98359
31529i8359j96106o7P9195j00448k58507j48889O6190J29081Q1648J08048K12424
$$ -98359 -294465 -294532 -215337 -315785 -574292 -723181 -656991 -527910 -446262 -338214 -125790
31518a25790K68070K07128J3346k71997m27395k04014K51099M26773J16572k39162
$$ -125790 142280 349408 362754 90757 -336638 -540652 -289553 137220 253792 14630
31508A4630j60553J85312K61123n3997l47725k88834l037J97068J78738J6526
$$ 14630 -145923 39389 300512 246515 -101210 -390044 -393081 -196013 -17275 -749
31498g49j45445j88509j07272k8750m3594n6517N5416J92127J40208p7771j90585
$$ -749 -146194 -334703 -441975 -470725 -514319 -570836 -515420 -323293 -183085 -260856 -451441
31487d51441o7811R2285P1528n3500n6881J08785L02245M23242M62584L63374
$$ -451441 -519252 -426967 -355439 -408939 -465820 -357035 -54790 368452 831036 1194410
31477A194410M4952l90129o52075n71667l00870j07882o8959p5597n6438l7145
$$ 1194410 1239362 849233 197158 -374509 -675379 -783261 -852220 -927817 -984255 -1021400
31467a021400k3181J7407O4017Q3537J46444L27204M86524L77314L3944j84197
$$ -1021400 -1044581 -1027174 -963157 -879620 -733176 -405972 80552 457866 491810 307613
31457C07613p6712R8480J6150k29128l07113j72277n1433J8843K34437N43749
$$ 307613 230901 329381 345531 116403 -190710 -362987 -414420 -395577 -161140 382609
31447C82609N42242O6727m32535m34711n6219J46180k1559j82535k2429K50512
$$ 382609 924851 991578 559043 124332 68113 214293 192734 10199 -12230 238282
31437B38282K69945N2409j09182j30302j86507l17153l05237m4002K41258K95264
$$ 238282 508227 560636 451454 321152 134645 -182508 -487745 -531747 -290489 4775
31427D775J53480j5184j83471l35131k45292K29770P04369N55857k11501q05284
$$ 4775 158255 143071 -40400 -375531 -620823 -391053 313316 869173 657672 -147612
31417a47612o09195K2643L01354R1398k7750K63847N25925K45865l62473o21464
$$ -147612 -756807 -734164 -432810 -341412 -369162 -105315 420610 666475 304002 -317462
31407c17462k93089J58453K34991J8095o6821R7642K01047L4475j61298p2315
$$ -317462 -610551 -452098 -217107 -199012 -265833 -168191 32856 67331 -93967 -166282
31397a66282J58498J08378k37205l50834Q7364O03712M67432k84201p78471l89610
$$ -166282 -7784 100594 -136611 -487445 -400081 203631 671063 386862 -391609 -781219
31387g81219M52340Q20314M56292j8933n4568J22425J2259k97568k86817Q2888
$$ -781219 -328879 491435 947727 928794 874226 996651 1008910 711342 424525 507413
31377E07413K19031j49368m51723j50339L33089K26588l30567m53368P4036M25480
$$ 507413 726444 577076 125353 -24986 308103 534691 204124 -249244 -175208 250272
31367B50272N1045m51911l22857J74943K82745L871j8527L23468M25977K9916
$$ 250272 301317 -150594 -473451 -298508 -15763 -11892 -30419 293049 719026 748942
31357G48942l28707j81729J77071K21031l5837j93469j08411K224k9749j10918
$$ 748942 420235 238506 415577 636608 600771 407302 298891 301115 271366 160448
31347A60448p0481R6235J82310k8262m47293o61267m02485N8226K59308J95787
$$ 160448 89967 186202 368512 340250 -107043 -768310 -1170795 -1112569 -853261 -657474
31337f57474K41079M55157M53827Q3813k57327k22632j7585J0055q5844q1290
$$ -657474 -416395 38762 492589 576402 319075 96443 78858 88913 3069 -78221
31327g8221m1608j29125j93534p071K53959K25616l6938j31194L9698J46038J3885
$$ -78221 -119829 -248954 -442488 -449559 -195600 30016 -6922 -138116 -98418 47620 61505
31316F1505j15443m0919P9434O4624L4693J53158K97054K45716K6346j67440k69048
$$ 61505 -53938 -94857 -15423 49201 83894 237052 534106 779822 806168 638728 369680
31305C69680l27573l12526j55809P5444K38286K83267K02449o6234m43309n45328
$$ 369680 42107 -270419 -426228 -350784 -112498 170769 373218 306984 -136325 -681653
31295f81653q9045N46595N87099j45971q84426q32311j34260M33964N04790L77657
$$ -681653 -770698 -224103 362996 217025 -667401 -1499712 -1633972 -1200008 -695218 -317561
31285c17561L42848K92487J12342k0089K6566O7072m9681j21844N0699K45635
$$ -317561 25287 317774 430116 410027 436593 503665 453984 332140 382839 628474
31275F28474J33533j55900j98770O0327K22971M6643k25681k53660l1399K02059
$$ 628474 762007 606107 407337 467664 690635 737278 511597 257937 226538 428597
31265D28597K70796J54335o8220k55897k93606k06621j13849p4377p1444q6262
$$ 428597 699393 853728 785508 529611 236005 29384 -84465 -158842 -230286 -316548
31255c16548n5625J37774M31800M67776J4116n57877n96251r820N67835N65370
$$ -316548 -372173 -234399 197401 665177 679293 121416 -474835 -484655 83180 648550
31245F48550J08325k77940l17961j54937p2229k04007l95429l11280J41156N41384
$$ 648550 756875 478935 160974 6037 -66192 -270199 -665628 -976908 -835752 -294368
31235b94368M11576q0784k90982k1405K18086N2728j80605m2403K77125K91288
$$ -294368 117208 36424 -254558 -275963 -57877 -5149 -185754 -228157 48968 340256
31225C40256l3941l28385l91702k84979l6241L13219N10488L56676O7347j3614
$$ 340256 306315 -22070 -413772 -698751 -734992 -421773 88715 445391 512738 499124
31215D99124N3073n0645l18430m05394j66201J66112L33364K79560P6117r7248
$$ 499124 552197 501552 183122 -222272 -388473 -222361 111003 390563 466680 369432
31205C69432j2983K57917K48669k60766p23945m80403K33409N58014K33469j52137
$$ 369432 356449 614366 863035 602269 -121676 -602079 -368670 189344 422813 270676
31195B70676j89601j65862l25848l54124q732L34172K73938M9622Q0110K27157
$$ 270676 81075 -84787 -410635 -764759 -773491 -439319 -165381 -115759 -35649 191508
31185A91508R5165k03785j89310J94772M70744L14431p8863l57368l96322k64396
$$ 191508 286673 82888 -106422 88350 559094 873525 794662 437294 40972 -223424
31175b23424q2072K1137j3119j15451k12458l08857l25961n7301M83835Q68528
$$ -223424 -305496 -284359 -297478 -412929 -625387 -934244 -1260205 -1317506 -833671 34857
31165C4857P23225K58623k3957m8143j67720m77860n89254k40297K48434L89811
$$ 34857 758082 1016705 992748 944605 776885 299025 -290229 -530526 -282092 107719
31155A07719J61465n0957k1919O1559p1946l72830n04277k61444J42250L09272
$$ 107719 269184 218227 196308 257867 185921 -186909 -691186 -952630 -810380 -501108
31145e01108J49323k7633M4008K43589K95132J52851l2622j70351k29924j39325
$$ -501108 -351785 -379418 -335410 -91821 203311 356162 323540 153189 -76735 -216060
31135b16060N9511J01106j47647l57515j44687K84189L56760L871k13101K3302
$$ -216060 -156549 -55443 -203090 -560605 -705292 -421103 -64343 -60472 -273573 -250271
31125b50271L02552J63106j83481k09158J39408M32939L87732J23504j24176k26017
$$ -250271 52281 215387 31906 -177252 -37844 395095 782827 906331 782155 556138
31115E56138j39293O3146J77256R3285l6571n3522p4895k55073m13492k65006
$$ 556138 416845 479991 657247 750532 713961 660439 585544 330471 -83021 -348027
31105c48027N6935J25535j07004j87897J46362N33803M78180J4273l78090l72585
$$ -348027 -291092 -165557 -272561 -460458 -314096 219707 697887 712160 334070 -38515
31095c8515q5558J52022J44934j6103q8907k377Q464k49823n23737l68428J72671
$$ -38515 -124073 27949 172883 156780 67873 65496 73960 -175863 -699600 -1068028 -895357
31084h95357N30609L88623Q8541J6018Q174k15817m00387j14810M14744M89033
$$ -895357 -364748 23875 112416 128434 136608 -79209 -479596 -594406 -179662 309371
31074C09371j5610l93771j12283M39513N28142N3307m25430m49868j15545J71250
$$ 309371 293761 -100010 -212293 227220 755362 808669 383239 -66629 -182174 -10924
31064a0924J41761j31115l42036k65989K592J82408J62454Q5741Q1499J12738
$$ -10924 130837 -278 -342314 -608303 -605711 -423303 -260849 -175108 -93609 19129
31054A9129J21975J08666J2498k31963m53637l46435O6454L72488L39132K21086
$$ 19129 141104 249770 262268 30305 -423332 -769767 -703313 -330825 8307 229393
31044B29393K72683K94257L653m13698n30842k88100R95J23794J00230k1594j40460
$$ 229393 502076 796333 799986 386288 -144554 -432654 -431659 -307865 -207635 -229229 -369689
31033c69689j8131L83777O30092L31324j87185k64275J15442L18009O5962k01240
$$ -369689 -387820 -4043 626049 957373 770188 505913 621355 939364 1005326 804086
31023H04086j33902M615q3668k14144j71996j70787l99559n48502k99078P4228
$$ 804086 670184 674799 591131 376987 204991 34204 -365355 -913857 -1212935 -1138707
31013a138707J41269N0985K20797N14460M12670o3493k84822L5422M28328M03825
$$ -1138707 -997438 -946453 -725656 -211196 201474 137981 -146841 -111419 316909 720734
31003G20734Q6212j41246j94114j77480n9155J93627L65864K21129j26559l33203
$$ 720734 806946 665700 471586 294106 234951 428578 794442 1015571 889012 555809
30993E55809k63289j02962o7681j62709k36282j70357r153Q2253K6046k8986J03789
$$ 555809 292520 189558 121877 -40832 -277114 -447471 -456624 -374371 -348325 -377311 -273522
30982b73522L34335L57562Q0942k06402k01743M4788K66090L22922K40436K6276
$$ -273522 60813 418375 499317 292915 91172 135960 402050 724972 965408 991684
30972I91684l23938o64234p33194m16939R1304M30977L82417P6418j17808J409
$$ 991684 667746 3512 -729682 -1146621 -1055317 -624340 -241923 -165505 -283313 -281904
30962b81904K03075J19174k13887l69260j62283M8620q0767l14429j97670K04873
$$ -281904 -78829 40345 -173542 -542802 -705085 -656465 -737232 -1051661 -1249331 -1044458
30952a044458M00223K49653J48049L01831L33929p4138n39298m39598J76243O27047
$$ -1044458 -644235 -394582 -246533 55298 389227 315089 -224209 -663807 -487564 139483
30942A39483N12103J33059p3814r5969j23417j24790K5014K05270J91103L5314
$$ 139483 651586 784645 710831 614862 491445 366655 391669 596939 788042 823356
30932H23356k4791M858j09225l61142m22917j56743J26502J28621o982N306J16903
$$ 823356 798565 803423 694198 333056 -89861 -246604 -120102 8519 1537 6843 123746
$$ [...]
##END NTUPLES=NMR SPECTRUM
##END=
