##TITLE=31Pdec_LY-TMF-17.7.Rt+TMF
 D2O, 24 sc
 24.3.2020
##JCAMPDX= 6.0         $$ Bruker NMR JCAMP-DX V2.0
##DATA TYPE= NMR SPECTRUM
##DATA CLASS= NTUPLES
##ORIGIN= UXNMR, Bruker Analytische Messtechnik GmbH
##OWNER= root
$$ XWIN-NMR		Version 3.5
$$ Tue Mar 24 15:38:47 2020 Russian Standard Time (UT+4h)  she@DPX200
##.OBSERVE FREQUENCY= 81.013821
##.OBSERVE NUCLEUS= ^31P
##.ACQUISITION MODE= SIMULTANEOUS
##.ACQUISITION SCHEME= undefined
##.AVERAGES= 24
##.DIGITISER RES= 17
##SPECTROMETER/DATA SYSTEM= spect
##.PULSE SEQUENCE= zgpg30
##.SOLVENT NAME= DMSO
##.SHIFT REFERENCE= (INTERNAL, DMSO, 0, 182.463)
##AUDIT TRAIL= $$ (NUMBER, WHEN, WHO, WHERE, WHAT)
$$ ##TITLE= Audit trail, XWIN-NMR		Version 3.5
$$ ##JCAMPDX= 5.01
$$ ##ORIGIN= Bruker BioSpin GmbH
$$ ##OWNER= she
$$ F:/spectra/data/she/nmr/P31/1/pdata/1/auditp.txt
$$ ##AUDIT TRAIL=  $$ (NUMBER, WHEN, WHO, WHERE, WHAT)
(   1,<2020-03-24 15:37:17.21 +0400>,<she>,<DPX200>,
      <created by zg, POWCHK disabled, PULCHK disabled
       configuration hash MD5:
       00 E9 B6 7A A2 85 ED C7 34 08 36 98 17 FE 4E 26
       data hash MD5: 32K
       30 C0 2A 16 48 7F 13 73 42 EE 44 B1 BD DD 2F 79>)
(   2,<2020-03-24 15:37:20.20 +0400>,<she>,<DPX200>,
      <Start of raw data processing
       efp BC_mod = 2 LB = 1 FT_mod = 6 PKNL = 1 PHC0 = -1383.964 PHC1 = 190.6017 SI = 64K 
       data hash MD5: 64K
       01 EF 8E FA 7F 41 F9 BB E9 E0 A3 3B D5 5B 2A 56>)
(   3,<2020-03-24 15:37:36.75 +0400>,<she>,<DPX200>,
      <pk PHC0 = 2.353031 PHC1 = 0 
       data hash MD5: 64K
       7A B9 67 84 56 77 E5 3B 4D AF 41 14 B3 E3 2B FA>)
(   4,<2020-03-24 15:37:39.71 +0400>,<she>,<DPX200>,
      <abs ABSG = 5 
       data hash MD5: 64K
       48 57 7D 08 21 61 E1 4A 1A F2 45 05 42 F0 3D 96>)
(   5,<2020-03-24 15:37:55.51 +0400>,<she>,<DPX200>,
      <pk PHC0 = -1.799846 PHC1 = 0 
       data hash MD5: 64K
       7C 5E CB C7 BF 07 28 56 26 34 66 55 02 17 30 9B>)
(   6,<2020-03-24 15:38:00.06 +0400>,<she>,<DPX200>,
      <abs ABSG = 5 
       data hash MD5: 64K
       0D 48 49 FA 24 71 9D DC 85 AE FE CF 91 B8 2C 76>)
$$ ##END=
$$ 
$$ hash MD5
$$ BF AC A9 60 31 3D 67 D7 0B 0C C1 C7 C3 A9 FE F5
##$RELAX= 
##$RELAX= 
##$RELAX= 
##$RELAX= 
##$RELAX= 
##$RELAX= 
##$RELAX= 
##$RELAX= 
$$ Bruker specific parameters
$$ --------------------------
##$DU= <F:/spectra>
##$EXPNO= 1
##$NAME= <P31>
##$PROCNO= 1
##$TYPE= <nmr>
##$USER= <she>
##$AMP= (0..31)
100 100 100 100 100 100 100 100 100 100 100 100 100 100 100 100 100 100 
100 100 100 100 100 100 100 100 100 100 100 100 100 100 
##$AQSEQ= 0
##$AQ_mod= 1
##$AUNM= <au_zg>
##$AUTOPOS= <>
##$BF1= 81.014009
##$BF2= 200.13
##$BF3= 200.13
##$BF4= 200.13
##$BF5= 200.13
##$BF6= 200.13
##$BF7= 200.13
##$BF8= 200.13
##$BYTORDA= 1
##$CFDGTYP= 0
##$CFRGTYP= 5
##$CHEMSTR= <none>
##$CNST= (0..31)
1 1 145 1 1 1 1 1 1 1 1 1 1 1 1 1 1 1 1 1 1 1 1 1 1 1 1 1 1 1 1 1 
##$CPDPRG= <waltz16>
##$CPDPRG1= <>
##$CPDPRG2= <waltz16>
##$CPDPRG3= <>
##$CPDPRG4= <mlev>
##$CPDPRG5= <mlev>
##$CPDPRG6= <mlev>
$$ [...]
##$SUBNAM3= <"">
##$SUBNAM4= <"">
##$SUBNAM5= <"">
##$SUBNAM6= <"">
##$SUBNAM7= <"">
##$SUBNAM8= <"">
##$SUBNAM9= <"">
##$SW= 369.568048894756
##$SWIBOX= (0..15)
0 1 3 0 0 0 0 0 0 0 0 0 0 0 0 0 
##$SW_h= 29940.119760479
##$TD= 32768
##$TD0= 1
##$TE= 0
##$TE2= 300
##$TE3= 300
##$TEG= 300
##$TL= (0..7)
0 120 53 12 22 120 120 120 
##$TP= (0..7)
150 150 150 150 150 150 150 150 
##$TP07= 0
##$TPNAME0= <>
##$TPNAME1= <>
##$TPNAME2= <>
##$TPNAME3= <>
##$TPNAME4= <>
##$TPNAME5= <>
##$TPNAME6= <>
##$TPNAME7= <>
##$TPOAL= (0..7)
0.5 0.5 0.5 0.5 0.5 0.5 0.5 0.5 
##$TPOFFS= (0..7)
0 0 0 0 0 0 0 0 
##$TUNHIN= 0
##$TUNHOUT= 0
##$TUNXOUT= 0
##$USERA1= <user>
##$USERA2= <user>
##$USERA3= <user>
##$USERA4= <user>
##$USERA5= <user>
##$V9= 5
##$VALIST= <valist>
##$VCLIST= <CCCCCCCCCCCCCCC>
##$VD= 0
##$VDLIST= <DDDDDDDDDDDDDDD>
##$VPLIST= <PPPPPPPPPPPPPPP>
##$VTLIST= <TTTTTTTTTTTTTTT>
##$WBST= 1024
##$WBSW= 4
##$XGAIN= (0..3)
0 0 0 0 
##$XL= 0
##$YL= 0
##$YMAX_a= 33965
##$YMIN_a= -36837
##$ZGOPTNS= <>
##$ZL1= 120
##$ZL2= 120
##$ZL3= 120
##$ZL4= 120
##$ABSF1= 182.463
##$ABSF2= -187.1042
##$ABSG= 5
##$ABSL= 3
##$ALPHA= 0
##$AQORDER= 0
##$ASSFAC= 0
##$ASSFACI= 0
##$ASSFACX= 0
##$ASSWID= 0
##$AUNMP= <proc_1d>
##$AZFE= 0.1
##$AZFW= 0.5
##$BCFW= 0
##$BC_mod= 2
##$BYTORDP= 0
##$COROFFS= 0
##$CY= -3
##$DATMOD= 1
##$DC= 0
##$DFILT= <>
##$DTYPP= 0
##$F1P= 0
##$F2P= 0
##$FCOR= 1
##$FTSIZE= 65536
##$FT_mod= 6
##$GAMMA= 0
##$GB= 0
##$INTBC= 1
##$INTSCL= 5.30512e-09
##$ISEN= 30
##$LB= 1
##$LEV0= 0
##$LPBIN= 0
##$MAXI= 10000
##$MC2= 0
##$MEAN= 0
##$ME_mod= 0
##$MI= 50
##$NCOEF= 0
##$NC_proc= -2
##$NLEV= 6
##$NOISF1= 182.463
##$NOISF2= 159.3651
##$NSP= 0
##$NTH_PI= 0
##$NZP= 0
##$OFFSET= 182.463
##$PC= 4
##$PHC0= -1383.411
##$PHC1= 190.6017
##$PH_mod= 1
##$PKNL= yes
##$PPARMOD= 0
##$PSCAL= 0
##$PSIGN= 0
##$REVERSE= no
##$SF= 81.0140089999434
##$SI= 65536
##$SIGF1= 159.3651
##$SIGF2= -187.1042
##$SINO= 113.3802
##$SIOLD= 16384
##$SREGLST= <1H.CDCl3>
##$SSB= 0
##$STSI= 65536
##$STSR= 0
##$SW_p= 29940.119760479
##$SYMM= 0
##$S_DEV= 0
##$TDeff= 32768
##$TDoff= 0
##$TI= <>
##$TILT= no
##$TM1= 0
##$TM2= 0
##$TOPLEV= 0
##$USERP1= <user>
##$USERP2= <user>
##$USERP3= <user>
##$USERP4= <user>
##$USERP5= <user>
##$WDW= 1
##$XDIM= 65536
##$YMAX_p= 278570915
##$YMIN_p= -685659
$$ End of Bruker specific parameters
$$ ---------------------------------
##NTUPLES= NMR SPECTRUM
##VAR_NAME=  FREQUENCY,     SPECTRUM/REAL,   SPECTRUM/IMAG
##SYMBOL=    X,             R,               I
##VAR_TYPE=  INDEPENDENT,   DEPENDENT,       DEPENDENT
##VAR_FORM=  AFFN,          ASDF,            ASDF
##VAR_DIM=   65536,         65536,           65536
##UNITS=     HZ,            ARBITRARY UNITS, ARBITRARY UNITS
##FACTOR=    0.456856943014862, 1,           1
##FIRST=     14782.0589164792, 0,            0
##LAST=      -15158.0608439998, 0,           0
##MIN=       -15158.0608439998, -685659,     0
##MAX=       14782.0589164792, 278570915,    0
$$ Real data points
##PAGE= N=1
##DATA TABLE= (X++(R..R)), XYDATA
$$ [...]
39763 224361 245167 121596 -34075 -128426 -158618 -132037 -27057 135189 268208 310560
39753 310560 279687 213336 121857 24578 -29523 -15519 32449 63353 56597 23729 -2473 8734
39741 8734 32825 -8653 -127850 -194389 -86344 106662 167275 45078 -81984 -80994 -39669
39730 -39669 -83977 -168574 -179039 -130966 -115982 -123969 -76197 6971 26733 -20706 -37048 8941
39718 8941 44214 40916 65034 136196 169772 121034 70332 85624 105011 55685 1060 43186
39706 43186 133596 122719 -13070 -130661 -132814 -97399 -131613 -198820 -188760 -101461 -48669
39695 -48669 -82494 -125012 -93719 -15561 32230 37647 48956 84674 109625 92561 36664 -45747
39683 -45747 -138216 -192190 -149594 -26948 61640 16252 -121947 -201229 -132170 1469 35818
39672 35818 -82719 -242751 -313938 -297712 -283490 -290549 -242927 -114713 -4915 -4400 -58080
39661 -58080 -47567 33089 88141 88509 112813 200060 271265 251128 179865 133509 100165 18742
39649 18742 -101677 -188042 -211838 -212985 -216516 -198316 -150957 -121678 -147391 -187976 -167634 -75654
39637 -75654 7406 -1849 -89914 -159548 -147157 -97412 -94013 -142218 -171375 -146695 -114119 -117027
39625 -117027 -131344 -120731 -102789 -109366 -120449 -93995 -36591 8003 21356 12481 -21727 -83065
39613 -83065 -132279 -119473 -50840 23097 78577 127608 165708 170299 149986 134226 111349 42956
39601 42956 -52020 -102382 -93815 -91693 -117635 -91205 36291 165300 163704 55564 -12760 20812
39589 20812 70232 53789 4003 -13713 -1560 7918 17141 28682 8932 -42130 -44693 48341
39577 48341 142094 114191 11034 -445 117699 212120 168720 70465 41609 52750 2853
39566 2853 -86658 -101727 -21157 63177 98361 115036 120319 77256 13305 20250 99188 123985
39554 123985 25721 -91370 -101928 -40141 -30354 -99606 -162901 -160483 -114647 -64898 -26330 -7997
39542 -7997 -11808 -19095 -22044 -45479 -92688 -108173 -57256 -7336 -53117 -181101 -281478 -278388
39530 -278388 -179941 -25915 128852 200955 150076 60526 48314 85472 35098 -119365 -216202
39519 -216202 -146955 -17408 20596 -8604 19796 106067 131319 67720 28603 76601 113452
39508 113452 35116 -94689 -123000 -18140 91850 91489 13955 -24486 19436 69880 31240
39497 31240 -103170 -253584 -341296 -347575 -291984 -189894 -57785 59306 109214 92957 72366
39486 72366 94312 130202 124366 88284 95871 170583 226045 164612 13097 -93236 -66456 38721
39474 38721 101202 67106 -19885 -92643 -126528 -139137 -155271 -176549 -172141 -104907 18390 132134
39462 132134 169799 135288 94289 91235 98672 64756 -5847 -48773 -24976 18446 6056 -53285
39450 -53285 -58657 52043 203336 264815 211715 139879 122061 121965 80136 22219 27528 123129
39438 123129 259854 375704 439773 444466 394825 307864 200097 78346 -44087 -134098 -156817
39427 -156817 -100999 10622 115478 129272 20743 -129328 -204302 -197365 -206727 -264825 -273503
39416 -273503 -169826 -53597 -44922 -93150 -60870 46497 83897 -2727 -90545 -59549 54997
39405 54997 136313 122475 25184 -107537 -200722 -192539 -109446 -45030 -34070 -12722 65891 153038
39393 153038 188513 194161 224274 274458 296072 262996 181404 73277 -15477 -38407 -13636
39382 -13636 -11624 -44711 -36269 53852 146116 148715 84738 39491 39761 67112 136040 258736
39370 258736 365844 365890 271959 177607 115145 31968 -87610 -170040 -148724 -44942 69276
39359 69276 133601 113882 14825 -103866 -171708 -174771 -135498 -44814 107082 241307 240406 118345
39347 118345 34540 78363 136453 65016 -82665 -124575 -16521 79783 20988 -129602 -200970
39336 -200970 -140658 -65045 -94497 -200754 -246831 -156679 -8654 58500 16284 -19294 57114
39325 57114 192639 239605 153205 53237 64371 161596 229873 225350 192612 145661 41128
39314 41128 -104704 -177182 -111710 -3277 25288 7632 67459 193447 223989 87963 -72033
39303 -72033 -93782 -10035 32062 -6916 -36613 -884 57216 92898 114460 122610 88337 19819
39291 19819 -31428 -62475 -131215 -231514 -246184 -103218 87534 149501 54993 -65604 -104526
39280 -104526 -65908 15204 124397 207814 172951 20587 -104253 -77842 40647 98995 56808
39269 56808 -1802 -30491 -69905 -124658 -119113 -30699 37180 -5905 -103601 -144131 -122084 -108893
39257 -108893 -106717 -48051 67853 148340 137888 88882 74047 99561 134993 166313 183389
39246 183389 163325 99872 17483 -58902 -114667 -127821 -90630 -46996 -47016 -64487 -32576 35708
39234 35708 53619 4197 -26309 1412 4767 -77745 -168133 -165562 -103223 -86854 -134049 -176289
39222 -176289 -177264 -150758 -97172 -19677 27417 3790 -30341 9369 93070 115213 47575 -51378
39210 -51378 -149846 -236762 -225505 -29910 238249 318194 123605 -123687 -182955 -95504 -69704
39199 -69704 -160572 -226620 -174435 -85674 -66983 -92818 -67127 24797 102568 110212 86249 96757
39187 96757 137489 143849 91142 36953 41152 83349 99848 72502 31205 -7312 -42226 -46682
39175 -46682 5699 75127 87664 37023 -16113 -46956 -82723 -106789 -51645 75181 161781
39164 161781 147227 109629 125579 138607 69057 -27348 -39082 14686 16884 -46451 -58270 39496
39152 39496 152634 172377 105016 15158 -72188 -153074 -199869 -202180 -201844 -225471 -224866 -147587
39140 -147587 -32068 35338 36499 25270 23649 -12782 -108625 -206396 -224208 -143118 -11271
39129 -11271 110827 180579 171314 78758 -67229 -215146 -317939 -344134 -283638 -165331 -55468
39118 -55468 -7100 -11889 -27404 -45023 -90357 -151797 -160465 -72951 63245 165680 208869 217349
39106 217349 197391 139154 75114 62797 94906 93478 24258 -42508 -30790 31538 62352 51645
39094 51645 64785 124711 163776 119132 26228 -21090 19885 101862 144980 109642 22472 -47150
39082 -47150 -42609 24153 71044 20936 -113687 -234593 -254097 -179938 -101828 -104293 -194269 -299286
39070 -299286 -330726 -262398 -151190 -65629 -910 96884 218355 265688 180486 38131 -52434
39059 -52434 -92782 -145538 -180393 -103073 56279 131903 57675 -20473 37591 150453 144015
39048 144015 11800 -101063 -124145 -115987 -108697 -56245 40094 95339 76598 61024 107679
39037 107679 172390 200676 204989 188880 94937 -87378 -245057 -273310 -227953 -242278 -326108
39026 -326108 -357399 -273297 -168143 -163629 -248477 -301703 -247324 -133028 -50839 -23790 -7068
39015 -7068 23096 43873 55118 98356 165728 167998 68320 -23458 1793 66906 11317 -146075
39003 -146075 -211225 -99482 49113 91807 63174 50738 35254 -30970 -100013 -105704 -78644
38992 -78644 -68931 -35458 66671 160378 138538 30604 -44538 -47203 -22541 12566 62342 75464
38980 75464 10441 -54490 -14162 87998 123994 100365 144661 264623 302465 186022 62005
38969 62005 83579 190135 211846 111732 10560 9715 81854 130541 102397 37619 26964
38958 26964 106792 202036 209310 127815 53817 50234 88180 119745 131393 109361 31836 -72229
38946 -72229 -125475 -100809 -62119 -75467 -132838 -190700 -228535 -240358 -220824 -186854 -163863 -132421
38934 -132421 -46990 72144 130429 71133 -61941 -194346 -285160 -299031 -200490 -27689 99380
38923 99380 106154 49330 27278 56713 87341 87562 62446 28345 13622 40770 71721 28263
38911 28263 -89874 -172374 -140360 -57372 -28362 -44784 -14810 88615 193786 227874 184171
38900 184171 109708 77812 142217 262785 314564 234781 120418 105415 183059 242064 243084
38889 243084 243453 256596 216010 109322 31364 42719 66868 6944 -99217 -130733 -61329
38878 -61329 -254 -49516 -179092 -264461 -218322 -71855 58549 81878 20157 -23005 4821
38867 4821 29981 -45798 -184963 -231230 -115450 31414 43392 -56223 -102165 -39370 6591
38856 6591 -54054 -126468 -92994 -12533 -20630 -100074 -112690 -36720 -3970 -77310 -148330 -116410
38844 -116410 -35833 -3520 -11501 -5594 -1763 -40835 -90895 -94624 -69374 -71114 -95986 -100744 -88014
38831 -88014 -90724 -99689 -84287 -61200 -67175 -83475 -60842 -4415 35171 42888 48165 66665 93650
38818 93650 139565 211545 274622 289364 269800 246579 199356 96215 -21229 -72815 -55826
38807 -55826 -52546 -114903 -199516 -224683 -152609 -24364 55172 1578 -138569 -215208 -170459
38796 -170459 -130514 -207611 -296189 -221152 -37261 18679 -112556 -204964 -76590 149070 232750
38785 232750 137310 11826 -50724 -81155 -99342 -63745 31386 119952 156827 171978 201513
38774 201513 219705 174803 65812 -41323 -69475 -1330 100288 153475 142890 123157 130515
38763 130515 127970 64288 -43123 -121248 -122540 -62999 10033 61247 83974 94005 107659 122358
38751 122358 128498 136429 166302 209454 232497 227668 222177 222707 191614 106830 12055 -28817 -7510
38738 -7510 29875 45497 42679 44247 60356 77072 71300 46195 45962 105532 181882 175654 43656
38725 43656 -138523 -248713 -231835 -129747 -30545 -8885 -83382 -201428 -283301 -299635 -285056
38714 -285056 -269769 -242141 -200383 -186988 -223368 -248265 -178953 -15529 162689 284978 326585
38703 326585 285523 188830 112506 122504 183604 189618 103537 7638 -13809 18864 37168 35019
38691 35019 56976 104614 128548 112690 100806 123483 153307 155977 136409 102951 34659 -68192
38679 -68192 -139933 -118393 -40000 -4032 -48668 -123662 -184635 -244795 -317899 -377619 -401799 -397910
38667 -397910 -357483 -252774 -116989 -51970 -92779 -131842 -59324 75680 141130 119785 116140
38656 116140 173302 200205 112738 -43207 -155350 -170170 -115815 -48055 -7642 3355 26431
38645 26431 101462 209989 293762 323497 309357 259447 186585 142626 170828 225829 222159 166367
38633 166367 147730 181065 166854 55218 -52951 -45332 39012 74070 23570 -31963 -16121
38622 -16121 68119 166224 216014 178025 70837 -34916 -89790 -109003 -115924 -85694 5947
38611 5947 111833 150640 104519 38510 30349 104124 213566 272126 228898 131601 75715 77759
38599 77759 57124 -31209 -118637 -126603 -79934 -50935 -48755 -40221 -33244 -56301 -87496 -84082 -57519
38586 -57519 -43816 -26340 28919 81724 52794 -50703 -129297 -122258 -75476 -68550 -136194 -266327
38574 -266327 -407339 -464631 -362312 -144252 34607 54985 -52345 -155332 -157573 -72345
38564 -72345 15354 38441 300 -55273 -108582 -169364 -225262 -238281 -207332 -176296 -154692 -98547
38552 -98547 -10048 23866 -40616 -113930 -98968 -38899 -30134 -44476 26718 174853 261209 212171
38540 212171 104236 31685 2105 -4194 24443 84025 131257 146027 147644 126876 43892 -80145
38528 -80145 -156433 -147827 -113128 -101655 -94431 -87319 -129012 -213781 -233348 -121359 27630 72999
38516 72999 4222 -87820 -165060 -259387 -352422 -347667 -197311 4662 99988 23607 -132811
38505 -132811 -212974 -147998 -9741 87613 106220 76886 18654 -62152 -116503 -89716 -18635
38494 -18635 957 -38306 -36989 50418 134995 122932 34213 -65307 -159157 -237643 -248864 -180555
38482 -180555 -119285 -136516 -176759 -149683 -71981 -16053 26760 114073 218479 246621 181048
38471 181048 95828 36247 -15153 -55954 -53569 -27721 -40540 -82255 -63413 43673 141296
38460 141296 130846 36080 -42553 -46839 3041 49741 47264 2982 -14704 46489 130358 117243
38448 117243 -15312 -138507 -120503 16717 134546 141322 75328 41208 99631 215706 296870
38437 296870 283443 203608 128156 82362 35271 -28187 -71888 -61386 -12282 39129 83309
38426 83309 128852 169506 188922 187804 183890 187576 188496 163642 97425 3059 -75057 -91862 -39081
38413 -39081 49401 121394 132348 69628 -30153 -104750 -126977 -123396 -114878 -73813 20089 113511
38401 113511 129157 71278 22811 34733 70587 69104 14693 -66340 -139297 -177659 -176805 -156531
38389 -156531 -126800 -65616 32798 112318 115243 71183 55960 71580 48252 -31456 -97887 -98679
38377 -98679 -50492 31714 155378 265384 252943 118877 24801 86836 202450 192614 51483
38366 51483 -67367 -71683 -10383 48795 95283 121214 103439 65022 64588 101775 114073 83136
38354 83136 58194 56384 34409 -11439 -15297 44340 96685 100652 117180 183936 213547 123834
38342 123834 -3326 -21182 64380 109193 50336 -22781 -34872 -33777 -81007 -137675 -131765 -65988
38330 -65988 11189 82782 142528 151867 98684 59404 114008 220043 260392 209150 155918 153835
38318 153835 143096 68021 -18646 -39368 -15773 -23643 -63988 -76662 -70838 -134417 -281561 -384298
38306 -384298 -326467 -168458 -73512 -94006 -121956 -62084 35625 68443 41506 52623 135821
38295 135821 206927 189224 126467 120287 191421 258168 239679 132809 -7925 -116683 -137619
38284 -137619 -55743 64523 112669 44389 -61435 -93642 -37474 25830 29770 -19354 -90142
38273 -90142 -166778 -217057 -179112 -38066 110453 138040 30539 -91926 -118331 -66016 -26672
38262 -26672 -31109 -21946 46322 135499 175131 151522 112654 100992 115492 137759 162644 189623
38250 189623 205835 197394 167388 125517 67943 -10536 -86764 -122560 -122997 -150875 -243759 -329074
38238 -329074 -278288 -68396 156401 229847 146062 47374 44419 109637 154877 147118 110793
38227 110793 64820 10063 -41445 -68688 -67233 -48352 -24713 -12705 -22452 -24061 40312 176105
38215 176105 303004 344784 316424 268894 188274 32193 -150306 -230330 -151316 492 102616
38204 102616 117074 86086 66050 91600 155081 198417 170524 105257 85596 117644 113906 32278
38192 32278 -47309 -40193 14987 17019 -50233 -101937 -67234 32094 109825 94880 2912 -58396
38180 -58396 3752 142102 212226 161921 95241 102798 123790 60585 -50418 -94108 -53597
38169 -53597 -18147 -39530 -84657 -116195 -123947 -88759 -9311 46746 13657 -60376 -69752 -11096
38157 -11096 19334 -14973 -49681 -49359 -59512 -98757 -111071 -69891 -33101 -49214 -93209 -128953
38145 -128953 -146320 -111645 10393 152218 184286 109741 81809 155982 178334 38472 -113021
38134 -113021 -72568 94097 140888 7663 -108665 -60208 62069 102109 52813 10637 17625
38123 17625 39918 50001 57876 80481 116852 141613 120990 61715 27442 59213 101325 73058
38111 73058 -6224 -50945 -55855 -97270 -174410 -176323 -61895 43619 20743 -65925 -68616 26959
38099 26959 103186 95835 58596 45502 41481 34668 59534 120013 146884 96591 41268 85889
38087 85889 216099 300449 252508 131573 51367 31970 -1579 -82046 -127438 -47380 113645
38076 113645 205545 151950 41826 9888 72425 134389 130565 91969 72693 76711 81007 80364
38064 80364 75210 52549 16011 6255 52728 125427 169182 164418 118856 29218 -96006 -199037
38052 -199037 -224357 -197608 -181370 -159232 -59055 88946 128731 -19648 -225298 -308273 -269631
38041 -269631 -247938 -291003 -305318 -230241 -129354 -72978 -44278 -18474 -35259 -114274 -176455
38030 -176455 -142273 -58657 -34949 -82888 -115075 -92704 -78962 -125977 -188617 -191718 -130271 -59363
38018 -59363 -18579 -7631 -14342 -23857 -8486 48602 110695 105740 13859 -87402 -104548 -46054
38006 -46054 -8558 -33975 -42456 43701 160888 173839 70442 -7633 47155 171828 230050
37995 230050 178798 78189 -12783 -77928 -111091 -114858 -123433 -165987 -208195 -182618 -80861
37984 -80861 27747 72383 40244 -32948 -89146 -70370 34026 155609 205545 171424 115193
37973 115193 76820 37798 -8997 -23030 10363 26952 -37332 -149153 -221346 -233235 -240199
37962 -240199 -266818 -263509 -195188 -112409 -86746 -112697 -126348 -99564 -58912 -19642 35335 97709
37950 97709 115280 64779 -891 -15438 26281 91287 163264 224402 222590 126459 -6577 -86400
37938 -86400 -102341 -109889 -118459 -80071 3747 57179 42103 12409 18306 34120 27054 21405 36591
37925 36591 31797 -18706 -55432 -14226 72417 131118 159352 197373 224609 178778 66473 -29296
37913 -29296 -52931 -21390 29172 78081 106134 107583 111966 140752 156405 113631 43102 14188
37901 14188 26407 13222 -48827 -107920 -116201 -74282 1385 84811 117724 60689 -26903 -37103
37889 -37103 46550 137127 178546 200813 224452 209775 138781 55662 -18079 -116098 -221535
37878 -221535 -229401 -98242 44194 51757 -39497 -72600 622 68447 39157 -38237 -70967
37867 -70967 -58765 -73224 -141207 -206592 -202806 -124902 -19211 73294 135066 137548 33421 -175511
37855 -175511 -382859 -452651 -368678 -261286 -253217 -315255 -317547 -202229 -54446 2344 -57376
37844 -57376 -150924 -193334 -182078 -168799 -174188 -166619 -123213 -70985 -49467 -66994 -115602 -189667
37832 -189667 -257533 -257398 -168307 -49645 38431 111581 198475 251643 209205 111711 55589 47103
37820 47103 10358 -63490 -90994 -35025 44620 105595 174965 248880 254930 172338 87253 63323
37808 63323 51824 2 -44468 -18969 46407 93977 137905 206343 247846 196269 88334
37797 88334 27048 54829 129076 186120 170820 55356 -103327 -177015 -106753 19849 90410
37786 90410 96928 77299 21507 -62511 -78337 31510 151076 123480 -27194 -144987 -171452
37775 -171452 -174002 -172799 -108288 12061 95208 119686 166991 258976 301741 242716 158575 125426
37763 125426 109872 53214 -28122 -86758 -111153 -101742 -55529 -8394 -9737 -27017 28708 151603
37751 151603 224107 192510 143540 152521 177918 176321 192099 236382 203504 35392 -136908
37740 -136908 -163930 -108036 -140059 -259703 -296717 -180818 -39754 3054 -15250 1013 59150
37729 59150 100046 91073 37846 -43596 -120649 -152055 -136112 -114826 -107884 -82012 -6523 98673
37717 98673 187805 224954 185385 69811 -63086 -126283 -95133 -31032 6756 26486 51292
37706 51292 54474 2909 -67652 -83845 -30683 39073 86873 120013 133701 90203 -3935 -53752
37694 -53752 24276 179007 269780 236587 158755 126677 127924 109168 87733 120363 191962 225647
37682 225647 202831 188798 221074 251403 232314 190959 172347 170613 166192 171555 181294 137171
37670 137171 20366 -73197 -46605 43039 54780 -23340 -57494 15088 83877 44742 -32781
37659 -32781 -22803 51632 60392 -18210 -56330 33540 179031 260437 253876 205481 137964 61920
37647 61920 31908 97074 204420 235738 160144 85037 122658 252408 353043 338710 223574
37636 223574 75207 -47632 -110960 -100867 -27492 72960 151432 169225 120983 41932 -16434
37625 -16434 -26558 1849 43885 76716 75266 22658 -55960 -95688 -57545 20668 65255 47517
37613 47517 -2839 -53229 -98044 -128592 -112833 -34403 63220 104484 65214 11054 29252 123095
37601 123095 201783 187624 101602 14957 -46454 -95061 -109836 -58211 10838 -5052 -107542
37590 -107542 -168319 -113033 -41551 -75517 -164341 -163265 -59818 10796 -31020 -116999 -160922
37579 -160922 -166118 -162652 -135376 -72201 -12406 9692 15928 32466 35851 -3933 -68485 -120472
37567 -120472 -151940 -168676 -163497 -137449 -110834 -84219 -28698 56788 124588 147221 156093 170554
37555 170554 145538 52621 -32480 -5460 120001 220240 222806 190840 220946 309930 365847
37544 365847 326169 220334 114583 32758 -43579 -116955 -156893 -147374 -114151 -84709 -53670
37533 -53670 -13250 18803 38085 80352 157601 204300 155981 56759 13991 61182 139210 193203
37521 193203 201750 132088 -22111 -162071 -167517 -76094 -50990 -139175 -202133 -141299 -43318
37510 -43318 -13486 -10566 29039 33903 -73337 -183032 -118519 93352 244655 227443 134133
37499 134133 71147 26675 -37480 -91401 -94502 -63014 -35344 -31024 -60887 -113145 -128184 -65046
37487 -65046 11964 8415 -41668 -12722 97491 128469 -5266 -165797 -181533 -84277 -31397
37476 -31397 -58860 -58628 14180 58206 -9044 -115360 -139247 -82848 -49978 -80814 -105349 -76752
37464 -76752 -61309 -133595 -240551 -260087 -177146 -104651 -113393 -135806 -85337 11691 72621 79394
37452 79394 58042 -10266 -153748 -307639 -352803 -265443 -144266 -76159 -53319 -41470 -48072
37441 -48072 -79136 -86838 -14822 124603 249640 279263 203060 97114 59464 105047 144260
37430 144260 99020 9384 -28426 -597 21399 1476 -21417 -18259 -12249 -18096 -14902 -5305
37418 -5305 -30655 -94602 -137157 -124306 -104557 -130038 -169846 -154075 -72874 16059 63075 74397
37406 74397 91137 139047 194350 199964 130853 33761 -23375 -26765 -7783 18057 50459 61027
37394 61027 19289 -40759 -48826 2819 55973 85079 122752 176007 200567 184291 175670 194742
37382 194742 193003 143878 98990 103664 123315 109882 82099 79556 86817 64269 15761 -28527
37370 -28527 -61465 -83043 -71669 -19197 39025 73647 107188 168310 235196 267352 261210 234925
37358 234925 192818 142732 110662 99208 70975 12219 -29450 -10998 47999 113630 189492
37347 189492 270279 303232 264305 222378 248011 294265 252271 106789 -40745 -96751 -59466
37336 -59466 11537 51386 27508 -22645 -6862 111215 233766 225112 76920 -83464 -140539
37325 -140539 -86607 16055 95901 94381 2785 -102627 -119653 -35492 63158 109000 130468
37314 130468 183169 250970 258290 164496 12461 -119336 -195088 -238216 -271714 -269590 -200104
37303 -200104 -101110 -56362 -89325 -138417 -153350 -147585 -127409 -52249 78155 175600 176735 133645
37291 133645 109107 63189 -41368 -98675 15340 217339 298790 237381 232780 379060 495521
37280 495521 400418 193796 102640 147254 150167 37965 -54376 -7989 105909 147709 98210
37269 98210 37535 1253 -46119 -116787 -166951 -172295 -170491 -193796 -203525 -141797 -30235 38004
37257 38004 12388 -56371 -94050 -96378 -106211 -131568 -143951 -146830 -181812 -249501 -275035 -188269
37245 -188269 -14809 141513 195970 147220 60497 6085 5366 21923 9471 -27697 -37501 7110
37233 7110 59768 51682 -17964 -75207 -62711 -9983 8127 -36663 -104206 -143983 -138060 -88440
37221 -88440 -10151 45850 14790 -94932 -175507 -133840 -6506 91858 105591 57940 -32710
37210 -32710 -158501 -251460 -222046 -97680 -18202 -47434 -90512 -58509 -8570 -29312 -81274
37199 -81274 -70917 -16718 -10026 -52242 -68219 -61465 -111126 -206532 -230139 -145227 -65284 -67785
37187 -67785 -60107 65088 227463 240645 65473 -135318 -203076 -148502 -80947 -52855 -37297
37176 -37297 -16380 -12059 -24547 -7811 55847 101861 59157 -43309 -108867 -105154 -93752 -118190
37164 -118190 -140096 -120337 -89110 -80787 -63418 -3189 51809 33710 -31758 -57112 -20981 16235
37152 16235 19313 23841 65798 127689 168135 160075 97906 9180 -48261 -47577 -38978 -81213 -141540
37139 -141540 -130853 -36539 48975 45555 -26362 -89950 -93959 -35930 48754 101193 80883 15686
37127 15686 -13530 46684 167279 260718 253562 152069 46293 24698 76509 115480 103191
37116 103191 83998 81373 48841 -28656 -76150 -41154 21142 53348 91831 160294 171453 67084
37104 67084 -36161 1236 118860 158680 123414 131961 163447 78614 -103905 -191019 -117307
37093 -117307 -39914 -64708 -94486 -45741 -13586 -94830 -216968 -273569 -280822 -273436 -192877 -20826
37081 -20826 108931 84682 -5670 -16316 38595 54878 29759 27082 29370 -18118 -75023 -64747
37069 -64747 -14824 -2053 -11053 16002 45305 15495 -11832 74757 238403 323313 272128 169113
37057 169113 72974 -42748 -167219 -215062 -156853 -78582 -67480 -119828 -187425 -235624 -230852
37046 -230852 -144953 -3526 119504 171571 151482 81117 -9835 -89136 -153822 -227412 -287458
37035 -287458 -252245 -100039 60068 114979 88206 70847 77057 69083 62354 86024 92208 35040
37023 35040 -4656 83658 249638 336689 308307 266743 256379 217305 151516 163295 280112
37012 280112 378378 354174 250481 156675 92455 50468 50561 89431 124346 155535 232967 336694
37000 336694 354193 238533 95175 43236 72598 104487 112436 107977 76710 12564 -30324
36989 -30324 5278 95902 159887 140586 41605 -82951 -153968 -130624 -65024 -41349 -54592
36978 -54592 -22564 71238 141390 140793 139100 201177 271439 256498 164601 86741 75555 106109
36966 106109 131980 130959 110814 96267 90923 50094 -64436 -203065 -266214 -232960 -179647
36955 -179647 -156798 -133209 -90922 -82909 -142789 -213253 -223608 -179245 -124513 -75405 -36334 -25911
36943 -25911 -38517 -31021 15710 74723 133531 205054 257544 227612 139729 107862 163272 190025
36931 190025 105494 -6467 -39523 -35457 -86174 -151973 -126473 -32258 2469 -49890 -75100
36920 -75100 -30 100720 120362 58772 2855 17319 85725 136062 115591 49889 11638
36909 11638 26042 51515 66602 104760 167803 189310 145083 113800 145604 157079 65861 -47581
36897 -47581 -48506 35812 58713 -15096 -78612 -78617 -81713 -120088 -130148 -99886 -130177 -263046 -369744
36884 -369744 -315254 -145842 -5372 66338 135118 214970 234143 161967 68349 26631 26440
36873 26440 19404 4369 26124 109938 226472 313034 314654 220047 80957 -11367 1327 84575
36861 84575 141590 112553 25161 -60752 -122456 -158097 -140841 -52337 51928 83430 36549
36850 36549 -3169 17120 58616 82820 118020 179023 200857 135967 58043 69582 140641 144807
36838 144807 45931 -53819 -66474 -28988 -30087 -95290 -180525 -230673 -216344 -153565 -106055 -125661
36826 -125661 -175941 -163492 -63337 41220 71752 51846 49146 72055 85143 90964 119164
36815 119164 143309 91885 -31189 -106705 -36995 116971 201697 161146 92975 105892 187458
36804 187458 247738 241357 197220 161710 160904 192304 209229 144613 503 -122159 -143963 -115983
36792 -115983 -128731 -155865 -102870 8237 39853 -55890 -163849 -181734 -147654 -133804 -130545
36781 -130545 -113597 -120777 -171059 -196164 -142786 -59955 1631 82049 200002 247955 136177
36770 136177 -33983 -89579 -24726 30177 30619 40326 55626 -6777 -127061 -162407 -63453 40193
36758 40193 40621 3855 33161 93320 83329 12600 -11718 49825 108492 63023 -73762 -181568
36746 -181568 -155465 -19974 90819 81563 -1709 -50791 -40228 -27246 -31940 -9045 51554
36735 51554 82738 33924 -53518 -100941 -82828 -40604 -39120 -116562 -240252 -312298 -262045 -131579
36723 -131579 -28641 -7257 -42720 -99918 -156458 -174804 -132776 -77166 -67480 -73117 -16651 83381
36711 83381 119372 60410 331 2267 2322 -70530 -168051 -192899 -134225 -61897 -27983 -35694 -74743
36698 -74743 -131516 -177179 -180983 -131926 -44606 37534 60283 19685 -16753 -6705 -20074 -141749
36686 -141749 -307227 -350645 -228061 -76493 -20156 -32490 -35649 -21756 -8808 21573 65231
36675 65231 62687 3737 -18138 60093 158852 168342 106570 70500 86976 111175 127213 146602
36663 146602 135859 49005 -72802 -118853 -35586 114999 217525 188416 31166 -146681
36653 -146681 -208590 -134481 -53492 -77930 -154664 -155116 -67453 -4476 -40547 -135121 -220262 -280691
36641 -280691 -327951 -357479 -355797 -315169 -235301 -141708 -94753 -138886 -240537 -307213 -271741
36630 -271741 -145518 -4344 66311 41475 -10619 -1930 55305 58894 -25395 -91795 -41776
36619 -41776 63857 87462 5052 -82504 -107570 -105397 -118838 -120586 -62876 47170 149193
36608 149193 180012 118501 9000 -62348 -43996 30000 83898 80477 39638 4280 12808 73166
36596 73166 132889 110301 -7795 -134625 -185800 -171089 -143054 -107501 -45750 21502 66833
36585 66833 116537 198807 257729 205883 55731 -80848 -129047 -121236 -125817 -166433 -222083 -259164
36573 -259164 -254266 -218816 -197266 -212224 -230164 -213053 -171492 -125130 -53108 56210 146351
36562 146351 157757 122187 113628 129581 107616 46333 18024 55945 108421 115177 63749 -29397
36550 -29397 -125436 -155351 -81127 34421 92265 87986 98427 144392 165136 139084 122907 138229
36538 138229 122055 41539 -33152 -36890 -14478 -40469 -91677 -87203 -26134 1893 -51826 -121314
36526 -121314 -114713 -41265 -4696 -63418 -136045 -94525 59079 184335 198675 192138 267435
36515 267435 345593 263645 35375 -133875 -111207 17954 107277 125164 109497 65891 5397
36504 5397 -6798 54476 96475 30911 -74347 -77762 29828 116442 102880 53355 47422 61572
36492 61572 33619 -24581 -48334 -21117 7343 -5272 -51228 -105294 -155671 -185581 -160374 -68160
36480 -68160 42074 102044 106935 122910 199369 303253 359683 333082 247146 149541 81486
36469 81486 55833 34368 -45649 -181856 -269144 -207561 -39869 76289 43591 -75263 -152085
36458 -152085 -149759 -152438 -247888 -401392 -467212 -346426 -124437 -2888 -75897 -226984 -285400
36447 -285400 -225600 -147360 -112315 -97532 -88658 -112210 -162072 -183882 -159251 -131643 -122154 -91507
36435 -91507 -19769 43492 52511 33097 30739 38113 24878 3893 15281 64932 123363 172298
36423 172298 213241 237559 225418 179000 130492 105688 93910 69799 42858 63162 155894
36412 155894 262603 287186 207793 102820 50554 49407 61914 80056 99263 81667 13636
36401 13636 -39577 -15919 30590 -14852 -160501 -274160 -235473 -69653 83692 98126 -40462
36390 -40462 -222380 -306035 -252273 -151604 -97359 -80265 -50010 -14066 816 26073 92865
36379 92865 142291 102528 19829 -4586 20393 4861 -44836 -25899 71691 124013 62624 -24787
36367 -24787 -37077 9658 50949 73702 88955 91613 99484 152752 229628 241553 154555 40223
36355 40223 -27605 -47887 -37187 11041 78143 115747 117631 112821 77427 -39961 -193752 -269557
36343 -269557 -257510 -253821 -261486 -165426 28176 119066 1537 -139179 -75276 144828 290256
36332 290256 262482 148992 35426 -62508 -115004 -85035 -18591 -9300 -70388 -126314 -116961
36321 -116961 -39758 78502 181009 193212 106315 6104 -37825 -48431 -52794 -13358 68714
36310 68714 85887 -22372 -136542 -111115 8734 64400 20046 -25969 -27560 -41124 -102795
36299 -102795 -181502 -244914 -267213 -198592 -36323 107868 128445 79564 86584 144824 148549
36288 148549 91066 74779 120890 128465 53964 -8203 26938 117407 171500 156797 97769 38696
36276 38696 29590 79467 115036 56438 -65162 -138028 -113133 -44231 3563 8337 -29583 -82403
36264 -82403 -85892 -14494 61128 72162 62466 101241 138596 81565 -23987 -43773 22233 29691
36252 29691 -77197 -176084 -154910 -58112 10904 23007 1878 -40243 -89960 -118991 -115605 -81392
36240 -81392 -1985 113043 185462 155503 90886 101921 168292 170898 80904 -15548 -73142 -123741
36228 -123741 -153745 -98474 17466 80179 56213 22548 5272 -55032 -142552 -139745 -21406
36217 -21406 85259 106360 130540 228466 316850 305886 242567 192953 110818 -46129 -176631
36206 -176631 -153571 -9444 119581 177268 204947 227603 229520 212647 195321 178097 166755
36195 166755 187654 231893 237356 173475 86192 18076 -46071 -110122 -121672 -50973 53748
36184 53748 134059 171534 139920 7487 -164294 -231737 -147349 -32924 -7674 -40259 -42697
36173 -42697 -9642 21571 57422 104320 119559 91409 88822 147734 187745 128295 12070 -71687
36161 -71687 -112746 -145559 -161759 -139184 -95609 -48990 6233 38576 -4793 -73855 -36110 110539
36149 110539 191981 118038 29158 57661 107649 44252 -46055 320 123589 119598 -29714
36138 -29714 -129222 -67295 55665 109806 81700 16444 -46802 -59069 8165 108223 179462
36127 179462 230731 275038 240753 80006 -89828 -107454 4262 85573 82518 74338 79853
36116 79853 23844 -88602 -142685 -100344 -61599 -89699 -112484 -55595 41350 97872 90511 38895
36104 38895 -23879 -44022 9669 84788 104361 76125 55204 27605 -51672 -128173 -94912 32231
36092 32231 122625 118695 82118 53283 11191 -21867 5008 35128 -49703 -215706 -283049 -192855
36080 -192855 -91876 -86015 -90577 -18127 59445 57641 34902 63739 75962 -13967 -132913 -147536
36068 -147536 -64390 8928 42601 89434 154884 189981 189506 189791 187626 151268 92124 50558
36056 50558 37143 49688 102823 174347 181204 89550 -10992 -33320 -30631 -101363 -213898 -254207
36044 -254207 -209992 -167389 -141486 -61044 63508 107009 16591 -93272 -102462 -39552 2245
36033 2245 13104 37031 62637 48486 17730 23842 41758 -3146 -97252 -133051 -65315 21167
36021 21167 40064 11260 -16827 -66810 -168455 -261465 -266332 -211180 -179640 -162078 -80328 52949
36009 52949 136930 155539 201685 291602 309018 206155 108319 109818 105670 -26209 -186397
35998 -186397 -176143 2448 145219 123245 3993 -97453 -136985 -98914 24153 170847
35988 170847 236718 195523 117384 58876 18371 -2446 11589 32627 12648 -33168 -47091
35977 -47091 -22927 4943 41791 101043 123043 47967 -51779 -48552 41494 80845 29963 -12541
35965 -12541 -1672 -9779 -59777 -58013 44482 167967 244846 308379 376635 385024 309308 229189
35953 229189 195767 159501 99519 87601 137579 129987 -3096 -139985 -138142 -41548 2464
35942 2464 -48074 -121559 -167756 -191726 -199097 -192959 -185709 -162910 -96843 -28775 -39946 -98902
35930 -98902 -63231 98949 222512 170832 18513 -94154 -155951 -208024 -201329 -88607 34632
35919 34632 39617 -49721 -116711 -132360 -144994 -155865 -137145 -114907 -112547 -77032 20618 89564
35907 89564 49820 -26043 -35872 -17690 -45372 -57928 22608 94064 9187 -153653 -181046 -52633
35895 -52633 49426 47386 50808 117014 161406 155377 195227 298784 328631 209031 52019
35884 52019 -22071 -36725 -45081 -14802 72451 139487 135796 127425 169647 202297 170208 138844
35872 138844 180642 239966 222594 139663 55553 -30154 -133805 -189116 -126427 -10565 23188
35861 23188 -48421 -129353 -168669 -217785 -305854 -360251 -301821 -157374 -24353 44203 72389
35850 72389 92332 91189 47160 -11858 -29752 -2541 10213 -23691 -54300 -26886 28601 43733
35838 43733 13825 -14088 -28163 -45093 -33753 56923 184838 225265 125822 -28425 -138310
35827 -138310 -200432 -248501 -260701 -196062 -78478 23839 80339 103484 88280 6201 -130370
35816 -130370 -242578 -257489 -195121 -149526 -169678 -192419 -137453 -46433 -49559 -180690 -313037
35805 -313037 -324117 -240757 -153676 -74885 20257 83084 53540 -11556 -9608 32097 -3362 -113066
35793 -113066 -163727 -115685 -95654 -183283 -272132 -237130 -120615 -41781 -15609 16882 47698
35782 47698 23092 -29211 -23116 36825 45244 -38414 -112344 -75866 18083 30897 -67254 -150108
35770 -150108 -98596 51701 171255 198887 172409 118298 7254 -154668 -278207 -291102
35760 -291102 -225079 -149438 -80605 -17991 743 -36491 -57750 -7671 45918 11254 -69073
35749 -69073 -81081 -27813 -19708 -87208 -140796 -129283 -106312 -111381 -106836 -73758 -62223 -98605
35737 -98605 -133121 -121283 -78479 -24532 45384 112009 136907 131478 133552 112833 11516 -111517
35725 -111517 -114161 12388 99062 36714 -68869 -65392 31453 89755 43502 -72806 -205977
35714 -205977 -308898 -328328 -244745 -100942 45165 155514 186693 106851 -32650 -123137
35704 -123137 -130112 -120640 -139683 -160277 -179953 -239348 -298802 -236910 -48587 90092 52337
35693 52337 -67199 -117089 -102683 -105373 -99957 -10484 123870 192493 178452 147883 119284 73768
35681 73768 53312 110125 182633 157647 48767 -12275 33589 104059 110864 64530 21685 7395
35669 7395 14484 25490 21132 606 -14816 -22477 -46634 -76450 -55838 15753 43821 -27171
35657 -27171 -106959 -75501 48114 144089 151490 99052 24667 -41112 -56923 -31864 -56722 -172952
35645 -172952 -264572 -199320 -31263 69328 54322 22334 21073 -20492 -140768 -261096 -296736
35634 -296736 -253696 -180574 -106937 -54581 -36413 -27681 -780 16013 -17155 -69517 -86400 -93050
35622 -93050 -149727 -223513 -222593 -152162 -114065 -146928 -190586 -218493 -269962 -324451 -285414 -142872
35610 -142872 -23850 -12445 -33425 8172 75399 78400 22782 -17281 -18461 -13808 -17621 -19271
35598 -19271 -25763 -51261 -83969 -105100 -118344 -131222 -135456 -127840 -117797 -101425 -70156 -51234
35586 -51234 -81240 -129432 -118750 -43964 8183 -12497 -52020 -55460 -53994 -87658 -115907 -80155
35574 -80155 1351 74262 133383 193753 224936 196347 150360 145269 155598 118063 51506 28842
35562 28842 38671 -9604 -121403 -174808 -102709 -17748 -60561 -186920 -221137 -102855 34227
35551 34227 51381 -29570 -103510 -140333 -177574 -202200 -147505 -13361 98324 101814 24414
35540 24414 -45314 -59631 -32150 585 2873 -42816 -109488 -138433 -99088 -13804 82850 169630
35528 169630 215521 185954 95402 3914 -60163 -119062 -170190 -167608 -113356 -83992 -111764 -120572
35516 -120572 -48639 43854 71976 57078 67184 96559 112969 160116 282608 392579 352650
35505 352650 175891 11023 -62143 -87632 -88019 -18557 101804 159531 108734 46009 56683
35494 56683 93149 81929 54786 79693 133055 140563 102658 85507 105209 101706 30963 -74974
35482 -74974 -150602 -162286 -121776 -60208 -2427 39683 57836 43256 1258 -40257 -53814 -40285
35470 -40285 -22819 -20962 -38535 -62487 -67755 -44903 -25312 -44845 -80613 -73328 -19997 18228
35458 18228 13076 -5060 -38123 -132216 -251191 -257634 -106058 54680 80665 32315 45554
35447 45554 101370 85955 9536 -16209 17300 12783 -45403 -74752 -66497 -103177 -187020 -213530
35435 -213530 -146816 -72630 -45782 -27062 623 188 -4300 68942 200389 262956 220434 181939
35423 181939 207018 212025 137643 58767 47227 62358 57775 64450 91094 79810 41012 84392
35411 84392 218747 271051 125115 -94849 -208070 -216397 -219237 -211686 -134229 -33592 -1902
35400 -1902 -10893 38367 140847 201509 188123 142293 75686 -15722 -66935 -7339 106380 144622
35388 144622 85984 31793 44041 78072 81591 60561 35009 16635 38966 124187 207603 181656
35376 181656 43953 -71899 -54160 51173 106928 52923 -42697 -91637 -91912 -96086 -108426
35365 -108426 -80127 -9777 33820 28243 45571 107176 89914 -88718 -271072 -232919 -28931
35354 -28931 48076 -116449 -294314 -248322 -42279 100816 96435 19862 -50111 -72009 -12724
35343 -12724 101670 171561 148565 100186 81996 48996 -27119 -71829 -38185 -7133 -48900
35332 -48900 -99157 -87954 -70526 -98846 -87120 37933 163526 144165 41768 29110 118021
35321 118021 168511 127262 79789 87886 136032 220833 340607 409850 332454 157495 32652
35310 32652 11214 25324 29301 40431 53933 46044 50573 111325 174153 148895 62749 27606
35298 27606 67718 103236 93260 70931 45365 -6319 -53896 -43766 -11100 -39323 -107186 -103397
35286 -103397 -8048 62560 21381 -83891 -164539 -200719 -218239 -221002 -187326 -107631 -14459
35275 -14459 23379 -29161 -104195 -102099 -48535 -75150 -201910 -270905 -178057 -33714 19867
35264 19867 15222 43622 62635 -8865 -108605 -124106 -80625 -59356 -20121 99941 195863 119041
35252 119041 -67459 -172159 -164812 -167283 -199886 -169195 -90573 -92718 -191627 -263942 -252530 -212757
35240 -212757 -166833 -105000 -108354 -259422 -446623 -474159 -352761 -261539 -245381 -196067 -116013
35229 -116013 -123936 -185565 -125688 48371 117931 9669 -96370 -91436 -91204 -166882 -199802 -129500
35217 -129500 -90635 -165792 -238665 -227345 -227975 -284593 -252729 -54151 151836 217774 220682 261128
35205 261128 262544 154788 55229 63611 56264 -103904 -308135 -363076 -278249 -192804 -137241
35194 -137241 -63337 -3241 -9887 -28488 7944 47557 31815 29790 107491 174896 124542 20938
35182 20938 -6285 35671 55912 42675 35353 25526 6212 16384 34710 -33853 -160441 -155841
35170 -155841 34003 189211 139485 24046 25344 52139 -53698 -179426 -117919 48855
35160 48855 64962 -80464 -164332 -115733 -84353 -133621 -156605 -114926 -93109 -84744 20815
35149 20815 194626 254801 159631 87012 139221 174449 38572 -199931 -356922 -355520 -252929
35138 -252929 -136332 -61948 -33613 -5245 47900 74129 29696 -22792 -254 60061 65136
35127 65136 30082 41088 88155 83615 26902 -1916 -1701 -46394 -121340 -122200 -35748 26148 1196
35114 1196 -48629 -64757 -66989 -68369 -33076 40735 91219 76861 15601 -65004 -140675 -166962
35102 -166962 -127613 -83450 -84193 -71290 23258 126962 110024 -11578 -99498 -103476 -101776 -133016
35090 -133016 -134494 -68634 13200 54115 39133 -35785 -138087 -164901 -58587 66511 50763
35079 50763 -72937 -116482 -6170 140565 214425 227066 199439 103755 -25340 -67154 18855
35068 18855 112354 92760 -2234 -44194 20755 126235 167050 98077 -25015 -104868 -115891
35057 -115891 -117988 -136825 -114973 -35151 16511 359 18398 134284 219033 142809 14027
35046 14027 26445 148712 188037 110147 60638 91560 107410 88608 130071 223775 229420 115189
35034 115189 17613 837 -37979 -146137 -197148 -99257 43670 90556 51584 22066 39783
35023 39783 91588 167019 239252 270850 271008 265465 212741 63654 -106578 -167470 -132246 -132267
35011 -132267 -190271 -193886 -113795 -59625 -71438 -38359 103670 252321 293747 246048 189612
35000 189612 173541 222548 307526 298205 99730 -154806 -226473 -101936 -7241 -63308 -145075
34989 -145075 -136970 -100641 -99809 -72633 11721 60807 31989 17428 55231 42220 -60859 -133633
34977 -133633 -122723 -158241 -299838 -370763 -227539 -20623 17245 -91675 -145971 -73863 29512
34966 29512 100055 157327 199424 195145 160059 135834 123782 109319 98379 74873 439 -93303
34954 -93303 -111527 -47475 -10859 -46733 -57790 18683 93045 72571 -32 -51121 -95064 -153374
34942 -153374 -174586 -132302 -94361 -108231 -123931 -100906 -73867 -51672 15859 110729 132405
34931 132405 69261 27163 34375 -490 -78613 -68537 49194 120611 96414 127880 265688
34920 265688 325828 215029 123613 193312 252215 126068 -20871 59402 289257 402138
34910 402138 343377 255227 189692 113977 93652 195716 295906 240719 118632 121049 222460
34899 222460 257857 232858 278901 361105 315499 150068 40481 34734 12347 -62492 -87191
34888 -87191 -34324 477 -14630 -9003 25370 10269 -63475 -118686 -131246 -137171 -116843 -24514
34876 -24514 87809 124635 99336 95143 118126 127072 147002 202978 212758 107559 -14989 -27902
34864 -27902 14421 -20497 -112308 -145934 -115325 -78222 -1456 144129 234121 158597 41779
34853 41779 58712 135742 92342 -21417 -21672 58752 34322 -73054 -68463 46090 71722 -14836
34841 -14836 -26674 64460 62335 -83158 -159614 -44309 112762 161117 143154 116251 34735
34830 34735 -82097 -96754 23273 135284 157814 169376 204153 176872 89545 81447 180379
34819 180379 224957 128419 5213 -54676 -117781 -217832 -253901 -184808 -119556 -111818 -67968
34808 -67968 42206 94970 39853 8240 80351 147026 121665 91695 138132 196709 216635
34797 216635 263590 344686 329134 174643 42212 51531 107750 103670 101562 167929 216136 174256
34785 174256 136553 184048 215915 126329 1932 -21074 36196 82082 115273 153738 136666
34774 136666 44356 -11088 43414 105268 64668 -18868 -41520 -24219 -21944 2494 77316 127409
34762 127409 114472 129916 210644 218374 64005 -99412 -90931 25061 71889 47741 75088
34751 75088 154387 172784 103022 20094 -29594 -29122 67317 242373 341849 254856 99161 63394
34739 63394 130181 131714 29764 -48021 -33943 -2921 -13905 -22339 10167 38244 17804 -7229
34727 -7229 45144 186199 323169 338863 215031 62657 -2768 13098 40972 82196 177148
34716 177148 274463 273870 189762 121723 69972 -43987 -170732 -157225 -14520 61265 4106
34705 4106 -12877 117243 247603 231948 159944 176531 242352 242021 183154 131551 83768 42786
34693 42786 76054 162320 138434 -50978 -208623 -152395 22234 116670 116226 118140 111814 35025
34681 35025 -54888 -58264 999 48539 103094 189877 217773 114321 -12339 -18245 53285 56657
34669 56657 -24693 -85973 -70718 2354 109166 200788 201038 125328 93053 129786 103879 -31505
34657 -31505 -110685 -16260 111029 100510 22473 34173 107531 122314 99448 125587 155680
34646 155680 99810 12573 4871 58453 98300 141719 210542 220313 128261 57042 96528 130525
34634 130525 44720 -55314 -35039 29975 25417 34513 159774 276517 227046 106530 87146
34623 87146 112210 48350 -13764 78257 212853 176698 29116 -9313 63852 92010 90992
34612 90992 175184 246717 123844 -89401 -129140 -9661 37815 8743 100165 264479 223455
34601 223455 -29075 -159439 -22884 124914 67081 -74398 -118544 -91496 -63400 5788
34591 5788 113811 151433 114503 153542 302748 381777 273473 91865 -20058 -60609 -59295
34580 -59295 1145 74895 55382 -47240 -109216 -107507 -134441 -179040 -120448 26594 96121
34569 96121 50009 39752 132701 207139 187120 160892 191439 211857 178241 142629 123377 76837
34557 76837 21429 13315 4887 -77964 -148392 -75238 53184 43952 -57522 -33243 119758 187647
34545 187647 126705 115251 195101 209191 141794 161853 258142 200948 -29368 -141660 3676
34534 3676 178925 186063 135235 161593 185400 136414 120783 183136 182613 77107 50366 185311
34522 185311 293743 246336 185888 228503 244299 140033 75512 173149 275575 225364 141962
34511 141962 185691 272399 254236 175371 129887 70871 -29068 -35247 119317 261666 240235
34500 240235 159449 160138 180284 139345 142229 274681 395762 359307 257404 232771 237636 185493
34488 185493 146036 178865 175055 79899 61393 220513 343885 210896 -35190 -98894 33861
34477 33861 140106 114867 34403 -30992 -48676 30218 167408 196382 55854 -73621 -33416
34466 -33416 72665 78128 21519 20174 43663 15402 -16004 -888 -24490 -128689 -165787 -28326
34454 -28326 138878 153750 65492 23024 41355 77868 162275 270487 256757 89748 -41980
34443 -41980 -29385 -19449 -114687 -159268 -39590 74008 33354 -9766 96432 193818 102893
34432 102893 -36516 -31227 10022 -71961 -123873 57041 309248 342828 204492 122274 65750
34421 65750 -128486 -342729 -318620 -114538 -16773 -66871 -62583 31942 54467 -16319 -42117
34410 -42117 -17592 -62534 -157433 -181238 -156568 -174111 -157731 -1212 160301 131719 13116
34399 13116 44991 191413 217733 102976 30254 36401 14930 4244 127423 295965 307649
34388 307649 189909 126826 115012 22626 -89414 -56525 52500 45841 -17884 59215 200611
34377 200611 155570 -29934 -57820 114321 218364 147867 89820 142038 174326 132424 135005
34366 135005 202993 207994 144444 157000 256216 287303 205258 115291 47309 -39620 -65016 67642
34354 67642 219342 178885 28086 21946 160246 219063 156340 130975 164195 142813 113289
34343 113289 205294 315617 248428 107643 144963 284828 243372 66975 72809 272768 355074
34332 355074 253917 228307 326273 289854 87493 31756 227238 372973 270406 92163
34322 92163 -2780 -95753 -202362 -158670 27548 104177 -892 -62244 16699 56825 -2392
34311 -2392 18844 137852 114485 -89089 -179651 -32082 100326 52498 11992 125045 236526
34300 236526 223849 214275 279063 279397 193470 221390 391633 448632 307943 227406 339489
34289 339489 417590 311695 213673 265980 297763 187022 112308 202355 285333 217622 127370
34278 127370 122845 97276 15299 40494 192594 244638 142018 135874 312641 401804 261184
34267 261184 134462 193609 243426 134757 61520 173492 280971 218134 132002 152575 143561
34256 143561 27170 -17025 87378 138811 64300 89942 283655 369464 236221 165976 296455
34245 296455 346300 167322 62148 216284 323040 151649 -10487 101596 229807 84690
34235 84690 -109764 -36179 157046 186011 140648 204698 237496 94218 2554 161898 320622
34224 320622 208814 38523 111374 280128 271006 193550 249998 281805 99839 -65755 52753
34213 52753 247363 201563 55115 95977 201485 111674 -33260 38374 192591 145430 3377
34202 3377 38264 169731 168503 122622 210559 274960 120161 -36429 83687 291781 269827
34191 269827 154537 246596 411894 335988 130214 119039 243306 224861 112001 123496
34181 123496 165797 38652 -96605 19067 234967 263046 211186 322323 452393 359215
34171 359215 235893 377423 583592 490870 240064 204184 306452 234998 88959 166096
34161 166096 335220 267827 79359 99566 227670 163034 41850 172410 372596 271533
34151 271533 48895 151330 475022 563656 430384 435036 519655 336336 -4167 -74473
34141 -74473 98279 138420 60282 158914 317717 197929 -26661 81805 380906 367386
34131 367386 109577 110554 345585 319708 28688 -29963 203311 278753 128516 166966 448642
34120 448642 559997 416940 371255 472094 410162 231327 311615 590898 621546 394525
34110 394525 322115 412096 290069 26231 69645 357458 376868 125717 105977 345511
34100 345511 363966 147113 189134 499530 547867 288826 254665 517793 561653 313134
34090 313134 289153 565314 625637 408102 452067 804483 842963 430563 188166 347637
34080 347637 392676 138863 108983 490038 746988 631280 572571 726683 646265 250125
34070 250125 107541 393301 556237 375040 334315 608710 705304 467754 394813 613786
34060 613786 601139 265624 206353 542471 632516 330490 324051 800686 1005735 614643
34050 614643 322180 537944 706764 477624 341659 541537 553694 226965 215057 698325
34040 698325 919295 575648 396888 735382 911654 598520 484662 870283 1001852 547961
34030 547961 319653 732815 993823 651798 489269 961873 1237595 772559 373475 656701
34020 656701 906530 541132 259054 605209 840182 398045 45512 413483 793189 570125
34010 570125 412169 840248 1098279 665887 382090 820840 1111304 645833 327085 787525
34000 787525 1074717 517920 137630 697070 1163498 699702 324599 899678 1371981 826826
33990 826826 345526 902165 1391009 785641 248738 922427 1649452 1187103 633860 1231736
33980 1231736 1844321 1194366 502268 1173700 1981365 1415263 690588 1389518 2283881
33971 2283881 1705128 880615 1539843 2433225 1789006 945867 1770895 2816339 2060533
33962 2060533 1045379 1987214 3277645 2491967 1293202 2326109 3875335 3062465 1661190
33953 1661190 2804125 4662900 3886295 2495299 4214329 6841004 6200184 4722949
33945 4722949 7184947 10944355 10593129 9313369 13851046 21109010 23616748 25621190
33937 25621190 36714333 51659377 59469581 74606533 128928858 217266716 278570915
33930 278570915 258725602 176652987 100310691 67319757 58995424 47482996 33393263
33923 33393263 28079028 27663960 22454276 15153381 13365359 14611445 12167317 7815670
33915 7815670 7201890 8741278 7384048 4391961 4193397 5638297 4683782 2323268 2257283
33906 2257283 3609108 2945562 1028752 1069309 2425034 2087317 568220 643401 1860986
33897 1860986 1630262 360916 486942 1608385 1374562 131162 151647 1170202 1010406
33888 1010406 -127834 -150282 828432 812147 -183604 -317427 437952 409382 -386102 -363859
33878 -363859 420156 429687 -254649 -127497 686751 613017 -312004 -498792 184334 299900
33868 299900 -323144 -397884 180340 164390 -518558 -623249 -54517 -22948 -630298 -684483
33858 -684483 -57871 86555 -415535 -465996 86719 168264 -373477 -471113 61130 192889
33848 192889 -281173 -370930 135351 269619 -211828 -393069 -10102 107342 -252434 -287464
33838 -287464 152664 219277 -258125 -413650 -26856 67044 -380312 -575479 -257296 -165089
33828 -165089 -529290 -614149 -189475 11940 -267192 -339805 35479 187547 -125242 -264584
33818 -264584 -13834 5944 -373499 -483434 -134482 -12697 -346588 -470884 -143617 -14471
33808 -14471 -337733 -487781 -218934 -153863 -529215 -685659 -322498 -67564 -271903 -397482
33798 -397482 -134977 6754 -235310 -337935 -54415 72541 -202466 -312198 3886 147041
33788 147041 -195607 -418488 -123339 153930 -20168 -209586 -38006 74264 -209535 -428242
33778 -428242 -188836 87489 -32860 -232210 -132084 6343 -99333 -163390 34054 134373
33768 134373 -98637 -266523 -80485 87153 -62105 -183697 -4509 112208 -119476 -333430
33758 -333430 -218925 -111700 -305398 -453952 -248027 -32562 -160249 -353525 -282316 -166300
33748 -166300 -247215 -272582 -52366 80887 -92784 -203028 17418 192150 3090 -204275
33738 -204275 -88587 48307 -115617 -282213 -132822 32181 -114248 -271101 -88342 152481
33728 152481 81344 -70799 27798 141710 -41347 -251581 -135076 58370 -53788 -275438
33718 -275438 -242837 -111606 -183667 -271330 -86433 139098 66483 -109179 -66595 -6636 -239134
33707 -239134 -507795 -404765 -113334 -68138 -197698 -167308 -66605 -185347 -381544 -333591
33697 -333591 -173158 -227438 -369521 -259083 -10822 3244 -172475 -201679 -80875 -69733
33687 -69733 -161734 -161326 -121506 -199007 -260852 -123789 28195 -46433 -159378 -20840 192141
33676 192141 125409 -127234 -224296 -180170 -230786 -308524 -195416 -12425 -28825 -162247 -169004
33665 -169004 -132805 -261369 -408929 -317438 -124174 -112273 -172282 -40401 147375 88616
33655 88616 -103521 -103369 38660 57841 18093 127419 219221 16980 -265473 -204152 104254
33644 104254 204881 48502 -21878 57661 28360 -135145 -211306 -212266 -321231 -430627 -300907
33633 -300907 -87605 -136256 -344061 -318712 -88878 -37621 -186968 -187193 409 50159 -81391
33622 -81391 -86198 66610 49729 -186129 -284594 -111030 40625 -2600 -49807 13368 20574
33611 20574 -101501 -185795 -163750 -158191 -174298 -90838 16155 -45177 -174064 -88139 160311
33600 160311 240422 113408 63389 149536 134038 -9134 -28665 98943 104040 -57938 -115146
33589 -115146 10903 89283 54428 105960 244862 209505 -13505 -106849 23046 90444 -36886
33578 -36886 -125406 -44604 15047 -48460 -64552 27640 40932 -69790 -103418 -33036 -93087
33567 -93087 -304927 -360473 -139632 90777 157227 223727 384484 446188 312704 185284
33557 185284 192183 198580 141472 159669 245178 179359 -34810 -104403 39537 108119 -4537
33546 -4537 -23924 162593 253745 73601 -101761 -35726 84680 45372 -25383 20795 53076
33535 53076 -20329 -15866 146314 204358 5285 -173657 -78652 94527 63121 -81168 -115259
33524 -115259 -87205 -132332 -160451 -61565 22631 -54096 -157435 -123082 -57423 -113684 -206068
33513 -206068 -211198 -211635 -283646 -296054 -173798 -96667 -177633 -219026 -58958 119529 107769
33502 107769 19294 25310 25958 -100736 -199522 -123249 -55123 -192675 -352952 -264103 -38483
33491 -38483 22904 -79780 -120978 -64662 -45104 -54858 11888 103499 97721 45811 64068 99012
33479 99012 50945 -9188 1543 -36002 -227326 -395579 -317875 -88546 37776 29393 24019
33468 24019 33940 -1920 401 136598 269128 205523 27276 -36250 29725 61604 28427
33457 28427 33080 70799 46026 -20298 -28772 8162 16278 26940 100911 168561 132326 40041
33445 40041 -10312 -27313 -33241 35340 163741 170052 -22426 -202167 -174463 -66665 -91359
33434 -91359 -185703 -152945 -8825 83143 90538 73606 2899 -135322 -189230 -48749 130815
33423 130815 154786 91768 104926 145942 90546 22503 90510 216135 229868 169059 161572
33412 161572 152095 35944 -72545 -10981 117044 104094 -5475 -26878 22978 11549 -3033
33401 -3033 114815 263656 242302 113070 94459 174610 167319 76528 64645 122470 107851
33390 107851 53755 102048 188258 132867 -5839 -15010 84916 87280 -6179 -16 108904 126125
33378 126125 36248 21722 93500 63624 -82256 -136543 -42131 21551 -18408 -20615 70200
33367 70200 118394 62573 6523 -11010 -69260 -149424 -137108 -69787 -102104 -198781 -156401 31935
33355 31935 132977 45729 -73256 -112375 -143810 -196342 -173512 -76634 -47113 -113451 -141807
33344 -141807 -92887 -78876 -119714 -100555 -17986 -8662 -85656 -103793 -29299 14910 4451 42177
33332 42177 102306 34931 -131385 -185943 -88200 -30291 -89319 -115617 -36830 24916 19586 61363
33320 61363 169934 202069 121730 60905 45796 -44528 -184913 -186645 -48750 3592 -76992
33309 -76992 -61441 135408 285445 243404 171203 200021 201512 86037 11073 81464 135110
33298 135110 45295 -37132 34557 135321 106086 22706 8830 4254 -64172 -92818 3900
33287 3900 104477 86735 35439 56712 75519 3828 -72214 -51204 9629 31871 44670 43479
33275 43479 -69747 -269836 -360539 -283949 -231424 -299990 -316329 -181406 -94207 -203493 -316755
33264 -316755 -219627 -35212 11216 -41394 -40189 -21788 -74168 -90891 34854 142780 38187
33253 38187 -153796 -167904 -8655 109734 122229 125577 124985 47848 -53553 -61258 3225 43066
33241 43066 74059 145730 175415 73726 -64367 -103340 -93228 -137775 -155156 -9122 217104
33230 217104 316068 251436 147250 67004 7395 15225 101327 136695 40172 -42588 38343
33219 38343 162761 129136 -1768 -14598 108301 210261 250995 299952 309081 175967 -5433
33208 -5433 -29276 105274 210509 223019 251608 318905 300028 146664 -28428 -117326 -111860
33197 -111860 -41217 42697 53278 -22708 -71010 -34630 -38165 -164796 -254612 -142885 39231
33186 39231 60219 -33439 -19336 112411 176742 140992 146893 214313 223984 188119 244291 367291
33174 367291 368412 210145 61572 13566 -10331 -35582 17372 133817 190552 174421 186820
33163 186820 211910 123826 -48371 -114607 -28396 42593 1583 -54577 -52579 -55517 -96179 -108160
33151 -108160 -79967 -80267 -93160 -33342 51742 19259 -106468 -149579 -88792 -87235 -174140 -179193
33139 -179193 -59997 -9252 -125349 -247530 -249165 -234920 -297152 -325389 -230413 -131153 -133920
33128 -133920 -132289 -21340 78671 23616 -90530 -84101 12792 41317 -5329 4102 96066
33117 96066 152891 100619 -7733 -89608 -110671 -80735 -45597 -54310 -85974 -62639 25012 84507
33105 84507 64362 40874 98059 203472 270327 269095 216267 122783 10838 -78398 -134135
33094 -134135 -175692 -192505 -166376 -154866 -240504 -380107 -425573 -324320 -182007 -99267 -70808
33083 -70808 -74428 -123861 -192838 -219849 -226893 -293737 -376720 -312895 -65296 191661 303225
33072 303225 300183 261576 175750 39369 -56346 -59832 -57622 -125909 -197694 -189519 -151240 -171497
33060 -171497 -228526 -251027 -245068 -248798 -232885 -154889 -58751 -26870 -73355 -148280 -197982 -176711
33048 -176711 -68495 57410 91617 29513 -12930 31220 91901 92785 67181 78256 111230
33037 111230 109985 54291 -37856 -115713 -94457 53093 198760 176141 7896 -120783 -127761
33026 -127761 -111085 -136331 -137246 -90864 -100184 -205454 -284738 -252002 -198220 -220836 -258887 -218619
33014 -218619 -133033 -80818 -66227 -79921 -151086 -242537 -233841 -110085 -19192 -36242 -37805 61692
33002 61692 127251 25176 -130968 -150910 -59450 -19628 -62931 -92439 -80696 -78334 -80494 -51784
32990 -51784 -34211 -78761 -124437 -92714 -43362 -83043 -169826 -164997 -47970 61253 72101
32979 72101 -850 -101604 -168540 -145629 -50696 16887 14403 23655 97299 141796 64830 -64787
32967 -64787 -130501 -139856 -151380 -139342 -82993 -82516 -210220 -336992 -295165 -143164 -77583 -139252
32955 -139252 -199605 -195149 -178098 -157163 -80217 25605 67127 41098 27374 37284 19673 1026
32943 1026 56635 146590 144158 39891 -33681 104 77335 124920 145728 147930 107692 34751
32931 34751 -13827 -4282 51903 128231 172332 117348 -12415 -77349 -8870 62804 -407 -114001
32919 -114001 -102077 11075 40926 -58762 -142082 -116035 -47936 -8142 18380 32491 -7720
32908 -7720 -80850 -107289 -84129 -80446 -89021 -33597 58657 52976 -82519 -206007 -192012 -70592
32896 -70592 63070 161294 209100 204288 183175 175278 132778 11369 -98629 -63195 80743
32885 80743 159978 122867 92416 133479 147519 65256 -19590 -2169 74519 103940 61621 -7881
32873 -7881 -62998 -64281 14817 124160 161014 97062 6646 -50994 -86298 -100191 -58481 24953
32861 24953 85133 118801 194861 316660 382750 334256 245994 218831 259276 306927 310576 245943
32849 245943 122204 -9175 -104686 -178704 -246242 -260723 -199538 -155515 -216324 -299863 -259207
32838 -259207 -115733 -23136 -26350 -36050 -25775 -57929 -114547 -106890 -63291 -94657 -161095 -111834
32826 -111834 13796 -4108 -186548 -270854 -123959 40936 26252 -39073 35044 157342
32816 157342 131008 -10281 -104717 -156413 -258015 -329638 -215657 15209 130453 75228
32806 75228 17549 53076 85200 25717 -76704 -151367 -193573 -199437 -144302 -59036 -16391 -20788
32794 -20788 -11301 20841 19140 -33941 -99028 -159205 -216035 -221370 -129690 -13609 -5496 -115147
32782 -115147 -221578 -256336 -269670 -288877 -246298 -115346 -8568 -45170 -183415 -276307 -266522
32771 -266522 -243619 -299553 -390077 -385905 -246257 -84573 -27029 -49588 -29334 61747 120040
32760 120040 87928 51262 95397 170902 196498 200600 237185 237332 100351 -101922 -178724 -89801
32748 -89801 -6290 -55417 -143605 -117897 3439 75004 42046 -4926 9522 32906 -21607
32737 -21607 -127805 -164286 -75952 46042 80230 25327 -26087 -40125 -80117 -174750 -235728
32726 -235728 -170235 -22711 69094 38900 -49502 -101091 -91111 -58066 -35611 -16125 25141
32715 25141 83204 116478 98262 55717 27984 6054 -35386 -59778 4289 144138 242847
32704 242847 212113 88917 -33761 -116005 -167411 -184319 -147933 -66637 16295 49887 6592
32693 6592 -84460 -138749 -98535 -14328 13287 -25887 -43255 4573 48808 19491 -54318 -99687
32681 -99687 -88869 -31864 55368 132906 149270 112462 87632 90609 57444 -39405 -126386 -136778
32669 -136778 -107711 -104655 -116589 -95715 -44747 2242 37012 57077 39538 -10242 -37837 -22623
32657 -22623 -25985 -99955 -202103 -258332 -257906 -231944 -192327 -147525 -127438 -141032 -157599 -165172
32645 -165172 -182525 -182250 -92671 72729 183726 159296 75789 38508 41220 38124 57430 134458
32633 134458 209711 207103 154099 119622 89874 11183 -94098 -158315 -175015 -184091 -192807 -193987
32621 -193987 -213978 -263078 -291573 -266816 -225407 -178322 -60471 129460 245054 177159 32665
32610 32665 -13402 37719 68489 73384 140614 243285 240328 93190 -77287 -165031 -172547 -123090
32598 -123090 -16977 102957 162878 158554 146330 130602 64656 -37089 -99654 -109417 -131207
32587 -131207 -190993 -235505 -220779 -162716 -102111 -89710 -177833 -340978 -441940 -378878 -230234
32576 -230234 -145158 -134076 -96971 -18824 15896 -15081 -52844 -96529 -201857 -328292 -349435
32565 -349435 -250105 -162360 -159795 -160012 -91323 -20501 -32713 -93155 -118656 -110510 -129930 -184090
32553 -184090 -203127 -118080 61361 233085 276700 172869 27522 -55800 -84255 -113236 -144417
32542 -144417 -156385 -162409 -149447 -44443 146184 254720 155032 -32735 -105210 -67995 -72084
32531 -72084 -122378 -83570 39282 69741 -54431 -180874 -185637 -128174 -103063 -108197 -119061
32520 -119061 -136539 -113431 10655 165920 208800 148660 133949 184354 150928 -2871 -110543
32509 -110543 -82594 -51339 -116728 -163627 -81664 26328 24939 -28796 -14352 39611 45737 38686
32497 38686 90322 144306 103717 3944 -52986 -62696 -77972 -78151 -15268 74198 126955 157046
32485 157046 192561 186355 103643 17172 -1407 -1004 -43402 -69457 -9982 55124 3044 -126662
32473 -126662 -182856 -118405 -21971 28336 21178 -38407 -118345 -137359 -62766 14006 2840 -44787
32461 -44787 -37317 -17393 -90941 -228221 -289533 -233123 -156270 -130881 -127010 -109032 -91933 -82203
32449 -82203 -57810 -26139 -24365 -48998 -51125 -10401 40072 65317 63511 55636 67898 105319
32437 105319 128854 101026 62447 91552 171752 195042 131595 80834 97077 93015 6946 -59622
32425 -59622 4723 131398 171719 111326 50870 33046 19055 -8986 -41333 -95254 -171066
32414 -171066 -201310 -144943 -78248 -91449 -155599 -194687 -218758 -269437 -304423 -265447 -200357
32403 -200357 -187500 -196721 -157930 -109063 -132121 -189824 -172593 -74241 15219 56428 68232 31329
32391 31329 -73958 -168773 -155429 -66421 -3069 30056 86720 126394 68403 -31724 -32794
32380 -32794 76127 171912 199432 215226 236517 214856 165706 158812 166132 83029 -76440 -165636
32368 -165636 -119962 -36693 -4223 6243 37306 65901 72976 80661 88074 73319 70447 130423
32356 130423 201817 175985 56062 -48054 -90629 -112547 -99036 12594 162503 185073 46874
32345 46874 -94679 -126395 -113604 -134025 -138028 -67189 22067 52013 36232 18541 -1450 -12977
32333 -12977 32353 120791 149641 72267 -22056 -40845 -11728 -7515 -34855 -65092 -96947 -122977
32321 -122977 -103582 -33988 23474 20584 -20111 -59312 -87353 -95718 -73938 -51614 -67652 -88956
32309 -88956 -46026 43385 81522 31876 -42207 -86375 -103855 -97097 -68654 -72035 -139859 -174743
32297 -174743 -57577 138608 206335 90043 -53026 -103560 -113926 -146272 -155333 -102200 -30258
32286 -30258 35027 114994 161236 76036 -100932 -203020 -187235 -183775 -237608 -220581 -89038
32275 -89038 4646 -17302 -7966 126351 223963 139223 12073 38585 142860 125856 9732
32264 9732 -23191 53152 98684 57750 -2564 -61484 -143071 -178474 -71042 113570 199964
32253 199964 138012 33924 -28847 -47998 -11563 92623 194120 211193 183443 196909 213898
32242 213898 129449 -32360 -136928 -137138 -103116 -73386 -31643 -18440 -102742 -234695 -277630
32231 -277630 -202008 -111279 -65658 -19747 47298 77353 42647 -5358 -26729 -36228 -41585 -32389
32219 -32389 -33610 -74637 -110585 -76308 -8821 -5671 -70104 -115388 -119123 -147488 -215332 -244043
32207 -244043 -183425 -73908 28997 98906 104838 33739 -51742 -77574 -74151 -122230 -198451
32196 -198451 -201796 -130202 -91890 -126590 -154349 -129409 -107258 -118009 -108115 -65569 -78100 -191927
32184 -191927 -314410 -337036 -279221 -239478 -261107 -300521 -282697 -158139 41316 186106 155177
32173 155177 -21152 -188027 -242854 -210985 -148145 -72374 -14449 -25330 -83986 -89341 833
32162 833 99280 109891 50702 4178 2851 14292 -4635 -75247 -177790 -241837 -202025 -82568
32150 -82568 17113 28376 -39781 -145684 -236699 -239069 -119889 32644 83420 18960 -50932
32139 -50932 -70084 -98882 -167208 -190325 -105215 10521 47959 23464 34105 106903 183635
32128 183635 227446 257918 282264 262634 174866 61237 -6350 -10668 -10323 -52908 -85675 -13578
32116 -13578 142560 231780 173010 83176 108125 197380 180864 30416 -106409 -130025 -97154
32105 -97154 -83784 -80731 -66998 -59529 -41300 39935 149491 164972 61853 -21167 18261 96336
32093 96336 88550 19611 -7544 13118 18256 20871 88167 190547 203297 82124 -59293 -86948
32081 -86948 -866 86536 87655 13407 -77965 -162002 -247819 -313663 -300264 -196751 -82179
32070 -82179 -28646 -5796 49904 112564 107491 49072 27145 58761 69889 39897 42240 101540
32058 101540 126792 51732 -52016 -73122 172 99971 171874 193218 164301 136380 185197
32047 185197 303128 380420 346353 263537 224159 218763 178379 93860 18409 -16922 -29168
32036 -29168 -45444 -78019 -112547 -101459 -12221 101669 138307 80109 22095 38652 96248
32025 96248 134431 149768 146213 85333 -39484 -142956 -141490 -65659 -12644 -20299 -43945 -27270
32013 -27270 49445 161131 243405 239934 166400 87139 24363 -43392 -92051 -62341 14067 11216
32001 11216 -114415 -249126 -288148 -268265 -252691 -194057 -28564 171807 263560 202337 53838
31990 53838 -110413 -230140 -230999 -103448 27741 27183 -78881 -155237 -155150 -150262 -174561 -164275
31978 -164275 -81947 1036 -1286 -73687 -127638 -113902 -68053 -49604 -60554 -46001 17040 64640
31966 64640 25609 -66023 -110387 -89289 -85980 -141649 -190048 -176007 -146413 -164073 -207417 -216851
31954 -216851 -178526 -114463 -52779 -39709 -100196 -160907 -121303 -36138 -86222 -297240 -439392
31943 -439392 -320251 -43464 157387 220176 237004 245457 214982 168354 145088 99860 -3720
31932 -3720 -64631 13449 115048 54175 -114077 -151730 -12699 77399 -23942 -162482 -143466
31921 -143466 -27129 -16049 -152967 -282634 -274450 -164190 -74125 -68553 -109123 -123172 -95327
31910 -95327 -78466 -112185 -163437 -173267 -128886 -58887 1299 4867 -87138 -231276 -309200 -271611
31898 -271611 -207740 -203413 -214271 -173319 -133472 -172846 -229190 -178651 -36229 70074 93038
31887 93038 86296 59198 -26898 -124521 -123930 -25970 52738 60508 53757 46910 -24722 -153229 -214195
31874 -214195 -135375 868 72708 44365 -49943 -152186 -193916 -158458 -130563 -182657 -235422
31863 -235422 -167466 -37436 -17274 -102551 -99097 51073 143917 18437 -193008 -254164 -128689
31852 -128689 37313 125788 111452 6698 -133358 -214433 -211759 -214517 -280803 -325100 -243058
31841 -243058 -80025 22786 2495 -85541 -156340 -155554 -78385 11427 27602 -29259 -67169
31830 -67169 -44367 -34893 -102216 -193483 -224035 -187716 -117301 -17068 90420 128930 65939
31819 65939 -15537 -21134 33472 74268 82479 84036 79720 56746 24694 -16222 -89133 -172069
31807 -172069 -182762 -92614 9888 33782 -112 -23374 -31455 -57985 -94220 -105282 -83230
31796 -83230 -33826 34018 65116 -17161 -188513 -309015 -293921 -215486 -170419 -144924 -97791
31785 -97791 -77394 -140352 -228484 -246785 -208386 -187197 -175274 -108679 -6312 33904 -27350
31774 -27350 -127254 -190266 -190267 -136462 -61619 -10681 8686 40583 107518 165382 172838 149666 116992
31761 116992 43986 -84153 -205712 -255455 -244384 -211646 -161794 -107505 -101774 -161621 -227861
31750 -227861 -256454 -267525 -252435 -146720 24648 99334 -11020 -168412 -191293 -91406 1081
31739 1081 47309 83768 86200 18311 -46373 -16143 54215 45131 -31878 -76007 -80367 -105126
31727 -105126 -119030 -54760 12145 -59783 -228885 -294463 -184877 -37856 29381 48222 59384
31716 59384 23544 -65736 -128738 -125045 -111837 -130260 -148182 -147510 -149820 -133305 -51964 45389
31704 45389 55436 -3749 -13672 24872 -26405 -190494 -292827 -220618 -91254 -50774 -60551
31693 -60551 -15277 60056 75852 39267 11766 -12388 -55707 -60822 22360 111371 84302 -41711
31681 -41711 -144927 -176609 -184257 -183169 -134415 -56700 -40223 -109025 -158624 -90901 38226 72621
31669 72621 -45698 -184748 -169211 -1738 126142 69900 -89605 -168283 -117916 -40274 -1316
31658 -1316 34644 82166 82801 15761 -54514 -87773 -119206 -156828 -143622 -83382 -85169 -195333
31646 -195333 -291422 -247526 -116107 -30354 -562 60524 156276 190558 129682 60206 61207
31635 61207 106547 125319 95383 41131 -21126 -96644 -179189 -230974 -217884 -169102 -167263 -241955
31623 -241955 -303473 -246084 -99516 2496 361 -36260 -37781 -12157 33217 128693 243835
31612 243835 264017 151444 40006 71969 206832 289289 254232 168044 106563 88256 107072
31601 107072 146665 167383 138057 71881 -2687 -71077 -100275 -40061 86784 158514 92996
31590 92996 -38490 -110117 -101255 -73554 -39838 39584 154035 234790 245900 207149 138773
31579 138773 54690 -6299 -14705 1814 11504 46207 132027 188001 107477 -65698 -159291 -91382
31567 -91382 38792 112699 141519 192186 249464 241131 161849 87838 70543 79156 66890 48751
31555 48751 72850 129199 139133 61231 -32992 -44752 10499 22977 -43892 -94547 -50468 25925
31543 25925 29055 -31768 -62889 -38056 -22694 -54144 -85925 -69572 -30589 -38889 -134590 -286852
31531 -286852 -403208 -396926 -277067 -146490 -74276 -12032 103021 208149 179588 28988
31521 28988 -75808 -23994 93344 115221 25770 -45487 -14822 52708 55155 -322 -25630
31510 -25630 5592 26975 3710 -883 56571 90213 -894 -147171 -165968 -12611 150023
31499 150023 169823 79164 -3319 -33567 -27561 16817 88681 128199 113099 115579 183160 229809
31487 229809 147587 -29337 -176831 -247674 -280367 -287713 -252462 -202662 -179866 -156953 -89880
31476 -89880 -15959 10955 42032 157237 297322 320055 214529 108761 62697 15326 -43385
31465 -43385 -25191 73651 109900 8188 -99766 -62405 73094 145305 99397 10288 -52020
31454 -52020 -69528 -31203 56522 136297 156596 139124 123299 80320 -36161 -178134 -229489
31443 -229489 -145632 -334 108798 143412 112332 40091 -30385 -47583 5932 95654 170638
31432 170638 202703 187224 127320 36671 -45959 -66443 -2227 97714 144309 98257 11245
31421 11245 -42722 -53659 -61021 -76843 -74506 -48581 -33541 -51928 -82861 -94583 -80582 -58517
31409 -58517 -56342 -93737 -151767 -176024 -142331 -97542 -94262 -114640 -116174 -120917 -175956 -239666
31397 -239666 -206256 -61039 76229 96334 20586 -53761 -64805 -13548 60096 99051 77875
31386 77875 47770 76691 137196 130770 39738 -37472 -38246 -26075 -71434 -133160 -136988 -98301
31374 -98301 -76988 -64644 -8311 90422 184818 260686 322355 328760 234817 87008 -9740 -26314
31362 -26314 -33464 -79256 -117222 -88249 -17591 12679 -38269 -129505 -183013 -153227 -61045 32764
31350 32764 88442 112329 117823 91601 30484 -10281 41221 174432 280510 260352 126459
31339 126459 -22364 -105645 -112359 -67158 2665 54373 36609 -45434 -104631 -72055 -3712
31328 -3712 -11657 -94521 -135600 -91911 -67132 -130602 -183203 -117995 -15186 -22543 -106563 -104487
31316 -104487 -813 43500 -40709 -127249 -120420 -100389 -143251 -161217 -59551 74088 91042
31305 91042 6134 -47051 -23041 14728 33082 50135 47100 -8070 -64137 -36913 50140 88915
31293 88915 45441 -13123 -44406 -69205 -83028 -49113 4640 -1014 -61234 -79794 -29271 2176
31281 2176 -27617 -33108 39130 82707 -24795 -228139 -360343 -349698 -250983 -119283 16407
31270 16407 77944 -13057 -184394 -244648 -123618 29311 60868 25805 79954 240664 384759
31259 384759 444569 465064 470026 414433 304859 237630 253889 265092 197752 114289 100656
31248 100656 121759 93317 23894 -28618 -77506 -158035 -212413 -165592 -78119 -69901 -112102 -60860
31236 -60860 98773 215759 208431 163852 148782 94915 -38944 -143526 -110583 9768 108138
31225 108138 165262 201366 183841 99647 28430 31377 49450 15351 -24965 -13929 -7182 -65362
31213 -65362 -110597 -40765 81999 111344 34923 -35811 -50514 -47243 -34831 -38 265 -88850
31201 -88850 -179243 -131941 20719 106363 61687 -13760 -52263 -85400 -96795 -2330 162187
31190 162187 216707 93013 -42787 -33828 39636 8482 -114280 -160357 -52678 107480 188244
31179 188244 164094 99385 60348 58025 52255 9455 -47253 -70811 -61450 -55854 -52254 -12145
31167 -12145 59226 105601 105411 93251 81000 34375 -49435 -118819 -152831 -194352 -260789 -291402
31155 -291402 -230030 -108805 -11111 10754 -35057 -87778 -68779 32856 113061 63670 -74551
31144 -74551 -158463 -139849 -107423 -118073 -109960 -28181 76567 136381 158035 167021 147808 98138
31132 98138 59459 41082 1272 -48308 -22302 92924 181211 161478 107831 116968 154826 136186
31120 136186 68421 9314 -37756 -77930 -55415 48567 121784 60060 -56844 -70832 14963
31109 14963 53742 -5230 -49281 7295 101087 131023 89381 33626 2325 2531 29089 62959
31097 62959 81559 84931 91111 112970 158230 223123 260461 202004 56594 -64480 -73963 -11064
31085 -11064 34175 33325 -8780 -113693 -264054 -351037 -304399 -217941 -220576 -277392 -265259 -203936
31073 -203936 -237069 -385025 -489972 -439617 -293595 -147953 -23040 60340 42063 -59114
31063 -59114 -113604 -55797 15865 -449 -55031 -52378 -16358 -30662 -83510 -96839 -70446 -78548
31051 -78548 -137909 -182420 -169906 -130773 -104106 -93072 -89994 -89631 -73824 -31854 3547 -13829
31039 -13829 -78125 -137547 -162869 -167216 -161833 -141153 -117560 -122577 -154256 -160596 -100211 5253
31027 5253 103357 176785 247433 320482 357819 325471 248853 188784 159720 105384 -19441 -164883
31015 -164883 -222540 -148517 -21510 33462 -32372 -147937 -193781 -123411 -19013 -7120 -106702
31004 -106702 -194728 -156015 -34478 20766 -54821 -168321 -190393 -91577 57423 169776 200535
30993 200535 158004 85526 17027 -52749 -132559 -184238 -156026 -63384 19554 57916 88731
30982 88731 140051 175388 146197 53959 -59891 -138418 -115169 30782 197283 218825 60402
30971 60402 -116600 -147211 -57859 6560 -12912 -57313 -74776 -58023 23533 197776 378707
30960 378707 407153 254371 82021 32417 50093 -481 -115267 -165740 -99984 -8275 17915
30949 17915 -14183 -67959 -147790 -244165 -289093 -246909 -198352 -243754 -346879 -369665 -265251
30938 -265251 -145185 -125733 -186696 -231209 -220917 -186660 -148436 -98747 -48875 -26705 -29713
30927 -29713 -29411 -19680 -16386 -17030 -10147 -16293 -59379 -97764 -55768 56193 125274 82891 7419
30914 7419 18424 108221 152316 76739 -55237 -137528 -145422 -132154 -138885 -155991 -166345 -179816
30902 -179816 -202324 -200689 -140205 -52663 -19541 -65752 -110877 -68908 30592 80474 49200 24991
30890 24991 77970 141098 94459 -56773 -165426 -121570 12724 97015 102760 133201 248697
30879 248697 359136 351060 260570 219587 249195 225636 82603 -68878 -99875 -49882 -43432
30868 -43432 -80733 -45747 90783 210220 218111 169718 171786 236708 289392 266747 169249 59305
30856 59305 34504 143725 298271 333560 205781 62996 61654 172539 244682 213509 150031
30845 150031 122988 113543 84919 53102 44546 37112 -5687 -67380 -91891 -57789 -378 46813
30833 46813 96651 169033 232908 233322 172806 111377 67721 -17948 -174662 -309608 -305143 -179540
30821 -179540 -66609 -46508 -85309 -139425 -212789 -283435 -280820 -195332 -123489 -133410 -156259 -89677
30809 -89677 46441 137604 116439 3303 -152934 -293360 -340716 -261724 -129227 -52168 -53262
30798 -53262 -75577 -85638 -94473 -93789 -56081 1821 31261 29086 28621 15788 -57721 -164246 -197393
30785 -197393 -119440 -31644 -41607 -119361 -145499 -63066 75654 190039 248985 276844 313454
30774 313454 361464 361862 248495 44479 -130752 -181046 -131085 -72283 -43764 -14459 39771
30763 39771 104514 174325 269018 372992 406559 310622 143448 39152 60485 136197 165081
30752 165081 138496 115092 104595 47763 -77947 -194473 -202280 -91643 55616 151485 164425
30741 164425 122949 84417 81575 83375 37016 -39028 -55147 23111 105646 93518 18396 -8622
30729 -8622 42848 98766 104571 83754 65711 40678 9558 1375 7745 -30217 -126672 -203749
30717 -203749 -192000 -131349 -116132 -171965 -239600 -256368 -203014 -90086 44987 131018 108927
30706 108927 5422 -69317 -21030 136615 293874 342640 264046 130958 34315 12239 45633
30695 45633 98195 138480 139070 93415 39313 33068 86909 156278 199497 221751 241956 242651 185289
30682 185289 72284 -28228 -33226 71379 195213 209496 70304 -131110 -258275 -254761
30672 -254761 -159564 -32164 81962 130078 76673 -30731 -86332 -50958 -1039 -18567 -83064
30661 -83064 -116981 -94294 -51885 -26118 -31610 -77004 -145671 -177811 -128716 -38324 8640 -11215
30649 -11215 -44274 -50665 -55287 -90893 -137273 -147759 -108992 -46438 12347 53832 65756 34557
30637 34557 -33939 -100895 -117618 -70837 3462 64054 111146 162719 192882 144029 21970
30626 21970 -68137 -28511 110734 223813 231040 165159 103114 81957 94125 124099 161184
30615 161184 192005 201673 184366 152183 133030 146126 171334 162066 104459 42257 21653 36208
30603 36208 54523 74415 110236 151410 179284 201484 218599 186864 83971 -13879 -12614 52390
30591 52390 58481 -5238 -9105 101342 195238 153067 54812 43032 91262 71510 -1376 19284
30579 19284 154548 240006 179770 96714 132189 226241 223485 110898 14430 4145 31173
30568 31173 44029 52287 65649 66101 62253 93150 152860 177657 136226 76010 50323 47918 25932
30555 25932 -28424 -100898 -179497 -244674 -252586 -165870 -4486 144504 173676 35913 -190703
30544 -190703 -334264 -275387 -70874 106323 153615 122014 111020 141498 162242 135146 73442
30533 73442 20103 13682 52287 78221 33192 -57669 -101872 -60910 -4770 -12404 -70094 -116891
30521 -116891 -144385 -184744 -224151 -200483 -95933 16731 43651 -27834 -106978 -89736 16313
30510 16313 79517 -675 -147935 -195161 -110711 -31028 -39943 -44751 48110 155290 141413 34226
30498 34226 -33178 -36838 -56869 -89711 -42164 79008 144605 110206 84535 128518 142740 50327
30486 50327 -47014 -22773 68412 80206 2375 -46430 -20829 117 -29232 -38270 39890 151020
30474 151020 181924 100978 -10838 -60400 -44612 -38710 -88342 -145776 -146931 -121879 -155176 -239393
30462 -239393 -265396 -193454 -133449 -182008 -266505 -254144 -155832 -99738 -127798 -142831 -68525
30451 -68525 44923 107197 98385 56226 13574 -16838 -38301 -72382 -129847 -174910 -162664 -109208
30439 -109208 -68330 -42367 10659 74846 69892 -21287 -103370 -97975 -46666 -22120 -10211 31935
30427 31935 57756 -15298 -151506 -209115 -125436 4442 68712 75977 98421 144165 156581
30416 156581 104668 9916 -92832 -161368 -136594 -1008 158016 219359 174757 131369 147003
30405 147003 146967 56729 -59212 -74899 24813 137198 183901 174380 138387 86243 45637 53822
30393 53822 91119 95559 64367 63633 110627 133121 91596 57156 101067 178620 202489 174764
30381 174764 159378 166306 154144 118290 84502 34460 -65494 -166740 -169340 -68175 19835
30370 19835 5218 -70350 -113283 -94290 -42833 18450 80026 117797 107290 55187 -9408 -65343
30358 -65343 -108696 -147330 -193589 -245884 -278263 -269894 -236756 -202728 -152119 -58436 46883 97206
30346 97206 91959 109029 187446 257830 234559 133667 49578 40336 77983 96820 60204 -6301
30334 -6301 -30201 35485 140298 173668 95630 -13849 -65392 -65260 -59720 -30162 71819 208867
30322 208867 270797 215859 124855 88945 103995 108959 76723 21203 -51560 -147347 -246940 -304968
30310 -304968 -293360 -228883 -153614 -95255 -46233 19168 104207 175316 202708 201493 201110 183913
30298 183913 106960 -3282 -41072 47583 170240 189245 94128 2374 -5334 26823 24850
30287 24850 -6579 -19441 -16894 -50497 -137204 -225742 -248972 -189909 -101677 -69544 -130829 -221978
30275 -221978 -237886 -159192 -77181 -66463 -87372 -62595 1244 37801 30094 17709 16996 11372
30263 11372 5378 11151 -680 -49849 -67814 19387 139991 143775 35780 -13223 56850 78764
30251 78764 -69700 -230734 -178475 31427 126894 1371 -168667 -209824 -171636 -185932 -251612
30240 -251612 -273405 -230283 -187129 -169732 -129437 -43214 20451 -25339 -169145 -293222 -294589
30229 -294589 -194715 -99938 -63680 -40676 9200 39746 -7525 -100051 -154696 -150994 -133544 -122589
30217 -122589 -96126 -52973 -24679 -25615 -50080 -110378 -213400 -307807 -326176 -279769 -242830 -243671
30205 -243671 -244401 -228838 -226265 -232760 -193168 -93354 -373 24700 -2340 -33226 -48982 -52845
30193 -52845 -51564 -62433 -90005 -89012 -12804 93820 125364 57090 -23128 -50408 -66558 -127501
30181 -127501 -206451 -244192 -232506 -194422 -136796 -71323 -30257 -16390 9488 50928 48297 -21643
30169 -21643 -82556 -56434 28703 92187 113726 126333 134998 111318 49317 -24144 -76473 -76449
30157 -76449 -11181 72649 92021 28760 -43815 -71441 -90757 -142514 -186775 -175388 -145014 -155310
30145 -155310 -185538 -178600 -145938 -139620 -151242 -126566 -60912 -2380 19845 568 -75437 -190431
30133 -190431 -248012 -167917 -14880 61256 14049 -57894 -62340 -20754 -6096 -44517 -101727
30122 -101727 -116844 -42888 97760 203536 195862 123758 102360 152036 170962 76538 -92312
30111 -92312 -230513 -270511 -217090 -125433 -57207 -26910 4238 55949 83982 53939 14904
30100 14904 25463 44944 -6986 -105876 -143048 -84063 -753 55685 100961 126134 83648 -1442
30088 -1442 -27684 23442 41373 -31798 -88177 -18261 109271 150538 100565 75352 118658 160971
30076 160971 167290 195101 266999 290208 173956 -30133 -176603 -195472 -156330 -161673 -221113
30065 -221113 -255170 -201551 -83689 28942 96883 122966 109331 45399 -50904 -114269 -88715
30054 -88715 -2388 40830 -31969 -166131 -218971 -118497 42529 113548 68325 13641 17428
30043 17428 20827 -38057 -104442 -91939 -22848 13044 -671 -8731 -4132 -40763 -124241 -184127
30031 -184127 -170879 -106827 -33700 18929 13317 -66779 -158745 -172330 -105448 -31649 23816 98187
30019 98187 177956 187623 120163 64301 57406 25173 -70458 -134641 -76865 45006 110809 94142
30007 94142 39261 -48420 -178384 -286053 -281380 -174721 -65485 -12192 11814 43522 85876
29996 85876 137381 199569 247774 245961 197317 142328 109090 99002 110605 138747 156477 132964
29984 132964 69006 -4459 -52710 -51293 -648 56598 64366 16514 -43161 -92538 -144924 -174190
29972 -174190 -108972 46004 161915 139572 51356 37383 105225 138673 84303 18915 21724
29961 21724 72728 103885 81460 14218 -62368 -92588 -45366 32545 61397 37503 36762 90448
29949 90448 125515 70751 -32648 -84255 -55725 -8442 7205 7116 14043 -1810 -76618 -170266
29937 -170266 -187854 -98701 11065 40273 -2296 -20430 38282 126826 172851 154865 94819
29926 94819 25549 -16338 -9350 20858 24897 -3720 -27197 -34180 -55334 -94714 -109437 -82354
29914 -82354 -52152 -43477 -33743 -20499 -45406 -106883 -127545 -66811 7871 25156 8794 1929
29902 1929 -22240 -80323 -91630 6382 115155 83335 -75944 -211425 -255896 -277818 -311415
29891 -311415 -288946 -181901 -75559 -40009 -33469 -87 30735 18751 5676 42849 80832
29880 80832 29367 -92931 -159426 -97384 20334 78552 67383 71344 123374 140625 48025
29869 48025 -86892 -126241 -51179 24839 45490 87780 187980 224175 96511 -74217 -89710
29858 -89710 36959 108501 43909 -28470 -5369 38882 8451 -48789 -35678 32386 64396
29847 64396 31466 -20342 -53842 -67521 -70323 -80234 -115372 -152226 -139643 -87919 -83631 -168112
29835 -168112 -259837 -257479 -171589 -88694 -43630 -1287 52063 71117 19169 -66561 -99662 -32543
29823 -32543 84160 148811 133163 126023 203051 289242 242971 69307 -63807 -51945 16738
29812 16738 19995 -15896 13015 110340 182872 183413 147651 107248 61043 31054 59841 131772
29800 131772 160681 85151 -57357 -166299 -166935 -65440 60505 128825 127670 112077 116183
29789 116183 102730 30810 -59786 -82086 -7938 101380 163730 139812 39210 -93142 -192236
29778 -192236 -211133 -160035 -93271 -54801 -49455 -63372 -90194 -127165 -156256 -144973 -76556 21360
29766 21360 92377 104047 73452 35965 13342 22822 76410 139894 136828 44645 -50083 -52359
29754 -52359 21730 95275 154201 220873 241908 138869 -28963 -98877 -37668 -253 -94478
29743 -94478 -221327 -237414 -158625 -93599 -71770 -58030 -62079 -105070 -130586 -75657 3553 -2789
29731 -2789 -89535 -149188 -140883 -131298 -162093 -184994 -153134 -89643 -35983 374 22168 22431 8524
29718 8524 1596 871 -12575 -34049 -34572 -369 56731 113027 128614 65859 -40651 -75100 28224
29705 28224 173741 204046 96368 -18016 -24738 58436 137765 142115 56338 -79687 -190180
29694 -190180 -227533 -220707 -222198 -225779 -189605 -117360 -49288 8136 68956 101950 66132 6729
29682 6729 20279 110013 165858 116173 19733 -29792 -24427 -25266 -71877 -142818 -179360 -138788
29670 -138788 -51472 -10558 -60230 -120099 -87181 13208 66192 37811 -454 -13706 -45637
29659 -45637 -97767 -98974 -45942 -43845 -126320 -154989 -15052 177086 201915 32992 -130453
29648 -130453 -128911 -23524 23975 -33837 -97049 -64393 43955 118184 89381 5802 -24998
29637 -24998 50653 193821 322481 366078 292816 133735 -26268 -126187 -185928 -240253 -249874
29626 -249874 -161593 -35204 2476 -58537 -89487 -18159 70010 79991 42477 26638 23824 10866
29614 10866 31871 104866 129503 17669 -142901 -191279 -120011 -61146 -71043 -77550 -41753 -19570
29602 -19570 -28344 5948 105129 163024 98334 -8112 -24588 45221 84685 39522 -22857 -25863
29590 -25863 21659 64162 82019 99000 120347 96853 -19967 -183926 -259671 -171045 -19061
29579 -19061 21506 -76356 -160294 -115712 -17877 3837 -28696 13876 157247 281896 300207
29568 300207 258407 222344 167516 57930 -42964 -39336 54006 129104 134892 122294 132725
29557 132725 128777 71745 204 -20438 15628 67416 114913 162633 192703 167653 86734 6360
29545 6360 -9333 51213 137564 186601 188340 194610 240917 276074 220404 91515 1069 5565
29533 5565 40932 48645 73950 154587 196227 88903 -93619 -155644 -43609 84959 83272
29522 83272 -18888 -115616 -169085 -181838 -132752 -38494 -867 -86450 -208874 -233127 -163123
29511 -163123 -123769 -175659 -252032 -282300 -276684 -260118 -210310 -114488 -28903 -20346 -74801 -114175
29499 -114175 -94108 -47663 -35378 -83502 -172978 -257650 -279886 -197291 -27061 143770 225575
29488 225575 209999 162440 132156 112307 100470 136402 227988 286097 210846 30918 -113406
29477 -113406 -128239 -47049 44517 94620 84327 11857 -91639 -179778 -244006 -303314 -338583
29466 -338583 -305772 -226253 -181464 -188490 -168175 -84311 -25775 -76914 -178815 -208657 -147687
29455 -147687 -79301 -50999 -27760 26703 95725 137255 117596 32358 -63596 -80451 -4559
29444 -4559 51032 -19439 -157816 -203787 -101557 40593 97503 49755 -50368 -147265 -184257
29433 -184257 -115868 26502 126364 91008 -50960 -188886 -243528 -219801 -174237 -158137 -175920
29422 -175920 -179191 -118642 -15655 45558 23935 -8816 46224 166782 209231 88386 -93157
29411 -93157 -157206 -64739 63007 134785 190839 268457 284597 166248 16170 -4087 78288
29400 78288 84497 -27460 -92044 -7325 98505 76127 -14874 -20585 69098 142810 154728 145060
29388 145060 122044 61956 1089 6447 71112 136962 188544 225367 191827 58862 -68242
29377 -68242 -65260 15957 17461 -75961 -120708 -53294 23517 29171 19429 52439 82536 60517
29365 60517 19277 -11677 -65300 -140608 -158644 -93760 -45792 -96778 -189766 -234431 -238200 -239192
29353 -239192 -204564 -110845 -47239 -107458 -225149 -243607 -127055 9266 67143 59393 37684
29342 37684 22566 19370 27586 17938 -41143 -124559 -168502 -150267 -102398 -50435 9269 65373
29330 65373 78823 33190 -36265 -77847 -66423 -9954 62651 116549 130594 104473 44643 -39612
29318 -39612 -120758 -162833 -161863 -146870 -128061 -87357 -42286 -60532 -160028 -244406 -211956 -103413
29306 -103413 -61173 -142726 -251344 -273348 -218952 -184993 -220824 -284208 -315250 -301914 -260689
29295 -260689 -195119 -111056 -51982 -64327 -117584 -113746 -12571 97122 103786 16632 -60804
29284 -60804 -74407 -58678 -44443 -17092 21256 31291 1572 -38113 -83763 -153631 -199293 -125404
29272 -125404 55570 193904 197532 158572 196523 266515 240030 111672 -2910 -39352 -29599
29261 -29599 5958 82975 163688 165826 94665 64644 140756 237165 229382 112869 -3590 -30458
29249 -30458 19000 61918 37338 -29462 -54041 2914 78412 90294 54600 57349 113336 130132
29237 130132 42034 -85343 -136486 -91413 -29584 -4829 18527 85418 155042 138272 23431
29226 23431 -88276 -101078 -39467 5177 17898 73953 198848 295014 260416 130480 40644
29215 40644 69114 164942 219322 171391 53972 -39915 -48343 -6947 6926 -2635 51148 191103
29203 191103 310030 309615 230486 166949 125572 72602 59049 158292 300884 319960 181262
29192 181262 34365 -6632 -6081 -61147 -127272 -96824 15490 81241 32605 -64489 -113328
29181 -113328 -88509 -20159 64317 149644 213866 232801 201263 139138 77143 36878 18695
29170 18695 6766 -9691 -19381 -128 46665 80521 58479 -10555 -69745 -81501 -62360 -34167
29158 -34167 15124 79470 92985 19560 -48080 13956 167900 241270 172106 94709 121146
29147 121146 173723 138913 67926 79648 144952 129272 12280 -87027 -90199 -25629 74622
29136 74622 199788 275993 207210 37788 -56930 7869 126277 168300 132567 74783 -4055
29125 -4055 -114628 -207674 -230950 -203911 -172514 -144164 -122460 -143306 -208542 -236159 -152381 -4746
29113 -4746 80325 39775 -67401 -129019 -81565 36393 116817 91306 7719 -37054 -24646
29102 -24646 -13513 -26592 -32918 -42750 -109282 -208390 -235512 -174435 -147928 -220013 -265089 -151416
29090 -151416 34776 90992 -21629 -140661 -135922 -54575 -10794 -31671 -60427 -56046 -42364
29079 -42364 -68213 -133157 -164999 -102209 4134 36132 -18799 -25300 107043 266138 272442
29068 272442 124299 -3742 7588 99298 149248 111620 12432 -112412 -224980 -278435 -249707
29057 -249707 -165870 -79254 -25634 -7022 1431 26683 68381 101931 115106 116135 97243 32045
29045 32045 -67038 -133800 -126439 -80191 -45652 -22599 -825 -12167 -74782 -128565 -104502 -33214
29033 -33214 -8596 -57561 -114943 -118049 -64200 14587 76345 84171 53371 61024 146503 231053
29021 231053 211161 106632 30444 28889 44016 25852 -16613 -78596 -171331 -253408 -247290 -152927
29009 -152927 -59098 -15897 15431 57326 59598 -2339 -62215 -57289 -14536 15930 40138 67737
28997 67737 53379 -25940 -89668 -39106 108588 249690 326106 349022 319367 221538 98176
28986 98176 42644 87929 160982 174242 120049 53725 22253 35142 77306 121725 138300 107715
28974 107715 30422 -72579 -162675 -201839 -185322 -145689 -108353 -61197 6266 55740 37652
28963 37652 -29464 -67313 -37332 14501 35656 44244 84038 132495 115864 18814 -76102 -83997
28951 -83997 -14618 59078 99074 121134 128768 89378 -2245 -84628 -98285 -71196 -84610 -152432
28939 -152432 -185442 -105532 37147 110882 64695 -6752 11586 105922 164250 137204 92769
28928 92769 94870 107622 75579 36406 72286 182045 282849 317726 281183 166349 -6196
28917 -6196 -121029 -63388 96107 149309 30449 -92193 -76784 -9633 -29812 -93171 -78062
28906 -78062 -23105 -61739 -171734 -190012 -66147 83400 178087 247158 283683 220110 100895
28895 100895 88427 212780 290049 193082 38710 -18666 -21284 -78639 -140442 -88338 37198
28884 37198 94402 64697 33524 -3871 -114440 -226869 -178458 11181 121626 48826 -52299
28873 -52299 -33367 21627 -31830 -150498 -189586 -135174 -83409 -56115 -6491 30257 -33591
28862 -33591 -159749 -200281 -123593 -73467 -145047 -236374 -209225 -91516 -16473 -33835 -86329
28851 -86329 -123896 -137146 -107129 -23665 55781 56290 -5710 -44590 -34176 -26822 -39288 -20532
28839 -20532 36076 47531 -32830 -123853 -125762 -63427 -40030 -85070 -130873 -125172 -91517 -73946
28827 -73946 -80189 -91317 -86919 -52158 9638 65729 75452 23884 -70284 -159421 -175389 -80403
28815 -80403 63315 125017 50701 -68198 -119928 -112580 -121448 -149807 -138037 -81856 -38807 -26943
28803 -26943 -16093 -15287 -61632 -114147 -74653 54070 141886 110496 34947 6350 -2931 -53521
28791 -53521 -110129 -106719 -78428 -111333 -192141 -221824 -173056 -128741 -146700 -175702 -141068 -45409
28779 -45409 58754 146804 223101 273253 267328 210182 150333 123072 107659 65241 6015 -20279
28767 -20279 -6417 -10788 -65882 -112334 -85917 -34585 -63232 -175209 -268140 -295740 -320417 -365599
28755 -365599 -337460 -179810 -6829 36852 -18511 -34186 5316 -25307 -176706 -337158 -400252
28744 -400252 -391753 -363908 -281380 -116190 29933 32119 -61801 -74854 48982 157985 102556
28733 102556 -65216 -174615 -149525 -52177 39364 94722 87705 -557 -111721 -138270 -66610
28722 -66610 -14396 -71465 -175106 -210347 -169227 -126120 -105944 -76265 -42574 -50224 -98760 -144221
28710 -144221 -181381 -232996 -260586 -187589 -26794 110496 155104 141096 108365 45592 -36240
28699 -36240 -77591 -69890 -88106 -164753 -219436 -181658 -103348 -73249 -87683 -83815 -44139 5099
28687 5099 49077 73823 52284 -2639 -31262 -25619 -58380 -152726 -215784 -182936 -129876 -137087
28675 -137087 -143511 -68227 15658 -4801 -64679 -10085 132216 183503 111460 78328 143861
28664 143861 146130 -9689 -142902 -50406 169226 247430 133389 42543 114353 211086 134212
28653 134212 -89624 -253335 -239396 -129436 -47289 3669 92965 214594 270939 203510 73414
28642 73414 -10813 -229 78829 165564 190577 111485 -29566 -118719 -87346 10569 75489
28631 75489 79252 59359 38414 13477 1293 31356 102663 187464 254610 255566 138238 -65075
28619 -65075 -212948 -198001 -82289 -11603 -28742 -61301 -66982 -84200 -137718 -190126 -204744
28608 -204744 -184793 -139916 -76464 -24530 -19044 -58156 -123272 -208439 -278321 -256879 -142291
28597 -142291 -68265 -133471 -224949 -157489 43603 163325 97320 -34660 -95125 -83655 -44579
28586 -44579 21164 88997 94202 48134 45223 97616 97743 11073 -34819 61165 224979 336687
28574 336687 384231 394243 335964 206381 100996 85759 97505 76184 83835 171553 240735
28563 240735 179253 41063 -55388 -117296 -208364 -272841 -208917 -67364 -530 -42193 -101128
28552 -101128 -144444 -214754 -279133 -241298 -118988 -42770 -49401 -31772 65659 148732 126027
28541 126027 33236 -50846 -100440 -104171 -42002 41503 44029 -52164 -136124 -124108 -68206 -48170
28529 -48170 -49575 -29867 -25433 -96279 -210250 -267077 -214221 -81296 70422 180589 203734
28518 203734 144217 57972 -14677 -87046 -166366 -202962 -149821 -39167 52934 94738 104867
28507 104867 96140 68300 42319 44969 57756 30403 -43443 -105275 -107387 -78156 -78811 -108776
28495 -108776 -95808 3719 127024 167744 107558 35585 23310 33719 -4047 -70462 -69046
28484 -69046 44551 199897 283297 235796 81668 -99800 -222106 -242033 -178160 -76036
28474 -76036 30444 114891 154314 163060 193849 256887 273027 171179 6504 -92839 -83401
28463 -83401 -34032 -5422 8144 10375 -24245 -74725 -60102 43342 140925 135210 48117 -29674
28451 -29674 -58398 -52724 -14149 55590 96571 34817 -108065 -221444 -242309 -226377 -253260
28440 -253260 -310946 -319967 -244506 -131576 -47152 -14041 -16950 -32795 -40127 -24635 3579 13344
28428 13344 -11158 -52096 -86625 -109016 -109124 -66860 -234 23097 -26422 -80887 -71076 -40437
28416 -40437 -64875 -89853 14163 221616 330901 237266 86713 58789 117689 109110 9742
28405 9742 -72790 -91795 -96228 -96238 -41455 61059 131735 136043 116796 107062 108513 146025 230766
28392 230766 275111 172359 -27497 -151430 -135683 -92032 -107075 -118822 -61479 -822 -24719
28381 -24719 -95069 -113658 -69099 -23403 -3394 6600 1636 -32980 -68893 -57002 10081 98845
28369 98845 176487 220860 219601 187788 153729 108453 15918 -106149 -175000 -146866 -78329 -47720
28357 -47720 -67699 -111237 -167277 -225556 -254520 -237962 -193507 -126822 -22760 86494 113857
28346 113857 31827 -61824 -53926 47919 141181 155743 107831 54769 35644 38609 11200 -69515
28334 -69515 -143151 -137797 -87420 -94845 -173039 -223451 -192568 -137924 -101610 -41442 51599 93104
28322 93104 47525 13434 63970 111290 50660 -57136 -84846 -42548 -35111 -71844 -71183 -25085
28310 -25085 -10875 -43720 -46497 22446 112571 158117 133740 48310 -42786 -54619 15575 43866
28298 43866 -55155 -179612 -180681 -93194 -73243 -145236 -184617 -142051 -103442 -106439 -75263 11895
28286 11895 53188 -8962 -89433 -104958 -92379 -104982 -108209 -66794 -34398 -63448 -108112 -104625
28274 -104625 -77110 -81212 -105708 -107893 -91089 -76458 -51175 -11359 -5176 -68536 -163596 -236093
28262 -236093 -282467 -307677 -278213 -184221 -95334 -81983 -118610 -127295 -82049 -13506 53488 111673
28250 111673 151165 171254 180929 162255 86752 -6782 -28466 27232 52170 -10075 -69595 -45114
28238 -45114 -8680 -55344 -119725 -75784 41776 87889 50852 63704 162786 217982 154799
28227 154799 78900 95409 146833 136903 97011 104235 124617 78143 2987 10905 101917 160100
28215 160100 135314 98156 90308 49219 -60404 -151538 -138427 -74963 -68657 -109723 -98180 -18278
28203 -18278 33377 8260 -17220 26131 83654 69129 11824 19076 117328 218634 247490 224203
28191 224203 201448 182441 141031 81319 32496 698 -38992 -102944 -168649 -186896 -125614
28180 -125614 -11947 73475 67167 -6054 -53907 -20079 51420 71540 14607 -46885 -18976
28169 -18976 108176 236601 249318 125420 -41698 -142317 -148495 -107831 -71563 -61086 -84999
28158 -84999 -141080 -195139 -195073 -125438 -31922 20761 9084 -32046 -46213 -14111 23170 15663
28146 15663 -19694 -9821 71309 153189 157864 98107 39125 2993 -23046 -17063 51072 134733
28134 134733 147019 95129 86009 165515 238867 204928 97593 25036 21397 36586 41845 61178
28122 61178 98439 107258 61231 7155 9498 59836 77880 8924 -104573 -170617 -155707 -113148
28110 -113148 -100714 -112146 -115629 -120068 -154803 -203692 -212055 -158647 -82172 -35483 -40393 -79343
28098 -79343 -106803 -84851 -30003 2229 -1935 -1162 3936 -56880 -185211 -240457 -122201 48412
$$ [...]
##END NTUPLES=NMR SPECTRUM
##END=
