##TITLE=31Pdec_LY-TMF-17.7.R.t
 D2O, 24 sc
 23.3.2020
##JCAMPDX= 6.0         $$ Bruker NMR JCAMP-DX V2.0
##DATA TYPE= NMR SPECTRUM
##DATA CLASS= NTUPLES
##ORIGIN= UXNMR, Bruker Analytische Messtechnik GmbH
##OWNER= root
$$ XWIN-NMR		Version 3.5
$$ Mon Mar 23 16:27:08 2020 Russian Standard Time (UT+4h)  she@DPX200
##.OBSERVE FREQUENCY= 81.013821
##.OBSERVE NUCLEUS= ^31P
##.ACQUISITION MODE= SIMULTANEOUS
##.ACQUISITION SCHEME= undefined
##.AVERAGES= 24
##.DIGITISER RES= 17
##SPECTROMETER/DATA SYSTEM= spect
##.PULSE SEQUENCE= zgpg30
##.SOLVENT NAME= CDCl3
##.SHIFT REFERENCE= (INTERNAL, CDCl3, 0, 182.463)
##AUDIT TRAIL= $$ (NUMBER, WHEN, WHO, WHERE, WHAT)
$$ ##TITLE= Audit trail, XWIN-NMR		Version 3.5
$$ ##JCAMPDX= 5.01
$$ ##ORIGIN= Bruker BioSpin GmbH
$$ ##OWNER= she
$$ F:/spectra/data/she/nmr/P31/1/pdata/1/auditp.txt
$$ ##AUDIT TRAIL=  $$ (NUMBER, WHEN, WHO, WHERE, WHAT)
(   1,<2020-03-23 16:23:05.79 +0400>,<she>,<DPX200>,
      <created by zg, POWCHK disabled, PULCHK disabled
       configuration hash MD5:
       00 E9 B6 7A A2 85 ED C7 34 08 36 98 17 FE 4E 26
       data hash MD5: 32K
       52 E6 BE 2B E3 1B F5 1D 82 D7 31 92 49 E7 F3 3D>)
(   2,<2020-03-23 16:26:01.09 +0400>,<she>,<DPX200>,
      <Start of raw data processing
       efp BC_mod = 2 LB = 1 FT_mod = 6 PKNL = 1 PHC0 = -1340.405 PHC1 = 107.2017 SI = 64K 
       data hash MD5: 64K
       3B B8 45 5F 63 02 33 60 6E FF 1C 88 67 09 C8 62>)
(   3,<2020-03-23 16:26:31.65 +0400>,<she>,<DPX200>,
      <pk PHC0 = -45.21092 PHC1 = 83.4 
       data hash MD5: 64K
       29 59 EF 46 92 E6 41 7C E4 40 E7 FC B0 85 DF D4>)
(   4,<2020-03-23 16:26:35.45 +0400>,<she>,<DPX200>,
      <abs ABSG = 5 
       data hash MD5: 64K
       78 12 F4 4C EA 6E A3 80 A4 85 58 9B C8 51 DB E2>)
$$ ##END=
$$ 
$$ hash MD5
$$ 5F 06 75 C3 35 FC 4A 5D A7 B6 AC BF CA 7F 89 05
##$RELAX= 
##$RELAX= 
##$RELAX= 
##$RELAX= 
##$RELAX= 
##$RELAX= 
##$RELAX= 
##$RELAX= 
$$ Bruker specific parameters
$$ --------------------------
##$DU= <F:/spectra>
##$EXPNO= 1
##$NAME= <P31>
##$PROCNO= 1
##$TYPE= <nmr>
##$USER= <she>
##$AMP= (0..31)
100 100 100 100 100 100 100 100 100 100 100 100 100 100 100 100 100 100 
100 100 100 100 100 100 100 100 100 100 100 100 100 100 
##$AQSEQ= 0
##$AQ_mod= 1
##$AUNM= <au_zg>
##$AUTOPOS= <>
##$BF1= 81.014009
##$BF2= 200.13
##$BF3= 200.13
##$BF4= 200.13
##$BF5= 200.13
##$BF6= 200.13
##$BF7= 200.13
##$BF8= 200.13
##$BYTORDA= 1
##$CFDGTYP= 0
##$CFRGTYP= 5
##$CHEMSTR= <none>
##$CNST= (0..31)
1 1 145 1 1 1 1 1 1 1 1 1 1 1 1 1 1 1 1 1 1 1 1 1 1 1 1 1 1 1 1 1 
##$CPDPRG= <waltz16>
##$CPDPRG1= <>
##$CPDPRG2= <waltz16>
##$CPDPRG3= <>
##$CPDPRG4= <mlev>
##$CPDPRG5= <mlev>
##$CPDPRG6= <mlev>
##$CPDPRG7= <mlev>
##$CPDPRG8= <mlev>
##$CPDPRGB= <>
##$CPDPRGT= <>
##$D= (0..31)
0 1 0 0 0 0 0 0 0 0 0 0.03 2e-05 3e-06 0 0 0 0 0 0 0 0 0 0 0 0 0 0 0 0 
0 0 
##$DATE= 1584966185
##$DBL= (0..7)
120 120 120 11 120 120 24 19 
##$DBP= (0..7)
150 150 150 150 150 150 150 150 
##$DBP07= 0
##$DBPNAM0= <>
##$DBPNAM1= <>
$$ [...]
##$SUBNAM3= <"">
##$SUBNAM4= <"">
##$SUBNAM5= <"">
##$SUBNAM6= <"">
##$SUBNAM7= <"">
##$SUBNAM8= <"">
##$SUBNAM9= <"">
##$SW= 369.568048894756
##$SWIBOX= (0..15)
0 1 3 0 0 0 0 0 0 0 0 0 0 0 0 0 
##$SW_h= 29940.119760479
##$TD= 32768
##$TD0= 1
##$TE= 0
##$TE2= 300
##$TE3= 300
##$TEG= 300
##$TL= (0..7)
0 120 53 12 22 120 120 120 
##$TP= (0..7)
150 150 150 150 150 150 150 150 
##$TP07= 0
##$TPNAME0= <>
##$TPNAME1= <>
##$TPNAME2= <>
##$TPNAME3= <>
##$TPNAME4= <>
##$TPNAME5= <>
##$TPNAME6= <>
##$TPNAME7= <>
##$TPOAL= (0..7)
0.5 0.5 0.5 0.5 0.5 0.5 0.5 0.5 
##$TPOFFS= (0..7)
0 0 0 0 0 0 0 0 
##$TUNHIN= 0
##$TUNHOUT= 0
##$TUNXOUT= 0
##$USERA1= <user>
##$USERA2= <user>
##$USERA3= <user>
##$USERA4= <user>
##$USERA5= <user>
##$V9= 5
##$VALIST= <valist>
##$VCLIST= <CCCCCCCCCCCCCCC>
##$VD= 0
##$VDLIST= <DDDDDDDDDDDDDDD>
##$VPLIST= <PPPPPPPPPPPPPPP>
##$VTLIST= <TTTTTTTTTTTTTTT>
##$WBST= 1024
##$WBSW= 4
##$XGAIN= (0..3)
0 0 0 0 
##$XL= 0
##$YL= 0
##$YMAX_a= 6537
##$YMIN_a= -5345
##$ZGOPTNS= <>
##$ZL1= 120
##$ZL2= 120
##$ZL3= 120
##$ZL4= 120
##$ABSF1= 182.463
##$ABSF2= -187.1042
##$ABSG= 5
##$ABSL= 3
##$ALPHA= 0
##$AQORDER= 0
##$ASSFAC= 0
##$ASSFACI= 0
##$ASSFACX= 0
##$ASSWID= 0
##$AUNMP= <proc_1d>
##$AZFE= 0.1
##$AZFW= 0.5
##$BCFW= 0
##$BC_mod= 2
##$BYTORDP= 0
##$COROFFS= 0
##$CY= -3
##$DATMOD= 1
##$DC= 0
##$DFILT= <>
##$DTYPP= 0
##$F1P= 0
##$F2P= 0
##$FCOR= 1
##$FTSIZE= 65536
##$FT_mod= 6
##$GAMMA= 0
##$GB= 0
##$INTBC= 1
##$INTSCL= 5.30512e-09
##$ISEN= 30
##$LB= 1
##$LEV0= 0
##$LPBIN= 0
##$MAXI= 10000
##$MC2= 0
##$MEAN= 0
##$ME_mod= 0
##$MI= 50
##$NCOEF= 0
##$NC_proc= -6
##$NLEV= 6
##$NOISF1= 182.463
##$NOISF2= 159.3651
##$NSP= 0
##$NTH_PI= 0
##$NZP= 0
##$OFFSET= 182.463
##$PC= 4
##$PHC0= -1385.616
##$PHC1= 190.6017
##$PH_mod= 1
##$PKNL= yes
##$PPARMOD= 0
##$PSCAL= 0
##$PSIGN= 0
##$REVERSE= no
##$SF= 81.0140089999434
##$SI= 65536
##$SIGF1= 159.3651
##$SIGF2= -187.1042
##$SINO= 113.3802
##$SIOLD= 16384
##$SREGLST= <1H.CDCl3>
##$SSB= 0
##$STSI= 65536
##$STSR= 0
##$SW_p= 29940.119760479
##$SYMM= 0
##$S_DEV= 0
##$TDeff= 32768
##$TDoff= 0
##$TI= <>
##$TILT= no
##$TM1= 0
##$TM2= 0
##$TOPLEV= 0
##$USERP1= <user>
##$USERP2= <user>
##$USERP3= <user>
##$USERP4= <user>
##$USERP5= <user>
##$WDW= 1
##$XDIM= 65536
##$YMAX_p= 383713327
##$YMIN_p= -10554859
$$ End of Bruker specific parameters
$$ ---------------------------------
##NTUPLES= NMR SPECTRUM
##VAR_NAME=  FREQUENCY,     SPECTRUM/REAL,   SPECTRUM/IMAG
##SYMBOL=    X,             R,               I
##VAR_TYPE=  INDEPENDENT,   DEPENDENT,       DEPENDENT
##VAR_FORM=  AFFN,          ASDF,            ASDF
##VAR_DIM=   65536,         65536,           65536
##UNITS=     HZ,            ARBITRARY UNITS, ARBITRARY UNITS
##FACTOR=    0.456856943014862, 1,           1
##FIRST=     14782.0589164792, 0,            0
##LAST=      -15158.0608439998, 0,           0
##MIN=       -15158.0608439998, -10554859,   0
##MAX=       14782.0589164792, 383713327,    0
$$ Real data points
##PAGE= N=1
##DATA TABLE= (X++(R..R)), XYDATA
$$ [...]
##PAGE= N=2
##DATA TABLE= (X++(I..I)), XYDATA
36626h75365Q96817J513733P27744p50043j397164r21618j21729N52605R36456
$$ -875365 21452 1535185 2262929 1512886 115722 -805896 -927625 -375020 561436
36617E61436M60347q75064j576001m84734J121679J186975K1957l82686K73835
$$ 561436 1021783 146719 -1429282 -1914016 -792337 394638 416595 33909 307744
36608C07744M13118l37065n37912J77538K27844j034781j902508r67838P38001
$$ 307744 720862 383797 -154115 23423 251267 -783514 -2686022 -3653860 -2915859
36599b915859J532952J368918J055088O12859k83510j285434j876764k013866
$$ -2915859 -1382907 -13989 1041099 1653958 1370448 85014 -1791750 -3805616
36591c805616j523765K5918K075655K880421J550685o24542j734871j330921l23419
$$ -3805616 -5329381 -5303463 -3227808 -347387 1203298 578756 -1156115 -2487036 -2810455
36582b810455L28884K44449k72273l58621L82673R77322L35373p51861n30473
$$ -2810455 -2481571 -2237122 -2509395 -2868016 -2485343 -1508021 -1172648 -1924509 -2454982
36573b454982Q13192J248950K12883n52016j83502j31848j110851j239839P56426
$$ -2454982 -1641790 -392840 -179957 -731973 -915475 -1047323 -2158174 -3398013 -2641587
36564b641587K720696J959069n93618j710739l99266J344076J693940P14242p04360
$$ -2641587 79109 2038178 1444560 -266179 -665445 678631 2372571 3086813 2382453
36555B382453j666456j282978M23062J830401J409236j98625j091862o23864K92682
$$ 2382453 715997 -566981 -143919 1686482 3095718 2897093 1805231 1181367 1474049
36546A474049P91099O06434l10397j349278j166460M91152J743679R32581r55244
$$ 1474049 2265148 2871582 2561185 1211907 45447 536599 2280278 3212859 2257615
36537B257615j963990k097848k367980k077287O4615K744175L163052J381265
$$ 2257615 293625 -1804223 -4172203 -6249490 -6184875 -3440700 -277648 1103617
36529A103617L71209J252210J671746J4211j834959j668322l39803J53330m4337
$$ 1103617 1474826 2727036 4398782 4412993 2578034 909712 569909 723239 678902
36520F78902L64648J011062N28965p31135j031815r5716M56546k56641j062756
$$ 678902 1043550 2054612 2583577 1852442 820627 724911 1181457 924816 -137940
36511a37940o71039L98016P04217o6167q82023r16233m55688j11239J76761P66163
$$ -137940 -808979 -410963 293254 227087 -654936 -1571169 -2026857 -2138096 -1961335 -1195172
36501a195172J330962J120366K49508j91392K85153P51096K75986o57861j033779
$$ -1195172 135790 1256156 1505664 1314272 1599425 2350521 2626507 1968646 934867
36492I34867q99373r95110j258376q88907K61790J388706J755243J244150J28130
$$ 934867 35494 -959616 -2217992 -3106899 -2845109 -1456403 298840 1542990 1671120
36483A671120r54733j160934l69424M62530N63086K89149Q6771m00860j120111
$$ 1671120 716387 -444547 -813971 -351441 211645 500794 587565 186705 -933406
36474i33406q68132O40863J390737j09093j916745j271140R31175J492686J21991
$$ -933406 -1801538 -1160675 230062 120969 -1795776 -3066916 -2135741 -643055 -521064
36465e21064m35612N12660M75875j347441k137324k24237J827660J311945n18209
$$ -521064 -956676 -444016 31859 -1315582 -3452906 -3677143 -1849483 -537538 -1055747
36456a055747j084471n01454q8822O70607K437681L303941J321274j655406k200317
$$ -1055747 -2140218 -2641672 -2730494 -2059887 377794 3681735 5003009 3347603 1147286
36447A147286m46898N11026k71805o90803K61774R60113L08352o06060q15168
$$ 1147286 700388 1211414 939609 248806 510580 1470693 1779045 1172985 357817
36438C57817p88930o79367K25821J438052J180681n19603j117503N86251K147341
$$ 357817 -431113 -1110480 -884659 553393 1734074 1214471 96968 683219 2830560
36429B830560J014743j468885j989540q8485J453040Q29710m91201l40143R38380
$$ 2830560 3845303 2376418 386878 298393 1751433 2581143 2089942 1749799 2688179
36420B688179J129995n84184k343927k031039j43435Q34372j88861j508015j188430
$$ 2688179 3818174 3233990 890063 -1140976 -1284411 -450039 -638900 -2146915 -3335345
36411c335345K77483J091465Q71943N89662M68650p1803o21910o0367J156758
$$ -3335345 -3057862 -1966397 -1094454 -504792 -36142 -107945 -729855 -790222 366536
36402C66536J136164l77593j168332Q5812J516989P67564j447542k415642j252529
$$ 366536 1502700 1125107 -43225 42587 1559576 2327140 879598 -1536044 -2788573
36393b788573K98541O57425K16781Q3540M21842P04419P48377P54225O74539J91176
$$ -2788573 -2490032 -1832607 -1615826 -1532286 -1110444 -406025 342352 1096577 1771116 1962292
36383A962292o28222j081589o00798L52756O86545J37045l16416K2521L88879
$$ 1962292 1334070 252481 -348317 4439 690984 828029 511613 534134 923013
36374I23013j38996q15366j89963J323066J595317j35294k016107k183086j096929
$$ 923013 784017 -31349 -221312 1101754 2697071 2561777 545670 -1637416 -2734345
36365b734345k17751K69216R70853J588897J396779Q14751Q00327R28798j54455
$$ -2734345 -2952096 -2682880 -1712027 -123130 1273649 2088400 2888727 3817525 3663070
36356C663070k186849k916706j072686J555630K165614M48904j143540o10546
$$ 3663070 1476221 -1440485 -2513171 -957541 1208073 1656977 513437 -97109
36348i7109J171615J790068M70213j051790r50340L35236R46485K44581n84109
$$ -97109 1074506 2864574 3334787 2282997 1332657 1667893 2614378 2858959 2274850
36339B274850n61075k70330n70564r56159k39176J541822K861335K400129M28865
$$ 2274850 1713775 1443445 872881 -83278 -322454 1219368 4080703 6480832 6909697
36330F909697j583936k405351j992235j157224m29218M24781J501009J945516
$$ 6909697 5325761 2920410 928175 -229049 -658267 -233486 1267523 3213039
36322C213039R17720q85897j815221j422115q01422n95940j70321O62971P62865
$$ 3213039 4130759 3244862 1429641 7526 -793896 -1389836 -1560157 -897186 -134321
36313a34321l75703j266895n62434O70702N83477m58154n28952P06160J595676
$$ -134321 -510024 -1776919 -2339353 -1668651 -1085174 -1543328 -2072280 -1366120 229556
36304B29556J193033L91160J43489K84796M45395N54519J39141j257021k620900
$$ 229556 1422589 1813749 1957238 2242034 2687429 3241948 3381089 2124068 -496832
36295d96832k189447j52385J163966N47081n25680n38924j84280m75585n05148
$$ -496832 -2686279 -2838664 -1674698 -1127617 -1653297 -2192221 -2376501 -2852086 -3357234
36286c357234Q17460K174409J467837o71176j523308l15763P87873J49879j052194
$$ -3357234 -2539774 -365365 1102472 431296 -1092012 -1407775 -619902 -470023 -1522217
36277a522217r28051M02162J384318J255758N56092K4815j15899r5835l36169
$$ -1522217 -2450268 -2048106 -663788 591970 1148062 1172877 1056978 961143 624974
36268F24974r61206j395246r85867j06449J88339k06717k00968O78350J360638
$$ 624974 -336232 -1731478 -2717345 -2823794 -2635455 -2842172 -3043140 -2364790 -1004152
36259a004152Q76743j14568m50948k27835k40781l96922r4146K77250k16315j192071
$$ -1004152 -127409 -241977 -692925 -920760 -1161541 -1558463 -1652609 -1375359 -1591674 -2783745
36249b783745j119511L51081J635206J373649K10977k98073L11213J244449J644950
$$ -2783745 -3903256 -3552175 -1916969 -543320 -332343 -630416 -319203 925246 2570196
36240B570196J289044N17326m8455p4758r913n00878j287845j499457j087705
$$ 2570196 3859240 4376566 4328111 4253353 4243440 3742562 2454717 955260 -132445
36231a32445q10980o03785M88450K162668K458334O99441r30340m83125P11201
$$ -132445 -943425 -1547210 -1058760 1103908 3562242 4261683 3331343 2848218 3559419
36222C559419L63623q37713n73071O90784K02367k059433k640846n5901K490498
$$ 3559419 3923042 3085329 2512258 3203042 3405409 1345976 -1294870 -1350771 1139727
36213A139727J833073o13712j589298q83458n11275p38398k39370P23295N52242
$$ 1139727 2972800 2359088 769790 -113668 -624943 -1363341 -1602711 -879416 -327174
36204c27174n42434o53714N01478J161219O93476M46784Q72991N42502r86248
$$ -327174 -869608 -1523322 -1021844 139375 832851 1279635 2152626 2695128 1708880
36195A708880j888327j023557J27770Q6428j45714Q66016K225831K172934J003759
$$ 1708880 -179447 -1203004 -1075234 -988806 -1134520 -268504 1957327 4130261 5134020
36186E134020K95326J67253l99090j133999p29809O25478J155002J67850j051128
$$ 5134020 5429346 5596599 5197509 4063510 3333701 3959179 5114181 5282031 4230903
36177D230903j394416j276198j316422j218495o48241K494L84134O74967P90954
$$ 4230903 2836487 1560289 243867 -974628 -1622869 -1620375 -1236241 -561274 229680
36168B29680K25273p46913q58414L65491J605943J419238R7856r95191j190667
$$ 229680 454953 -291960 -1150374 -784883 821060 2240298 2338154 1342963 152296
36159A52296o92872K77714J396332J744970N89145j430826k749430k466734q96972
$$ 152296 -540576 -262862 1133470 2878440 3467585 2036759 -712671 -3179405 -4076377
36150d076377J104197K555050K504969Q98840q24235j094773j94374K18848m08232
$$ -4076377 -2972180 -417130 2087839 2986679 2162444 1067671 873297 1092145 683913
36141F83913q68058l58853J91715j60845o59826j52365Q19373P89472k46397q11560
$$ 683913 -184145 -542998 -351283 -512128 -1171954 -1324319 -504946 284526 38129 -773431
36131g73431k17239O66011J047906J127867R70289m772j608467k299759j141893
$$ -773431 -990670 -324659 723247 1851114 2821403 2816631 1208164 -1091595 -2233488
36122b233488O56223J358577J033786R32730J218808R29374o6294p17693n46207
$$ -2233488 -1577265 -218688 815098 1747828 2966636 3896010 3829716 3112023 2565816
36113B565816k99752n22549p58341o13231m37749m59574l37123p3442k50520q15752
$$ 2565816 2266064 1743515 985174 371943 -65806 -525380 -862503 -935945 -1186465 -2002217
36103b002217q52717k21949q8914r11496j320274k70195J052681J107953N64518
$$ -2002217 -2854934 -3076883 -3165797 -4077293 -5397567 -5667762 -4615081 -3507128 -2942610
36094b942610R46267J664914R16408q36034j055598Q01820K089031Q93223j186772
$$ -2942610 -1996343 -331429 584979 -251055 -1306653 -504833 1584198 2477421 1290649
36085A290649j742171j069388r60383j372779o98453J152635K211951J301415
$$ 1290649 -451522 -1520910 -2481293 -3854072 -4552525 -3399890 -1187939 113476
36077A13476k71386n60313N28490J355613P00149p89298j334051r8665J684523
$$ 113476 -157910 -718223 -189733 1165880 1866029 1076731 -257320 -355985 1328538
36068A328538K037305N93570j052418j446470p89045j5749N01287O32763L6408
$$ 1328538 3365843 3959413 2906995 1460525 671480 655731 1157018 1789781 1826189
36059A826189r38270r73688L03273J198546L42325q52711k51473J298739J066180
$$ 1826189 887919 -85769 217504 1416050 1758375 905664 654191 1952930 3019110
36050C019110r41782j604294L33490K071865J184792o45651p72059l8222q29762
$$ 3019110 2077328 473034 806524 2878389 4063181 3417530 2645471 2607249 1777487
36041A777487k297893j465962J315596K124794m66905k839335j734510R38881
$$ 1777487 -520406 -1986368 -670772 1454022 987117 -1852218 -3586728 -2647847
36033b647847J485611K26111L53509K192950K561388J10032k335571k169695p70562
$$ -2647847 -1162236 -936125 -582616 1610334 4171722 4281754 1946183 -223512 -994074
36024i94074p13242j477423p62929J180501J677140o5065j654459j174394L10908
$$ -994074 -1707316 -3184739 -3947668 -2767167 -1090027 -1155092 -2809551 -3983945 -3673037
36015c673037J011260J018726J107740P51693o07014j569075m24921J802132K345819
$$ -3673037 -2661777 -1643051 -535311 216382 -390632 -1959707 -2384628 -582496 1763323
36006A763323O92648p22156k53069P45034M52470n88164p16878Q3911M10765k27710
$$ 1763323 2455971 1733815 1480746 2225780 2678250 2090086 1373208 1457119 1867884 1640174
35996A640174q74170p40131j33354K53055J02577m74014j003056q76009m6951
$$ 1640174 766004 25873 -107481 145574 248151 -225863 -1228919 -2104928 -2151879
35987b151879P45355R35844Q63470R60361Q56015J86677l28241J38550Q53975
$$ -2151879 -1406524 -470680 392790 1353151 2209166 2395843 2067602 2206152 3060127
35978C060127L00154j389864k280896j301776L02640Q40599L10256k15096l65650
$$ 3060127 3360281 1970417 -310479 -1612255 -1309615 -469016 -158760 -373856 -739506
35969g39506n00165n21657J10624J243347J872344J363635K30539n72769p36038
$$ -739506 -1239671 -1761328 -1650704 -407357 1464987 2828622 3059161 2486392 1750354
35960A750354o62019o51880m23332L60023J285515J409193M74595n56610o70655
$$ 1750354 1088335 436455 13123 373146 1658661 3067854 3542449 2985839 2315184
35951B315184j35317N734m55831o36446N7483J120023J704330J463982M76041
$$ 2315184 2179867 2185601 1729770 1093324 1150807 2270830 3975160 5439142 5915183
35942E915183q84812j783941j501979m72103J43011J72873N83726J460503J348794
$$ 5915183 5030371 3246430 1744451 1272348 1415359 1588232 2171958 3632461 4981255
35933D981255l50686j798830j171541M17703N00259r15237j467195l07613O98958
$$ 4981255 4630569 2831739 1660198 2077901 2578160 1662923 195728 -111885 587073
35924E87073K61868l00646L66612J155265M90727o95246l08011J378678J924145
$$ 587073 848941 548295 914907 2070172 2560899 1865653 1557642 2936320 4860465
35915D860465L79712j419889j644571o92329J12447M69546P29910P60381L17793
$$ 4860465 5240177 3820288 2175717 1483388 1595835 2065381 2795291 3555672 3873465
35906C873465k26034n13881q82748j516112j648926o69114O41920J157043J116821
$$ 3873465 3647431 3133550 2250802 734690 -914236 -1583350 -941430 215613 1332434
35897A332434J420883J685394P34360j059491j840863j080882m07771p86633p90318
$$ 1332434 2753317 4438711 5173071 4113580 2272717 1191835 784064 -2569 -792887
35888g92887Q15791K389542J502032j116005k130245j71385K292909K348779K32759
$$ -792887 22904 2412446 3914478 2798473 668228 496843 2789752 5138531 5371290
35879E371290j528909j467299m30461M2251m33668r52604n49411O22752J414147
$$ 5371290 3842381 2375082 1944621 1986872 1553204 600600 51189 673941 2088088
35870B088088J077786K37606L188M26692N87561O3308n74699p72322o07481k56292
$$ 2088088 3165874 3403480 3406668 3833360 4420921 4484229 3909530 3137208 2529727 2273435
35860B273435K76007O98406N73121R8261j34592k63339r30763j780141j572583
$$ 2273435 2549442 3247848 3820969 3919230 3784638 3521299 2590536 810395 -762188
35851g62188k78004M47954l09434j264155r73880K9125N00798O23604J222659
$$ -762188 -1040192 -592238 -901672 -2165827 -3139707 -3110582 -2609784 -1986180 -763521
35842g63521J823381J356513K04006k98996m7452p9399n55303o39513l23892n17657
$$ -763521 1059860 2416373 2620379 2321383 2273931 2194532 1639229 999716 675824 158167
35832A58167j163274j071921J473Q32322P70830O60292J057327J129103K41348
$$ 158167 -1005107 -2077028 -2075555 -1243233 -472403 187889 1245216 2374319 2615667
35823B615667o99232n43861M32918J077070Q00664j63994j172459j375318m43086
$$ 2615667 1916435 1372574 1805492 2882562 3683226 3519232 2346773 971455 528369
35814E28369N60222J76780j201159j516492m9847J396803J213551J66993l70715
$$ 528369 1088591 1265371 64212 -1452280 -1502127 -105324 1108227 1275220 904505
35805I04505o43923j280138j421455k27495R82545N20970n86818O586J906321
$$ 904505 260582 -1019556 -2441011 -2668506 -1685961 -1164991 -1751809 -1745223 161098
35796A61098K228372J60687j670324j330114l19840n74635j109398j9013J780984
$$ 161098 2389470 2550157 879833 -450281 -770121 -1344756 -2454154 -2473167 -692183
35787f92183J625893o20790k064178r30894J039799J374948L02632j22317O97093
$$ -692183 933710 312920 -1751258 -2682152 -1642353 -267405 35227 -87090 610003
35778F10003J301516P07000j35761j442O88621O09126m25418j241809r97967j75121
$$ 610003 1911519 2618519 2482758 2481316 3169937 3779063 3353645 2111836 1113869 938748
35768I38748K46687q1099p49440j073952n86664N04430J345674J370291R89265
$$ 938748 1185435 1104336 354896 -719056 -1305720 -801290 544384 1914675 2903940
35759B903940P31918J39730j352040k738857k290384k65130R97128L45283n96806
$$ 2903940 3635858 3775588 2423548 -315309 -2605693 -2870823 -1873695 -1528412 -2125218
35750b125218j40024R29666R96187K48509j50356k66466p28888q63083K76306
$$ -2125218 -2265242 -1335576 -339389 -90880 -241236 -507702 -1236590 -2099673 -1823367
35741a823367J696074J612405L91003k2295O23620O73401l26395q89348l54290
$$ -1823367 -127293 1485112 1876115 1853820 2477440 3150841 2824446 1935098 1580808
35732A580808J36904N5573L70214J158416Q80272p74400j783176j001267q3945
$$ 1580808 1717712 1773285 2143499 3301915 4182187 3407787 1624611 623344 539399
35723E39399m79980q95513R9368J194103O78617k99087J77963J051765N7190j858748
$$ 539399 59419 -836094 -736726 457377 1135994 836907 1014870 2066635 2123825 265077
35713B65077j692743L90871R80636r06621j972692L8541K565315K100621o44238
$$ 265077 -1427666 -1036795 -56159 -962780 -2935472 -2896931 -331616 1769005 1124767
35704A124767k113820r28747J021427J738414J150851K18404k88267q7240M11605
$$ 1124767 -989053 -1917800 -896373 842041 1992892 2211296 1923029 1835789 2247394
35695B247394L52217l26613m62600N73282J469289O59242j197104k017891j271261
$$ 2247394 2599611 2272998 1810398 2383680 3852969 4512211 3315107 1297216 25955
35686B5955m25637m29844n57326j94864k4112n18280p44808J05868J130227J043949
$$ 25955 -399682 -829526 -1386852 -1581716 -1605828 -2124108 -2868916 -2763048 -1632821 -588872
35676e88872K61956J05171N00984K29553o98028q05097L14595J022558J04697
$$ -588872 -326916 -221745 279239 508792 -189236 -994333 -679738 342820 447517
35667D47517j275169j326913j93932O53003P25765O69760O70826L46591m4645
$$ 447517 -827652 -2154565 -2348497 -1695494 -969729 -299969 370857 717448 672803
35658F72803R7167L06470m15364j620632j712079m78726M75440L33271K18774
$$ 672803 769970 1076440 661076 -959556 -2671635 -3150361 -2674921 -2341650 -2122876
35649b122876R59484J578401J157194M62059L58239K37814m59334p87990j28862
$$ -2122876 -1163392 415009 1572203 2034262 2392501 2630315 2170981 1382991 1254129
35640A254129J41862j050846k015027o90281J671799K110638M41393r25241j122163
$$ 1254129 1395991 345145 -1669882 -2360163 -688364 1422274 1863667 938426 -183737
35631a83737j416846j779034n70640J739800K295952N43089m07062J101836K310244
$$ -183737 -1600583 -3379617 -3950257 -2210457 85495 628584 221522 1323358 3633602
35622C633602P12333j547394j227695O38784P51390q28451j152718L31486J045531
$$ 3633602 4345935 2798541 1570846 2209630 2961020 2132569 979851 1311337 2356868
35613B356868r5350j015185j96613J040937J085821L18382l22749r01559j419315
$$ 2356868 2261518 1246333 1049720 2090657 3176478 3494860 3172111 2270552 851237
35604H51237j076051J65936Q89787K99317m27884l4209Q53969Q71409l2867q37995
$$ 851237 -224814 -58878 830909 1130226 702342 668133 1522102 2393511 2360644 1522649
35594A522649q95105j87007R89186J775267J185792l37280r18419J46941R59815
$$ 1522649 627544 440537 1429723 3204990 4390782 4053502 3135083 3282024 4241839
35585D241839l94747k816160l493286j700814N27442J412613J346364J433197
$$ 4241839 3847092 1030932 -2462354 -4163168 -3635726 -2223113 -876749 556448
35577E56448J657366J330722M18290m46165q24365p68694n41984m35677o03515
$$ 556448 2213814 3544536 3962826 3516661 2692296 1923602 1381618 945941 342426
35568C42426p61238l28954P66596J652156J341144L437j059363r25060j43064
$$ 342426 -418812 -747766 18830 1670986 3012130 3015567 1956204 1031144 888080
35559H88080J23537k52328l27787K94269Q04766O06469L77947P78691R71618j27631
$$ 888080 1011617 759289 431502 725771 1530537 2137006 2514953 3293644 4265262 4137631
35549D137631j638092j545197K02851J291453L05478j341560j712848r85972m01232
$$ 4137631 2499539 954342 1157193 2448646 2754124 1412564 -300284 -1286256 -1687488
35540a687488Q7017J264361K513857K212983K30660j626907j952320j222535n85233
$$ -1687488 -1600471 -336110 2177747 4390730 4621390 2994483 1042163 -180372 -765605
35531g65605k94659O6945N94673R21227P37204J15401n21876p52120o64445p75849
$$ -765605 -1060264 -993319 -398646 522581 1259785 1375186 853310 101190 -563255 -1339104
35521a339104j111716q53436M29430J670050J450478O1518p40810j50280O71487
$$ -1339104 -2450820 -3304256 -2874826 -1204776 245702 307220 -433590 -583870 87617
35512H7617M08371o03777j084740o02140J58165N27087M77935K03448k81105r08317
$$ 87617 495988 -107789 -1192529 -1794669 -1636504 -1109417 -631482 -428034 -709139 -1617456
35502a617456j285638r84821j10221O63155Q29707O73332P66250R55647N32061
$$ -1617456 -2903094 -3887915 -3998136 -3334981 -2505274 -1831942 -1065692 -110045 422016
35493D22016m12882o47660N55470K114496K348267J081826l60561r96481j062702
$$ 422016 9134 -638526 -83056 2031440 4379707 5461533 5100972 4104491 3041789
35484C041789j121846j201836r93410l20661O41853J260392Q51961l11297r29391
$$ 3041789 1919943 718107 -275303 -595964 45889 1306281 2158242 1846945 917554
35475I17554l15359N27518M21305j43769l5513L47417k23006j263477r26453Q81632
$$ 917554 602195 1129713 1551018 1407249 1371736 1719153 1496147 232670 -693783 187849
35465A87849J949742J075888j40586J6639P52357L97581p27048r12288K45157
$$ 187849 2137591 3213479 3072893 3089532 3841889 4239470 3512422 2600134 2845291
35456B845291J407131J430501M68543o77498j360435j399364j198189j256337
$$ 2845291 4252422 5682923 6151466 5473968 4113533 2714169 1515980 259643
35448B59643j276518m89078Q24307J259694L67819m47900l0855P72134O27811
$$ 259643 -1016875 -1505953 -681646 578048 945867 497967 467112 1239246 1867057
35439A867057j69578n05900l95026n84536r52572q18454l01235J0336K04828O00707
$$ 1867057 1697479 1191579 796553 212017 -740555 -1559009 -1860244 -1849908 -1645080 -1044373
35429a044373Q07766N01576L44017P83634Q85061j04713j086806q22918j94784
$$ -1044373 -236607 264969 608986 1392620 2277681 2172968 1086162 263244 68460
35420F8460n90792j160331l17396R63482N25116q17530j21352K504210L361474
$$ 68460 -522332 -1682663 -2000059 -1036577 -511461 -1328991 -1450343 1053867 4415341
35411D415341Q21590k053004k165518m70312N94911Q50885J117005O83624j143765
$$ 4415341 5236931 3183927 1018409 548097 1143008 1993893 3110898 3794522 2650757
35402B650757k739198k150412j76797R51476Q24747M83377p466j066915j610664
$$ 2650757 -88441 -2238853 -2415650 -1464174 -639427 -156050 -163516 -1230431 -2841095
35393b841095k68503J868914K312756Q63823j66604M46335J242693N16066j440514
$$ -2841095 -3109598 -1240684 1072072 1935895 1769291 2215626 3458319 3974385 2533871
35384B533871l015694k883086p68325K128593L544986K323328K7283r43858m95015
$$ 2533871 -481823 -3364909 -4133234 -2004641 1540345 3863673 3890956 2947098 2452083
35375B452083m55896j395226j841524q48527N76836J105491O11750l25887j041042
$$ 2452083 1996187 600961 -1240563 -2089090 -1512254 -406763 204987 -120900 -1161942
35366a161942o39170J268664L361056L558758J518911j087335k814840l439540
$$ -1161942 -1801112 -532448 2828608 6387366 7906277 6818942 4004102 564562
35358E64562k812883p66318J482887J915881M28854q71818p47682k31773k02432
$$ 564562 -2248321 -3014639 -1531752 384129 812983 -58835 -806517 -1038290 -1240722
35349a240722J87563J393708J961763Q57695m87638l72306M54289K87052n89170
$$ -1240722 -1053159 340549 2302312 3160007 2672369 2300063 2754352 3041404 2452234
35340B452234o23614K34426O48091K03543l60461p86694j298766j364623l46263
$$ 2452234 1828620 2063046 2711137 2914680 2554219 1767525 468759 -895864 -1242127
35331a242127Q72232P72068m08552r98860n67794l56365q32012p43836P30601
$$ -1242127 -369895 402173 -6379 -1005239 -1573033 -1929398 -2761410 -3505246 -2774645
35322b774645K453390K763360J410484m75600j480007p84258R97249J789664J54390
$$ -2774645 -321255 2442105 3852589 3376989 1896982 1112724 2109973 3899637 4054027
35313D054027k438578k930428o27926J776723J793530R0081j165553j343860j220264
$$ 4054027 1615449 -1314979 -1942905 -166182 1627348 1717429 551876 -791984 -2012248
35304b012248r66684j22193R20231J127329N26397K67902P62180R89735J60510
$$ -2012248 -2978932 -3101125 -2180894 -1053565 -527168 -259266 502914 1492649 1653159
35295A653159r28086r62699N524O16146P9930p53242o21418K97181N41234n15324
$$ 1653159 725073 -237626 -232102 384044 463974 -289268 -910686 -613505 -72271 -587595
35285e87595j536101r02124J000199K166437J542226J64534m82512k68304n5781
$$ -587595 -2123696 -3025820 -2025621 140816 1683042 1847576 1365064 1096760 1040979
35276A040979l19058q05382j099252r13907j54301Q12826J257835Q91027K68013
$$ 1040979 721921 -83461 -1182713 -2096620 -2250921 -1438095 -180260 710767 978780
35267I78780L4286J47339K36279K72697L59459K63494k15855o93315o25999j07229
$$ 978780 1013066 1160405 1396684 1669381 2028840 2292334 2076479 1383164 757165 649936
35257F49936L07498L73522K40752L845k58444k31616J96346M44450p4842r00582
$$ 649936 957434 1330956 1571708 1575553 1317109 1085493 1281839 1726289 1651447 750865
35247G50865r89333k52376K81943O1275j71421L43915J112043J178017O39622
$$ 750865 -238468 -490844 -208901 -147626 -319047 24868 1136911 2314928 2954550
35238B954550L98155O07480M11366n53932j325008r14770J51231M91132j42279
$$ 2954550 3352705 3960185 4371551 3817619 2492611 1577841 1729072 2220204 2077925
35229B077925n40020M4418O70309J97380p51777n88712O87197J220821N2859j230301
$$ 2077925 1537905 1582323 2252632 2450012 1698235 1109523 1796720 3017541 3070400 1840099
35219A840099o80044J121123J815748N80174q67981q34013J24558K91720p61761
$$ 1840099 1160055 2281178 4096926 4677100 3809119 2975106 3099664 3391384 2629623
35210B629623j797107j645200m98904N65073Q10850L95644n1894j78887j58306
$$ 2629623 832516 -812684 -1311588 -746515 64335 459979 408085 229198 70892
35201G0892k26569k12385K15310R67089J533465J472700N85226j110488k949702
$$ 70892 -155677 -368062 -152752 814337 2347802 3820502 4405728 3295240 345538
35192C45538l451648j681238J044475K047554N50222j099397n25582J370329J806002
$$ 345538 -3106110 -4787348 -3742873 -1695319 -1145097 -2244494 -2770076 -1399747 406255
35183D06255K55451q41596K20517J958519K005292M33157p29316n23502J1558
$$ 406255 661706 -179890 40627 1999146 4004438 4437595 3708279 3184777 3196335
35174C196335j91147p54682p48979r7337M73002M09513j52941o36198n89079j53870
$$ 3196335 3005188 2250506 1501527 1404190 1877192 2286705 2133764 1497566 908487 754617
35164G54617Q5960q0184j05569M37354R42937N47084l19870k24942J135976K137486
$$ 754617 840577 760393 654824 1092178 2035115 2582199 2262329 2037387 3173363 5310849
35154E310849J239828r39518k386974k050234o39744N69965Q78645K44927r11205
$$ 5310849 6550677 5611159 3224185 1173951 534207 1104172 1982817 2227744 1316539
35145A316539j827825j868136j037441K04272J471813K421872K501921J397288
$$ 1316539 -511286 -2379422 -3416863 -3212591 -1740778 681094 3183015 4580303
35137D580303l37675j666112k041253j543433l57630J116981J873971J095419
$$ 4580303 4242628 2576516 535263 -1008170 -1365800 -248819 1625152 2720571
35129B720571n16108j234958n16280K45620k83380j488050j731866n98351P16211
$$ 2720571 2204463 969505 453225 698845 415465 -1072585 -2804451 -3402802 -2686591
35120b686591J048325N05221k6630m9782J65955K11950K30864O46133J189738
$$ -2686591 -1638266 -1133045 -1159675 -1209457 -1043502 -831552 -600688 45445 1235183
35111A235183Q37330p29244k160243j902146k95046R51131J177132J229452J455611
$$ 1235183 2072513 1343269 -816974 -2719120 -3014166 -2063035 -885903 343549 1799160
35102A799160R99810l33112j221972p97414K6809K48282L08809P07702O45456
$$ 1799160 2798970 2465858 1243886 446472 473281 721563 1030372 1738074 2383530
35093B383530l96884j209505p81228k20549o81407q94628O03159K146516J162579
$$ 2383530 1986646 777141 -4087 -224636 -906043 -1800671 -1197512 949004 2111583
35084B111583j120005j031443J511407K463238N5426k292612j337108J257526
$$ 2111583 991578 -39865 1471542 3934780 3990206 1697594 360486 1618012
35076A618012K082960R93178M0385l53330j055393j599620r19371K64116M32078
$$ 1618012 3700972 4694150 4734535 4381205 3325812 1726192 806821 1070937 1503015
35067A503015j40398j57367J89042j18149n84260o2996P28603J85360j175103
$$ 1503015 1362617 1205250 1394292 1276143 691883 628887 1357490 1542850 367747
35058C67747j350424k21447M03866n032j84240J75329l0002o93977k40812J361220
$$ 367747 -982677 -1204124 -800258 -805290 -989530 -814201 -844203 -1538180 -1778992 -417772
35048d17772K029141Q96322l30061l59609j76934o82805q85984R731Q14775L22522
$$ -417772 1611369 2507691 2177630 1818021 1641087 958282 72298 82029 896804 1219326
35038A219326o71837q76430m50562l8009N52030J290901J157935j10771j023916
$$ 1219326 547489 -328941 -779503 -817512 -265482 1025419 2183354 2072583 1048667
35029A048667n21557L50371L16336k22925n57613j086740j758639j096238J251269
$$ 1048667 527110 877481 1193817 970892 413279 -673461 -2432100 -3528338 -2277069
35020b277069K933016K109124L55742r1707k6492j224601k505482j442080J129688
$$ -2277069 655947 2765071 3120813 3029106 3002614 1778013 -727469 -2169549 -1039861
35011a039861K091967R90378K93300Q96716J092514K51794j18001L77637J71335
$$ -1039861 1052106 2042484 2335784 3232500 4325014 4576808 4458807 4836444 5007779
35002E007779j016213j398969n81095m29520j274331p56607J759015L077864R44387
$$ 5007779 3991566 2592597 2011502 1581982 307651 -448956 1310059 4387923 5332310
34993E332310k066097k331821m62720L33256o75336j553801j365834q54998j39443
$$ 5332310 3266213 934392 471672 804928 129592 -1424209 -2790043 -3645041 -3784484
34984c784484J320279K695731K378607O46149n20594l72998o9068k91235k85382
$$ -3784484 -2464205 231526 2610133 3256282 2735688 2362690 2293622 2002387 1717005
34975A717005K98759N20345j71574q92531p80473l25013l90898p58874n09076
$$ 1717005 2015764 2536109 2364535 1472004 691531 366518 -24380 -783254 -1292330
34966a292330N41819J468907J292340J03178j016482j232406q33199m56337J45592
$$ -1292330 -750511 718396 2010736 2113914 1097432 -134974 -968173 -1424510 -1278918
34957a278918J503932K729688K023814n53394k475230j985124m13148J68947J00990
$$ -1278918 225014 2954702 4978516 4425122 1949892 -35232 -448380 -279433 -178443
34948a78443R16371K100367J643867m36686j680476p70890N76543K41460j388848
$$ -178443 737928 2838295 4482162 4045476 2365000 1594110 2170653 2412113 1023265
34939A023265k290619j565927j78641O24435P05716P89078J233989J392581N13446
$$ 1023265 -1267354 -2833281 -3011922 -2387487 -1681771 -892693 341296 1733877 2247323
34930B247323q14085r74329M49201J685650R62103j024096j985534r47883R23059
$$ 2247323 1433238 458909 908110 2593760 3555863 2531767 546233 -401650 521409
34921E21409K089877K018253R46863m93305j359527j079017j42403N50176P91486
$$ 521409 2611286 4629539 5576402 5083097 3723570 2644553 2502150 3052326 3843812
34912C843812Q15863M80820l17397r45922q79199o89877r59988q92366L76923
$$ 3843812 4659675 5140495 4823098 3877176 2997977 2308100 1348112 455746 832669
34903H32669J660969R52315j328403k408100q76369J493395K240865J029147o50503
$$ 832669 2493638 3445953 2117550 -290550 -1166919 326476 2567341 3596488 2945985
34894B945985j303105m33473J165438J795224N88025j066453j070766M74829J467267
$$ 2945985 1642880 1209407 2374845 4170069 4758094 3691641 2620875 3095704 4562971
34885D562971Q94699r9837m82333o67647j032293j010374m57590j59828j98451
$$ 4562971 5457670 5357833 4875500 4207853 3175560 2165186 1707596 1547768 1349317
34876A349317M12586J630078J829066M00971r94170j026629o60067j022071j193202
$$ 1349317 1761903 3391981 5221047 5622018 4627848 3601219 2941152 1919081 725879
34867G25879n2103J237219Q24687p71147j428355o32766J58873R3021n6912M44727
$$ 725879 673776 1910995 2735682 1964535 536180 -96586 62287 155308 98396 543123
34857E43123J107676J022823k6688j360658j809693o72904J218153J969103P47352
$$ 543123 1650799 2673622 2646934 1286276 -523417 -1196321 21832 1990935 2738287
34848B738287j192329k101748j535838j10301J392544K033188J106230o47849
$$ 2738287 1545958 -555790 -2091628 -2201929 -809385 1223803 2330033 1682184
34840A682184j461843q96406k74311j00270P86009K288201J952580r79755k943723
$$ 1682184 220341 -676065 -950376 -1050646 -264637 2023564 3976144 2996389 52666
34831E2666p13447L140265L335317m93642l393219k370831L8158N68491j17623
$$ 52666 -660781 2479484 5814801 5321159 1927940 -442891 -404733 163758 46135
34822D6135L17994J660609J769707R9102j630414j826283o11586Q16526J471262
$$ 46135 364129 2024738 3794445 3893547 2263133 436850 -174736 641790 2113052
34813B113052J211607N31437j49925p27266q35884R8886J538633J645403k45308
$$ 2113052 3324659 3856096 3706171 2978905 2143021 2241907 3780540 5425943 5180635
34804E180635j959560j137877J182313J864241J92240j376433j087509J2627M53398
$$ 5180635 3221075 2083198 3265511 5129752 5321992 3945559 2858050 2870677 3324075
34795C324075M42239N83032M97067j03203n57979n15084o17821j073274j001303
$$ 3324075 3766314 4349346 4846413 4743210 4185231 3670147 3052326 1979052 977749
34786I77749q7976N80179K69157k07067K3762N32866O15283L93576R5109m60712
$$ 977749 889773 1469952 1739109 1532042 1555804 2088670 2703953 3097529 3192638 2731926
34776B731926r64508o79793l8887m15178j551707j325887P82472K292171J471289
$$ 2731926 1767418 1087625 1048738 633560 -918147 -2244034 -1461562 830609 2301898
34767B301898K15319Q79265K204233J309056j524252l178030k309144o99670J5530
$$ 2301898 2517217 3396482 5600715 6909771 5385519 2207489 -101655 -801325 -785795
34758g85795K77060P86827J082961P33037J98171k28768q91472j570955j226111
$$ -785795 -508735 278092 1361053 2094090 2292261 2063493 1172021 -398934 -1625045
34749a625045L40806J738536J659326L95112q88120j493959j251415j55596J256046
$$ -1625045 -1284239 454297 2113623 2508735 1620615 126656 -1124759 -1280355 -24309
34740b4309J829944R74738l70300o63232L94667J484957J278204M9675o61427
$$ -24309 1805635 2780373 2410073 1746841 2141508 3626465 4904669 4954344 4292917
34731D292917L7901J271795J519174N02238o81476j126035r69021o53609l13296
$$ 4292917 4330818 5602613 7121787 7624025 6942549 5816514 4847493 4193884 3880588
34722C880588j44814m14869p36668l70529L51006J41904j083521j629321n90467
$$ 3880588 3735774 3320905 2584237 2213708 2564714 2706618 1623097 -6224 -596691
34713e96691N19038J89058m82654L37335J819338J507908o00865j717711m06401
$$ -596691 -77653 111405 -371249 -33914 1785424 3293332 2692467 974756 568355
34704E68355J389870J443506K53613m65479o32953j275101k098442j589387N18448
$$ 568355 1958225 3401731 3655344 3189865 2556912 1281811 -816631 -2406018 -1887570
34695a887570K455502K556298J192462o413k17439Q182j5643j44001N767J22437
$$ -1887570 567932 3124230 4316692 4310279 4092840 4101022 4085379 3941378 3947145 4069582
34685D069582l71052j146454j142133j21696Q17957P90043L40238L60243N16588
$$ 4069582 3698530 2552076 1409943 1288247 2106204 2896247 3236485 3596728 4113316
34676D113316j17150j252938j515947m81772N75305M41472l93143n30053M08437
$$ 4113316 3996166 2743228 1227281 745509 1320814 1762286 1369143 839090 1247527
34667A247527J406986J488277Q06813P3637n36081j255460j752639j259478K8217
$$ 1247527 2654513 4142790 4949603 5023240 4487159 3231699 1479060 219582 247799
34658B47799O96660M8574o26759Q8164J405367J490648M06451j60237P1906l30406
$$ 247799 944459 993033 366274 454438 1859805 3350453 3756904 3596667 3668573 3338167
34648C338167j432615j256303P18195K024462R31023p00362n08893N28252Q6576
$$ 3338167 1905552 649249 1367444 3391906 4322929 3622567 3113674 3641926 3728502
34639C728502j344933j426520o7122O54652K00089P8747P23307Q63512K52342
$$ 3728502 2383569 957049 889927 1544579 1744668 1823415 2546722 3410234 3662576
34630C662576J17401M29892l78056k166418k422673j54677K073665J656125n43304
$$ 3662576 3779977 4209869 3831813 1665395 -757278 -911955 1161710 2817835 2274531
34621B274531j921216j686274q72481j22561O68446J253261J166484O07709J40818
$$ 2274531 353315 -1332959 -2205440 -2328001 -1659555 -406294 760190 1367899 1508717
34612A508717j28477l81837n76601n95972l88424K08633J022973J040799l96711
$$ 1508717 1380240 998403 421802 -174170 -562594 -353961 669012 1709811 1313100
34603A313100j963578j627338K62097J203861L87678n6914J224957K294617J045283
$$ 1313100 -650478 -2277816 -2015719 -811858 -424180 -481094 743863 3038480 4083763
34594D083763j161289j481022M9920P85251l95937j677424j196595N75923J852242
$$ 4083763 2922474 1441452 1491372 2276623 1880686 203262 -993333 -417410 1434832
34585A434832J646219M07638o85219q01971k20139R5148j32916j24151O11512
$$ 1434832 3081051 3488689 2803470 2001499 1781360 1876508 1743592 1619441 2230953
34576B230953J430041J636630J449983J146047L13290j049937j762259j030833
$$ 2230953 3660994 5297624 6747607 7893654 8206944 7157007 5394748 4363915
34568D363915R4118J62751n60137q13356m45305k59181k98242P2228O44740N41452
$$ 4363915 4458033 4620784 4060647 3247291 2801986 2542805 2244563 2316791 2961531 3502983
34558C502983j06559j23607Q46790J658731J217398j22252j049700p53958K14246
$$ 3502983 3396424 3272817 4119607 5778338 6995736 6873484 5823784 5069826 5284072
34549E284072M31326o94285j757392q95255J324886K112261L04705j762671j633099
$$ 5284072 5715398 5021113 3263721 2368466 3693352 5805613 6110318 4347647 2714548
34540B714548k31704J4983r03015j083675k10579K35214q0838P1454Q70993R98551
$$ 2714548 2482844 2497827 1594812 511137 300558 535772 454934 526388 1397381 2395932
34530B395932J76673k81442m096k56205j349240j706165n69599N48624M13944
$$ 2395932 2572605 2291163 2287067 2030862 681622 -1024543 -1594142 -1045518 -631574
34521f31574L4526N60888J082404L62920p25239n55695M97399P34144m8653m26911
$$ -631574 -597048 -36160 1046244 1409164 683925 128230 625629 1359773 1311120 884209
34511H84209J37017N03083j74416j189303j520705j220352q86908m53709P00558
$$ 884209 1021226 1524309 1349893 160590 -1360115 -2580467 -3467375 -3921084 -3220526
34502c220526K531181L799311L178215Q81631j249178j645574o61856J86769K11775
$$ -3220526 -689345 3109966 6288181 7169812 5920634 4275060 3613204 3799973 4011748
34493D011748j15194n16810j283468k088463j765345M9441K037952K715553K059368
$$ 4011748 3896554 3379744 2096276 7813 -1757532 -1708091 329861 3045414 5104782
34484E104782R49258k17823j470819k374457k165758p20785J113976K119950J603974
$$ 5104782 6054040 5836217 4365398 1990941 -174817 -895602 218374 2338324 3942298
34475C942298J12181q07093k67828N86296p4542k010913k963743j913380n94971
$$ 3942298 4054479 3247386 2979558 3565854 3491312 1480399 -1483344 -3396724 -3991695
34466c991695p02192j200537j30127K063999L073029K105242P03194J83324J20581
$$ -3991695 -4693887 -5894424 -6024551 -3960552 -887523 1217719 1920913 2104237 2224818
34457B224818k10363m89458k04470K89069L72798R4486j67068m01422p41010r35108
$$ 2224818 2014455 1524997 1320527 1609596 1982394 2076880 1909812 1508390 767380 -167728
34447a67728n81166K80986J111725J337798Q27079L7399l92792l78266m60620
$$ -167728 -748894 -467908 643817 1981615 2808694 2846093 2453301 2075035 1614415
34438A614415q78024j023520m02315L49695K93462k84838k82854L72096N73040
$$ 1614415 736391 -287129 -689444 -339749 -46287 -331125 -613979 -241883 331157
34429C31157k6903k72161O25673J642372J358350r909j069097j139740n94628
$$ 331157 304254 32093 657766 2300138 3658488 3648579 2579482 1439742 845114
34420H45114J95203R95839J071768j55349j691068j622600L16905K087629J985955
$$ 845114 1040317 2036156 3107924 2952575 1261507 -361093 -44188 2043441 4029396
34411D029396Q02523K88646M63853k7645j358712k059383j309273j56411J72242
$$ 4029396 4831919 5120565 5584418 5556773 4198061 2138678 829405 672994 845236
34402H45236p1542m4265J82973J14727P3537O38166J233075P00384p02011j275983
$$ 845236 773694 729429 912402 1027129 1100666 1738832 2971907 3672291 2970280 1694297
34392A694297k92227Q13648M55590q50095j344025n74037J97196Q9886j56392
$$ 1694297 1402070 2215718 2671308 1821213 477188 -96849 100347 190233 33841
34383C3841M23682J334015J282164J58700o88604l36963M03682J42713j108358
$$ 33841 457523 1791538 3073702 3232402 2543798 2206835 2610517 2753230 1644872
34374A644872j847367r38375J013035K303669J847562J65306j144860r83606L8315
$$ 1644872 -202495 -1140870 -127835 2175834 4023396 4188702 3043842 2060236 2098551
34365B098551K76663p30964j334902M9346K318911K706303N16268j774846j802035
$$ 2098551 2375214 1644250 309348 358694 2677605 5383908 5900176 4125330 2323295
34356B323295j73215J022607J186807J141469J074715M18110o00062j014172p21648
$$ 2323295 2150080 3172687 4359494 5500963 6575678 6993788 6393726 5379554 4657906
34347D657906n63511p71912p14480k52632L9266J61560P59849J601001J428287
$$ 4657906 4094395 3322483 2608003 2355371 2394637 2556197 3316046 4917047 6345334
34338F345334r0066j523774j491932l43692N59299M19523n24102j273824o66840
$$ 6345334 6255268 4731494 3239562 2895870 3455169 3874692 3350590 2076766 1409926
34329A409926J276888K583693J328077j441190k544628r13566J002337R45645
$$ 1409926 2686814 5270507 6598584 5157394 2612766 1699200 2701537 3647182
34321C647182j72446m58562j44796m21154p63308R8431J526074J770349Q58603
$$ 3647182 3474736 3016174 2871378 2450224 1686916 1785347 3311421 5081770 5940373
34312E940373L24514M28895N8921p51440p28957M541k40324j639842k079025m96347
$$ 5940373 6264887 6693782 6752703 6001263 5272306 5276847 5036523 3396681 1317656 821309
34302H21309J260928J319099N02604M73443Q78550M18378m86200l69516N81131
$$ 821309 2082237 3401336 3903940 4377383 5255933 5674311 5188111 4818595 5399726
34293E399726P04949m02513j321103j148577o40363n62404m78186Q8055N41961
$$ 5399726 6104675 5702162 4381059 3232482 2592119 2029715 1551529 1639584 2181545
34284B181545J95794n19027p29363m21810k21450k65127j04378M32291R48952
$$ 2181545 2377339 1858312 1128949 707139 485689 220562 116184 548475 1497427
34275A497427J039112O75917Q7092l92912m30788j9708L66396K76726j25459k93505
$$ 1497427 2536539 3212456 3299548 2906636 2475848 2456140 2822536 3099262 2973803 2680298
34265B680298k9426L63265N78149N68724L54259k5620l51498m10035l44960m23944
$$ 2680298 2650872 3014137 3592286 4161010 4515269 4489649 4138151 3728116 3383156 2959212
34255B959212n00361k16248K87847N09859M58247N62512N63333l99606k031715
$$ 2959212 2458851 2242603 2530450 3040309 3498556 4061068 4624401 4224795 2193080
34246B193080k426675n15972J951567K430773J048345K12691Q30829J063229l85669
$$ 2193080 -233595 -749567 1202000 3632773 4681118 4893809 5724638 6787867 6402198
34237F402198j778166q44862J524447K269805M83188j421844j312544j86898k01355
$$ 6402198 4624032 3779170 5303617 7573422 8056610 6634766 5322222 5135324 4933969
34228D933969j224372j226968K97444J319997L09077j339773j293437K27735P65853
$$ 4933969 3709597 2482629 2780073 4100070 4409147 3069374 1775937 2003672 2769525
34219B769525o62314k049268j342969O18831J465016O26992k96225j44512M76263
$$ 2769525 2107211 57943 -1285026 -666195 798821 1425813 1129588 985076 1461339
34210A461339O74346O53374R78496J434724J357217N67051n30526j354708j355939
$$ 1461339 2135685 2789059 3767555 5202279 6559496 7126547 6596021 5241313 3885374
34201C885374l86449P72391Q82982k18913j123681n59390Q09269J154018l9038
$$ 3885374 3498925 4271316 5154298 4935385 3811704 3252314 4061583 5215601 5176563
34192E176563j184818o77112R16625J515265K39439j394200j416096J04843J325443
$$ 5176563 3991745 3314633 4231258 5746523 5985962 4591762 3175666 3280509 4605952
34183D605952J073952m385q06133j141853j283303j147939o65688j92617J46220
$$ 4605952 5679904 5675519 4869386 3727533 2444230 1296291 630603 437986 584206
34174E84206P82376J691494J942385J088343M5359m01013q68249j896467k392895
$$ 584206 1366582 3058076 5000461 6088804 6134163 5733150 4864901 2968434 575539
34165E75539j283315K88735M67731l50236l06827P02635J081512N38824L69212
$$ 575539 -707776 -419041 48690 -301546 -608373 94262 1175774 1714598 2083810
34156B083810O63090P4814j158764r04673J192229K539897J495581j57847l20002
$$ 2083810 2746900 2821714 1662950 758277 1950506 4490403 5985984 5828137 5508135
34147E508135K37330j61812r58942n10152J020715K044572J821339O67123j024240
$$ 5508135 5745465 5583653 4624711 4114559 5135274 7179846 9001185 9668308 8644068
34138H644068k451657k345664p70337L31035j05956n26503N19051J699197J165200
$$ 8644068 6192411 3846747 3076410 3407445 3301489 2774986 3294037 4993234 6158434
34129F158434j62510k25541N68438L10012p59117p09611L61917L12029j152646
$$ 6158434 5995924 5770383 6338821 6648833 5889716 5180105 5542022 5854051 4701405
34120D701405j650112l2506J535639P28112j661267k985016j995266L34774K310591
$$ 4701405 3051293 3018787 4554426 5282538 3621271 636255 -1359011 -1024237 1286354
34111A286354K848207J896746L20302p94217r66218m23387K91134M94263k67965
$$ 1286354 4134561 6031307 6351609 5557392 4591174 4167787 4458921 4953184 4685219
34102D685219j416000j524748r8449J443623J428252K6676j166011j096754K1441
$$ 4685219 3269219 1744471 1646022 3089645 4517897 4544573 3378562 2281808 2303249
34093B303249J356608K030172J624126P43602L79425L65061l61278j589931j654196
$$ 2303249 3659857 5690029 7314155 8057757 8437182 8802243 8440965 6851034 5196838
34084E196838j84766Q96754L22663n57714k21556O14431P20217M96458N30644
$$ 5196838 5012072 5908826 6231489 5673775 5452219 6066650 6786867 7283325 7813969
34075G813969O8993j039609j075261N98352J674913N96983m92745L70176R28380
$$ 7813969 7882962 6843353 5768092 6366444 8041357 8638340 8145595 8515771 9444151
34066I444151j403688m070197k735782J495172L476459J812112j9680o4110o1232
$$ 9444151 8040463 3970266 1234484 2729656 6206115 8018227 7998547 7934437 7873205
34057G873205q05596n45749Q81289J048921n26602j174315J16266P95075o29378
$$ 7873205 7067609 6521860 7403149 8452070 7925468 6751153 6867419 7662494 7033116
34048G033116j947173j169884L42272O57785J96659R2201K88619P16021J824506
$$ 7033116 5085943 3916059 4258331 4916116 5112775 5204976 5493595 6209616 8034122
34039H034122K864909K236541L27387p27663n44626o44762r64555K4005J423829
$$ 8034122 10899031 13135572 13462959 12735296 12190670 11545908 10581353 10605358 12029187
34030A2029187N27841j941999j986184R64624K462418J59498k390009j726120
$$ 12029187 12557028 10615029 8628845 9593469 12055887 12215385 9825376 8099256
34022H099256K52337K29728j193691j477024l20754J113801K414546K936773J472720
$$ 8099256 8351593 8581321 7387630 5910606 5589852 6703653 9118199 12054972 13527692
34013A3527692j049619j659079O6743J039445j1189m31748J054863J580355n43229
$$ 13527692 12478073 10818994 10885737 11925182 11913993 11482245 12537108 14117463 13574234
34004A3574234k280918r82032J155852J190850P5995k03769k36775n76466M40788
$$ 13574234 11293316 10311284 11467136 12657986 12733981 12530212 12293437 11716971 12157759
33995A2157759K824824L062835k02540k839813j442785J339583J706398O54220
$$ 12157759 14982583 18045418 17842878 15003065 13560280 14899863 16606261 17260481
33987A7260481P45329J132204K79456l27501M77627N20742j286348j898121L82839
$$ 17260481 18005810 19138014 19417470 19089969 19567596 20088338 18801990 16903869 17286708
33978A7286708K234760J353611P19354K260195K368484r22156k752100L91879
$$ 17286708 19521468 20875079 21594433 23854628 26223112 25300956 22548856 22940735
33970B2940735L811536K662033K69495J086694K237732J69421j340617J296253
$$ 22940735 26752271 29414304 29683799 30770493 33008225 33177646 31837029 33133282
33962C3133282L200700n4404k794768P60694M721510J851989k285589P85420O200546
$$ 33133282 36333982 36279578 33484810 34245504 38967014 40819003 38533414 39318834 45519380
33953D5519380M706556M61982K935205Q015190N915797J317842M910200J1193295
$$ 45519380 50225936 50687918 53623123 61638313 67554110 68871952 73782152 84975447
33945H4975447Q041799K233147Q344130J7923817J2730100M818917K0704255M0778486
$$ 84975447 93017246 95250393 103594523 121518340 134248440 139067357 159771612 200550098
33937B00550098O650484q6981435j56479092j27036493l2104446L2523756L0417611
$$ 200550098 207200582 120219147 -36259945 -163296438 -195400884 -162877128 -132459517
33930a32459517P657757O634900J5250099J0228157K14245K290395R624486P721968
$$ -132459517 -124801760 -118166860 -102916761 -92688604 -92474359 -90183964 -80559478 -72837510
33922g2837510J002025J466874O443251O117577J726979O93496K551806K507040
$$ -72837510 -71835485 -70368611 -63925360 -57807783 -56080804 -55387308 -52835502 -50328462
33914e0328462J516608K413259K925371J096426O09278L406348M528397J111503
$$ -50328462 -48811854 -46398595 -43473224 -42376798 -41767520 -38361172 -33832775 -32721272
33906c2721272j419302J052374L676676J641574j212937k14044J455084l21830
$$ -32721272 -34140574 -33088200 -29411524 -27769950 -28982887 -29196931 -27741847 -28063677
33898b8063677k243434k19014K341195J024830j010763P46784L187941J407727
$$ -28063677 -30307111 -30526125 -28184930 -27160100 -28170863 -27424079 -24236138 -22828411
33890b2828411j694681n13343K948013K795155k45800q67674R72435Q72620j195984
$$ -22828411 -24523092 -25036435 -22088422 -19293267 -19539067 -20406741 -19434306 -18561686 -19757670
33881a9757670j108432J388341K351866Q57906r5589M51792N02682k41505j71450
$$ -19757670 -20866102 -19477761 -17125895 -16267989 -16363578 -15911786 -15409104 -15650609 -15822059
33872a5822059L61672r8323l77329J324759K995310J497632j608161k260757o97805
$$ -15822059 -15460387 -15558710 -15936039 -14611280 -11615970 -10118338 -11726499 -13987256 -14685061
33863a4685061m81136j713686j147539J314292K148444N23406m74933M14856Q59662
$$ -14685061 -15166197 -16879883 -18027422 -16713130 -14564686 -14041280 -14516213 -14101357 -13241695
33854a3241695j73742o08983M87098J244842P88315O49666J282057J044332k47336
$$ -13241695 -13415437 -14024420 -13537322 -12292480 -11504165 -10854499 -9572442 -8528110 -8775446
33845h775446n48369N29322Q19090k42114l93191J051448J433399o12858k280830
$$ -8775446 -9323815 -8794493 -7975403 -8217517 -8610708 -7559260 -6125861 -6738719 -9019549
33836i019549q79017J840689K370887M16572j395536j379179j48816R72538J189175
$$ -9019549 -9898566 -8057877 -5686990 -5270418 -6665954 -8045133 -8193949 -7221411 -6032236
33827f032236M78466l22905l10614J38230j25811r31192q39138K38786M73258
$$ -6032236 -5553770 -5876675 -6187289 -6049059 -6174870 -7106062 -7945200 -7706414 -7233156
33818g233156q49219j723085l90876J733282K020398M11350p83561l36664O25116
$$ -7233156 -8082375 -9805460 -10196336 -8463054 -6442656 -6031306 -6814867 -7151531 -6526415
33809f526415Q32762N85581O45047P37472J80036o73493p38095J20703O98425
$$ -6526415 -5693653 -5108072 -4463025 -3725553 -3545517 -4219010 -4957105 -4836402 -4137977
33800d137977J06675r67552j311194q82623n20073l38990L41013J413930J620050
$$ -4137977 -4031302 -4998854 -6310048 -7192671 -7712744 -8051734 -7710721 -6296791 -4676741
33791d676741L03113j420874j940593r92440L31226R73139Q73098P90807J310349
$$ -4676741 -4373628 -5794502 -7735095 -8727535 -8396309 -7423170 -6550072 -5759265 -4448916
33782d448916J865721J155750r30552k451029j558696R39481K457806J749617
$$ -4448916 -2583195 -1427445 -2357997 -4809026 -6367722 -5428241 -2970435 -1220818
33774a220818j74943j838191k431715j544894M21575J770929J256271L7435K190
$$ -1220818 -1395761 -3233952 -5665667 -7210561 -6788986 -5018057 -3761786 -3724351 -3722161
33765c722161P06723L75255o64117n49535M39630K38655r32889o87954Q89046
$$ -3722161 -3015438 -2640183 -3304300 -3853835 -3414205 -3175550 -4108439 -4796393 -3907347
33756c907347R04656j050111j711305J21447J222330l57966j749358m61529J187169
$$ -3907347 -3002691 -4052802 -5764107 -5642660 -4420330 -4778296 -6527654 -6989183 -5802014
33747e802014N53862l69489J165472L189913K226746o29720j724666r29974q95822
$$ -5802014 -5248152 -5617641 -4452169 -1262256 964490 334770 -1389896 -2319870 -3215692
33738c215692j771483j456378n9346M34466J75913Q71916J923892J323642k41924
$$ -3215692 -4987175 -6443553 -6502899 -6068433 -5892520 -5020604 -3096712 -1773070 -2014994
33729b014994l31528P71236O74721n23242n27954N68687L80698j082035j184864
$$ -2014994 -2346522 -1575286 -900565 -1423807 -1951761 -1383074 -1002376 -2084411 -3269275
33720c269275M97942J307873J05234j140131j087546p22793o30731n3084P03223
$$ -3269275 -2771333 -1463460 -1358226 -2498357 -3585903 -4308696 -4939427 -4992511 -4289288
33711d289288K96053p10723l16144J146993J244557k29573q95216j40553J21165
$$ -4289288 -3993235 -4703958 -5020102 -3873109 -2628552 -2858125 -3753341 -3893894 -3772729
33702c772729m51726j2161J232831O61536j670663k190177K18173J960734P00579
$$ -3772729 -4224455 -4236616 -3003785 -2342249 -4012912 -6203089 -5984916 -4024182 -3323603
33693c323603q56974M2237J517014P36961j156503j454449m64236j03069j29061
$$ -3323603 -4180577 -4138340 -2621326 -1884365 -3040868 -4495317 -4959553 -5062622 -5191683
33684e191683P32810J644913R63756n90905j060833n14278m85313j000692o84306
$$ -5191683 -4458873 -2813960 -1850204 -2441109 -3501942 -4016220 -4501533 -5502225 -6186531
33675f186531O90507J856159J921854J057497j85175j039414p40746L86716R02865
$$ -6186531 -5496024 -3639865 -1718011 -660514 -845689 -1885103 -2625849 -2239133 -1336268
33666a336268J38365r03094j169719q10496k01710P64244J727153J738307P64722
$$ -1336268 -1197903 -2100997 -3270716 -4081212 -4282922 -3518678 -1791525 -53218 711504
33657G11504j56085o22849j049655j108338k14034M33492q75751k780320j886897
$$ 711504 555419 -67430 -1117085 -2225423 -2439457 -2005965 -2881716 -5662036 -7548933
33648g548933J804076M076490K466951m60222j524248j083862o54083J40882J549925
$$ -7548933 -5744857 -1668367 798584 338362 -1185886 -2269748 -2923831 -2782949 -1233024
33639a233024J714549l42853k302474j888143k53766M95925O07064R03861M61018
$$ -1233024 481525 138672 -2163802 -4051945 -4305711 -3809786 -3202722 -2298861 -1837843
33630a837843j067395j521450K44581J603612K46102j664773j067128R10973J438162
$$ -1837843 -2905238 -4426688 -4182107 -2578495 -2332393 -3997166 -5064294 -4153321 -2715159
33621b715159J018541J582143J826836n22054l493759l184212k24761J295183
$$ -2715159 -1696618 -114475 1712361 1190307 -2303452 -5487664 -5712425 -4417242
33613d417242O28133O44509J635535P19855j922321k127967J172902L340738J113459
$$ -4417242 -3789109 -3144600 -1509065 -789210 -2711531 -4839498 -3666596 -325858 787601
33604G87601k310521k503124l26467M99653m12850l79668J323166K399419J354134
$$ 787601 -1522920 -4026044 -4352511 -3852858 -4265708 -4645376 -3322210 -922791 431343
33595D31343m14604q90700o4146M90734j44843j145040j140452j09148O25302
$$ 431343 16739 -873961 -938107 -447373 -592216 -1737256 -2877708 -2986856 -2361554
33586b361554L83188L7102L15981M92520p7135m03489N03500J563746J114878
$$ -2361554 -1978366 -1941264 -1625283 -1132763 -1209898 -1613387 -1109887 453859 1568737
33577A568737m33268j455515j731666j956029j502347O07922K958573K853580
$$ 1568737 1135469 -320046 -2051712 -4007741 -5510088 -4902166 -1943593 909987
33569I09987K51542k070676k471201j931364j325589p3038J664716K134215O93752
$$ 909987 1161529 -909147 -3380348 -5311712 -6637301 -6710339 -5045623 -2911408 -2217656
33560b217656p34698l63834R11456J036895l24336j682627j748656o58840M23164
$$ -2217656 -2952354 -3316188 -2404732 -1367837 -1692173 -3374800 -5123456 -5782296 -5359132
33551e359132N02200k07528n59151p1283M33850L41933K74530O30325M72841o83375
$$ -5359132 -4856932 -5064460 -5623611 -5694894 -5261044 -4919111 -4644581 -4014256 -3541415 -4224790
33541d224790j424951o14377M44102J71753m60842J69835J147762P70125P8442
$$ -4224790 -5649741 -6264118 -5820016 -5648263 -6109105 -5939270 -4791508 -4021383 -3942941
33532c942941J049870K394714J285727j351564j794352K46643J082551o08036
$$ -3942941 -2893071 -498357 787370 -564194 -2358546 -2111903 -1029352 -1637388
33524a637388j698517l09714J035273J12944j273953q87235J94583K12730q494
$$ -1637388 -3335905 -3645619 -2610346 -2497402 -3771355 -4658590 -4464007 -4251277 -4259771
33515d259771O69954R63724k70984j171310K62329K418681K394426N25848n12505
$$ -4259771 -3589817 -2626093 -2897077 -4068387 -3806058 -1387377 1007049 1532897 1020392
33506A020392j2793L67488j56256o15225m42540k50344m11065n34757l79161j02968
$$ 1020392 1007599 1375087 1218831 603606 161066 -89278 -500343 -1035100 -1414261 -1517229
33496a517229K15139M72969L56114j54017o53679r78655j128268n76529R18240
$$ -1517229 -1302090 -829121 -473007 -627024 -1280703 -2259358 -3387626 -3964155 -3045915
33487c045915J929618Q24479j276882j484399M91803J792308J000840O7700L37564
$$ -3045915 -1116297 -291818 -1568700 -3053099 -2561296 -768988 231852 299552 637116
33478F37116J84960j256048j499395J112214L612505K481262p04623j644916J33186
$$ 637116 822076 -433972 -1933367 -821153 2791352 5272614 4567991 2923075 3056261
33469C056261J157641k11824j784963j520644k39536L62317P869o08513r18114
$$ 3056261 4213902 4002078 2217115 696471 456935 819252 827121 218608 -699506
33460f99506o60727n7642K35735J42463M53788J226277J083965n97567k137748
$$ -699506 -1360233 -1417875 -1182140 -1039677 -585889 640388 1724353 1126786 -1010962
33451a010962j766302j12675J167608J824303K204267J579886m03465j946483
$$ -1010962 -2777264 -2889939 -1722331 101972 2306239 3886125 3482660 1536177
33443A536177j293426L22503M30332r09116j605151r62245l7032O79200J362043
$$ 1536177 242751 565254 995586 86470 -1518681 -2480926 -2517958 -1838758 -476715
33434d76715J355515J91427o14014M67121J916472J092828j336067k177170p41121
$$ -476715 878800 1070227 456213 923334 2839806 3932634 2596567 419397 -321724
33425c21724L62279k45028q09746P1474J181613J144658N58205L21479K245q09648
$$ -321724 40555 -204473 -1014219 -942745 238868 1383526 1941731 2263210 2265455 1455807
33415A455807j314381q69397j14224J58901p327m04695r71195j091516m2659J557085
$$ 1455807 141426 -727971 -842195 -683294 -690621 -1095316 -2066511 -3158027 -3200686 -1643601
33405a643601K168836J371344R7142j005844j809932j667083k21890R65317M896
$$ -1643601 525235 1896579 1993721 987877 -822055 -2489138 -2711028 -1745711 -1740815
33396a740815k105553k422290m49204J143692P40253j24413J30998O67981K84030
$$ -1740815 -3846368 -6268658 -6717862 -5574170 -4833917 -4958330 -4827332 -4159351 -3875321
33387c875321m14455m56244j76628m3599L54912Q83454L54910j176463j599638
$$ -3875321 -4289776 -4746020 -4922648 -4966247 -4611335 -3727881 -3372971 -4549434 -6149072
33378f149072J65723K118874K002120M85547m12547n30700r30415j235892j57509
$$ -6149072 -5983349 -3864475 -1862355 -1376808 -1789355 -2320055 -3250470 -4486362 -4643871
33369d643871J760449K311706P96282q88556r70800j97275m71878j837727k151653
$$ -4643871 -2883422 -571716 224566 -663990 -1634790 -1832065 -2303943 -4141670 -6293323
33360f293323j13632K417021K453370M372j662402n67319J181036P53873j101707
$$ -6293323 -6406955 -3989934 -1536564 -1532192 -3194594 -3761913 -2580877 -1827004 -2928711
33351b928711j642974o24121p8433l45605K09227J568309J712084L98375j98270
$$ -2928711 -4571685 -5195806 -5274239 -5619844 -5410617 -3842308 -2130224 -1731849 -1930119
33342a930119N14589M40451j056973j521337K27576J593952N22291q84132m5922
$$ -1930119 -1415530 -975079 -2032052 -3553389 -3325813 -1731861 -1209570 -2093702 -2139624
33333b139624J527965Q22329j538080k344315q16174P92995R59530L20932k86530
$$ -2139624 -611659 210670 -1327410 -3671725 -4487899 -3694904 -2735374 -2414442 -2700972
33324b700972o77003m40192O27908J490121J070213j5696n69134p82846j302826
$$ -2700972 -3377975 -3818167 -3190259 -1700138 -629925 -645621 -1214755 -1997601 -3300427
33315c300427j398696k44249R42491M77483p78716n38329J212215K202930J446128
$$ -3300427 -4699123 -4943372 -4000881 -3523398 -4302114 -4840443 -3628228 -1425298 20830
33306B0830L05364j67247n89407j420825j776444q27791R47143K385259K570219
$$ 20830 326194 158947 -430460 -1851285 -3627729 -4455520 -3508377 -1123118 1447101
33297A447101J214595q72877k035939j564215o72401n72402n58369M39653J535584
$$ 1447101 2661696 1788819 -247120 -1811335 -2483736 -3056138 -3614507 -3174854 -1639270
33288a639270J225181J38917M9607P56332N56282n25252p41744J20094K86899
$$ -1639270 -414089 -275172 -225565 530767 1087049 561797 -179947 -59853 227046
33279B27046p94206j473416q49106k08873n17991o99920L16434J627173J738448
$$ 227046 -567160 -2040576 -2889682 -3098555 -3616546 -4316466 -4000032 -2372859 -634411
33270f34411O35861n66790j069609q23657l76296n01694j119253r11921P17386
$$ -634411 1450 -565340 -1634949 -2458606 -2834902 -3336596 -4455849 -5367770 -4650384
33261d650384K018752J153125o26008o20336R26579J235063j76462o69753P13500
$$ -4650384 -2631632 -1478507 -2104515 -2724851 -1798272 -563209 -739671 -1409424 -695924
33252f95924J398471j50700j578276o91821P86635L81309q65510n09230R36246
$$ -695924 702547 551847 -1026429 -1718250 -931615 -550306 -1415816 -1925046 -988800
33243i88800J126731m5321p84104p57703r78249j113394o9346J263436R77387
$$ -988800 137931 92610 -691494 -1449197 -2427446 -3540840 -3610186 -2346750 -1369363
33234a369363m24270o81452K74292L24537p05545n11910J261099J738448l35418
$$ -1369363 -1793633 -2475085 -2200793 -1876256 -2581801 -3093711 -1832612 -94164 -429582
33225d29582j880081k13302K280705J584112j628568k874026n06743K211671K245097
$$ -429582 -2309663 -2522965 -242260 1341852 -286716 -3160742 -3667485 -1455814 789283
33216G89283P28940K88693R47255R07607j00323o48864k02983K72013K45896K51473
$$ 789283 1518223 1806916 2754171 3661778 3561455 2912591 2709608 2981621 3227517 3478990
33206C478990L22007l50309j585666j822537n29815O46516M45380O1972Q73916
$$ 3478990 3800997 3450688 1865022 42485 -487330 159186 604566 666538 1540454
33197A540454J622460L48111j859709k036538j9456J194780J93338r45859n83888
$$ 1540454 3162914 3511025 1651316 -385222 -404678 790102 983440 37581 -546307
33188e46307j77943j112651j756362l55082J387982Q09587j129431j172259J036729
$$ -546307 -724250 -1836901 -3593263 -3948345 -2560363 -1750776 -2880207 -4052466 -3015737
33179c015737K486151J527740j12577o23068n40078q49392j061415n23319J91962
$$ -3015737 -529586 998154 885577 262509 -277569 -1126961 -2188376 -2711695 -2519733
33170b519733M95905Q58082J502046J465110J95934j168104j367925p59710k92195
$$ -2519733 -2023828 -1165746 336300 1801410 1997344 829240 -538685 -1298395 -1590590
33161a590590J08356P54342Q62176l11529j690630j530379o8692P19464R3014
$$ -1590590 -1482234 -727892 134284 -177245 -1867875 -3398254 -3466946 -2747482 -2654468
33152b654468m13040N53357K063987K201796N81118j408806k424503k284076j396404
$$ -2654468 -3067508 -2514151 -450164 1751632 2332750 923944 -1500559 -3784635 -5181039
33143e181039m5665J366762K031696J441149K54519k69937J18025K99647n66730
$$ -5181039 -5226704 -3859942 -1828246 -387097 -132578 -402515 -284490 15157 -551573
33134e51573j716258j825289q77053K542K99710N34561Q92804P14017j70812o96535
$$ -551573 -2267831 -4093120 -4970173 -4967631 -4667921 -4133360 -3240556 -2526539 -2697351 -3393886
33124c393886K3211J260008J508566L85389j000382j373956n37325N36830O32593
$$ -3393886 -3370675 -2110667 -602101 -216712 -1217094 -2591050 -3128375 -2591545 -1958952
33115a958952l93229j194998m14102J412334K307051J421261N9748l33890k9815
$$ -1958952 -2352181 -3547179 -3961281 -2548947 -241896 1179365 1239113 905223 875408
33106H75408m9554m76977q06295j028575j177793o47183P18713J627646R27099
$$ 875408 825854 348877 -457418 -1485993 -2663786 -3310969 -2592256 -964610 -37511
33097c7511m54588p68976j00045N7664n13541n58346J90637N22492P7090M7833
$$ -37511 -492099 -1261075 -1361120 -1303456 -1816997 -2375343 -2184706 -1662214 -1585124 -1537291
33087a537291Q78607J279112M98778l12738k27543k42789j328837k295206j447506
$$ -1537291 -658684 620428 1119206 806468 578925 336136 -992701 -3287907 -4735413
33078d735413O47215J876532J444801M22013r6663O0204O36017J094534O68617
$$ -4735413 -4088198 -2211666 -766865 -344852 -441515 -381311 254706 1349240 2017857
33069B017857n82797j321725p17451Q0089k97197j040913m28910J115943J477331
$$ 2017857 1435060 113335 -604116 -524027 -821224 -1862137 -2291047 -1175104 302227
33060C02227K28441p73432m86619o2787l87884m84710L63932Q10371n20392k492159
$$ 302227 530668 -242764 -729383 -792170 -1180054 -1664764 -1300832 -490461 -1010853 -3503012
33050c503012k783823j049035Q80734J578381J321653Q83191L79215k85451p15747
$$ -3503012 -6286835 -7335870 -6455136 -4876755 -3555102 -2671911 -2292696 -2578147 -3293894
33041c293894l86547N45611J204105R17917Q8206k25579K39570M58424l54349
$$ -3293894 -3680441 -3134830 -1930725 -1012808 -924602 -1150181 -910611 -452187 -806536
33032h06536j326082j072326J23258O26787q9667p56367l20273P48397J549996
$$ -806536 -2132618 -3204944 -3081686 -2454899 -2544566 -3300933 -3621206 -2872809 -1322813
33023a322813J776537J222006k18005j521666j194847L11078O86558p18937j567492
$$ -1322813 453724 1675730 1457725 -63941 -1258788 -947710 -261152 -980089 -2547581
33014b547581k83613J047873r8078k364119k439139k43016J156161N26307j7076
$$ -2547581 -2831194 -1783321 -1881399 -4245518 -6684657 -6927673 -5771512 -5245205 -5262281
33005e262281J001715K075400J570593K89644m01260q38704j651311j837855l13919
$$ -5262281 -4260566 -2185166 -614573 -324929 -726189 -1564893 -3216204 -5054059 -5367978
32996e367978J770585K278483J027736k36568l84065J54944O85577R56379O42273
$$ -5367978 -3597393 -1318910 -291174 -527742 -911807 -756863 -71286 885093 1527366
32987A527366m55329j555288j498660m42403K01002j65502m89491J22899Q87890
$$ 1527366 1072037 -483251 -1981911 -2424314 -2223312 -2388814 -2878305 -2755406 -1867516
32978a867516O02447l82583p06082j72831N740o55353r12618K43866J670867J472253
$$ -1867516 -1265069 -1647652 -2353734 -2526565 -2520825 -3176178 -4088796 -3844930 -2174063 -701810
32968g01810j22798q68923K75910J576002J040240o93614j381101m25192N13787
$$ -701810 -824608 -1693531 -1417621 158381 1198621 505007 -876094 -1301286 -787499
32959g87499J73658n84088l37513P36071J262048O58895l13444q79113j154401
$$ -787499 -613841 -1197929 -1535442 -799371 462677 1121572 808128 -70985 -1225386
32950a225386j426000j298478k85185J091934J660543J105070K67877k85846r53268
$$ -1225386 -2651386 -3949864 -4235049 -3143115 -1482572 -377502 -109625 -395471 -1348739
32941a348739j732530j441727L63348J768576Q15069j170798j074573J187376
$$ -1348739 -3081269 -4522996 -4159648 -2391072 -1576003 -2746801 -3821374 -2633998
32933b633998K248367M53147j640550j553946o62160j129071j744631k75668J972975
$$ -2633998 -385631 67516 -1573034 -3126980 -3789140 -4918211 -6662842 -6938510 -4965535
32924d965535J985022L12944J88152J680681J387230j375095k747003n37720J954767
$$ -4965535 -2980513 -2667569 -2479417 -798736 588494 -786601 -3533604 -4071324 -2116557
32915b116557J114986j445633j915269k50950O92027L57579Q30367K506443L088265
$$ -2116557 -1001571 -2447204 -4362473 -4613423 -3921396 -3563817 -2733450 -227007 2861258
32906B861258J344650r76967j788413j100925r5926N20541N15520j30042q11139
$$ 2861258 4205908 3228941 1440528 339603 243677 764218 1279738 1149696 338557
32897C38557o86733Q7600M76961J49495j44709m2399j98805q99965j152546n1418
$$ 338557 -348176 -260576 216385 365880 221171 178772 -20033 -919998 -2072544 -2123962
32887b123962J615657K083921P60781j037012j596349o53825N05285O31505j78818
$$ -2123962 -508305 1575616 2336397 1299385 -296964 -950789 -445504 186001 7183
32878G183r29169j075567q66555n35977K4196O79357R64770Q51021Q16176Q78260
$$ 7183 -921986 -1997553 -2864108 -3400085 -3375889 -2696532 -1731762 -880741 -64565 813695
32868H13695M54291m37006q60101m37303q9773n31052j060066q26290l03527l08766
$$ 813695 1267986 830980 -29121 -466424 -556197 -1087249 -2147315 -2973605 -3277132 -3585898
32858c585898m06754L17212J482270J828777J070371N0777o53829j048618r22659
$$ -3585898 -3992652 -3675440 -2193170 -364393 705978 756755 102926 -945692 -1868351
32849a868351n9036Q67419Q44382k6056p00473p23885n12091k75428J24996L24724
$$ -1868351 -1927387 -1059968 -215586 -241642 -942115 -1666000 -2178091 -2453519 -2328523 -2003799
32839b003799k42034j094938j030479O3967Q82059N10532m69913j029519q71144
$$ -2003799 -2245833 -3340771 -4371250 -4307283 -3425224 -2914692 -3384605 -4414124 -5285268
32830e285268k34477N54146R67333N73738j64120j90440O50555J200639N50919
$$ -5285268 -5519745 -4965599 -3998266 -3424528 -3588648 -3779088 -3128533 -1927894 -1376975
32821a376975o57179j089590m50537K34035l0199r40180j166198L5023J666754
$$ -1376975 -2034154 -3123744 -3574281 -3340246 -3370445 -4310625 -5476823 -5441800 -3775046
32812c775046J980146O79899o40147o19157K38571O98155N52937K67476j73758
$$ -3775046 -1794900 -1115001 -1755148 -2374305 -2135734 -1437579 -884642 -617166 -790924
32803g90924p82861p66801L05806J244862Q06091j07162K63437J479732J397892
$$ -790924 -1573785 -2340586 -2034780 -789918 16173 -90989 172448 1652180 3050072
32794C050072k96243j396908n25515R90432J380452O43773m37342j693087k820808
$$ 3050072 2753829 1356921 831406 1821838 3202290 3846063 3408721 1715634 -1105174
32785a105174k794938j302034M14141J216538J452540J720844J547269M63078
$$ -1105174 -3900112 -5202146 -4788005 -3571467 -2118927 -398083 1149186 1612264
32777A612264p23782r94279n79146k80428k37946l80956j064559k072881k007677
$$ 1612264 888482 -105797 -684943 -965371 -1203317 -1584273 -2648832 -4721713 -6729390
32768f729390p2956K300209L002387J836407L18285m76770n63692j43537N07121
$$ -6729390 -6802346 -4502137 -1499750 336657 654942 178172 -385520 -529057 -21936
32759b1936O10419k80697j259505j106718r5025M75580K78706J69883N25879P29037
$$ -21936 588483 307786 -951719 -2058437 -2153462 -1677882 -1399176 -1229293 -703414 25623
32749B5623L82132j62404n78203p64176k99220J013000J999620J063047j285556
$$ 25623 407755 245351 -332852 -1097028 -1396248 -383248 1616372 2679419 1393863
32740A393863k412108j001492Q61962M39463j791826k771925j086598J279305
$$ 1393863 -1018245 -2019737 -1157775 -718312 -2510138 -5282063 -6368661 -5089356
32732e089356J906771J069834P24121J404821J767865R90658n255j60796K18836
$$ -5089356 -3182585 -2112751 -1388630 16191 1784056 2774714 2769459 2608663 2827499
32723B827499L15938Q9319j64613n77892j035533p19360M16637P37659p99125
$$ 2827499 3143437 3232756 3068143 2490251 1454718 735358 1151995 1889654 1090529
32714A090529k333134j289583J542722K710415J062144o99715k76480J054720
$$ 1090529 -1242605 -2532188 -989466 1720949 2783093 2083378 1806898 2861618
32706B861618J040635l3545m41556M303J79389k39717p85726j436710k108137
$$ 2861618 3902253 3868708 3427152 3431455 3610844 3371127 2585401 1148691 -959446
32697i59446j793287L717J756473J663736K48918o11352o06540r10162j606832
$$ -959446 -2752733 -2749016 -992543 671193 920111 308759 -297781 -1207943 -2814775
32688b814775j411256l2081J147323J092698K54425n65729j052021r18664k9163
$$ -2814775 -4226031 -4258112 -3110789 -2018091 -1763666 -2329395 -3381416 -4300080 -4329243
32679d329243Q54836P72518J09006J07961Q22078J011757J77872q20732j339586
$$ -4329243 -3474407 -2701889 -2592883 -2484922 -1662844 -651087 -473215 -1293947 -2633533
32670b633533j582126j443665l84305J117576J607867P61370j5032K97517J004644
$$ -2633533 -4215659 -5659324 -6043629 -4926053 -3318186 -2556816 -2571848 -2274331 -1269687
32661a269687J121229P28278K25093m18218r46158o90567J26776L30360k69905
$$ -1269687 -148458 579820 804913 386695 -559463 -1250030 -1123254 -792894 -1062799
32652a062799m07724L58968O67675j73326o04310N79729J751283Q29102j137318
$$ -1062799 -1470523 -1111555 -443880 -617206 -1221516 -641787 1109496 1938598 801280
32643H01280j397316J62507R44078q5091q86424P6079J292362P62616p79301j129911
$$ 801280 -596036 -433529 510549 425458 -460966 -384887 907475 1670091 890790 -239121
32633b39121j2680P69301J87188p87056r48394m16112L5669J39097M7409j38096
$$ -239121 -251801 517500 704688 -82368 -1030762 -1446874 -1411205 -1272108 -1224699 -1362795
32623a362795k07628J22302M89649j8053j290518j565339L62319K860640L081716
$$ -1362795 -1570423 -1448121 -958472 -976525 -2267043 -3832382 -3470063 -609423 2472293
32614B472293Q38174j014437o18624M08655j96832j770613j968093n23302N83414
$$ 2472293 3310467 2296030 1677406 2086061 1889229 118616 -1849477 -2372779 -1789365
32605a789365L96943Q8394M79278O45557j11009o90109Q7043J397038J498650
$$ -1789365 -1392422 -1304028 -824750 -179193 -290202 -980311 -893268 503770 2002420
32596B002420K57922p27630l43039P38302J095106K82191p53156q44946o3988
$$ 2002420 2260342 1532712 1189673 1927975 3023081 3305272 2552116 1707170 1643182
32587A643182K80702o47873j919077j937846n85140O70143P75984K35204P3049
$$ 1643182 1923884 1276011 -643066 -2580912 -3166052 -2495909 -1719925 -1484721 -1411672
32578a411672N68396J232371J261481k1708k218624l412142k015887P80915K002335
$$ -1411672 -843276 389095 1650576 1628868 -589756 -4001898 -6017785 -5236870 -3234535
32569c234535P83141m78478K48895J685811J452225k95702j446610j214484o77384
$$ -3234535 -2451394 -2929872 -2680977 -995166 457059 161357 -1285253 -2499737 -3177121
32560c177121m30406J28030R91784J016651j11617r63124m43860L47354l64407
$$ -3177121 -3607527 -3479497 -2487713 -1471062 -1582679 -2545803 -2989663 -2642309 -3006716
32551c006716k198168k716395o37351K120596K567235M57099j289444m32249J599858
$$ -3006716 -5204884 -7921279 -8558630 -6438034 -3870799 -3413700 -4703144 -5135393 -3535535
32542c535535J896426L43694m29991O28582J263204l59839k402181j924879O88598
$$ -3535535 -1639109 -1295415 -1725406 -1096824 166380 -193459 -2595640 -4520519 -3831921
32533c831921K346632J714530N77427N84830R57283L57660p07033p64087K35275
$$ -3831921 -1485289 229241 806668 1391498 2348781 2706441 1999408 1235321 1470596
32524A470596P75795j01713j491934j763471o02708O05655O21927N5243M04839
$$ 1470596 2246391 2144678 652744 -1110727 -1713435 -1107780 -485853 -430610 -25771
32515b5771J587369J758131P9893j743203j778269n04577K99295K91855L93334
$$ -25771 1561598 3319729 3399622 1656419 -121850 -626427 -327132 -35277 358057
32506C58057O04486J17323o71282m67486M81532M73399o85873j063300J97421
$$ 358057 962543 1079866 408584 -58902 422630 896029 210156 -853144 -655723
32497f55723J267493N82372n91605l84208M47906k20772k228769l038754j276967
$$ -655723 611770 1194142 602537 218329 666235 445463 -1783306 -4822060 -6099027
32488f099027J461394K697583J733745p4546q73382j2610J251264J008954q08672
$$ -6099027 -4637633 -1940050 -206305 -280851 -1154233 -1166843 84421 1093375 284703
32479B84703j944862q28447Q67383M19714j752565k400730j99781K178118J828597
$$ 284703 -1660159 -2488606 -1621223 -1201509 -2954074 -5354804 -5554585 -3376467 -1547870
32470a547870n02943j897790j195757L86402J624414K292198K208134J185901
$$ -1547870 -2050813 -3948603 -5144360 -4757958 -3133544 -841346 1366788 2552689
32462B552689l5891m52094m64396j249527k316520j698364P24437K186386P86949
$$ 2552689 2516798 2064704 1600308 350781 -1965739 -3664103 -2939666 -753280 33669
32453C3669j442000j265658J074975K314873R17454j088404j396016l29770M90829
$$ 33669 -1408331 -2673989 -1599014 715859 1633313 544909 -851107 -1180877 -690048
32444f90048O15611N68487M36360O4160j40513J08785R2125q55361j859734j442467
$$ -690048 -74437 494050 930410 994570 854057 962842 1054967 199606 -1660128 -3102595
32434c102595K26527J344300R09092l7206o0382O69571P42148n10286k012678
$$ -3102595 -2876068 -1531768 -622676 -659882 -720264 -50693 691455 181169 -1831509
32425a831509k056021k69463J733704K008466N56216o45603j50924J162718J441368
$$ -1831509 -3887530 -4156993 -2423289 -414823 141393 -504210 -655134 507584 1948952
32416A948952L08674j002240j536906j466135j126141m00038O31198J329924J251579
$$ 1948952 2257626 1255386 -281520 -1747655 -2873796 -3273834 -2642636 -1312712 -61133
32407f1133O90061J77342q8448j44651r1845j79150o05520j122838j252325r17546
$$ -61133 628928 806270 717822 573171 481326 302176 -303344 -1426182 -2678507 -3596053
32397c596053m42202j0714L76375N86596N85270P23199J074428Q61601m27739
$$ -3596053 -4038255 -4048969 -3672594 -3085998 -2500728 -1777529 -703101 158500 -269239
32388b69239j664722j190218P04689J893756J267018n2402p82576j117954j485489
$$ -269239 -1933961 -3124179 -2419490 -525734 741284 688882 -93694 -1211648 -2697137
32379b697137j296114j55312J011159J353674J410299J636677R38817j466119
$$ -2697137 -3993251 -4148563 -3137404 -1783730 -373431 1263246 2202063 735944
32371G35944l756761l334943n29985J698357J683147N97093m0813k39953l55212
$$ 735944 -3020817 -6355760 -6885745 -5187388 -3504241 -2907148 -2947961 -3187914 -3543126
32362c543126j5622Q06893J183942O25625j52572n70643r49155j230625m96580
$$ -3543126 -3558748 -2751855 -1567913 -942288 -1094860 -1665503 -2614658 -3845283 -4341863
32353d341863J221968K176550J251036k49021n69568j3877J03498j91813q7884
$$ -4341863 -3119895 -943345 307691 58670 -510898 -524775 -421277 -613090 -700974
32344g00974R3943m09602r25313l18720P06824N98277j54242L00545J679862J622225
$$ -700974 -607031 -1016633 -1941946 -2260666 -1553842 -955565 -1109807 -809262 870600 2492825
32334B492825l13976j658220j023455j83935o49610r97819K19954J417482N47047
$$ 2492825 2178849 520629 -502826 -686761 -1336371 -2334190 -2114236 -696754 -149707
32325a49707j221561j422278m43395n14279j508147j219591M99825J348991N62586
$$ -149707 -1371268 -2793546 -3236941 -3751220 -5259367 -6478958 -5979133 -4630142 -4067556
32316d067556j7983M88980N78042m16853p52600M81739J351595K92907j096244
$$ -4067556 -4085539 -3596559 -3018517 -3435370 -4187970 -3706231 -2354636 -2061729 -3157973
32307c157973p49145M99288P70642N59125J385172K348489J249914j379970k523797
$$ -3157973 -3907118 -3407830 -2637188 -2078063 -692891 1655598 2905512 1525542 -998255
32298i98255j096501O73830Q11531K6060k73249j48277j04641K83023J278894
$$ -998255 -2094756 -1420926 -609395 -583335 -856584 -1004861 -1109502 -826479 452415
32289D52415J831038R44406o68268j557691j471432j164677q72873k18877O49496
$$ 452415 2283453 3227859 2559591 1001900 -469532 -1634209 -2507082 -2725959 -2076463
32280b076463J036985Q41412O96944P85997M49674n53316j197103m38229J061387
$$ -2076463 -1039478 -198066 498878 1284875 1734549 1181233 -15870 -454099 607288
32271F07288J482024K38805j169677j251229n21674l77190o99790k10597R48058
$$ 607288 2089312 2328117 1158440 -92789 -614463 -991653 -1691443 -1902040 -953982
32262i53982R54949p13913j916678q04383J319522J901717Q92374M34167J189551
$$ -953982 967 -712946 -2629624 -3434007 -2114485 -212768 679606 1113773 2303324
32253B303324J340187k62415j987983j657955L93673J835885J317174k66311j339360
$$ 2303324 3643511 3381096 1393113 -264842 128831 1964716 3281890 3015579 1676219
32244A676219j468306j262455j070898n21701N44991J365846J160832M27292L63256
$$ 1676219 207913 -1054542 -2125440 -2647141 -2102150 -736304 424528 851820 1215076
32235A215076J002463J074701M8399r44313q90772l59907k22567j04871O20650
$$ 1215076 2217539 3292240 3340639 2396326 1505554 1145647 923080 818209 1438859
32226A438859J318760J014755M6389o28639r99977j394125j150925L12984J791621
$$ 1438859 2757619 3772374 3818763 3190124 2190147 796022 -354903 -41919 1749702
32217A749702J557769j04039j452585j830652j692680p80690J277320K932134
$$ 1749702 3307471 3203432 1750847 -79805 -1772485 -2553175 -1275855 1656279
32209A656279K020688p89000k494967j952959r15598n78057l7391J093204J550546
$$ 1656279 3676967 2887967 393000 -1559959 -2475557 -3053614 -3091005 -1997801 -447255
32200d47255J015982R56245J592712J009643j117102k021521k69690J297020j26858
$$ -447255 568727 1524972 3117684 4127327 3010225 988704 719014 2016034 1889176
32191A889176k585891k296705M88926K076507Q27867j160477j512475o7322J846183
$$ 1889176 -696715 -2993420 -2504494 -427987 399880 -760597 -2273072 -2340394 -494211
32182d94211K530151Q11162k281085l560270j410111J594398K017541K59037p73962
$$ -494211 2035940 2847102 566017 -2994253 -4404364 -2809966 -792425 -533388 -1307350
32173a307350m62467n92666j371565j042920M30191R04520p9763l38168J026592
$$ -1307350 -1769817 -2362483 -3734048 -4776968 -4346777 -3442257 -3522020 -3860188 -2833596
32164b833596J887751P32787p86902p33838P8772n6225p45969m91333O36454J289708
$$ -2833596 -945845 -213058 -999960 -1733798 -1655026 -1711251 -2457220 -2948553 -2312099 -1022391
32154a022391R81794L11367l14819q41502r74601n50425o2375K6733J2108L10985
$$ -1022391 -40597 270770 -44049 -885551 -1860152 -2410577 -2472952 -2446219 -2434111 -2123126
32144b123126O92919P98104Q17953J002932J018202M07349o52833j460633j406933
$$ -2123126 -1430207 -632103 185850 1188782 2206984 2614333 1961500 500867 -906066
32135i06066m66588N33489M22722q42012j652475p20148R31489J331986M41875
$$ -906066 -1372654 -839165 -416443 -1258455 -2910930 -3631078 -2699589 -1367603 -925728
32126i25728j32231K4202j68350o80075o0689J592882K008526L61535r63970m2724
$$ -925728 -1057959 -1033757 -1202107 -1882182 -1942871 -349989 1658537 2020072 1056102 1013378
32116A013378J375112O41711j494091k075113m85319Q74074K55099j385983k237639
$$ 1013378 2388490 3030201 1536110 -539003 -1024322 -150248 104851 -1281132 -3518771
32107c518771j728742l87976J005992J693489J316840L71815k91940m09974k83864
$$ -3518771 -5247513 -5635489 -4629497 -2936008 -1619168 -1247353 -1539293 -1949267 -2233131
32098b233131j51826j22841k80626l03197L69811J375603J349599r2644j306696
$$ -2233131 -2384957 -2507798 -2788424 -3091621 -2721810 -1346207 3392 -89252 -1395948
32089a395948p90471N48424Q42676J56911J5856N35281K56802j023529j475100
$$ -1395948 -2186419 -1637995 -795319 -638408 -622552 -87271 169531 -853998 -2329098
32080b329098p0049J585068J407430m01743j918462j958318q70064N10515J539179
$$ -2329098 -2399147 -814079 593351 191608 -1726854 -3685172 -4555236 -4044721 -2505542
32071b505542J629671N05362j197966k199321j740030k54535J193472J874493
$$ -2505542 -875871 -370509 -1568475 -3767796 -5507826 -5762361 -4568889 -2694396
32063b694396J688927Q46405l00327j120319r74866l7128N51105k4041j024053
$$ -2694396 -1005469 -159064 -459391 -1579710 -2554576 -2591704 -2040599 -2064640 -3088693
32054c088693j019602J24952J121558J216263J069501J212217R27322l47641j587011
$$ -3088693 -4108295 -3983343 -2861785 -1645522 -576021 636196 1563518 1215877 -371134
32045c71134j491236n31251k10496o74107o10179M91760J510433J450948O90180
$$ -371134 -1862370 -2393621 -2604117 -3278224 -3888403 -3396643 -1886210 -435262 254918
32036B54918q1506r37003j876442j896215j17247K496316L661749K212490o13958
$$ 254918 173412 -763591 -2640033 -4536248 -4653495 -2157179 1504570 3717060 3103102
32027C103102k502493k258056n89383Q15424P36113o40344j807992j244531Q95965
$$ 3103102 600609 -1657447 -2246830 -1431406 -695293 -1335637 -3143629 -4388160 -3492195
32018c492195K635166K329800P18457j42792J52434m4760j449683k289851j091140
$$ -3492195 -857029 1472771 2191228 2048436 2200870 2156110 706427 -1583424 -2674564
32009b674564O17926N21620o87925m20799J365418J892848J40164j356053m96532
$$ -2674564 -2056638 -1535018 -2222943 -2643742 -1278324 614524 754688 -601365 -1097897
32000a097897J250710J439407J75236q62495j088680p22160M80943K064127J999134
$$ -1097897 152813 1592220 1767456 904961 -183719 -905879 -424936 1639191 3638325
31991C638325o12701l220218k748311R5592J977892J595128N01859j05816n46956
$$ 3638325 3025624 -194594 -2942905 -2847313 -869421 725707 1227566 1121750 574794
31982E74794p73545j70467N84251P9950j135089r79383O93981J649295Q12062
$$ 574794 -198751 -369218 215033 294983 -840106 -1819489 -1125508 523787 1335849
31973A335849l16177m56364j96259m9725M98406J057673J78825j664804j798687
$$ 1335849 1019672 563308 367049 317324 815730 1873403 2052228 387424 -1411263
31964a411263L65744J674759k6001k271697j788230M74626J275997K22093m42065
$$ -1411263 -1045519 629240 603239 -1668458 -3456688 -2982062 -1706065 -1483972 -1926037
31955a926037P590K55445k764K83895R93071Q59760k3007m38242o34068j806084
$$ -1926037 -1918447 -1663002 -1665766 -1381871 -388800 470960 447953 9711 -624357 -2430441
31945b430441l031892j938955J104965K761179J666355L88370R55274J592112
$$ -2430441 -5462333 -7401288 -6296323 -3535144 -1868789 -1480419 -525145 1066967
31937A066967J43278j960214j988977k54563Q05761O02500N12071Q33871N73600
$$ 1066967 1210245 -749969 -2738946 -2993509 -2187748 -1585248 -1073177 -239306 334294
31928C34294m9756K65971J158299P20370j119679j960948o28415R06899P01118
$$ 334294 284538 550509 1708808 2429178 1309499 -651449 -1279864 -372965 328153
31919C28153k07628J19958J178324J031211l16129r55613k39573K92053n10311
$$ 328153 120525 240483 1418807 2450018 2133889 1178276 938703 1230756 720445
31910G20445j693592j766275o76553N27444J068803P89354j04130r77082j047335
$$ 720445 -973147 -2739422 -3415975 -2888531 -1819728 -1030374 -1134504 -2111586 -3158921
31901c158921l16277K71277O6624m23059l99756P1028L62318K62701M6328j8277
$$ -3158921 -3475198 -3203921 -3137297 -3560356 -3960112 -3889084 -3526766 -3264065 -3217737 -3236014
31891c236014L25186J302813K438855K463430Q20384j111511j385772K9631J195914
$$ -3236014 -2910828 -1608015 830840 3294270 4114654 3003143 1617371 1647002 2842916
31882B842916O97815q50983k034290k300747j864812q57409N55689J661949J650828
$$ 2842916 3540731 2689748 655458 -1645289 -3510101 -4367510 -3811821 -2149872 -499044
31873d99044N51411p25387j240209p03393M46786J321124J176163J45444p31328
$$ -499044 52367 -673020 -1913229 -2616622 -2169836 -848712 327451 472895 -258433
31864b58433n69406L18136P64418J47069q62860j083516j75062R80433J245823
$$ -258433 -827839 -509703 254715 401784 -461076 -1544592 -1719654 -739221 506602
31855E06602M42482m98241n41498M26471J556761J833777R13706n55398j379669
$$ 506602 949084 450843 -90655 335816 1892577 3726354 4640060 4084662 2704993
31846B704993r21564J17974M46852j09971l13097N91481J461515P84457q93092
$$ 2704993 1783429 1901403 2348255 2238284 1925187 2516668 3978183 4762640 3869548
31837C869548j511041m98049L58931l25363j391678j004488M15888Q63413n9240
$$ 3869548 2358507 1860458 2219389 1894026 502348 -502140 -86252 777161 717921
31828G17921n33476N20335J631242J002638o94809j278719k20656P81264M15171
$$ 717921 184445 704780 2336022 3338660 2643851 1365132 1144476 1925740 2340911
31819B340911o01516j002228p72428n84867m42109P076M54585L69207J0992m1939
$$ 2340911 1739395 737167 -35261 -620128 -1062237 -1055161 -600576 -231369 -220377 -262316
31809b62316O3471r747K24959J127271J498876R881k139702k259878j84530J221791
$$ -262316 -198845 -208592 16367 1143638 2642514 2652395 512693 -1747185 -1931715 -709924
31799g09924M17252n75469J66454J143025K14816j379154r40013J006240J405284
$$ -709924 -292672 -868141 -701687 441338 656154 -723000 -1663013 -656773 748511
31790G48511l23072j454367n76362K43034q19280k187310j389199J121949K733044
$$ 748511 425439 -1028928 -1605290 -1362256 -2181536 -4368846 -5758045 -4636096 -1903052
31781a903052K280443J042369M76805M94193K36176l30148k48910R35285J979435
$$ -1903052 377391 1419760 1896565 2390758 2626934 2296786 2047876 2983161 4962596
31772D962596J123884j301386k683502j472264N19238O54228q31513j706896j404554
$$ 4962596 6086480 4785094 2101592 629328 1148566 1802794 971281 -735615 -2140169
31763b140169j237867j391244n68076J178928K081910J640511J249239J242496
$$ -2140169 -3378036 -4769280 -5337356 -4158428 -2076518 -436007 813232 2055728
31755B055728K77308j400235j312538J028411K410700O47760j812973j655999
$$ 2055728 2333036 932801 -379737 648674 3059374 3707134 1894161 238162
31747B38162L76931J312386O74815J51116L6174o45629j420450r57222J78232
$$ 238162 615093 1927479 2602294 2753410 2789584 2143955 723505 -233717 -55485
31738e5485K60626n42353n83856K16589M41922p4185k61813k25275q57971j373782
$$ -55485 205141 -337212 -921068 -704479 -262557 -336742 -598555 -823830 -1681801 -3055583
31728c055583k26298J653749J758881K63827n0502J359885J696397k76565j840232
$$ -3055583 -3281881 -1628132 130749 394576 344074 1703959 3400356 3123791 1283559
31719A283559p53093J136238J154788k0123k97635j26351j251638k845055k273905
$$ 1283559 530466 1666704 2821492 2801369 2503734 2377383 1125745 -1719310 -3993215
31710c993215N64551K674316K130753M14150k06034L18413N99324K65150J04093
$$ -3993215 -3428664 -754348 1376405 1790555 1584521 1902934 2502258 2767408 2871501
31701B871501K35315l33091j880669k835782j621471P94335J712252L13330j196556
$$ 2871501 3106816 2773725 893056 -1942726 -3564197 -2769862 -1057610 -744280 -1940836
31692a940836q87300K37687M28690K58951J084390J806526L67569k125702k354164
$$ -1940836 -2828136 -2590449 -2161759 -1902808 -818418 988108 1355677 -770025 -3124189
31683c124189n2471J361689K71879q05819L5572Q02365m36372j688938m63513
$$ -3124189 -3176660 -1814971 -1543092 -2348911 -2313339 -1510974 -1947346 -3636284 -4099797
31674d099797J640743J533656j74975n98088K44447l5384j231232o67897J601460
$$ -4099797 -2459054 -925398 -1100373 -1698461 -1454014 -1489398 -2720630 -3388527 -1787067
31665a787067K259814L66702p96504O64379J811535j85918k950455k333323J134250
$$ -1787067 472747 839449 42945 707324 2518859 2332941 -617514 -2950837 -1816587
31656a816587L074102J640279n83336j097450n93357o27746q74511l33957M25429
$$ -1816587 1257515 2897794 2314458 1217008 623651 -4095 -878606 -1212563 -787134
31647g87134Q5955j121300j570370o04703N07749L57381o68037r08725L22838
$$ -787134 -701179 -1822479 -3392849 -3997552 -3489803 -3132422 -3800459 -4709184 -4386346
31638d386346J754421J785294O13047j09061L10048O65414o7513q75650k67267
$$ -4386346 -2631925 -846631 -233584 -342645 -32597 632817 565304 -310346 -577613
31629e77613J055725J002416m69670r36263O40250J822714K66650k320669k393821
$$ -577613 478112 1480528 1010858 74595 714845 2537559 2804209 483540 -1910281
31620a910281Q0764J510667J14513j571767q73127R70354J045969p31616j864035
$$ -1910281 -1829517 -318850 -204337 -1776104 -2649231 -1678877 -632908 -1364524 -3228559
31611c228559j119051K54605R00862Q59562N92314K38097Q9312M05583N98538
$$ -3228559 -4347610 -4093005 -3192143 -2332581 -1740267 -1502170 -1412858 -1007275 -408737
31602d08737j01678j133824j135916l3358Q63417R53157R62668J225187J009418
$$ -408737 -510415 -1644239 -2780155 -2813513 -1950096 -996939 -34271 1190916 2200334
31593B200334Q7634n89560m53495j37015q1173K31938Q97250R00167k20201j307545
$$ 2200334 2287968 1698408 1244913 1107898 1026725 1258663 2155913 3056080 2835879 1528334
31583A528334j208825l44160K63517M10536K87347j77852o33787k13149Q99290
$$ 1528334 319509 -24651 238866 649402 936749 758897 125110 -88039 811251
31574H11251J132861j53715j429877j298635n54219m64816n19522L04107J380125
$$ 811251 1944112 1790397 360520 -938115 -1492334 -1957150 -2476672 -2172565 -792440
31565g92440J544768J169168J041210M36996j263202k250494n77578K011951J954375
$$ -792440 752328 1921496 2962706 3399702 2136500 -113994 -691572 1320379 3274754
31556C274754n96063j724560K00538K119504J298873o81411j163135p44043j479269
$$ 3274754 2678691 954131 1154669 3274173 4573046 3891635 2728500 1984457 505188
31547E05188k754233k195301K26610J992667J734933O08622j39526o54333j051674
$$ 505188 -2249045 -4444346 -4217736 -2225069 -490136 118486 -21040 -675373 -1727047
31538a727047o33707N29573R17706k98264j634599j200125N63378J555607J081835
$$ -1727047 -2360754 -1831181 -913475 -1211739 -2846338 -4046463 -3483085 -1927478 -845643
31529h45643N89308J078101J413370K76868j380624j483423Q379R06574K8317
$$ -845643 -256335 821766 2235136 2512004 1131380 -352043 -343664 562910 591227
31520E91227j139531q76371K23588N32020L5694p1038K61971j8272q62119r49076
$$ 591227 -548304 -1424675 -1201087 -669067 -633373 -704411 -442440 -460712 -1322831 -2271907
31510b271907R550O68167L15076l3616L34664M23044n76732j472051q30333N21996
$$ -2271907 -2262357 -1594190 -1279114 -1312730 -978066 -555022 -1131754 -2603805 -3434138 -2912142
31500b912142O84379k35886l04262J009651J851968Q61857p26958j002087j45195
$$ -2912142 -2227763 -2463649 -2767911 -1758260 93708 955565 228607 -773480 -918675
31491i18675J39159o90283j373649q16764N49689J631000J924469J540336P65376
$$ -918675 -779516 -1469799 -2843448 -3660212 -3110523 -1479523 444946 1985282 2750658
31482B750658P1399r7797j9286n21539j610193k040378j041793L02365N10619
$$ 2750658 2822057 2724260 2704974 2183435 573242 -1467136 -2508929 -2206564 -1695945
31473a695945r0614k5597Q67038J332262J014238R50209J319031P09868j322523
$$ -1695945 -1786559 -1812156 -945118 387144 1401382 2351591 3670622 4380490 3057967
31464C057967k765176j737431P34014K157523J787631P39912k29784j175415j677196
$$ 3057967 292791 -1444640 -710626 1446897 3234528 3974440 3744656 2569241 892045
31455H92045j028649L09974J019901P42672K63980k4231m37256q24950n77242
$$ 892045 -136604 173370 1193271 1935943 2199923 2175692 1738436 913486 336244
31446C36244O2366J00671n46248q05407j48754O72915R15462P40279N07677J85044
$$ 336244 398610 499281 -46967 -852374 -1001128 -328213 587249 1327528 1835205 2020249
31436B020249k50198o68910j132594j550227j223345J58524J377523R72777m99092
$$ 2020249 1770051 1101141 -31453 -1581680 -2805025 -2646501 -1268978 -296201 -795293
31427g95293j079854k62769M73120J10974o87700j092857j066752m83154Q72204
$$ -795293 -1875147 -2137916 -1664796 -1553822 -2241522 -3334379 -4401131 -4884285 -4012081
31418d012081K012682J433468l50878j014799R8813Q98013m6529j268892j015001
$$ -4012081 -1999399 -565931 -916809 -1931608 -1832795 -934782 -981311 -2250203 -3265204
31409c265204l458J62091l77930m75984P7472R18261J989819K646181J572877
$$ -3265204 -3268662 -3106571 -3484501 -3960485 -3883013 -2964752 -974933 1671248 3244125
31400C244125q31965j901423l90699J266932N91919j133788j384135o76071r85583
$$ 3244125 2412160 510737 120038 1386970 1978889 845101 -539034 -1215105 -2200688
31391b200688j557579k74427J782831J471830q90725j529652O62560K234387P53267
$$ -2200688 -3758267 -4032694 -2249863 -778033 -1668758 -3198410 -2535850 -301463 451804
31382D51804j586581j862139n92072K57377N90257J015831P55560o43102j418299
$$ 451804 -1134777 -2996916 -3588988 -3331611 -2741354 -1725523 -969963 -1613065 -3031364
31373c031364p3156J800992J783675L79788j60370L17798Q3149j063367j486441
$$ -3031364 -3104520 -1303528 480147 859935 699565 1017363 1100512 37145 -1449296
31364a449296p29971j42073k49749N462Q98417J097641K9435r41547o76066J11273
$$ -1449296 -2179267 -2321340 -2571089 -2565627 -1667210 -569569 -540134 -1481681 -2157747 -2046474
31354b046474L81446L17114K53242l44240j468276j601098J21056J900638J443619
$$ -2046474 -1665028 -1347914 -1094672 -1438912 -2907188 -4508286 -4387230 -2486592 -1042973
31345a042973n28592j093870O55334K359264J820248k22252j661085j807713j367517
$$ -1042973 -1571565 -2665435 -2010101 349163 2169411 1947159 286074 -1521639 -2889156
31336b889156p59298J00135R03499J115969P88769L08819k75936q15064n48613
$$ -2889156 -3648454 -3548319 -2644820 -1528851 -740082 -431263 -707199 -1522263 -2070876
31327b070876P75945J830823J254307p4682r5417J151606J406705j55842j412880
$$ -2070876 -1294931 535892 1790199 1715517 1620100 2771706 4178411 4022569 2609689
31318B609689o36237P17056M19404r37832j106050O3020N90807k10688q23716
$$ 2609689 1973452 2690508 3109912 2172080 1066030 1129050 1719857 1509169 685453
31309F85453k95619L77652K99545N3408J28197j41489q84905p09165J037780K489945
$$ 685453 389834 767486 1067031 1120439 1248636 1107147 222242 -486923 550857 3040802
31299C040802J649259m81362j235844j76967N42178l71828j723641k091320j718703
$$ 3040802 4690061 4208699 2972855 2795888 3338066 2966238 1242597 -848723 -2567426
31290b567426j285076n32909O63846J299693P66181K49955R72513J942406J376140
$$ -2567426 -3852502 -4385411 -3721565 -2421872 -1655691 -1405736 -433223 1509183 2885323
31281B885323k16213n89666O25198J233822K1967j263622p21530Q07053J294393
$$ 2885323 2669110 2079444 2704642 3938464 3960431 2696809 1975279 2782332 4076725
31272D076725N28067k63421o68846j050340j094160m15079L2049p65533j689950
$$ 4076725 4604792 4341371 3672525 2622185 1528025 1112946 1144995 379462 -1310488
31263a310488q62468J098149J692052M48038m31234K55216J081939Q01970P3424
$$ -1310488 -2172956 -1074807 617245 1065283 634049 889265 1971204 2773174 2846598
31254B846598o33153k006955l359637k153088J779051M379435K566373j087332
$$ 2846598 2213445 206490 -3153147 -5306235 -3527184 852251 3418624 2331292
$$ [...]
##END NTUPLES=NMR SPECTRUM
##END=
