##TITLE=31Pdec_LY-TMF-17.70
 D2O, 24 sc
 24.3.2020
##JCAMPDX= 6.0         $$ Bruker NMR JCAMP-DX V2.0
##DATA TYPE= NMR SPECTRUM
##DATA CLASS= NTUPLES
##ORIGIN= UXNMR, Bruker Analytische Messtechnik GmbH
##OWNER= root
$$ XWIN-NMR		Version 3.5
$$ Tue Mar 24 15:31:58 2020 Russian Standard Time (UT+4h)  she@DPX200
##.OBSERVE FREQUENCY= 81.013821
##.OBSERVE NUCLEUS= ^31P
##.ACQUISITION MODE= SIMULTANEOUS
##.ACQUISITION SCHEME= undefined
##.AVERAGES= 24
##.DIGITISER RES= 17
##SPECTROMETER/DATA SYSTEM= spect
##.PULSE SEQUENCE= zgpg30
##.SOLVENT NAME= DMSO
##.SHIFT REFERENCE= (INTERNAL, DMSO, 0, 182.463)
##AUDIT TRAIL= $$ (NUMBER, WHEN, WHO, WHERE, WHAT)
$$ ##TITLE= Audit trail, XWIN-NMR		Version 3.5
$$ ##JCAMPDX= 5.01
$$ ##ORIGIN= Bruker BioSpin GmbH
$$ ##OWNER= she
$$ F:/spectra/data/she/nmr/P31/1/pdata/1/auditp.txt
$$ ##AUDIT TRAIL=  $$ (NUMBER, WHEN, WHO, WHERE, WHAT)
(   1,<2020-03-24 15:26:37.03 +0400>,<she>,<DPX200>,
      <created by zg, POWCHK disabled, PULCHK disabled
       configuration hash MD5:
       00 E9 B6 7A A2 85 ED C7 34 08 36 98 17 FE 4E 26
       data hash MD5: 32K
       A1 0A 91 04 E7 91 4A DA 2E 3B 9A D3 67 C0 E1 3F>)
(   2,<2020-03-24 15:26:40.50 +0400>,<she>,<DPX200>,
      <Start of raw data processing
       efp BC_mod = 2 LB = 1 FT_mod = 6 PKNL = 1 PHC0 = -1387.028 PHC1 = 190.6017 SI = 64K 
       data hash MD5: 64K
       A1 2F 7D 31 DC AC B7 CE 8B 20 D2 4C 2A 0C 45 0B>)
(   3,<2020-03-24 15:26:56.73 +0400>,<she>,<DPX200>,
      <pk PHC0 = 3.86387 PHC1 = 0 
       data hash MD5: 64K
       41 83 84 75 85 41 CA D6 64 B8 BA 93 05 95 62 9E>)
(   4,<2020-03-24 15:26:59.62 +0400>,<she>,<DPX200>,
      <abs ABSG = 5 
       data hash MD5: 64K
       99 6C AC E1 74 69 B9 C3 48 42 78 CF 89 BC 26 94>)
(   5,<2020-03-24 15:27:16.43 +0400>,<she>,<DPX200>,
      <pk PHC0 = -2.399674 PHC1 = 0 
       data hash MD5: 64K
       34 9E 81 5E 2E CF 1C 60 21 7E 57 F9 3B FA 7D BC>)
(   6,<2020-03-24 15:31:13.34 +0400>,<she>,<DPX200>,
      <pk PHC0 = 1.600001 PHC1 = 0 
       data hash MD5: 64K
       97 CD BF 6E 9A 99 17 CE DC 38 87 FD D9 AE 4C F1>)
$$ ##END=
$$ 
$$ hash MD5
$$ 3F F6 13 C8 0B FA 5E 67 78 F6 1B AD 64 51 E0 23
##$RELAX= 
##$RELAX= 
##$RELAX= 
##$RELAX= 
##$RELAX= 
##$RELAX= 
##$RELAX= 
##$RELAX= 
$$ Bruker specific parameters
$$ --------------------------
##$DU= <F:/spectra>
##$EXPNO= 1
##$NAME= <P31>
##$PROCNO= 1
##$TYPE= <nmr>
##$USER= <she>
##$AMP= (0..31)
100 100 100 100 100 100 100 100 100 100 100 100 100 100 100 100 100 100 
100 100 100 100 100 100 100 100 100 100 100 100 100 100 
##$AQSEQ= 0
##$AQ_mod= 1
##$AUNM= <au_zg>
##$AUTOPOS= <>
##$BF1= 81.014009
##$BF2= 200.13
##$BF3= 200.13
##$BF4= 200.13
##$BF5= 200.13
##$BF6= 200.13
##$BF7= 200.13
##$BF8= 200.13
##$BYTORDA= 1
##$CFDGTYP= 0
##$CFRGTYP= 5
##$CHEMSTR= <none>
##$CNST= (0..31)
1 1 145 1 1 1 1 1 1 1 1 1 1 1 1 1 1 1 1 1 1 1 1 1 1 1 1 1 1 1 1 1 
##$CPDPRG= <waltz16>
##$CPDPRG1= <>
##$CPDPRG2= <waltz16>
##$CPDPRG3= <>
##$CPDPRG4= <mlev>
##$CPDPRG5= <mlev>
$$ [...]
##$SUBNAM3= <"">
##$SUBNAM4= <"">
##$SUBNAM5= <"">
##$SUBNAM6= <"">
##$SUBNAM7= <"">
##$SUBNAM8= <"">
##$SUBNAM9= <"">
##$SW= 369.568048894756
##$SWIBOX= (0..15)
0 1 3 0 0 0 0 0 0 0 0 0 0 0 0 0 
##$SW_h= 29940.119760479
##$TD= 32768
##$TD0= 1
##$TE= 0
##$TE2= 300
##$TE3= 300
##$TEG= 300
##$TL= (0..7)
0 120 53 12 22 120 120 120 
##$TP= (0..7)
150 150 150 150 150 150 150 150 
##$TP07= 0
##$TPNAME0= <>
##$TPNAME1= <>
##$TPNAME2= <>
##$TPNAME3= <>
##$TPNAME4= <>
##$TPNAME5= <>
##$TPNAME6= <>
##$TPNAME7= <>
##$TPOAL= (0..7)
0.5 0.5 0.5 0.5 0.5 0.5 0.5 0.5 
##$TPOFFS= (0..7)
0 0 0 0 0 0 0 0 
##$TUNHIN= 0
##$TUNHOUT= 0
##$TUNXOUT= 0
##$USERA1= <user>
##$USERA2= <user>
##$USERA3= <user>
##$USERA4= <user>
##$USERA5= <user>
##$V9= 5
##$VALIST= <valist>
##$VCLIST= <CCCCCCCCCCCCCCC>
##$VD= 0
##$VDLIST= <DDDDDDDDDDDDDDD>
##$VPLIST= <PPPPPPPPPPPPPPP>
##$VTLIST= <TTTTTTTTTTTTTTT>
##$WBST= 1024
##$WBSW= 4
##$XGAIN= (0..3)
0 0 0 0 
##$XL= 0
##$YL= 0
##$YMAX_a= 14488
##$YMIN_a= -15666
##$ZGOPTNS= <>
##$ZL1= 120
##$ZL2= 120
##$ZL3= 120
##$ZL4= 120
##$ABSF1= 182.463
##$ABSF2= -187.1042
##$ABSG= 5
##$ABSL= 3
##$ALPHA= 0
##$AQORDER= 0
##$ASSFAC= 0
##$ASSFACI= 0
##$ASSFACX= 0
##$ASSWID= 0
##$AUNMP= <proc_1d>
##$AZFE= 0.1
##$AZFW= 0.5
##$BCFW= 0
##$BC_mod= 2
##$BYTORDP= 0
##$COROFFS= 0
##$CY= -3
##$DATMOD= 1
##$DC= 0
##$DFILT= <>
##$DTYPP= 0
##$F1P= 0
##$F2P= 0
##$FCOR= 1
##$FTSIZE= 65536
##$FT_mod= 6
##$GAMMA= 0
##$GB= 0
##$INTBC= 1
##$INTSCL= 5.30512e-09
##$ISEN= 30
##$LB= 1
##$LEV0= 0
##$LPBIN= 0
##$MAXI= 10000
##$MC2= 0
##$MEAN= 0
##$ME_mod= 0
##$MI= 50
##$NCOEF= 0
##$NC_proc= -4
##$NLEV= 6
##$NOISF1= 182.463
##$NOISF2= 159.3651
##$NSP= 0
##$NTH_PI= 0
##$NZP= 0
##$OFFSET= 182.463
##$PC= 4
##$PHC0= -1383.964
##$PHC1= 190.6017
##$PH_mod= 1
##$PKNL= yes
##$PPARMOD= 0
##$PSCAL= 0
##$PSIGN= 0
##$REVERSE= no
##$SF= 81.0140089999434
##$SI= 65536
##$SIGF1= 159.3651
##$SIGF2= -187.1042
##$SINO= 113.3802
##$SIOLD= 16384
##$SREGLST= <1H.CDCl3>
##$SSB= 0
##$STSI= 65536
##$STSR= 0
##$SW_p= 29940.119760479
##$SYMM= 0
##$S_DEV= 0
##$TDeff= 32768
##$TDoff= 0
##$TI= <>
##$TILT= no
##$TM1= 0
##$TM2= 0
##$TOPLEV= 0
##$USERP1= <user>
##$USERP2= <user>
##$USERP3= <user>
##$USERP4= <user>
##$USERP5= <user>
##$WDW= 1
##$XDIM= 65536
##$YMAX_p= 376635694
##$YMIN_p= -8048298
$$ End of Bruker specific parameters
$$ ---------------------------------
##NTUPLES= NMR SPECTRUM
##VAR_NAME=  FREQUENCY,     SPECTRUM/REAL,   SPECTRUM/IMAG
##SYMBOL=    X,             R,               I
##VAR_TYPE=  INDEPENDENT,   DEPENDENT,       DEPENDENT
##VAR_FORM=  AFFN,          ASDF,            ASDF
##VAR_DIM=   65536,         65536,           65536
##UNITS=     HZ,            ARBITRARY UNITS, ARBITRARY UNITS
##FACTOR=    0.456856943014862, 1,           1
##FIRST=     14782.0589164792, 0,            0
##LAST=      -15158.0608439998, 0,           0
##MIN=       -15158.0608439998, -8048298,    0
##MAX=       14782.0589164792, 376635694,    0
$$ Real data points
##PAGE= N=1
##DATA TABLE= (X++(R..R)), XYDATA
$$ [...]
##PAGE= N=2
##DATA TABLE= (X++(I..I)), XYDATA
$$ plain form
36816 585870 486943 543275 943417 1477045 1778007 1805930 1821537 1929711 1901347 1514891
36806 1514891 899573 408642 230569 270040 388897 562573 703208 544656 -35276 -686161
36796 -686161 -906194 -684194 -475802 -496757 -450099 -109795 262540 378876 415817 649897
36786 649897 908745 841100 517636 292914 221020 81969 -116242 -143534 1183 111876
36776 111876 208549 470584 761369 742125 498370 507894 864607 1071310 811303 437630
36766 437630 428517 770293 1147994 1365680 1311101 895410 348326 208540 642110 1068253
36756 1068253 864184 205702 -204227 -58817 328949 607215 743457 807361 796531 774809
36746 774809 889835 1126311 1239456 1048939 668883 356714 226677 192615 139026 66499
$$ packed form
36816E85870r8927N6332M00142N33628L00962K7923J5607J08174k8364l86456
36806A514891o15318m90931j78073L9471J18857J73676J40635j58552n79932o50885
36796f86161k20033K22000K08392k0955M6658L40304L72335J16336L6941K34080
36786F49897K58848o7645l23464k24722p1894j39051j98211k7292J44717J10693
36776A11876R6673K62035K90785j9244k43755R524L56713K06703k60007l73673
36766D37630r113L41776L77701K17686n4579m15691n47084j39786M33570M26143
36756A068253k04069o58482m09929J45410L87766K78266J36242O3904j0830k1722
36746G74809J15026K36476J13145j90517l80056l12169j30037l4062n3589p2527
$$ plain form
36736 66499 54660 124915 203997 241947 290419 399997 514383 555778 532123 449865 232859
36725 232859 -108008 -336643 -234269 108672 454589 745384 1003676 1073622 841614 590861
36715 590861 664467 837076 577218 -33334 -272229 152441 640624 642781 474625 708173
36705 708173 1218311 1417250 1149674 795302 650884 711796 956018 1371773 1734474 1754687
36695 1754687 1464284 1172307 1066403 1089563 1124303 1068003 839725 533048 409607 522442
36685 522442 562613 347627 202227 491716 1005175 1221027 1009726 646348 295791 -37866
36675 -37866 -185955 26348 345451 341259 101290 154112 647974 1132240 1279584 1311043
36665 1311043 1490272 1650834 1513946 1134294 747181 434292 197286 150386 390340 799309
$$ packed form
36736F6499j1839P0255P9082L7950M8472J09578J14386M1395k3655q2258k17006
36725B32859l40867k28635J02374L42941L45917K90795K58292O9946k32008k50753
36715E90861P3606J72609k59858o10552k38895M24670M88183K157j68156K33548
36705G08173N10138J98939k67576l54372j44418O0912K44222M15755L62701K0213
36695A754687k90403k91977j05904K3160L4740n6300k28278l06677j23441J12835
36685E22442M0171k14986j45400K89489N13459K15852k11301l63378l50557l33657
36675c7866j48089K12303L19103m192k39969N2822M93862M84266J47344L1459
36665A311043J79229J60562j36888l79652l87113l12889k37006m6900K39954M08969
$$ plain form
36655 799309 1146589 1296756 1250746 1118034 1076879 1186738 1236231 993351 588676 368222
36645 368222 372598 320793 166132 251416 730700 1215131 1268143 972746 721259 661228 650501
36634 650501 616475 657838 821239 987628 1002077 835041 632995 609453 804972 1008502
36624 1008502 1070586 1183748 1553025 1874990 1612956 861372 403673 651432 1026291 818687
36614 818687 248854 100718 535283 915078 808622 580450 780582 1364107 1806342 1775105
36604 1775105 1433282 1154586 1114042 1164254 1050033 715462 347895 98097 -111575 -369229
36594 -369229 -488587 -189776 435278 880676 757570 219636 -252779 -386438 -305411 -245677
36584 -245677 -235399 -123436 141239 372064 349282 118645 -23462 112206 349738 351491
$$ packed form
36655G99309L47280J50167m6010j32712m1155J09859M9493k42880m04675k20454
36645C68222M376n1805j54661Q5284M79284M84431N3012k95397k51487o0031j0727
36634F50501l4026M1363J63401J66389J4449j67036k02046k3542J95519K03530
36624A008502O2084J13162L69277L21965k62034p51584m57699K47759L74859k07604
36614H18687n69833j48136M34565L79795j06456k28172K00132N83525M42235l1237
36604A775105l41823k78696m0544N0212j14221l34571l67567k49798k09672k57654
36594c69229j19358K98811O25054M45398j23106n37934m72415j33659Q1027N9734
36584b45677J0278J11963K64675K30825k2782k30637j42107J35668K37532J753
$$ plain form
36574 351491 64026 -153102 81136 693531 1181959 1157057 756611 401703 225524 -14596
36564 -14596 -421077 -651522 -352465 301911 795315 886041 744307 558646 362008 245025
36554 245025 353714 572815 565947 291295 146211 377972 651112 498065 -13426 -379480
36544 -379480 -294642 104177 533973 813630 851268 658250 422856 397024 669247 1129662
36534 1129662 1601718 1903824 1889955 1604561 1325228 1272395 1332660 1241110 968799 730302
36524 730302 662035 714717 833499 999261 1077760 882080 463074 122196 32890 42322 -22611
36513 -22611 -40810 203412 606820 774820 493445 1799 -293154 -263555 -103750 12316
36503 12316 143266 395203 674301 778214 674647 521033 418362 328921 271987 390468
$$ packed form
36574C51491k87465k17128K34238O12395M88428k4902m00446l54908j76179k40120
36564a4596m06481k30445K99057O54376M93404R0726j41734j85661j96638j16983
36554B45025J08689K19101o868k74652j45084K31761K73140j53047n11491l66054
36544c79480Q4838L98819M29796K79657L7638j93018k35394k5832K72223M60415
36534A129662M72056L02106j3869k85394k79333n2833O0265r1550k72311k38497
36524G30302o8267N2682J18782J65762P8499j95680m19006l40878q9306R432o4933
36513b2611j8199K44222M03408J68000k81375m91646k94953K9599J59805J16066
36503A2316J30950K51937K79098J03913j03567j53614j02671q9441n6934J18481
$$ plain form
36493 390468 698239 931124 833050 493324 215495 113583 38092 -112617 -224662 -184170
36483 -184170 -88913 -105270 -196698 -146958 144376 515855 750266 825335 845839 796605 555534
36472 555534 176076 -61274 -4825 150135 179946 187804 382243 651291 703015 562430
36462 562430 544150 719554 807509 666467 484853 352108 75679 -356628 -566066 -351481
36452 -351481 -75242 -88780 -126119 245050 840302 1085689 879149 657581 654426 655992 544292
36441 544292 529452 675944 676329 345214 -26895 -70567 186666 458906 565632 450564
36431 450564 83753 -409015 -700331 -584990 -239199 14098 74250 49811 31921 65633
36421 65633 222125 502311 747289 817783 807056 927286 1219743 1485024 1467393 1063894
$$ packed form
36493C90468L07771K32885r8074l39726k77829j01912p5491j50709j12045M0492
36483a84170R5257j6357r1428M9740K91334L71479K34411P5069K0504m9234k41071
36472E55534l79458k37350N6449J54960K9811P858J94439K69048N1724j40585
36462E62430j8280J75404Q7955j41042j81614j32745k76429m32307k09438K14585
36452c51481K76239j3538l7339L71169N95252K45387k06540k21568l155J566j11700
36441E44292j4840J46492L85l31115l72109m3672K57233K72240J06726j15068
36431D50564l66811m92768k91316J15341L45791K53297O0152k4439j7890L3712
36421F5633J56492K80186K44978P0494j0727J20230K92457K65281j7631m03499
$$ plain form
36411 1063894 450631 42538 150473 571056 717529 335611 -115235 -65178 349870 469613
36401 469613 85534 -209337 158091 912559 1264647 911921 334443 96587 218494 401783
36391 401783 582398 923912 1355397 1483524 1083336 433748 -15383 -154055 -192658 -248777
36381 -248777 -213477 -27797 152981 175791 117490 174062 405251 692427 898788 979011
36371 979011 958310 892118 851837 879164 925639 891843 776500 737708 901440 1113177 1039472
36360 1039472 612948 219856 248289 558917 678374 471583 272479 291561 293000 65730
36350 65730 -148633 -24090 325879 563397 657357 796918 941221 921755 909417 1265445
36340 1265445 1883820 2169047 1809655 1159503 687525 444842 283699 221286 297153 366728
$$ packed form
36411A063894o13263m08093J07935M20583J46473l81918m50846N0057M15048J19743
36401D69613l84079k94871L67428P54468L52088l52726n77478k37856J21907J83289
36391D01783J80615L41514M31485J28127m00188o49588m49131j38672l8603n6119
36381b48777L5300J85680J80778K2810n8301N6572K31189K87176K06361Q0223
36371I79011k0701o6192m0281K7327M6475l3796j15343l8792J63732K11737p3705
36360A039472m26524l93092K8433L10628J19457k06791j99104J9082J439k27270
36350F5730k14363J24543L49969K37518R3960J39561J44303j9466j2338L56028
36340A265445O18375K85227l59392o50152m71978k42683j61143o2413P5867O9575
$$ plain form
36330 366728 337808 378151 599627 748007 519972 36194 -306653 -355086 -294403 -298313 -339266
36319 -339266 -318721 -189873 20850 186299 169445 72129 233595 792303 1414361 1689374
36309 1689374 1631975 1516119 1385040 1095924 743244 598744 625020 491432 175996 119244
36299 119244 564838 1121718 1291705 1150038 1126931 1289411 1273944 925768 601557 678012
36289 678012 1032231 1236031 1120664 909013 828400 831506 779179 713645 772396 909950 918780
36278 918780 758370 667020 827420 1074772 1127178 1018946 1061644 1357961 1595065 1439392
36268 1439392 958043 486031 207532 71891 45374 195440 501454 806500 1040626 1297213
36258 1297213 1570782 1617083 1274121 783048 543477 617330 723934 687774 606092 559052
$$ packed form
36330C66728k8920M0343K21476J48380k28035m83778l42847m8433O0683l910m0953
36319c39266K0545J28848K10723J65449j6854r7316J61466N58708O22058K75013
36309A689374n7399j15856j31079k89116l52680j44500K6276j33588l15436n6752
36299A19244M45594N56880J69987j41667k3107J62480j5467l48176l24211P6455
36289F78012L54219K03800j15367k11651q0613L106n2327o5534N8751J37554Q830
36278I18780j60410r1350J60400K47352N2406j08232M2698K96317K37104j55673
36268A439392m81349m72012k78499j35641k6517J50066L06014L05046K34126K56587
36258A297213K73569M6301l42962m91073k39571P3853J06604l6160q1682m7040
$$ plain form
36248 559052 476029 390298 504399 815336 969677 754910 485908 572883 889371 951112
36238 951112 626232 271264 173201 235579 271038 256671 200402 62243 -76990 -50643 81126
36227 81126 50998 -148764 -143771 263632 709718 735742 420924 228653 362428 602770
36217 602770 717920 713610 651120 493092 236610 28117 20928 182536 327309 338904 315793
36206 315793 433640 642031 621820 198232 -297313 -340612 114219 582542 737897 800832
36196 800832 1053557 1320746 1270611 984912 821522 831440 722680 386811 82708 27842
36186 27842 117927 158857 120951 33932 -159556 -483925 -792641 -890905 -730011 -395195 30834
36175 30834 506944 972359 1318818 1443929 1336944 1109668 902542 743335 559059 354553
$$ packed form
36248E59052q3023q5731J14101L10937J54341k14767k69002Q6975L16488O1741
36238I51112l24880l54968r8063O2378L5459j4367n6269j38159j39233K6347J31769
36227H1126l0128j99762M993M07403M46086K6024l14818j92271J33775K40342
36217F02770J15150m310o2490j58028k56482k08493p189J61608J44773J1595k3111
36206C15793J17847K08391k0211m23588m95545m3299M54831M68323J55355O2935
36196H00832K52725K67189n0135k85699j63390R918j08760l35869l04103n4866
36186B7842R0085M0930l7906q7019j93488l24369l08716r8264J60894L34816M26029
36175C0834M76110M65415L46459J25111j06985k27276k07126j59207j84276k04506
$$ plain form
36165 354553 282845 458925 776623 1002637 1009044 850968 677007 625390 736120 898867
36155 898867 951410 862851 723868 554597 310926 133918 336457 965058 1579945 1701029
36145 1701029 1341838 900898 664497 639981 747521 911249 1028275 1075578 1187415 1435527
36135 1435527 1638525 1606631 1451618 1396828 1401229 1274648 1069070 1008446 1067158 968389 618417
36124 618417 224886 -41706 -191615 -188947 84723 545048 870042 865729 649665 418005
36114 418005 271280 306720 595201 980276 1159833 1053021 848930 652890 382300 76385
36104 76385 -36870 76139 122781 -87637 -363652 -456511 -391197 -280351 -77960 250006
36094 250006 533053 602122 502580 321496 29460 -301804 -376459 -45152 396669 568181
$$ packed form
36165C54553p1708J76080L17698K26014O407j58076j73961n1617J10730J62747
36155H98867N2543q8559j38983j69271k43671j77008K02539O28601O14887J21084
36145A701029l59191m40940k36401k4516J07540J63728J17026M7303J11837K48112
36135A435527K02998l1894j55013n4790M401j26581k05578o0624N8712r8769l49972
36124F18417l93531k66592j49909K668K73670M60325L24994m313k16064k31660
36114D18005j46725L5440K88481L85075J79557j06812k04091j96040k70590l05915
36104G6385j13255J13009M6642k10418k76015r2859O5314J10846K02391L27966
36094B50006K83047O9069r9542j81084k92036l31264p4655L31307M41821J71512
$$ plain form
36084 568181 509842 549756 784790 977381 903688 573078 163839 -65698 108380 645766
36074 645766 1194002 1429972 1350753 1096586 681687 126053 -332184 -460817 -367379 -328878
36064 -328878 -378704 -349513 -248300 -269026 -443264 -561874 -459418 -148452 301744 778846
36054 778846 1068718 1065088 1006573 1196974 1504039 1488060 1066134 666175 600904 661348 533736
36043 533736 289698 190798 259224 339637 406481 519142 609067 593175 580975 678542 699893
36032 699893 420265 50512 46487 410324 628305 469082 388442 795311 1294365 1190071
36022 1190071 566665 259042 694312 1328407 1467136 1166359 942776 949773 920236 747074
36012 747074 637614 716075 864588 978114 1051704 1014130 804727 617590 715319 980547
$$ packed form
36084E68181n8339L9914K35034J92591p3693l30610m09239k29537J74078N37386
36074F45766N48236K35970p9219k54167m14899n55634m58237j28633R3438L8501
36064c28878m9826K9191J01213k0726j74238j18610J02456L10966M50196M77102
36054G78846K89872l630n8515J90401L07065j5979m21926l99959o5271O0444j27612
36043E33736k44038r8900O8426Q0413O6844J12661Q9925j5892j2200R7567K1351
36032F99893k79628l69753m025L63837K17981j59223q0640M06869M99054j04294
36022A190071o23406l07623M35270O34095J38729l00777k23583O997k9537j73162
36012G47074j09460P8461J48513J13526P3590l7574k09403j87137R7729K65228
$$ plain form
36002 980547 1039475 874881 866956 1106896 1176459 871001 656076 993428 1582789 1755719
35992 1755719 1381277 898743 610737 429182 251911 130293 50965 -63972 -124630 7049
35982 7049 170684 61607 -240856 -303507 8169 304085 263769 94469 149254 368407
35972 368407 396434 95809 -318796 -576922 -577414 -367333 -63209 214408 418788 567308
35962 567308 620424 457862 44369 -454031 -791312 -841136 -660456 -425187 -303322 -289102
35952 -289102 -159876 273019 857411 1201689 1125923 844527 634751 519852 413056 384609
35942 384609 556722 826220 937373 831004 711067 716374 719172 562688 349005 315164
35932 315164 489264 658829 679325 614841 510275 247445 -188577 -472367 -257274 308915
$$ packed form
36002I80547N8928j64594p925K39940O9563l05458k14925L37352N89361J72930
35992A755719l74442m82534k88006j81555j77271j21618p9328j14937o0658J31679
35982G049J63635j09077l02463o2651L11676K95916m0316j69300N4785K19153
35972C68407K8027l00625m14605k58126m92K10081L04124K77617K04380J48520
35962E67308N3116j62562m13493m98400l37281m9824J80680K35269J21865J4220
35952b89102J29226M32895N84392L44278p5766k81396k09776j14899j06796k8447
35942C84609J72113K69498J11153j06369j19937N307K798j56484k13683l3841
35932C15164J74100J69565K0496o4484j04566k62830m36022k83790K15093N66189
$$ plain form
35922 308915 672388 515962 62643 -314197 -504102 -571319 -536205 -431600 -350751 -253554
35912 -253554 46229 501351 703599 416135 -2057 -39231 289989 561654 562352 394910
35902 394910 124732 -204443 -292860 140954 783721 955437 532593 148137 287618 658191
35892 658191 720378 430672 122275 -31579 -84827 -76635 -39440 -85094 -229087 -283360 -125592
35881 -125592 115114 326779 614009 986264 1126593 820910 410630 418346 832218 1151150
35871 1151150 1100238 928609 962725 1191570 1397658 1460472 1405459 1294584 1169110 1044770
35861 1044770 932860 877239 912266 966776 934706 874693 945278 1069011 928793 459551
35851 459551 44998 -33579 -39839 -301009 -556132 -296723 380479 825933 742650 488855
$$ packed form
35922C08915L63473j56426m53319l76840j89905o7217L5114J04605Q0849R7197
35912b53554K99783M55122K02248k87464m18192l7174L29220K71665O98j67442
35902C94910k70178l29175q8417M33814O42767J71716m22844l84456J39481L70573
35892F58191O2187k89706l08397j53854n3248Q192L7195m5654j43993n4273J57768
35881a25592K40706K11665K87230L72255J40329l05683m10280P716M13872L18932
35871A151150n0912j71629L4116K28845K06088O2814n5013j10875j25474j24340
35861A044770j11910n5621L5027N4510l2070o0013P0585J23733j40218m69242
35851D59551m14553p8577o260k61170k55123K59409O77202M45454q3283k53795
$$ plain form
35841 488855 384938 279282 33439 -77212 176456 493148 446177 134398 7288 180217
35831 180217 334056 260195 141490 237804 559870 924425 1137614 1080131 791540 517962
35821 517962 513141 740145 914941 887255 814883 887766 1044232 1086449 949917 704431 382779
35810 382779 6229 -246490 -117891 395064 938818 1157730 1061637 923641 893373 871345
35800 871345 742943 565883 475167 519402 651207 797144 887716 882844 799114 661037 448220
35789 448220 194237 99626 360687 864523 1264192 1421801 1540397 1736582 1755968 1356262
35779 1356262 763497 434905 476991 595564 552219 377396 181242 60479 168322 546330
35769 546330 868486 700367 94912 -395516 -411547 -171597 -31924 -8914 45417 115961
$$ packed form
35841D88855j03917j05656k45843j10651K53668L16692m6971l11779j27110J72929
35831A80217J53839p3861j18705R6314L22066L64555K13189n7483k88591k73578
35821E17962m821K27004J74796k7686p2372P2883J56466M2217j36532k45486l21652
35810C82779l76550k52719J28599N12955N43754K18912r6093j37996l0268k2028
35800H71345j28402j77060r0716M4235J31805J45937R0572m872q3730j38077k12817
35789D48220k53983r4611K61061N03836L99669J57609J18596J96185J9386l99706
35779A356262n92765l28592M2086J18573m3345j74823j96154j20763J07843L78008
35769E46330L22156j68119o05455m90428j6031K39950J39673K3010N4331P0544
$$ plain form
35759 115961 166282 346296 716964 955890 706825 126165 -263802 -224950 4122 139872
35749 139872 159151 137874 74148 -30243 -108908 -123470 -78837 48168 234072 322708 245864
35738 245864 258774 624418 1081533 1052403 486822 38051 137849 331589 -35442 -791143
35728 -791143 -1155978 -855600 -418137 -302884 -299270 -37409 364692 545745 493925 467566
35718 467566 481845 315189 1874 -104889 141825 460459 613052 754983 1031225 1120333
35708 1120333 627754 -183833 -569490 -297395 10275 -205489 -597393 -436669 264992
35699 264992 729844 514018 93771 152302 709036 1276516 1580649 1733477 1841652 1836613
35689 1836613 1686677 1470621 1198920 805186 371944 155288 295324 638785 911673
$$ packed form
35759A15961N0321J80014L70668K38926k49065n80660l89967L8852K29072J35750
35749A39872J9279k1277o3726j04391p8665j4562M4633J27005J85904Q8636p6844
35738B45864J2910L65644M57115k9130n65581m48771R9798J93740l67031p55701
35728g91143l64835L00378M37463J15253L614K61861M02101J81053n1820k6359
35718D67566J4279j66656l13315j06763K46714L18634J52593J41931K76242Q9108
35708A120333m92579q11587l85657K72095L07670k15764l91904J60724P01661
35699B64992M64852k15826m20247N8531N56734N67480L04133J52828J08175n039
35689A836613j49936k16056k71701l93734m33242k16656J40036L43461K72888
$$ plain form
35680 911673 969379 861635 760612 824203 1016640 1088463 868686 535408 421962 585996
35670 585996 777991 826031 812951 841212 869845 860977 862657 856340 734293 516916 373548
35659 373548 338278 256304 137738 286469 864841 1548302 1852061 1656864 1222323 837243
35649 837243 650320 693852 867255 998800 1053995 1135798 1199022 1031822 661195 442002
35639 442002 512912 523315 216483 -90762 -29056 188663 189481 176425 569807 1114672 1114414
35628 1114414 531137 90868 185664 410682 412148 472672 879778 1328952 1427437 1324040
35618 1324040 1355608 1426430 1213404 737162 315286 132424 174592 385735 614688 641150
35608 641150 507758 550972 853771 1013817 764364 441618 432721 533447 353945 41504
$$ packed form
35680I11673N7706j07744j01023O3591J92437P1823k19777l33278j13446J64034
35670E85996J91995M8040j3080K8261K8633q868J680o317j22047k17377j43368
35659C73548l5270q1974j18566J48731N78372O83461L03759j95197m34541l85080
35649H37243j86923M3532J73403J31545N5195Q1803O3224j67200l70627k19193
35639D42002P0910J0403l06832l07245O1706K17719Q18j3056L93382N44865k58
35628A114414n83277m40269R4796K25018J466O0524M07106M49174R8485j03397
35618A324040L1568P0822k13026m76242m21876j82862M2168K11143K28953K6462
35608F41150j33392M3214L02799J60046k49453l22746q897J00726j79502l12441
$$ plain form
35598 41504 16056 214165 226573 72423 198875 707199 1170906 1312726 1338289 1456495
35588 1456495 1528052 1376632 1083696 795431 524736 280629 145771 133926 192456 366670
35578 366670 703628 1005966 999609 755157 601878 603260 497348 215902 51458 172885
35568 172885 360224 411170 476284 772721 1231696 1623542 1804554 1702995 1322634 898243
35558 898243 764148 917718 1009408 915601 959349 1329317 1658181 1537292 1154480 998290
35548 998290 1128410 1192356 1067561 1019145 1183961 1315567 1202206 1037280 1146181 1496996
35538 1496996 1703415 1496223 1043401 743652 772283 934467 975385 898402 860612 866428
35528 866428 773840 572340 423724 402626 427735 499836 740457 1069120 1109159 646928
$$ packed form
35598D1504k5448J98109J2408j54150J26452N08324M63707J41820K5563J18206
35588A456495P1557j51420k92936k88265k70695k44107j34858j1845N8530J74214
35578C66670L36958L02338o357k44452j53279J382j05912k81446j64444J21427
35568A72885J87339N0946O5114K96437M58975L91846J81012j01559l80361m24391
35558H98243j34095J53570R1690r3807M3748L69968L28864j20889l82812j56190
35548I98290J30120O3946j24795m8416J64816J31606j13361j64926J08901L50815
35538A496996K06419k07192m52822k99749K8631J62184M0918p6983l7790N816
35528H66428r2588k01500j48616k1098K5109P2101K40621L28663M0039m62231
$$ plain form
35518 646928 21134 -192668 175386 744881 1046629 985150 847947 939793 1219615 1325266
35508 1325266 1026127 569618 386170 508491 589228 519189 632184 1110117 1565841 1559905
35498 1559905 1269061 1231409 1557282 1801162 1601676 1090503 604543 286038 88258 -22070
35488 -22070 -6500 181547 532440 929541 1173436 1130182 843992 462552 114580 -93897
35478 -93897 -80632 118960 363606 592338 855266 1078801 1036838 740759 605753 922615
35468 922615 1352998 1325358 818827 340560 176687 136664 97873 294265 822022 1272824
35458 1272824 1223254 843094 657257 839724 1072809 1045678 802250 596148 624489 909049
35448 909049 1258887 1369550 1141650 866394 886070 1108059 1124321 818548 524676 480560
$$ packed form
35518F46928o25794k13802L68054N69495L01748o1479j37203R1846K79822J05651
35508A325266k99139m56509j83448J22321Q0737p0039J12995M77933M55724n936
35498A559905k90844l7652L25873K43880j99486n11173m85960l18505j97780j10328
35488b2070J5570J88047L50893L97101K43895m3254k86190l81440l47972k08477
35478i3897J3265J99592K44646K28732K62928K23535m1963k96079j35006L16862
35468I22615M30383k7640n06531m78267j63873m0023l8791J96392N27757M50802
35458A272824m9570l80160j85837J82467K33085k7131k43428k06102K8341K84560
35448I09049L49838J10663k27900k75256J9676K21989J6262l05773k93872m4116
$$ plain form
35438 480560 480283 303457 166929 374668 727542 739684 381753 146490 321511 642515
35428 642515 811388 920054 1107110 1193814 1031965 912809 1191027 1678190 1846265 1548843
35418 1548843 1142824 949477 985096 1190137 1504912 1686883 1465947 980605 701942 818620
35408 818620 1031550 1054340 959156 895630 832440 763663 836509 1052911 1130025 880327 491254
35397 491254 245786 209293 340995 621709 901847 943148 807858 869170 1217294 1429548
35387 1429548 1206863 853584 784867 931872 1026815 1104700 1256884 1235396 847611 456689
35377 456689 496486 725569 608812 257602 270792 722298 1072023 1117817 1240045 1525526
35367 1525526 1463308 898546 568233 1101335 1982222 2161771 1435997 607222 364327 541897
$$ packed form
35438D80560k77j76826j36528K07739L52874J2142l57931k35263J75021L21004
35428F42515J68873J08666J87056Q6704j61849j19156K78218M87163J68075k97422
35418A548843m06019j93347L5619K05041L14775J81971k20936m85342k78663J16678
35408H18620K12930K2790r5184o3526o3190o8777P2846K16402P7114k49698l89073
35397D91254k45468l6493J31702K80714K80138M1301j35290O1312L48124K12254
35387A429548k22685l53279o8717J47005R4943P7885J52184k1488l87785l90922
35377D56689L9797K29083j16757l51210J3190M51506L49725M5794J22228K85481
35367A525526o2218n64762l30313N33102Q80887J79549p25774q28775k42895J77570
$$ plain form
35357 541897 573635 292360 72801 311513 908201 1317025 1147832 642166 395766 655230
35347 655230 1121864 1428935 1486052 1294456 822153 275828 141484 624328 1279550 1532460
35337 1532460 1395000 1324796 1495431 1586111 1293358 730190 252574 120905 380947 864335
35327 864335 1240554 1259413 1029353 904743 1028157 1158424 1068532 932258 1081901 1449309
35317 1449309 1533013 1030892 308072 31587 407080 969708 1128306 745235 161733 -159715
35307 -159715 44787 675908 1289882 1424039 1040271 543668 289406 249632 264678 358793
35297 358793 584206 789675 845123 908312 1130617 1272242 1029723 633591 624398 1029861
35287 1029861 1277862 1047501 710926 698452 874975 892242 805762 904860 1133107 1138324
$$ packed form
35357E41897L1738k81275k19559K38712N96688M08824j69193n05666k46400K59464
35347F55230M66634L07071N7117j91596m72303n46325j34344M82844O55222K52910
35337A532460j37460p0204J70635R0680k92753n63168m77616j31669K60042M83388
35327H64335L76219J8859k30060j24610J23414J30267q9892j36274J49643L67408
35317A449309Q3704n02121p22820k76485L75493N62628J58598l83071n83502l21448
35307a59715K04502O31121O13974J34157l83768m96603k54262l9774J5046R4115
35297C58793K25413K05469N5448O3189K22305J41625k42519l96132r193M05463
35287A029861K48001k30361l36575j2474J76523J7267q6480R9098K28247N217
$$ plain form
35277 1138324 862997 682985 866583 1194915 1289023 1123563 995350 1050223 1090997 944929
35267 944929 811466 1001584 1418126 1609864 1381990 1030030 854771 805461 810507 1055451
35257 1055451 1564865 1870375 1593140 1090887 970413 1168763 1150458 865526 774078 945377
35247 945377 932292 664439 651675 1026569 1177145 754391 326114 494387 985569 1215642
35237 1215642 1204770 1257371 1217916 822238 447835 686482 1335646 1603474 1271829 922080
35227 922080 969490 1175989 1259893 1342341 1534800 1608739 1391605 1117203 1080627 1195906
35217 1195906 1142018 785067 294256 -36163 -540 354030 744870 946780 1016735 1087750
35207 1087750 1085544 909129 754642 901980 1244100 1405397 1299454 1166354 1054464 729809
$$ packed form
35277A138324k75327j80012J83598L28332R4108j65460j28213N4873M0774j46068
35267I44929j33463J90118M16542J91738k27874l51960j75259m9310N046K44944
35257A055451N09414L05510k77235n02253j20474J98350j8305k84932r1448J71299
35247I45377j3085k67853j2764L74894J50576m22754m28277J68273M91182K30073
35237A215642j0872N2601l9455l95678l74403K38647O49164K67828l31645l49749
35227I22080M7410K06499Q3904Q2448J92459P3939k17134k74402l6576J15279
35217A195906n3888l56951m90811l30419L5623L54570L90840K01910O9955P1015
35207A087750k206j76415j54487J47338L42120J61297j05943j33100j11890l24655
$$ plain form
35197 729809 206866 -91771 75113 398010 499213 474420 658257 1075629 1423610 1474700
35187 1474700 1278158 1062670 1086295 1436847 1840767 1853594 1410180 985205 988226 1201475
35177 1201475 1126505 756694 624376 1061082 1750110 2140793 2053967 1704200 1319889 991292
35167 991292 820520 951704 1360637 1759740 1829296 1498243 951701 445823 182487 254322
35157 254322 562426 832441 866820 779524 848480 1139452 1417911 1440313 1186781 794972
35147 794972 425276 224321 266652 480430 732845 967334 1130651 1069328 739985 424308
35137 424308 402957 493518 342081 125924 381476 1037764 1304639 833973 325420 479681
35127 479681 944089 955529 551677 354850 464559 421111 146979 83132 356697 587385
$$ packed form
35197G29809n22943k98637J66884L22897J01203k4793J83837M17372L47981N1090
35187A474700j96542k15488K3625L50552M03920J2827m43414m24975L021K13249
35177A201475p4970l69811j32318M36706O89028L90683q6826l49767l84311l28597
35167I91292j70772J31184M08933L99103O9556l31053n46542n05878k63336P1835
35157B54322L08104K70015L4379q7296O8956K90972K78459K2402k53532l91809
35147G94972l69696k00955M2331K13778K52415K34489J63317o1323l29343l15677
35137D24308k1351R0561j51437k16157K55552O56288K66875m70666n08553J54261
35127D79681M64408J1440m03852j96827J09709m3448k74132o3847K73565K30688
$$ plain form
35117 587385 645041 872731 1345663 1581731 1296010 877469 777690 901302 942137 909241
35107 909241 968696 1095662 1199759 1319502 1442632 1421076 1288572 1350623 1720995 2077714
35097 2077714 2123054 1978949 1880645 1805441 1693251 1718467 1998749 2280415 2249795 1966834
35087 1966834 1708373 1586022 1583322 1731891 1949023 1931749 1547864 1140846 1112477 1368606
35077 1368606 1498672 1338259 1027095 672538 301890 15546 -138769 -300324 -489196
35068 -489196 -373852 254945 981838 1236133 1117044 1172815 1428056 1321118 722839 296357
35058 296357 490374 789271 503609 -121554 -229565 419426 1182234 1487566 1473339 1513352
35048 1513352 1604696 1540704 1364139 1267217 1195831 916969 455056 153421 242145 575950
$$ packed form
35117E87385N7656K27690M72932K36068k85721m18541r9779J23612M0835l2896
35107I09241N9455J26966J04097J19743J23130k1556j32504O2051L70372L56719
35097B077714M5340j44105r8304p5204j12190K5216K80282K81666l0620k82961
35087A966834k58461j22351k700J48569K17132j7274l83885m07018k8369K56129
35077A368606J30066j60413l11164l54557l70648k86344j54315j61555j88872
35068d89196J15344O28797P26893K54295j19089N5771K55241j06938n98279m26482
35058B96357J94017K98897k85662o25163j08011O48991P62808L05332j4227M0013
35048A513352R1344o3992j76565r6922p1386k78862m61913l01635Q8724L33805
$$ plain form
35038 575950 880860 1062068 1160297 1174309 1075776 909407 774985 781456 1045078 1562572
35028 1562572 2015782 1941807 1290617 624771 521641 913272 1268044 1290639 1133486 1001393
35018 1001393 902034 803019 726569 638401 501745 466933 734282 1192249 1472772 1423688
35008 1423688 1256017 1169558 1123833 1058080 1042669 1104492 1168923 1258308 1460306 1632412 1492888
34997 1492888 1118402 951811 1129449 1222061 926351 603848 731103 1136783 1257540 949530
34987 949530 570295 368132 259289 183904 232002 344967 281086 23870 -75912 246626
34977 246626 771080 1028370 830547 416537 126483 71502 147678 265908 441029 647118
34967 647118 732941 596918 341747 111971 -99014 -273821 -159630 413145 1074117 1224944
$$ packed form
35038E75950L04910J81208R8229J4012r8533j66369j34422O471K63622N17494
35028A562572M53210p3975o51190o65846j03130L91631L54772K2595j57153j32093
35018A001393r9359r9015p6450q8168j36656l4812K67349M57967K80523m9084
35008A423688j67671q6459m5725o5753j5411O1823O4431Q9385K01998J72106j39524
34997A492888l74486j66591J77638R2612k95710l22503J27255M05680J20757l08010
34987I49530l79235k02163j08843p5385M8098J12965o3881k57216r9782L22538
34977B46626N24454K57290j97823m14010k90054n4981P6176J18230J75121K06089
34967F47118Q5823j36023k55171k29776k10985j74807J14191N72775O60972J50827
$$ plain form
34957 1224944 862333 620784 850321 1154786 1120334 992751 1172268 1433946 1249300 697333
34947 697333 456734 882654 1573514 1950348 1897910 1704543 1641745 1755675 1931199 2058212
34937 2058212 2159697 2315822 2441134 2310771 1926178 1651703 1783211 2145293 2334759
34928 2334759 2204752 1877035 1453382 1008899 737136 781690 991625 1120470 1194160 1405043
34918 1405043 1710529 1833714 1649776 1330003 1115116 1130556 1356121 1589533 1548816 1219712
34908 1219712 966357 1065705 1303364 1322396 1194851 1271934 1583747 1799866 1749194 1587900
34898 1587900 1444338 1262795 1039036 885553 818123 760896 767868 939245 1130216 1088873
34888 1088873 903899 941340 1255552 1435746 1199045 817478 731301 954338 1101302 915571
$$ packed form
34957A224944l62611k41549K29537L04465l4452j27583J79517K61678j84646n51967
34947F97333k40599M25920O90860L76834n2438j93367o2798J13930J75524J27013
34937B058212J01485J56125J25312j30363l84593k74475J31508L62082J89466
34928B334759j30007l27717m23653m44483k71763M4554K09935J28845P3690K10883
34918A405043L05486J23185j83938l19773k14887J5440K25565K33412m0717l29104
34908A219712k53355R9348K37659J9032j27545P7083L11813K16119n0672j61294
34898A587900j43562j81543k23759j53483o7430n7227O972J71377J90971m1343
34888A088873j84974L7441L14212J80194k36701l81567q6177K23037J46964j85731
$$ plain form
34878 915571 592179 560739 988605 1531113 1667788 1312921 920374 889609 1101756 1229231
34868 1229231 1242207 1307215 1398199 1368187 1255147 1163197 992631 663373 442721 616717
34858 616717 972162 1077989 967766 1025672 1281370 1398645 1345240 1456853 1775461 1945018
34848 1945018 1878361 1882808 1942419 1572857 729960 208003 631878 1552169 2087135 2078679
34838 2078679 2028751 2151507 2116872 1699871 1184879 1020560 1349346 1934748 2386345 2454691
34828 2454691 2206365 1873650 1537085 1145682 865310 1067943 1788611 2487629 2620413
34819 2620413 2239203 1789412 1528283 1437913 1523200 1814796 2117703 2097826 1701500 1281164
34809 1281164 1208204 1467696 1701361 1594769 1172496 725091 497308 508804 658964 871713
$$ packed form
34878I15571l23392l1440M27866N42508J36675l54867l92547l0765K12147J27475
34868A229231J2976O5008R0984l0012j13040r1950j70566l29258k20652J73996
34858F16717L55445J05827j10223N7906K55698J17275n3405J11613L18608J69557
34848A945018o6657M447N9611l69562q42897n21957M23875R20291N34966q456
34838B078679m9928J22756l4635m17001n14992j64319L28786N85402M51597O8346
34828B454691k48326l32715l36565l91403k80372K02633P20668O99018J32784
34819B620413l81210m49791k61129r0370Q5287K91596L02907j9877l96326m20336
34809A281164p2960K59492K33665j06592m22273m47405k27783J1496J50160K12749
$$ plain form
34799 871713 1085995 1260919 1481738 1874575 2302456 2410842 2171227 2050021 2308884 2487311
34789 2487311 2076325 1415314 1273728 1697416 1985703 1791109 1500634 1429522 1387116 1271137
34779 1271137 1381279 1795472 2046959 1813088 1408350 1228134 1203314 1175565 1304266 1671345
34769 1671345 1935038 1821067 1569146 1494917 1509738 1455536 1472474 1622163 1619796 1406440
34759 1406440 1488122 2141148 2747675 2578922 1856632 1348165 1243051 1179169 1116640 1350093
34749 1350093 1749657 1800248 1448310 1210706 1346339 1554875 1624457 1766153 2087908 2258495
34739 2258495 1984135 1460124 1098568 1053576 1188357 1320762 1384114 1464504 1684472 1947419
34729 1947419 1928507 1507449 1032409 890524 1002644 1059803 1060814 1219066 1492531 1643032
$$ packed form
34799H71713K14282J74924K20819L92837M27881J08386k39615j21206K58863J78427
34789B487311m10986o61011j41586M23688K88287j94594k90475p1112m2406j15979
34779A271137J10142M14193K51487k33871m04738j80216k4820k7749J28701L67079
34769A671345K63693j13971k51921p4229J4821n4202J6938J49689k367k13356
34759A406440Q1682O53026O06527j68753p22290n08467j05114o3882o2529K33453
34749A350093L99564N0591l51938k37604J35633K08536O9582J41696L21755J70587
34739B258495k74360n24011l61556m4992J34781J32405O3352Q0390K19968K62947
34729A947419j8912m21058m75040j41885J12120N7159J011J58252K73465J50501
$$ plain form
34719 1643032 1663939 1725076 1784153 1692307 1604009 1803154 2150585 2188460 1821630 1445067
34709 1445067 1352853 1458798 1653189 1977197 2329802 2431390 2251713 2127465 2286988 2545737
34699 2545737 2617877 2478192 2281839 2125879 1996466 1823690 1572369 1375350 1456801 1756345
34689 1756345 1832363 1420102 883605 757341 1029413 1293323 1424831 1614851 1872721 2043671
34679 2043671 2223876 2570378 2763504 2329055 1526369 1194153 1548519 1854173 1591485
34670 1591485 1263506 1568181 2305227 2681816 2390298 1852077 1550460 1555626 1651080 1617895
34660 1617895 1406852 1197636 1230149 1497900 1745738 1827919 1865848 1977506 2088074 2116204
34650 2116204 2115356 2105954 1981043 1704848 1425706 1301305 1373203 1630286 1977425 2151915
$$ packed form
34719A643032K0907O1137N9077r1846q8298J99145L47431L7875l66830l76563
34709A445067r2214J05945J94391L24008L52605J01588j79677j24248J59523K58749
34699B545737P2140j39685j96353j55960j29413j72776k51321j97019Q1451K99544
34689A756345P6018m12261n36497j26264K72072K63910J31508J90020K57870J70950
34679B043671J80205L46502J93126m34449q02686l32216L54366L05654k62688
34670A591485l27979L04675P37046L76589k91518n38221l01617N166R5454l3185
34660A617895k11043k09216L2513K67751K47838Q2181L7929J11658J10568K8130
34650B116204q48r402j24911k76195k79142j24401P1898K57083L47139J74490
$$ plain form
34640 2151915 1969357 1679187 1739874 2166893 2452075 2255410 1842015 1660469 1778837 1936158
34630 1936158 1931407 1785837 1670658 1758474 1997701 2053564 1705762 1249588 1169978 1445656
34620 1445656 1580000 1347152 1060500 1008552 1086186 1152230 1316429 1649664 1983698 2210148
34610 2210148 2428974 2619830 2549783 2211200 1952206 1934197 1862195 1527590 1207923 1186621
34600 1186621 1260081 1139791 1036541 1368197 2051073 2520090 2413382 1923662 1489547 1361934
34590 1361934 1458665 1506804 1349633 1137177 1110783 1248755 1349449 1412037 1603069 1857360
34580 1857360 1916751 1809503 1848065 2065401 2134274 1967204 1862843 1880502 1666085 1180745
34570 1180745 983230 1379067 1866722 1927423 1834306 2090093 2517019 2566933 2202557 1822020
$$ packed form
34640B151915j82558k90170O0687M27019K85182j96665m13395j81546J18368J57321
34630A936158m751j45570j15179Q7816K39227N5863l47802m56174p9610K75678
34620A445656J34344k32848k86652n1948P7634O6044J64199L33235L34034K26450
34610B210148K18826J90856p0047l38583k58994j8009p2002l34605l19667k1302
34600A186621P3460j20290j03250L31656O82876M69017j06708m89720m34115j27613
34590A361934R6731M8139j57171k12456k6394J37972J00694O2588J91032K54291
34580A857360N9391j07248L8562K17336O8873j67070j04361J7659k14417m85340
34570A180745j97515L95837M87655O0701r3117K55787M26926M9914l64376l80537
$$ plain form
34560 1822020 1579165 1414165 1498314 1950004 2292316 1939231 1169658 904080 1469223 2242494
34550 2242494 2611845 2634634 2559365 2325428 1889746 1591744 1782558 2325059 2754784 2778950
34540 2778950 2429472 1903842 1452821 1296079 1457647 1718060 1825161 1739508 1658099 1823820
34530 1823820 2268850 2694804 2698620 2223341 1699975 1617018 2016916 2517387 2723744 2503725
34520 2503725 1992758 1501934 1329374 1502476 1769471 1932459 2044763 2172487 2176171 1939713
34510 1939713 1648059 1589587 1782249 2011029 2148770 2237000 2317210 2360871 2321580 2149819
34500 2149819 1853391 1622263 1717375 2110034 2424333 2391297 2160123 1987841 1848530 1589147
34490 1589147 1281400 1137160 1182749 1262713 1302301 1375718 1560044 1840101 2097057 2157952
$$ packed form
34560A822020k42855j65000Q4149M51690L42312l53085p69573k65578N65143P73271
34550B242494L69351K2789p5269k33937m35682k98002J90814N42501M29725K4166
34540B778950l49478n25630m51021j56742J61568K60413J07101q5653q1409J65721
34530A823820M45030M25954L816m75279n23366q2957L99898N00471K06357k20019
34520B503725n10967m90824j72560J73102K66995J62988J12304J27724L684k36458
34510A939713k91654n8472J92662K28780J37741Q8230Q0210M3661l9291j71761
34500B149819k96428k31128R5112L92659L14299l3036k31174j72282j39311k59383
34490A589147l07747j44240M5589P9964L9588P3417J84326K80057K56956O0895
$$ plain form
34480 2157952 2000890 1916554 2227285 2808669 3174391 3094028 2808451 2579109 2420110 2369743
34470 2369743 2552544 2783873 2602539 1965166 1442600 1428639 1629181 1671353 1706179 1971527
34460 1971527 2240146 2219516 2098930 2179599 2326756 2300499 2258049 2391173 2443956 2172117
34450 2172117 1905115 2009062 2148634 1810699 1277382 1292060 1926238 2543599 2784334 2835568
34440 2835568 2787299 2487659 2079523 1976007 2201422 2360562 2325297 2356369 2483613 2379054
34430 2379054 1976266 1670797 1750817 2066517 2341433 2400711 2101710 1505323 1094433 1320369
34420 1320369 1940425 2302753 2248991 2190303 2328703 2420252 2348392 2314641 2351476 2210093
34410 2210093 1862973 1615363 1610309 1682812 1750630 1876344 1945314 1805717 1711705 2048893
$$ packed form
34480B157952j57062q4336L10731N81384L65722q0363k85577k29342j58999n0367
34470B369743J82801K31329j81334o37373n22566j3961K00542M2172L4826K65348
34460A971527K68619k0630j20586Q0669J47157k6257m2450J33124N2783k71839
34450B172117k67002J03947J39572l37935n33317J4678O34178O17361K40735N1234
34440B835568m8269k99640m08136j03516K25415J59140l5265L1072J27244j04559
34430B379054m02788l05469Q0020L15700K74916N9278k99001n96387m10890K25936
34420A320369O20056L62328n3762n8688J38400R1549p1860l3751L6835j41383
34410B210093l47120k47610n054P2503O7818J25714O8970j39597r4012L37188
$$ plain form
34400 2048893 2619672 2821007 2561898 2358766 2463843 2573334 2495285 2412340 2341844 2038689
34390 2038689 1617434 1560006 1869168 1922138 1464983 1070322 1240664 1675863 1837057 1706528
34380 1706528 1590609 1618987 1780654 2051855 2238263 2117009 1906525 2080880 2563585 2731576
34370 2731576 2437001 2318615 2755596 3223395 3166437 2873085 2909393 3192420 3224790 2885655
34360 2885655 2460782 2172821 2106678 2312884 2620625 2649439 2316663 1995521 1907949 1796514
34350 1796514 1510796 1429455 1877331 2546383 2939467 3023165 3022319 2939022 2729102 2632139 2860120
34339 2860120 3194507 3283589 3118668 2892290 2640240 2338223 2103783 2022035 2015816 2089606
34329 2089606 2375224 2740147 2759242 2337693 1958942 2029936 2369136 2612431 2709922 2734218
$$ packed form
34400B048893N70779K01335k59109k03132J05077J09491p8049q2945p0496l03155
34390B038689m21255n7428L09162N2970m57155l94661J70342M35199J61194j30529
34380A706528j15919K8378J61667K71201J86408j21254k10484J74355M82705J67991
34370B731576k94575j18386M36981M67799n6958k93352L6308K83027L2370l39135
34360B885655m24873k87961o6143K06206L07741K8814l32776l21142q7572j11435
34350A796514k85718q1341M47876O69052L93084Q3698q46q3297k09920r6963K27981
34339B860120L34387Q9082j64921k26378k52050l02017k34440q1748o219P3790
34329B089606K85618L64923J9095m21549l78751P0994L39200K43295R7491K4296
$$ plain form
34319 2734218 2623187 2421868 2376375 2509134 2521504 2360960 2391227 2725447 2930561 2724095
34309 2724095 2426916 2374963 2430459 2436970 2571600 2838920 2816713 2354386 1927498 1845080
34299 1845080 1757368 1460853 1471635 2135069 2835103 2858751 2477270 2375741 2536658 2537144
34289 2537144 2485518 2747853 3096540 3047004 2787787 2887951 3260486 3281133 2844066 2496666
34279 2496666 2549015 2747076 2809180 2679720 2322478 1839261 1676919 2131662 2773417 2941724
34269 2941724 2669890 2523888 2675131 2773417 2658078 2573622 2680445 2859261 2985108 2993465
34259 2993465 2784218 2431447 2290274 2518057 2760542 2705273 2591106 2725250 2921940 2949406
34249 2949406 3070877 3518544 3893597 3789113 3551455 3651932 3769156 3386939 2886732
$$ packed form
34319B734218j11031k01319m5493J32759J2370j60544L0267L34220K05114k06466
34309B724095k97179n1953N5496O511J34630K67320k2207m62327m26888q2418
34299A845080q7712k96515J0782O63434P00034K3648l81481j01529J60917M86
34289B537144n1626K62335L48687m9536k59217J00164L72535K0647m37067l47400
34279B496666N2349J98061O2104j29460l57242m83217j62342M54743O41755J68307
34269B941724k71834j46002J51243R8286j15339q4456J06823J78816J25847Q357
34259B993465k09247l52771j41173K27783K42485n5269j14167J34144J96690K7466
34249B949406J21471M47667L75053j04484k37658J00477J17224l82217n00207
$$ plain form
34240 2886732 3039688 3716331 4147437 4238673 4512902 4865530 4567688 3607039 2912206 2988876
34230 2988876 3299175 3297656 3212589 3435629 3862063 4194595 4332144 4222005 3865706 3611831
34220 3611831 3866323 4396768 4526727 4135171 3836728 4024445 4361119 4425032 4290429 4226546
34210 4226546 4283959 4384923 4456139 4364228 4055732 3772412 3782972 3961637 3985482 3810032
34200 3810032 3575964 3283377 3003478 3096669 3662712 4109183 3920203 3520571 3634714 4116505
34190 4116505 4271094 4064563 4056777 4297346 4290495 4019446 4029328 4431672 4724556 4688100 4623575
34179 4623575 4627613 4433264 4046996 3796911 3729064 3671149 3798481 4335819 4835860 4662590
34169 4662590 4086956 3942361 4281796 4405872 4172408 4173185 4563079 4817885 4772357 4832532
$$ packed form
34240B886732J52956O76643M31106R1236K74229L52628k97842r60649o94833P6670
34230B988876L10299j519q5067K23040M26434L32532J37549j10139l56299k53875
34220C611831K54492N30445J29959l91556k98443J87717L36674O3913j34603o3883
34210D226546N7413J00964P1216r1911l08496k83320J0560J78665K3845j75450
34200C810032k34068k92587k79899R3191N66043M46471j88980l99632J14143M81791
34190D116505J54589k06531p786K40569o851k71049R882M02344K92884l6456o4525
34179D623575M038j94349l86268k50085o7847n7915J27332N37338N00041j73270
34169D662590n75634j44595L39435J24076k33464P77L89894K54806m5528O0175
$$ plain form
34159 4832532 5028559 4913542 4534490 4447778 4657462 4626836 4436779 4753571 5498351 5780539
34149 5780539 5373867 5019068 5017244 4827799 4382732 4433738 5127392 5559764 5301731 5097744
34139 5097744 5447700 5739414 5463522 5107763 5131752 5168952 4960291 4996662 5509081 5866284
34129 5866284 5689111 5529683 5748806 5794927 5342976 5060350 5413120 5747473 5429730 4930990
34119 4930990 4905338 5113868 5130031 5213879 5613906 5863792 5634283 5455741 5773902 6125654
34109 6125654 6050489 5947669 6210166 6395989 6114214 5863783 6123608 6455391 6363343 6195280
34099 6195280 6350987 6476467 6297037 6340457 6942530 7445455 7290702 6985474 7067409 7083305
34089 7083305 6586106 6171195 6458000 6964157 7051480 7053071 7375018 7456010 6800025 6100293
$$ packed form
34159D832532J96027j15017l79052q6712K09684l0626j90057L16792P44780K82188
34149E780539m06672l54799j824j89445m45067N1006O93654M32372k58033k03987
34139E097744L49956K91714k75892l55759K3989L7200k08661L6371N12419L57203
34129E866284j77173j59428K19123M6121m51951k82626L52770L34353l17743m98740
34119D930990k5652K08530J6163Q3848M00027K49886k29509j78542L18161L51752
34109F125654p5165j02820K62497J85823k81775k50431K59825L31783r2048j68063
34099F195280J55707J25480j79430M3420O02073N02925j54753l05228Q1935J5896
34089G083305m97199m14911K86805N06157Q7323J591L21947Q0992o55985o99732
$$ plain form
34079 6100293 6109744 6321778 6047767 5856841 6531686 7457256 7561406 7137248 7203277 7668456
34069 7668456 7678198 7293862 7296567 7661931 7669756 7295366 7185993 7442786 7585615 7523297 7527741
34058 7527741 7513221 7285146 7164042 7494567 7965874 8210448 8487551 8976091 9139406 8679564
34048 8679564 8290926 8503638 8680921 8208962 7712093 7924300 8344081 8279859 8245089 8938903
34038 8938903 9779749 9889280 9648304 9831447 10086150 9754551 9323357 9540889 9962301
34029 9962301 9880980 9783413 10323594 10825467 10449973 9876157 10119914 10674191 10584810 10336996
34019 10336996 10799385 11338067 10975804 10419023 10852211 11693762 11703124 11349167 11817611 12597157
34009 12597157 12429645 11819897 12164087 13130337 13344874 12975637 13198973 13805977 13783147
$$ packed form
34079F100293R451K12034k74011j90926O74845R25570J04150m24158O6029M65179
34069G668456R742l84336K705L65364P825l74390j09373K56793J42829o2318M444
34058G527741j4520k28075j21104L30525M71307K44574K77103M88540J63315m59842
34048H679564l88638K12712J77283m71959m96869K12207M19781o4222l4770O93814
34038H938903Q40846J09531k40976J83143K54703l31599m31194K17532M21412
34029I962301q1321r7567N40181N01873l75494n73816K43757N54277q9381k47814
34019A0336996M62389N38682l62263n56781M33188Q41551R362l53957M68444P79546
34009A2597157j67512o09748L44190R66250K14537l69237K23336O07004k2830
$$ plain form
34000 13783147 13536071 14077026 14821201 14713996 14600973 15768176 17136748 16862054 15757057
33991 15757057 15972275 17173474 17386661 16839826 17395879 18769709 18981601 18166436 18271814
33982 18271814 19298467 19512300 19074624 19715835 21103835 21367889 20916486 21772569 23447541
33973 23447541 23632767 22700018 23176608 24984583 25695167 25285830 25954488 27450526 27549754
33964 27549754 26941365 28378627 31156773 32012051 31340041 32558409 35450480 36609857
33956 36609857 36419443 38536778 42363072 43710304 43253137 45932701 51395586 54213067
33948 54213067 54483210 58059033 64948902 68850982 70114467 76362134 87510142 94762233
33940 94762233 98271561 108644151 125431201 135418051 141673690 166580338 204234118
$$ packed form
34000A3783147k47076N40955P44175j07205j13023J167203J368572k74694j104997
33991A5757057K15218J201199K13187n46835N56053J373830K11892q15165J05378
33982A8271814J026653K13833m37676O41211J388000K64054m51403Q56083J674972
33973B3447541J85226r32749M76590J807975P10584m09337O68658J496038R9228
33964B7549754o08389J437262K778146Q55278o72010J218368K892071J159377
33956C6609857j90414K117335L826294J347232m57167K679564N462885K817481
33948E4213067K70143L575823O889869L902080J263485O247667J1148008P252091
33940I4762233L509328J0372590J6787050R986850O255639K4906648L7653780
$$ plain form
33933 204234118 196907354 97251871 -56960785 -170105626 -192211744 -160721761 -134819926
33926 -134819926 -126984943 -117234895 -100922539 -90749396 -88050650 -81761608 -70530100
33919 -70530100 -63708345 -62975134 -60917065 -56410450 -55869507 -59590657 -60429671 -56498962
33911 -56498962 -53443339 -53384825 -52105347 -48210401 -45586359 -45384665 -43978631 -40343150
33903 -40343150 -37966290 -38045131 -37593743 -35564802 -34497891 -34886401 -33922777 -31114955 -29526130
33894 -29526130 -30120815 -30121580 -28268972 -26741742 -26539435 -25699954 -23542331 -22277213 -22886714
33885 -22886714 -23376835 -22519241 -21651871 -21532017 -20937182 -19568397 -18981944 -19529689 -19557410
33876 -19557410 -18602762 -18249157 -18907208 -18882612 -17579655 -16595009 -16692947 -16630506 -15877639 -15594288
$$ packed form
33933B04234118p326764r9655483j54212656j13144841k2106118L1489983K5901835
33926a34819926P834983R750048J6312356J0173143K698746O289042J1231508
33919g0530100O821755P33211K058069M506615N40943l721150q39014L930709
33911e6498962L055623N8514J279478L894946K624042K01694J406034L635481
33903d0343150K376860p8841M51388K028941J066911l88510R63624K807822J588825
33894b9526130n94685p65J852608J527230K02307Q39481K157623J265118o09501
33885b2886714m90121Q57594Q67370J19854N94835J368785N86453n47745k7721
33876a9557410R54648L53605o58051K4596J302957R84646r7938O2441P52867K83351
$$ plain form
33866 -15594288 -16004790 -15683705 -14403492 -13881221 -14703648 -15234297 -14579743 -13980399 -14226794
33857 -14226794 -14299720 -13652697 -13330680 -13725079 -13641380 -12685912 -12213204 -12808794 -13145199 -12439744
33847 -12439744 -11778156 -11890538 -11872972 -11269072 -11166275 -11963568 -12228540 -11136007 -10003150
33838 -10003150 -10004565 -10292661 -9828957 -9274264 -9562154 -10202963 -10453134 -10716339 -11424308 -11881345
33828 -11881345 -11509539 -10995576 -11028701 -11089006 -10543954 -9778776 -9295732 -8876075 -8468194 -8633723
33818 -8633723 -9300038 -9402982 -8589901 -7924387 -8102137 -8388336 -8147325 -7929361 -8123581
33809 -8123581 -8044999 -7381097 -7079804 -7705420 -8302903 -8019708 -7526722 -7687672 -8095766 -8093137
33799 -8093137 -8028863 -8340776 -8536107 -8219674 -8026011 -8432643 -8752795 -8387778 -7962042 -8121705
$$ packed form
33866a5594288m10502L21085J280213N22271q22427n30649O54554N99344k46395
33857a4226794p2926O47023L22017l94399Q3699R55468M72708n95590l36405P05455
33847a2439744O61588j12382J7566O03900J02797p97293k64972J092533J132857
33838a0003150j415k88096M63704N54693k87890o40809k50171k63205p07969m57037
33828a1881345L71806N13963l3125o0305N45052P65178M83044M19657M07881j65529
33818h633723o66315j02944Q13081O65514j77750k86199K41011K17964j94220
33809h123581P8582O63902L01293o25616n97483K83195M92986j60950m08094K629
33799h093137O4274l11913j95331L16433J93663m06632l20152L65017M25736j59663
$$ plain form
33789 -8121705 -8330847 -7983738 -7589812 -7687248 -7686150 -7016281 -6365451 -6508716 -6904954 -6748603
33779 -6748603 -6454573 -6736741 -7077945 -6544742 -5451041 -4857319 -4948866 -5117059 -5145614 -5217035
33769 -5217035 -5240567 -5157720 -5360581 -5910681 -6032234 -5323107 -4704885 -5121723 -6030444 -6295114
33759 -6295114 -5905068 -5660123 -5751753 -5803582 -5808794 -5942403 -5910486 -5483431 -5182303 -5488865
33749 -5488865 -5920608 -5828870 -5506388 -5516568 -5565110 -5116619 -4543933 -4541965 -4905494 -4982196
33739 -4982196 -4851441 -4960363 -5065100 -4662763 -4075723 -4004948 -4347830 -4489459 -4410935 -4503359
33729 -4503359 -4651305 -4498178 -4250500 -4250720 -4176851 -3671944 -3310389 -3837716 -4835474 -5253273
33719 -5253273 -4929367 -4484735 -4059857 -3344943 -2624058 -2589246 -3197030 -3751759 -4023649 -4315251
$$ packed form
33789h121705k09142L47109L93926r7436J098O69869O50830j43265l96238J56351
33779f748603K94030k82168l41204N33203J093701N93722r1547j68193k8555p1421
33769e217035k3532Q2847k02861n50100j21553P09127O18222m16838r08721k64670
33759f295114L90046K44945r1630n1829n212j33609L1917M27055L01128l06562
33749e488865m31743R1738L22482j0180m8542M48491N72686J968l63529p6702
33739d982196J30755j08922j04737M02337N87040P0775l42882j41629P8524r2424
33729d503359j47946J53127K47678k20P3869N04907L61555n27327r97758m17799
33719e253273L23906M44632M24878P14914P20885L4812o07784n54729k71890k91602
$$ plain form
33709 -4315251 -4573446 -4421398 -3955707 -3601111 -3338680 -2952875 -2775119 -3211601 -3788348
33700 -3788348 -3701745 -3131947 -2982003 -3464731 -3959581 -4128228 -4155942 -4011421 -3496597 -2959680
33690 -2959680 -2976236 -3388325 -3585252 -3592168 -3896744 -4355733 -4346037 -3924206 -3760925 -3939089
33680 -3939089 -3862976 -3377577 -2964641 -2803510 -2625981 -2509486 -2810063 -3293481 -3348403 -3088823
33670 -3088823 -3218900 -3769070 -4021664 -3758176 -3509212 -3466211 -3233104 -2803796 -2697421 -2942135
33660 -2942135 -3008254 -2928174 -3321693 -4048793 -4069902 -3096713 -2221734 -2321606 -2873830 -3011900
33650 -3011900 -2811582 -2782716 -2860568 -2692990 -2395061 -2352686 -2667062 -3254958 -4072390 -4858850
33640 -4858850 -5129339 -4801079 -4408417 -4389762 -4579749 -4644189 -4558785 -4427617 -4269901 -4172588
$$ packed form
33709d315251k58195J52048M65691L54596K62431L85805J77756m36482n76747
33700c788348Q6603N69798J49944m82728m94850j68647k7714J44521N14824N36917
33690b959680j6556m12089j96927o916l04576m58989R696M21831J63281j78164
33680c939089P6113M85399M12936J61131J77529J16495l00577m83418n4922K59580
33670c088823j30077n50170k52594K63488K48964M3001K33107M29308J06375k44714
33660b942135o6119Q0080l93519p27100k1109R73189Q74979r9872n52224j38070
33650c011900K00318K8866p7852J67578K97929M2375l14376n87896q17432p86460
33640d858850k70489L28260L92662J8655j89987o4440Q5404J31168J57716R7313
$$ plain form
33630 -4172588 -4233439 -4266229 -4031353 -3762485 -3894244 -4287561 -4394931 -4184209 -4134613 -4285679
33620 -4285679 -4138969 -3616655 -3239558 -3182945 -3058405 -2842079 -3046329 -3649819 -3848346 -3317339
33610 -3317339 -2781940 -2812130 -2964209 -2734104 -2502919 -2807091 -3392871 -3745535 -3941914 -4236897
33600 -4236897 -4351558 -3940086 -3340699 -3135176 -3282329 -3328400 -3190901 -3139950 -3239567 -3341577
33590 -3341577 -3445158 -3621755 -3762677 -3744729 -3637315 -3492203 -3223421 -2921215 -2895862 -3140562
33580 -3140562 -3176953 -2757198 -2302725 -2285942 -2559703 -2677470 -2548178 -2405836 -2389889 -2463552
33570 -2463552 -2550102 -2567762 -2527631 -2619925 -2906949 -3036874 -2741347 -2467211 -2816765 -3446882
33560 -3446882 -3408816 -2638948 -2108835 -2266140 -2398946 -1979958 -1574251 -1768858 -2157379 -2160912
$$ packed form
33630d172588o0851l2790K34876K68868j31759l93317j07370K10722M9596j51066
33620d285679J46710N22314L77097N6613J24540K16326k04250o03490j98527N31007
33610c317339N35399l0190j52079K30105K31185l04172n85780l52664j96379k94983
33600d236897j14661M11472N99387K05523j47153m6071J37499N0951r9617j02010
33590c341577j03581j76597j40922J7948J07414J45112K68782L02206K5353k44700
33580c140562l6391M19755M54473J6783k73761j17767J29292J42342J5947p3663
33570b463552q6550j7660M0131r2294k87024j29925K95527K74136l49554o30117
33560c446882L8066P69868N30113j57305j32806M18988M05707j94607l88521l533
$$ plain form
33550 -2160912 -2043489 -2291015 -2673702 -2740096 -2625899 -2587336 -2347306 -1728474 -1339498 -1732770
33540 -1732770 -2389367 -2463797 -2103790 -2094297 -2554040 -2941401 -3090406 -3298078 -3536030 -3444614
33530 -3444614 -3031922 -2637604 -2323977 -1993321 -1906947 -2321757 -2778773 -2570410 -1853023 -1519782
33520 -1519782 -1963407 -2671690 -3078352 -3153710 -3085211 -2959651 -2860441 -2832894 -2733795 -2471543
33510 -2471543 -2266152 -2293225 -2310717 -2090529 -1914329 -2092916 -2320329 -2153558 -1825359 -1845381
33500 -1845381 -2066148 -1973616 -1710866 -1903983 -2526993 -2849727 -2583794 -2231984 -2166883 -2167856
33490 -2167856 -2060868 -2054549 -2191662 -2157643 -1904978 -1834046 -2072710 -2175434 -1856046 -1483521
33480 -1483521 -1500291 -1782752 -1912377 -1752584 -1500069 -1424380 -1688780 -2151181 -2314074 -1839706
$$ packed form
33550b160912J17423k47526l82687o6394J14197L8563K40030O18832L88976l93272
33540a732770o56597p4430L60007R493m59743l87361j49005k07672k37952R1416
33530c444614M12692L94318L13627L30656Q6374m14810m57016K08363P17387L33241
33520a519782m43625p08283m06662p5358O8499J25560R9210K7547R9099K62252
33510b471543K05391k7073j7492K20188J76200j78587k27413J66771L28199k0022
33500a845381k20767R2532K62750j93117o23010l22734K65933L51810O5101r73
33490b167856J06988O319j37113L4019K52665P0932k38664j02724L19388L72525
33480a483521j6770k82461j29625J59793K52515P5689k64400m62401j62893M74368
$$ plain form
33470 -1839706 -1123063 -909241 -1314108 -1726142 -1748715 -1682377 -1898765 -2264361 -2447672 -2377908
33460 -2377908 -2150660 -1831579 -1560723 -1532792 -1707628 -1823970 -1780700 -1693441 -1573428 -1358089
33450 -1358089 -1246113 -1486955 -1806319 -1645159 -1088245 -887054 -1311629 -1662984 -1326676
33441 -1326676 -676201 -389340 -411097 -278967 -102821 -432720 -1254055 -1844939 -1761991 -1402722
33431 -1402722 -1342198 -1530074 -1502259 -1167595 -959881 -1150694 -1348735 -982349 -168607 295384
33421 295384 -50764 -668574 -691792 -27156 628093 754865 528399 335011 239802 137157
33411 137157 87789 212328 396622 343677 -76411 -613779 -813241 -468282 83009 274183
33401 274183 2054 -230142 -20281 385674 551821 551442 759682 1162718 1399605 1379531
$$ packed form
33470a839706P16643K13822m04867m12034k2573O6338k16388l65596j83311O9764
33460b377908K27248L19081K70856K7931j74836j16342M3270Q7259J20013K15339
33450a358089J11976k40842l19364J61160N56914K01191m24575l51355L36308
33441a326676O50475K86861k1757J32130J76146l29899q21335n90884Q2948L59269
33431a402722O0524j87876K7815L34664K07714j90813j98041L66386Q13742M63991
33421B95384l46148o17810k3218O64636O55249J26772k26466j93388r5209j02645
33411A37157m9368J24539J84294n2945m20088n37368j99462L44959N51291J91174
33401B74183k72129k32196K09861M05955J66147l79K08240M03036K36887k0074
$$ plain form
33391 1379531 1302710 1090983 363371 -936156 -2376858 -3598443 -4568525 -5215048 -5328988
33382 -5328988 -5003312 -4687454 -4592434 -4468190 -4167800 -3975188 -4099467 -4260348 -4116956 -3794980
33372 -3794980 -3655202 -3771191 -3925372 -3934353 -3736897 -3331825 -2844310 -2519232 -2493869 -2694100
33362 -2694100 -3006432 -3350494 -3547039 -3399044 -2994799 -2650796 -2467050 -2254975 -2013328
33353 -2013328 -2097672 -2686842 -3383324 -3621388 -3289451 -2746049 -2395335 -2422547 -2772639 -3193288
33343 -3193288 -3389005 -3247923 -2867404 -2393541 -1989706 -1874209 -2109823 -2398607 -2406405 -2266055
33333 -2266055 -2387943 -2767540 -2913240 -2553836 -2002628 -1676177 -1624996 -1686142 -1740253 -1668804
33323 -1668804 -1402948 -1151656 -1240211 -1617689 -1897927 -1969548 -2117402 -2430326 -2609708 -2553292
$$ packed form
33391A379531p6821k11727p27612j299527j440702j221585r70082o46523j13940
33382e328988L25676L15858R5020J24244L00390J92612j24279j60881J43392L21976
33372c794980J39778j15989j54181q981J97456M05072M87515L25078K5363k00231
33362b694100l12332l44062j96545J47995M04245L44003J83746K12075K41647
33353b013328q4344n89170o96482k38064L31937N43402L50714k7212l50092m20649
33343c193288j95717J41082L80519M73863M03835J15497k35614k88784p798J40350
33333b266055j21888l79597j45700L59404N51208L26451N1181o1146n4111P1449
33323a668804K65856K51292q8555l77478k80238p1621j47854l12924j79382N6416
$$ plain form
33313 -2553292 -2575744 -2774936 -2742926 -2283908 -1878424 -1945304 -2115383 -1833967 -1340146 -1386443
33303 -1386443 -2138029 -2956211 -3261428 -3110685 -2860033 -2668566 -2486712 -2283406 -2118969
33294 -2118969 -2054604 -2048317 -1979559 -1842557 -1832182 -2051820 -2227753 -2025764 -1607989 -1477033
33284 -1477033 -1745238 -2007835 -2014627 -1955587 -1921885 -1639183 -1028877 -535321 -529844 -794600
33274 -794600 -938180 -937241 -942399 -944792 -964780 -1168871 -1482692 -1534507 -1309092 -1334102 -1817956
33263 -1817956 -2180411 -1953142 -1558992 -1555553 -1665546 -1343833 -841484 -809233 -1164446 -1286421
33253 -1286421 -1135002 -1214503 -1513585 -1473349 -1081792 -1036740 -1594311 -2133251 -2192003 -2134014
33243 -2134014 -2343269 -2465478 -2019110 -1259383 -853473 -1004928 -1388741 -1723383 -1958221
$$ packed form
33313b553292k2452j99192L2010M59018M05484o6880j70079K81416M93821m6297
33303a386443p51586q18182l05217J50743K50652J91467J81854K03306J64437
33294b118969O4365O287O8758J37002J0375k19638j75933K01989M17775J30956
33284a477033k68205k62597o792N9040L3702K82702O10306M93556N477k64756
33274g94600j43580R39n158k393j9988k04091l13821n1815K25415k5010m83854
33263a817956l62455K27269L94150L439j09993L21713N02349L2251l55213j21975
33253a286421J51419p9501k99082M0236L91557M5052n57571n38940n8752N7989
33243b134014k09255j22209M46368P59727M05910j51455l83813l34642k34838
$$ plain form
33234 -1958221 -2042389 -1922928 -1741886 -1732568 -1902873 -2015550 -1899044 -1655543 -1544268 -1714041
33224 -1714041 -2056371 -2318902 -2360229 -2228205 -1972979 -1540280 -965140 -515548 -454951 -748022
33214 -748022 -1143882 -1433919 -1500043 -1299090 -996100 -921092 -1157989 -1359332 -1218591 -927799
33204 -927799 -880199 -1114164 -1365176 -1476207 -1422945 -1141740 -721374 -574096 -978966 -1594761
33194 -1594761 -1856879 -1726285 -1609590 -1686852 -1809989 -1943677 -2169383 -2321861 -2164796 -1882869
33184 -1882869 -1842234 -1899317 -1572509 -940361 -703105 -1177540 -1833956 -2074085 -1937821 -1767357
33174 -1767357 -1655106 -1549017 -1527526 -1658442 -1847430 -2020496 -2196044 -2284436 -2162741 -2024655
33164 -2024655 -2222247 -2629247 -2637568 -2003038 -1245767 -944899 -1044625 -1149040 -1125535 -1086740
$$ packed form
33234a958221q4168J19461J81042R318j70305j12677J16506K43501J11275j69773
33224a714041l42330k62531m1327J32024K55226M32699N75140M49592O0597k93071
33214g48022l95860k90037o6124K00953L02990P5008k36897k01343J40741K90792
33204i27799M7600k33965k51012j11031N3262K81205M20366J47278m04870o15795
33194a594761k62118J30594J16695p7262j23137j33688k25706j52478J57065K81927
33184a882869M0635n7083L26808O32148K37256m74435o56416k40129J36264J70464
33174a767357J12251J06089K1491j30916j88988j73066j75548q8392J21695J38086
33164b024655j97592m07000q321O34530P57271L00868r9726j04415K3505L8795
$$ plain form
33154 -1086740 -1076048 -1081527 -1132056 -1160338 -1024962 -833443 -915773 -1289047 -1516237 -1333966
33144 -1333966 -1053279 -1065588 -1310007 -1528806 -1692443 -1825240 -1741618 -1352642 -978839 -972951
33134 -972951 -1232836 -1425675 -1485437 -1553869 -1639896 -1688161 -1798137 -2028968 -2163296 -2012706
33124 -2012706 -1786875 -1792299 -1913610 -1789164 -1407923 -1134592 -1166387 -1327296 -1431647 -1538425
33114 -1538425 -1755377 -2002668 -2072123 -1846935 -1461010 -1259685 -1481399 -1923797 -2108100 -1863769
33104 -1863769 -1520107 -1391095 -1360533 -1200371 -1009299 -1006624 -1100734 -1027345 -797903 -675532
33094 -675532 -777417 -992228 -1225670 -1456992 -1615910 -1661409 -1720288 -1900881 -2038214 -1875492
33084 -1875492 -1440976 -1005370 -727272 -576163 -527535 -566288 -552207 -366733 -179033 -291301
$$ packed form
33154a086740J0692n479n0529k8282J35376J91519q2330l73274k27190J82271
33144a333966K80687j2309k44419k18799j63637j32797Q3622L88976L73803N888
33134i72951k59885j92839n9762o8432q6027m8265j09976k30831j34328J50590
33124b012706K25831n424j21311J24446L81241K73331l1795j60909j04351j06778
33114a538425k16952k47291o9455K25188L85925K01325k21714m42398j84303K44331
33104a863769L43662J29012L0562J60162J91072K675r4110P3389K29442J22371
33094f75532j01885k14811k33442k31322j58918m5499n8879j80593j37333J62722
33084a875492M34516M35606K78098J51109M8628l8753J4081J85474J87700j12268
$$ plain form
33074 -291301 -695315 -1028329 -1020939 -787047 -616005 -650303 -834430 -1051839 -1234883 -1387842
33064 -1387842 -1531537 -1637000 -1666687 -1651430 -1591704 -1318181 -702195 -33895 155625 -192575
33054 -192575 -488158 -296598 17037 -170546 -830177 -1381026 -1535157 -1529005 -1554859 -1469520
33044 -1469520 -1167961 -843723 -723906 -820329 -1038054 -1280989 -1390568 -1236749 -928280 -692563
33034 -692563 -531818 -289795 -73958 -224126 -729185 -1063321 -868425 -507509 -607575 -1226764
33024 -1226764 -1819903 -1965634 -1798753 -1675372 -1688110 -1674166 -1547879 -1412118 -1344069 -1248400
33014 -1248400 -1035882 -856860 -980256 -1414968 -1811860 -1846780 -1594645 -1393173 -1405371 -1470680
33004 -1470680 -1372952 -1101657 -797647 -549625 -344934 -203292 -262200 -639074 -1204320 -1595088
$$ packed form
33074b91301m04014l33014P390K33892J71042l4298j84127k17409j83044j52959
33064a387842j43695j05463k9687J5257N9726K73523O15986O68300J89520l48200
33054a92575k95583J91560L13635j87583o59631n50849j54131O152k5854Q5339
33044a469520L01559L24238J19817r6423k17725k42935j09579J53819L08469K35717
33034f92563J60745K42023K15837j50168n05059l34136J94896L60916j00066o19189
33024a226764n93139j45731J66881J23381j2738J3944J26287J35761O8049R5669
33014a248400K12518J79022j23396m34712l96892l4920K52135K01472j2198o5309
33004a470680R7728K71295L04010K48022K04691J41642n8908l76874n65246l90768
$$ plain form
32994 -1595088 -1543388 -1141698 -712656 -497855 -563643 -859566 -1168371 -1145210 -718460 -369917
32984 -369917 -638563 -1358030 -1812014 -1693692 -1411634 -1290303 -1044550 -422618 132618 23775
32974 23775 -600672 -1061561 -1102834 -1070347 -1193967 -1247539 -1034098 -778532 -835622 -1238410
32964 -1238410 -1665831 -1736405 -1332757 -768305 -571324 -946974 -1534841 -1835818 -1724090 -1378411
32954 -1378411 -956374 -609163 -566453 -833631 -999131 -748443 -403602 -507543 -1006745 -1336726
32944 -1336726 -1243296 -1010423 -892995 -836329 -794554 -835686 -866340 -723487 -601776 -896380
32934 -896380 -1533127 -1967971 -1976849 -1911776 -1999454 -1956999 -1593422 -1264833 -1343038 -1641629 -1757038
32923 -1757038 -1644061 -1500800 -1400387 -1378338 -1570544 -1910889 -1994139 -1606067 -1101823 -886135
$$ packed form
32994a595088N1700M01690M29042K14801o5788k95923l08805K3161M26750L48543
32984c69917k68646p19467m53984J18322K82058J21331K45753O21932N55236j08843
32974B3775o24447m60889m1273L2487j23620n3572K13441K55566n7090m02788
32964a238410m27421p0574M03648N64452J96981l75650n87867l00977J11728L45679
32954a378411M22037L47211M2710k67178j65500K50688L44841j03941m99202l29981
32944a336726R3430K32873J17428N6666M1775m1132l0654J42853J21711k94604
32934h96380o36747m34844q878O5073q7678M2455L63577L28589p8205k98591j15409
32923a757038J12977J43261J00413K2049j92206l40345q3250L88072N04244K15688
$$ plain form
32913 -886135 -823950 -596645 -351092 -476028 -927736 -1313025 -1533602 -1827137 -2214779 -2416455
32903 -2416455 -2337806 -2178406 -2009583 -1694468 -1307085 -1177373 -1368493 -1525105 -1445455 -1426540
32893 -1426540 -1768637 -2234353 -2312061 -1838015 -1103584 -499951 -283717 -525348 -1010894 -1300142
32883 -1300142 -1161161 -890627 -942843 -1296307 -1499709 -1352158 -1174339 -1264993 -1426977 -1308023
32873 -1308023 -969086 -753982 -723452 -633385 -475670 -592020 -1070012 -1414099 -1153945 -541942
32863 -541942 -255620 -507416 -844065 -850317 -679888 -731436 -1061652 -1348772 -1329912 -1087617
32853 -1087617 -909671 -961222 -1125621 -1173519 -1080348 -1082403 -1338179 -1646929 -1682178 -1450973
32843 -1450973 -1304358 -1473473 -1795218 -1956638 -1839854 -1547503 -1231238 -987642 -826713
$$ packed form
32913h86135O2185K27305K45553j24936m51708l85289k20577k93535l87642k01676
32903b416455P8649J59400J68823L15115L87383J29712j91120j56612P9650J8915
32893a426540l42097m65716p7708M74046P34431O03633K16234k41631m85546k89248
32883a300142J38981K70534n2216l53464k03402J47551J77819r0654j61984J18954
32873a308023L38937K15104L0530R0067J57715j16350m77992l44087K60154O12003
32863e41942K86322k51796l36649o252J70429n1548l30216k87120J8860K42295
32853a087617J77946n1551j64399m7898R3171k055k55776l08750l5249K31205
32843a450973J46615j69115l21745j61420J16784K92351L16265K43596J60929
$$ plain form
32834 -826713 -676242 -486922 -346289 -389291 -596942 -813880 -974578 -1163172 -1419440 -1640966
32824 -1640966 -1740044 -1768486 -1812421 -1850369 -1770896 -1488333 -1057946 -729451 -786391 -1186371
32814 -1186371 -1462953 -1218739 -677311 -487133 -958051 -1735022 -2265225 -2338346 -2099650 -1793872
32804 -1793872 -1640459 -1768196 -2105570 -2415862 -2507268 -2338743 -1962026 -1525412 -1286846 -1386728
32794 -1386728 -1613610 -1635554 -1449788 -1332372 -1371961 -1398991 -1379905 -1462854 -1551319 -1292620
32784 -1292620 -678983 -220903 -258128 -502486 -576692 -599815 -814545 -977256 -665705 -33253
32774 -33253 278597 -16566 -512694 -674583 -420973 -81035 -13567 -325681 -794423 -1053957
32764 -1053957 -999272 -951552 -1252336 -1763092 -1990151 -1697720 -1195488 -976499 -1200451 -1577644
$$ packed form
32834h26713J50471J89320J40633m3002k07651k16938j60698j88594k56268k21526
32824a640966r9078k8442m3935l7948P9473K82563M30387L28495n6940l99980
32814a186371k76582K44214N41428J90178m70918p76971n30203p3121K38696L05778
32804a793872J53413j27737l37374l10292r1406J68525L76717M36614K38566r9882
32794a386728k26882k1944J85766J17416l9589k7030J9086q2949q8465K58699
32784a292620O13637M58080l7225k44358p4206k3123k14730j62711L11551O32452
32774c3253L11850k95163m96128j61889K53610L39938O7468l12114m68742k59534
32764a053957N4685M7720l00784n10756k27059K92431N02232K18989k23952l77193
$$ plain form
32754 -1577644 -1707509 -1524301 -1385719 -1621719 -2026582 -2021802 -1390238 -605817 -297893 -610716
32744 -610716 -1241441 -1850028 -2198912 -2121880 -1668824 -1170799 -919907 -885176 -917782 -1043169
32734 -1043169 -1307622 -1533105 -1532698 -1427212 -1441324 -1516802 -1455418 -1327458 -1362218 -1489457 -1389373
32723 -1389373 -1034184 -807287 -954447 -1200719 -1090565 -547964 47737 266810 20983
32714 20983 -417537 -734985 -860935 -881720 -769934 -434351 -43417 15386 -360887 -803158
32704 -803158 -957309 -883218 -782273 -658529 -526654 -622268 -1026470 -1350236 -1213375 -829658
32694 -829658 -691820 -860280 -1005458 -984074 -894791 -706453 -357712 -137872 -407502 -945032
32684 -945032 -1122603 -788347 -436540 -393583 -382349 -114710 168656 77551 -332300 -661253
$$ packed form
32754a577644j29865J83208J38582k36000m04863M780O31564P84421L07924l12823
32744f10716o30725o08587l48884P7032M53056M98025K50892L4731l2606j25387
32734a043169k64453k25483M07J05486j4112p5478O1384J27960l4760j27239J00084
32723a389373L55189K26897j47160k46272J10154N42601N95701K19073k45827
32714B0983m38520l17448j25950k0785J11786L35583L90934N8803l76273m42271
32704h03158j54151P4091J00945J23744J31875r5614m04202l23766J36861L83717
32694h29658J37838j68460j45178K1384Q9283J88338L48741K19840k69630n37530
32684i45032j77571L34256L51807M2957J1234K67639K83366r1105m09851l28953
$$ plain form
32674 -661253 -683342 -532347 -478622 -657198 -952775 -1126259 -1112548 -1091363 -1143728 -1047361 -665455
32663 -665455 -315708 -387572 -770277 -1066309 -1194284 -1311494 -1321914 -1042622 -747076 -896508
32653 -896508 -1356892 -1546449 -1380556 -1361333 -1650316 -1822131 -1718986 -1737285 -1946990 -1739854
32643 -1739854 -845589 12742 70401 -450593 -865005 -1046670 -1258027 -1395861 -1155583 -704016
32633 -704016 -506125 -604852 -642706 -506911 -456599 -670426 -1056417 -1407771 -1445354 -941359
32623 -941359 -155316 155516 -386080 -1167482 -1347625 -949859 -632693 -634739 -631304 -502790
32613 -502790 -516882 -721098 -816040 -751587 -878314 -1345218 -1817705 -1932973 -1633580 -996026
32603 -996026 -183763 376680 290271 -206694 -435881 -217167 -111770 -528813 -1123642 -1393577
$$ packed form
32674f61253k2089J50995N3725j78576k95577j73484J3711K1185n2365R6367L81906
32663f65455L49747p1864l82705k96032j27975j17210j0420K79292K95546j49432
32653h96508m60384j89557J65893J9223k88983j71815J03145j8299k09705K07136
32643a739854Q94265Q58331N7659n20994m14412j81665k11357j37834K40278M51567
32633g04016J97891r8727l7854J35795N0312k13827l85991l51354l7583N03995
32623i41359P86043L10832n41596p81402j80143L97766L17166k046L435J28514
32613e02790j4092k04216r4942O4453j26727m66904m72487j15268K99393O37554
32603i96026Q12263N60443q6409m96965k29187K18714J05397m17043n94829k69935
$$ plain form
32593 -1393577 -1380023 -1372274 -1324354 -1055805 -754064 -762846 -1001385 -1057013 -818771 -616132 -697464
32582 -697464 -915251 -1020853 -1002551 -998421 -1051994 -1089655 -1046059 -915185 -735274 -594202 -609476
32571 -609476 -833940 -1178085 -1456503 -1522741 -1362796 -1081689 -829287 -725184 -784142 -868362
32561 -868362 -778088 -488182 -262098 -399689 -860288 -1269771 -1339609 -1147724 -956132 -898055
32551 -898055 -926005 -928643 -795633 -487571 -144216 -13728 -185238 -498596 -767766 -931508
32541 -931508 -939192 -739009 -503669 -587983 -1041109 -1401054 -1242681 -731303 -344061 -226054
32531 -226054 -160086 -43890 -30796 -234654 -595631 -1006584 -1322450 -1333780 -1019316 -731505
32521 -731505 -806631 -1067806 -1067552 -763971 -557606 -655573 -807713 -746621 -519494 -282677 -104598
$$ packed form
32593a393577J3554P749M7920K68549L01741q782k38539n5628K38242K02639q1332
32582f97464k17787j05602J8302M130n3573l7661M3596J30874J79911J41072j5274
32571f09476k24464l44145k78418o6238J59945K81107K52402J04103n8958q4220
32561h68362R0274K89906K26084j37591m60599m09483o9838J91885J91592N8077
32551h98055k7950k638J33010L08062L43355J30488j71510l13358k69170j63742
32541i31508p684K00183K35340q4314m53126l59945J58373N11378L87242J18007
32531b26054O5968J16196J3094k03858l60977m10953l15866j1330L14464K87811
32521g31505p5126k61175K54L03581K06365r7967j52140O1092K27127K36817J78079
$$ plain form
32510 -104598 -77414 -288683 -550647 -483789 -44238 311599 175218 -328622 -761702 -855381
32500 -855381 -623570 -224911 97103 119020 -124957 -332703 -298090 -156938 -155846 -324532
32490 -324532 -516333 -651837 -771604 -907699 -1013905 -1014709 -904741 -820104 -944423 -1258438
32480 -1258438 -1481040 -1397043 -1125911 -888575 -678035 -442842 -422936 -875829 -1526756 -1767137
32470 -1767137 -1466555 -1142178 -1191454 -1384352 -1319445 -1004928 -729542 -646077 -723236 -875347
32460 -875347 -941574 -758573 -418149 -228815 -296454 -403209 -407617 -435824 -528953 -472209 -200086
32449 -200086 -22695 -177260 -460652 -582813 -589765 -645396 -681860 -592532 -525907 -652211 -823907
32438 -823907 -759664 -411922 46280 385027 327538 -254546 -959522 -1103463 -636944 -331871
$$ packed form
32510a04598K7184k11269k61964O6858M39551L55837j36381n03840m33080r3679
32500h55381K31811L98659L22014K1917k43977k07746L4613J41152J092j68686
32490c24532j91801j35504j19767j36095j06206q04J09968Q4637j24319l14015
32480a258438k22602Q3997K71132K37336K10540K35193J9906m52893o50927k40381
32470a767137L00582L24377m9276j92898O4907L14517K75386Q3465p7159j52111
32460h75347o6227J83001L40424J89334o7639j06755m408k8207r3129N6744K72123
32449b00086J77391j54565k83392j22161o952n5631l6464Q9328O6625j26304j71696
32438h23907O4243L47742M58202L38747n7489n82084p04976j43941M66519L05073
$$ plain form
32428 -331871 -667191 -1060357 -762179 -17992 380532 307709 230359 181388 -247033 -919130
32418 -919130 -1103208 -590017 -58657 -41097 -213282 -63257 323876 538986 448777 165153
32408 165153 -207913 -491441 -444758 -144141 -34257 -363826 -877941 -1252728 -1455825 -1465601
32398 -1465601 -1079911 -348373 172558 775 -660116 -1202666 -1291734 -998425 -523709 -103214
32388 -103214 16890 -194961 -496055 -714234 -930310 -1160173 -1180657 -910119 -631490 -558583
32378 -558583 -518203 -368093 -349694 -629634 -861154 -689984 -381928 -399421 -611657 -535370
32368 -535370 -192521 -88867 -403607 -814465 -1121200 -1437249 -1709770 -1647293 -1257412 -923682
32358 -923682 -804377 -660861 -419510 -361724 -558956 -663421 -525699 -498737 -807556 -1120115
$$ packed form
32428c31871l35320l93166K98178P44187L98524p2823p7350m8971m28421o72097
32418i19130j84078N13191N31360J7560j72185J50025L87133K15110r0209k83624
32408A65153l73066k83528M6683L00617J09884l29569n14115l74787k03097r776
32398a465601L85690P31538N20931j71783o60891n42550q9068K93309M74716M20495
32388a03214J20104k11851l01094k18179k16076k29863k0484K70538K78629P2907
32378e58583M0380J50110J8399k79940k31520J71170L08056j7493k12236P6287
32368e35370L42849J03654l14740m10858l06735l16049k72521O2477L89881L33730
32358i23682J19305J43516K41351N7786j97232j04465J37722K6962l08819l12559
$$ plain form
32348 -1120115 -1129290 -1078083 -1230757 -1255867 -731775 22585 262761 -150120 -614542 -675649
32338 -675649 -531542 -579016 -886581 -1257960 -1506564 -1534883 -1358117 -1133409 -1014369 -975897
32328 -975897 -925649 -898457 -929025 -850089 -513002 -133657 -88062 -386361 -667110 -694992 -537172
32317 -537172 -281812 17918 107819 -295397 -977731 -1322366 -1113396 -806575 -769094 -737119
32307 -737119 -409642 -120451 -339546 -790827 -748903 -162782 186696 -185877 -762156 -781802
32297 -781802 -303222 -40869 -326002 -706207 -631265 -166978 180345 136861 -118440 -352439
32287 -352439 -602723 -976286 -1327332 -1377856 -1114878 -854089 -872381 -1119571 -1310327 -1168986
32277 -1168986 -610814 118661 493342 171655 -508970 -786792 -373405 178720 211839 -214006
$$ packed form
32348a120115r175N1207j52674k5110N24092P54360K40176m12881m64422o1107
32338f75649J44107m7474l07565l71379k48604k8319J76766K24708J19040L8472
32328i75897N0248K7192l0568P8936L37087L79345M5595k98299k80749k7882J57820
32317e37172K55360K99730Q9901m03216o82334l44635K08970L06821L7481L1975
32307g37119L27477K89191k19095m51281M1924N86121L49478l72573n76279j9646
32297g81802M78580K62353k85133l80205P4942M64287L47323m3484k55301k33999
32287c52439k50284l73563l51046n0524K62978K60789j8292k47190j90756J41341
32277a168986N58172P29475L74681l21687o80625k77822M13387N52125L3119m25845
$$ plain form
32267 -214006 -541823 -538540 -486409 -630364 -841442 -901443 -823887 -771709 -828907 -921222 -851221
32256 -851221 -441234 202416 628177 460103 -144884 -679557 -894659 -967083 -1073935 -1125301
32246 -1125301 -1026444 -921177 -978960 -1103108 -1029492 -646123 -119053 244686 232569 -87233
32236 -87233 -400537 -450520 -286732 -136736 -128894 -272846 -551026 -788703 -611028 85481
32226 85481 717368 554587 -287869 -901090 -766845 -379978 -419014 -779991 -863364 -479503
32216 -479503 19985 326003 428408 374724 177790 -47092 -176023 -307034 -624336 -1039505
32206 -1039505 -1227177 -1039421 -676191 -429993 -430234 -622972 -832251 -852329 -627391 -331048
32196 -331048 -177291 -224231 -441405 -810735 -1218800 -1436524 -1410307 -1391137 -1535416 -1583101
$$ packed form
32267b14006l27817L283N2131j43955k11078o0001P7556N2178n7198r2315P0001
32256h51221M09987O43650M25761j68074o04987n34673k15102p2424j06852n1366
32246a125301R8857J05267n7783j24148P3616L83369N27070L63739j2117l19802
32236h7233l13304m9983J63788J49996P842j43952k78180k37677J77675O96509
32226H5481O31887j62781q42456o13221J34245L86867l9036l60977q3373L83861
32216d79503M99488L06018J02405n3684j96934k24882j28931j31011l17302m15169
32206a039505j87672J87756L63230K46198k41j92738k09279k0078K24938K96343
32196c31048J53757m6940k17174l69330m08065k17724K6217J9170j44279m7685
$$ plain form
32186 -1583101 -1255938 -790808 -653271 -811412 -765023 -322023 114729 161195 -59970 -242176
32176 -242176 -351407 -503815 -661990 -738102 -802797 -904167 -827056 -358608 252297 430059
32166 430059 -36862 -669337 -821040 -398315 117454 290501 143276 -76198 -266208 -419179
32156 -419179 -414750 -191351 -26721 -258546 -710480 -814600 -425805 -86395 -254414 -681627
32146 -681627 -879276 -815247 -729689 -592886 -260772 64020 75654 -73979 3821 257673
32136 257673 293207 75199 -56988 -56010 -218444 -511260 -498912 -104027 183239 79127
32126 79127 -109774 -133882 -207911 -422828 -379665 99236 441505 103044 -542892 -725169
32116 -725169 -374722 -61993 -47118 -55045 76402 144108 27644 -110376 -164627 -239244 -389276
$$ packed form
32186a583101L27163M65130J37537j58141M6389M43000M36752M6466k21165j82206
32176b42176j09231j52408j58175p6112o4695j01370P7111M68448O10905J77762
32166D30059m66921o32475j51703M22725N15769J73047j47225k19474j90010j52971
32156d19179M429K23399J64630k31825m51934j04120L88795L39410j68019m27213
32146f81627j97649O4029Q5558J36803L32114L24792J1634j49633P7800K53852
32136B57673L5534k18008j32187R78j62434k92816J2348L94885K87266j04112
32126G9127j88901k4108p4029k14917M3163M78901L42269l38461o45936j82277
32116g25169L50447L12729J4875p927J31447O7706j16464j38020n4251p4617j50032
$$ plain form
32105 -389276 -534448 -666726 -849613 -1007607 -1004357 -911292 -906183 -944108 -849381 -698552 -755122
32094 -755122 -1018626 -1203804 -1216837 -1289615 -1534736 -1702431 -1557134 -1254642 -1154516 -1383105
32084 -1383105 -1701449 -1738766 -1332691 -708887 -285418 -232537 -348035 -446181 -606481 -827116
32074 -827116 -771588 -277397 155676 -54437 -657535 -871336 -552191 -361182 -661847 -997853
32064 -997853 -956026 -838400 -1002747 -1131806 -773743 -192678 -21196 -313743 -577550 -603461
32054 -603461 -646246 -803535 -795502 -460931 -11128 327604 531854 535119 164440 -490682
32044 -490682 -975044 -966023 -655334 -442773 -444490 -501662 -518982 -574008 -751922 -1026752 -1278625
32033 -1278625 -1351457 -1163756 -838738 -642580 -705864 -877181 -933801 -855488 -782190 -768048
$$ packed form
32105c89276j45172j32278j82887j57994L250R3065N109l7925R4727J50829n6570
32094g55122k63504j85178j3033p2778k45121j67695J45297L02492J00126k28589
32084a383105l18344l7317M06075O23804M23469N2881j15498r8146j60300k20635
32074h27116N5528M94191M33073k10113o03098k13801L19145J91009l00665l36006
32064i97853M1827J17626j64347j29059L58063N81065J71482k92547k63807k5911
32054f03461m2785j57289Q033L34571M49803L38732K04250L265l70679o55122
32044d90682m84362R021L10689K12561j717n7172j7320n5026j77914k74830k51873
32033a278625p2832J87701L25018J96158o3284j71317n6620P8313P3298J4142
$$ plain form
32023 -768048 -725048 -614189 -561617 -715431 -1048783 -1376718 -1544350 -1528243 -1361587 -1071681
32013 -1071681 -758788 -628106 -779816 -992858 -905355 -461784 -16480 87455 -116848 -372563
32003 -372563 -532307 -582389 -514448 -400987 -465439 -808568 -1146831 -1108482 -746394 -454249
31993 -454249 -387129 -308994 -71837 110889 13019 -291955 -633971 -960925 -1154856 -959341
31983 -959341 -383716 94887 83119 -195176 -294048 -259917 -467660 -869335 -988757 -718893
31973 -718893 -553145 -812209 -1144677 -1124615 -928916 -990818 -1269445 -1350116 -1131924 -941004
31963 -941004 -975959 -1068421 -1069162 -1099898 -1267395 -1410984 -1321924 -1023352 -674517 -364827 -163603
31952 -163603 -216235 -578102 -1029050 -1254957 -1204748 -1112551 -1158339 -1248294 -1177836 -907842 -606814
$$ packed form
32023g68048M3000J10859N2572j53814l33352l27935j67632J6107J66656K89906
32013a071681L12893J30682j51710k13042Q7503M43571M45304J03935k04303k55715
32003c72563j59744n0082O7941J13461o4452l43129l38263L8349L62088K92145
31993d54249O7120P8135K37157J82726r7870l04974l42016l26954j93931J95515
31983i59341N75625M78603j1768k78295r8872L4131k07743m01675j19422K69864
31973g18893J65748k59064l32468K0062J95699o1902k78627q0671K18192J90920
31963i41004l4955r2462p41l0736j67497j43589Q9060K98572L48835L09690K01224
31952a63603n2632l61867m50948k25907N0209R2197m5788q9955P0458K69994L01028
$$ plain form
31941 -606814 -464522 -515379 -626601 -636428 -528743 -487968 -735616 -1258484 -1721978 -1735055
31931 -1735055 -1238328 -584440 -195209 -177826 -317050 -376294 -301400 -152970 25381 217033
31921 217033 392049 514803 557325 499854 375498 294889 325058 355687 222220 -32057
31911 -32057 -180616 -122451 29747 208946 482620 773837 787353 423213 -4668 -228004
31901 -228004 -431106 -847940 -1213457 -1108487 -706824 -612658 -953563 -1203064 -1023639 -738844
31891 -738844 -740467 -924586 -1032400 -1122561 -1324776 -1467934 -1358925 -1162443 -1106998 -1054680
31881 -1054680 -776799 -438114 -351227 -423872 -345891 -202620 -351283 -720625 -825773 -575453
31871 -575453 -477147 -806174 -1110347 -912937 -472972 -367056 -603343 -684235 -418150 -124706
$$ packed form
31941f06814J42292n0857j11222r827J07685M0775k47648n22868m63494j3077
31931a735055M96727O53888L89231J7383j39224n9244P4894J48430J78351J91652
31921B17033J75016J22754M2522n7471j24356q0609L0169L0629j33467k54277
31911c2057j48559N8165J52198J79199K73674K91217J3516l64140m27881k23336
31901b28004k03102m16834l65517J04970M01663R4166l40905k49501J79425K84795
31891g38844j623j84119j07814r0161k02215j43158J09009J96482N5445N2318
31881a054680K77881L38685Q6887p2645P7981J43271j48663l69342j05148K50320
31871e75453R8306l29027l04173J97410M39965J05916k36287q0892K66085K93444
$$ plain form
31861 -124706 -5510 170604 558832 840125 664842 224049 -14156 -11169 -183706 -704310
31851 -704310 -1173802 -1156279 -736397 -321838 -129737 -116696 -198890 -237535 -194 487464
31841 487464 707265 233758 -517295 -670999 -78960 453539 307027 -175017 -374902 -300631
31831 -300631 -305443 -374269 -308490 -304266 -667167 -1119571 -1087987 -651033 -520385 -971214 -1419525
31820 -1419525 -1288677 -754019 -310968 -44116 272756 621774 694868 333802 -242298 -652682
31810 -652682 -701861 -546157 -521337 -726940 -863050 -657386 -341092 -392316 -851231 -1250885
31800 -1250885 -1251572 -962067 -560973 -30955 537439 770071 443400 -150750 -546204 -630634
31790 -630634 -610941 -618428 -581375 -407315 -134340 61311 -8758 -296901 -456470 -260934
$$ packed form
31861a24706J19196J76114L88228K81293j75283m40793k38205K987j72537n20604
31851g04310m69492J7523M19882M14559J92101J3041q2194l8645K37341M87658
31841D87464K19801m73507p51053j53704N92039N32499j46512m82044j99885P4271
31831c00631m812o8826O5779M224l62901m52404L1584M36954J30648m50829m48311
31820a419525J30848N34658M43051K66852L16872L49018P3094l61066n76100m10384
31810f52682m9179J55704K4820k05603j36110K05664L16294n1224m58915l99654
31800a250885o87K89505M01094N30018N68394K32632l26671n94150l95454q4430
31790f30634J9693p487L7053J74060K72975J95651p0069k88143j59569J95536
$$ plain form
31780 -260934 -20471 -227634 -800263 -1121657 -914679 -584696 -514840 -538607 -416399 -342730
31770 -342730 -544470 -755961 -577288 -96535 281908 405144 360241 134409 -261575 -519094
31760 -519094 -344945 71364 315075 341962 412048 568928 623366 554726 499873 423616 205440
31749 205440 -47741 -189125 -397693 -887784 -1385137 -1434368 -1147750 -1059311 -1257764 -1297667
31739 -1297667 -1025391 -821523 -853987 -754961 -335800 -28547 -226280 -658284 -817723 -616074
31729 -616074 -244669 224047 689552 823654 461751 -60730 -359194 -534852 -857047 -1169070
31719 -1169070 -1089368 -642634 -214894 30064 239354 428772 412786 218793 162309 387804
31709 387804 637490 601092 276406 -103406 -319172 -290025 -113554 -13712 -110875 -258964
$$ packed form
31780b60934K40463k07163n72629l21394K06978L29983O9856k3767J22208P3669
31770c42730k01740k11491J78673M80753L78443J23236m4903k25832l95984k57519
31760e19094J74149M16309K43711K6887P0086J56880N4438o8640n4853p6257k18176
31749B05440k53181j41384k08568m90091m97353m9231K86618Q8439j98453l9903
31739a297667K72276K03868l2464R9026M19161L07253j97733m32004j59439K01649
31729f16074L71405M68716M65505J34102l61903n22481k98464j75658l22195l12023
31719a169070P9702M46734M27740K44958K09290J89418j5986j93993n6484K25495
31709C87804K49686l6398l24686l79812k15766K9147J76471R9842r7163j48089
$$ plain form
31699 -258964 -254529 -142619 -119225 -198415 -222995 -168331 -164394 -220853 -214364 -171163 -257282 -424167
31687 -424167 -389137 -100532 93581 -57424 -324486 -378690 -313983 -445452 -727758 -772915
31677 -772915 -460490 -174440 -291024 -669164 -833938 -546188 -35606 276442 174520 -199644
31667 -199644 -510508 -549578 -424925 -404175 -571543 -733426 -704806 -570244 -544527 -651109
31657 -651109 -694450 -541311 -282271 -76077 45616 147242 241230 251987 109487 -153325
31647 -153325 -387766 -436456 -300252 -155134 -115553 -44332 236408 580240 611305 248243
31637 248243 -127685 -178115 -33545 7968 -31888 38892 112297 -104423 -520067 -659110
31627 -659110 -365071 -104541 -312328 -734842 -763947 -256775 327525 557183 467610 327006
$$ packed form
31699b58964M435J11910K3394p9190k4580N4664L937n6459O489M3201q6119j66885
31687d24167L5030K88605J94113j51005k67062n4204O4707j31469k82306m5157
31677g72915L12425K86050j16584l78140j64774K87750N10582L12048j01922l74164
31667a99644l10864l9070J24653K0750j67368j61883K8620J34562K5717j06582
31657f51109m3341J53139K59040K06194J21693J01626R3988J0757j42500k62812
31647a53325k34441m8690J36204J45118L9581P1221K80740L43832L1065l63062
31637B48243l75928n0430J44570M1513l9856P0780P3405k16720m15644j39043
31627f59110K94039K60530k07787m22514k9105N07172N84300K29658q9573j40604
$$ plain form
31617 327006 248258 185669 132866 113692 30135 -282414 -787700 -1168684 -1147139 -843492 -670981
31606 -670981 -835813 -1082602 -1039397 -705197 -433554 -476155 -713490 -855092 -768306 -573142
31596 -573142 -519223 -788331 -1300805 -1689941 -1597867 -1060120 -500042 -283111 -359013 -397818
31586 -397818 -202608 80573 133738 -176369 -605494 -758295 -570757 -452798 -781526 -1342832
31576 -1342832 -1539898 -1153413 -596815 -328772 -315167 -267944 -157377 -181751 -355280 -453589
31566 -453589 -388226 -379642 -645980 -1057645 -1232465 -958258 -449325 -140693 -233432 -506109
31556 -506109 -616298 -496695 -338858 -275920 -284078 -364946 -571794 -805653 -832621 -605869
31546 -605869 -350079 -219186 -113182 23294 -3302 -308112 -640097 -725430 -715489 -939696
$$ packed form
31617C27006p8748o2589n2803j9174q3557l12549n05286l80984K1545L03647J72511
31606f70981j64832k46789M3205L34200K71643m2601k37335j41602Q6786J95164
31596e73142N3919k69108n12474l89136R2074N37747N60078K16931p5902l8805
31586c97818J95210K83181N3165l10107m29125j52801J87538J17959l28728n61306
31576a342832j97066L86485N56598K68043J3605M7223J10567k4374j73529r8309
31566d53589O5363Q584k66338m11665j74820K74207N08933L08632r2739k72677
31556e06109j10189J19603J57837O2938q158q0868k06848k33859k6968K26752
31546f05869K55790J30893J06004J36476k6596l04810l31985q5333R941k24207
$$ plain form
31536 -939696 -1317014 -1395471 -983251 -406200 -74212 -66557 -217826 -353888 -337820 -111049
31526 -111049 178920 271129 130375 22652 126641 259950 198237 130628 496751 1321059
31516 1321059 1952539 1682993 593177 -406966 -498132 168804 666231 348746 -477021
31507 -477021 -1020241 -930468 -538650 -303620 -324170 -432027 -496387 -484954 -381619 -208732
31497 -208732 -58946 17120 96500 244919 348075 220543 -131622 -502850 -770332 -1030326
31487 -1030326 -1356247 -1560220 -1392333 -940078 -604272 -606926 -719330 -623778 -386867 -352661
31477 -352661 -634573 -951955 -996765 -774670 -525308 -446425 -554526 -704556 -693710 -428825
31467 -428825 -22870 325342 517054 559724 491234 424676 535064 797578 871576 519444
$$ packed form
31536i39696l77318p8457M12220N77051L31988P655j51269j36062J6068K26771
31526a11049K89969R2209j40754j07723J03989J33309o1713o7609L66123Q24308
31516A321059O31480k69546j089816j000143r1166O66936M97427l17485q25767
31507d77021n43220Q9773L91818K35030k0550j07857o4360J1433J03335J72887
31497b08732J49786P6066P9380J48419J03156j27532l52165l71228k67482k59994
31487a030326l25921k03973J67887M52255L35806k654j12404R5552K36911L4206
31477c52661k81912l17382m4810K22095K49362P8883j08101j50030J0846K64885
31467d28825M05955L48212J91712M2670o8490o6558J10388K62514P3998l52132
$$ plain form
31457 519444 22195 -164631 -69439 -94681 -309777 -382028 -256359 -308233 -631932 -768774
31447 -768774 -454397 -89655 -82323 -234685 -232988 -240558 -465409 -611328 -396061 -199707 -468788
31436 -468788 -817204 -546075 165492 472324 164743 -155795 -220332 -453846 -996352 -1291272
31426 -1291272 -1032615 -721071 -812640 -1020842 -986792 -990083 -1357983 -1692348 -1402935 -681819
31416 -681819 -262793 -398107 -685233 -800096 -829657 -883751 -872811 -763516 -706822 -803161
31406 -803161 -939086 -904166 -578131 -69599 269646 148020 -257680 -451044 -302818 -257838
31396 -257838 -632650 -1066962 -1024658 -548732 -117408 22640 -34564 -214312 -474937 -581423
31386 -581423 -322671 76230 159323 -134306 -388856 -274692 87808 335196 210690 -252952
$$ packed form
31457E19444m97249j86826R5192k5242k15096p2251J25669n1874l23699j36842
31447g68774L14377L64742P332j52362J697p570k24851j45919K15267J96354k69081
31436d68788l48416K71129P11567L06832l07581l20538o4537k33514n42506k94920
31426a291272K58657L11544r1569k08202L4050l291l67900l34365K89413P21116
31416f81819M19026j35314k87126j14863k9561n4094J0940J09295N6694r6339
31406h03161j35925L4920L26035N08532L39245j21626m05700j93364J48226M4980
31396b57838l74812m34312M2304M75926M31324J40048n7204j79748k60625j06486
31386e81423K58752L98901Q3093k93629k54550J14164L62500K47388j24506m63642
$$ plain form
31376 -252952 -713189 -786971 -519529 -390983 -643042 -896754 -771768 -537776 -642894 -889482
31366 -889482 -744799 -316331 -260271 -688000 -922958 -555076 -50076 33680 -143484 -107296
31356 -107296 157381 313636 265729 204237 226347 271976 327192 402587 396225 213071 -41967
31345 -41967 -155374 -24589 297148 646336 774950 517673 25222 -355192 -502187 -599745
31335 -599745 -736236 -727951 -480290 -218975 -159475 -206728 -187482 -128296 -91208 7660 178478
31324 178478 210355 3819 -193967 -168213 -107823 -272713 -508364 -468410 -177024 585
31314 585 -135066 -455082 -746979 -816898 -471798 248167 902001 1060999 831142 641924
31304 641924 612575 502787 206850 -135509 -479961 -862138 -1040491 -678634 13086 345965
$$ packed form
31376b52952m60237p3782K67442J28546k52059k53712J24986K33992j05118k46588
31366h89482J44683M28468N6060m27729k34958L67882N05000Q3756j77164L6188
31356a07296K64677J56255m7907o1492K2110M5629N5216P5395o362j83154k55038
31345d1967j13407J30785L21737L49188J28614k57277m92451l80414j46995r7558
31335e99745j36491Q285K47661K61315N9500m7253J9246N9186L7088R8868J70818
31324A78478L1877k06536j97786K5754O0390j64890k35651L9954K91386J77609
31314E85j35651l20016k91897o9919L45100P19965O53834J58998k29857j89218
31304F41924k9349j09788k95937l42359l44452l82177j78353L61857O91720L32879
$$ plain form
31294 345965 58947 -348483 -451986 -543463 -1012818 -1540531 -1500589 -930963 -485072 -464793
31284 -464793 -474985 -149339 268643 320470 -14733 -356596 -451324 -399265 -396434 -455427 -447500
31273 -447500 -333141 -256336 -371887 -614120 -729745 -571986 -265555 -17322 118110 168856
31263 168856 73111 -212980 -494537 -480843 -188696 31033 -26875 -123386 74242 495193
31253 495193 743231 618760 343961 236439 337587 455216 451462 356244 236996 84639
31243 84639 -130372 -351364 -445193 -328102 -75710 97993 4107 -329345 -633336 -641203
31233 -641203 -398758 -257436 -469454 -848419 -975997 -734378 -446987 -424806 -571814 -599903
31223 -599903 -465945 -345442 -267938 -96527 106797 17878 -499978 -1121995 -1417673 -1300427
$$ packed form
31294C45965k87018m07430j03503r1477m69355n27713L9942N69626M45891K0279
31284d64793j0192L25646M17982N1827l35203l41863r4728N2059K831n8993P927
31273d47500J14359P6805j15551k42233j15625J57759L06431K48233J35432N0746
31263A68856r5745k86091k81557J3694K92147K19729n7908r6511J97628M20951
31253D95193K48038j24471k74799j07522J01148J17629l754r5218j19248j52357
31243H4639k15011k20992r3829J17091K52392J73703r3886l33452l03991p867
31233f41203K42445J41322k12018l78965j27578K41619K87391K2181j47008k8089
31223e99903J33958J20503P7504J71411K03324q8919n17856o22017k95678J17246
$$ plain form
31213 -1300427 -961604 -570591 -274457 -295325 -691663 -1115202 -1147149 -847682 -635861 -631273
31203 -631273 -508931 -95976 297113 350187 185949 66742 -67327 -404796 -807874 -930437
31193 -930437 -695483 -325877 18923 304046 389495 126312 -298485 -475009 -298027 -57065
31183 -57065 65688 224605 507435 674121 527459 242478 67862 -40034 -205691 -301027
31173 -301027 -156535 82731 169898 178015 320881 466413 295654 -57740 -38996 493353
31163 493353 921495 660391 -43564 -488601 -478338 -465145 -775519 -1126224 -1076211 -672128
31153 -672128 -370053 -399514 -462995 -159598 437788 818596 662351 246876 82959 260784
31143 260784 400911 243420 3736 23541 309550 619560 817461 883119 706860 208656
$$ packed form
31213a300427L38823L91013K96134k0868l96338m23539l1947K99467K11821M588
31203f31273J22342M12955L93089N3074j64238j19207j34069l37469m03078j22563
31193i30437K34954L69606L44800K85123Q5449k63183m24797j76524J76982K40962
31183e7065J22753J58917K82830J66686j46662k84981j74616j07896j65657r5336
31173c01027J44492K39266Q7167Q117J42866J45532j70759l53394J8744N32349
31163D93353M28142k61104p03955m45037J0263J3193l10374l50705N0013M04083
31153f72128L02075k9461o3481L03397N97386L80808j56245m15475j63917J77825
31143B60784J40127j57491k39684J9805K86009L10010J97901O5658j76259m98204
$$ plain form
31133 208656 -358191 -559860 -328973 -80605 -145576 -337959 -288982 -17230 100551 -145603
31123 -145603 -535786 -686851 -436633 27600 317499 173380 -231962 -393269 -29708 542919
31113 542919 800730 691621 630918 814430 895915 521584 -102821 -457246 -359457 -86440
31103 -86440 77211 114048 74806 -113411 -481322 -809389 -784396 -371707 88718 233278
31093 233278 84195 8000 229791 508833 443851 32947 -299193 -264560 -54179 9716
31083 9716 -70019 -83620 -28345 -121819 -449078 -833962 -1051231 -978290 -586197 -14190 371730
31072 371730 267988 -171114 -469197 -423759 -325009 -486798 -812206 -994673 -952831 -855959
31062 -855959 -834118 -860569 -877005 -894111 -974343 -1162061 -1383852 -1437071 -1226168 -1009135 -1169786
$$ packed form
31133B08656n66847k01669K30887K48368o4971j92383M8977K71752J17781k46154
31123a45603l90183j51065K50218M64233K89899j44119m05342j61307L63561N72627
31113E42919K57811j09109o0703J83512Q1485l74331o24405l54425R7789K73017
31103h6440J63651L6837l9242j88217l67911l28067K4993M12689M60425J44560
31093B33278j49083p6195K21791K79042o4982m10904l32140L4633K10381O3895
31083I716p9735j3601N5275r3474l27259l84884k17269P2941L92093N72007L85920
31072C71730j03742m39102k98083M5438R8750j61789l25408j82467M1842R6872
31062h55959K1841k6451j6436j7106q0232j87718k21791n3219K10903K17033j60651
$$ plain form
31051 -1169786 -1660577 -1936348 -1614710 -960047 -485035 -307312 -211488 -156628 -313809 -659258
$$ packed form
31051a169786m90791k75771L21638O54663M75012J77723R5824N4860j57181l45449
$$ [...]
##END NTUPLES=NMR SPECTRUM
##END=
