##TITLE=31Pdec_LY-TMF-17.40
 D2O, 24 sc
 24.3.2020
##JCAMPDX= 6.0         $$ Bruker NMR JCAMP-DX V2.0
##DATA TYPE= NMR SPECTRUM
##DATA CLASS= NTUPLES
##ORIGIN= UXNMR, Bruker Analytische Messtechnik GmbH
##OWNER= root
$$ XWIN-NMR		Version 3.5
$$ Tue Mar 24 15:22:52 2020 Russian Standard Time (UT+4h)  she@DPX200
##.OBSERVE FREQUENCY= 81.013821
##.OBSERVE NUCLEUS= ^31P
##.ACQUISITION MODE= SIMULTANEOUS
##.ACQUISITION SCHEME= undefined
##.AVERAGES= 24
##.DIGITISER RES= 17
##SPECTROMETER/DATA SYSTEM= spect
##.PULSE SEQUENCE= zgpg30
##.SOLVENT NAME= DMSO
##.SHIFT REFERENCE= (INTERNAL, DMSO, 0, 182.463)
##AUDIT TRAIL= $$ (NUMBER, WHEN, WHO, WHERE, WHAT)
$$ ##TITLE= Audit trail, XWIN-NMR		Version 3.5
$$ ##JCAMPDX= 5.01
$$ ##ORIGIN= Bruker BioSpin GmbH
$$ ##OWNER= she
$$ F:/spectra/data/she/nmr/P31/1/pdata/1/auditp.txt
$$ ##AUDIT TRAIL=  $$ (NUMBER, WHEN, WHO, WHERE, WHAT)
(   1,<2020-03-24 15:21:07.84 +0400>,<she>,<DPX200>,
      <created by zg, POWCHK disabled, PULCHK disabled
       configuration hash MD5:
       00 E9 B6 7A A2 85 ED C7 34 08 36 98 17 FE 4E 26
       data hash MD5: 32K
       55 63 00 68 F3 BA 1E CF 36 CA 2D 29 44 30 47 6A>)
(   2,<2020-03-24 15:21:14.03 +0400>,<she>,<DPX200>,
      <Start of raw data processing
       efp BC_mod = 2 LB = 1 FT_mod = 6 PKNL = 1 PHC0 = -1385.616 PHC1 = 190.6017 SI = 64K 
       data hash MD5: 64K
       8B 65 E5 F9 58 FA 8E EF 27 7B F0 2E A3 49 30 C6>)
(   3,<2020-03-24 15:21:31.75 +0400>,<she>,<DPX200>,
      <pk PHC0 = 1.387993 PHC1 = 0 
       data hash MD5: 64K
       05 F2 39 8C C6 25 3A 37 22 5E 60 98 2D 88 B3 84>)
(   4,<2020-03-24 15:21:48.92 +0400>,<she>,<DPX200>,
      <pk PHC0 = -2.8 PHC1 = 0 
       data hash MD5: 64K
       38 E7 A9 68 3D DB DB F5 B6 79 9F 04 7F E8 FF 1E>)
(   5,<2020-03-24 15:21:51.87 +0400>,<she>,<DPX200>,
      <abs ABSG = 5 
       data hash MD5: 64K
       D1 EC 91 87 47 4E BC 61 CD 73 90 62 B8 FA 07 67>)
$$ ##END=
$$ 
$$ hash MD5
$$ 26 FE A7 D4 2F A5 0A 95 5B 45 CD 54 FF D6 F1 84
##$RELAX= 
##$RELAX= 
##$RELAX= 
##$RELAX= 
##$RELAX= 
##$RELAX= 
##$RELAX= 
##$RELAX= 
$$ Bruker specific parameters
$$ --------------------------
##$DU= <F:/spectra>
##$EXPNO= 1
##$NAME= <P31>
##$PROCNO= 1
##$TYPE= <nmr>
##$USER= <she>
##$AMP= (0..31)
100 100 100 100 100 100 100 100 100 100 100 100 100 100 100 100 100 100 
100 100 100 100 100 100 100 100 100 100 100 100 100 100 
##$AQSEQ= 0
##$AQ_mod= 1
##$AUNM= <au_zg>
##$AUTOPOS= <>
##$BF1= 81.014009
##$BF2= 200.13
##$BF3= 200.13
##$BF4= 200.13
##$BF5= 200.13
##$BF6= 200.13
##$BF7= 200.13
##$BF8= 200.13
##$BYTORDA= 1
##$CFDGTYP= 0
##$CFRGTYP= 5
##$CHEMSTR= <none>
##$CNST= (0..31)
1 1 145 1 1 1 1 1 1 1 1 1 1 1 1 1 1 1 1 1 1 1 1 1 1 1 1 1 1 1 1 1 
##$CPDPRG= <waltz16>
##$CPDPRG1= <>
##$CPDPRG2= <waltz16>
##$CPDPRG3= <>
##$CPDPRG4= <mlev>
##$CPDPRG5= <mlev>
##$CPDPRG6= <mlev>
##$CPDPRG7= <mlev>
##$CPDPRG8= <mlev>
##$CPDPRGB= <>
##$CPDPRGT= <>
##$D= (0..31)
0 1 0 0 0 0 0 0 0 0 0 0.03 2e-05 3e-06 0 0 0 0 0 0 0 0 0 0 0 0 0 0 0 0 
0 0 
$$ [...]
##$SUBNAM3= <"">
##$SUBNAM4= <"">
##$SUBNAM5= <"">
##$SUBNAM6= <"">
##$SUBNAM7= <"">
##$SUBNAM8= <"">
##$SUBNAM9= <"">
##$SW= 369.568048894756
##$SWIBOX= (0..15)
0 1 3 0 0 0 0 0 0 0 0 0 0 0 0 0 
##$SW_h= 29940.119760479
##$TD= 32768
##$TD0= 1
##$TE= 0
##$TE2= 300
##$TE3= 300
##$TEG= 300
##$TL= (0..7)
0 120 53 12 22 120 120 120 
##$TP= (0..7)
150 150 150 150 150 150 150 150 
##$TP07= 0
##$TPNAME0= <>
##$TPNAME1= <>
##$TPNAME2= <>
##$TPNAME3= <>
##$TPNAME4= <>
##$TPNAME5= <>
##$TPNAME6= <>
##$TPNAME7= <>
##$TPOAL= (0..7)
0.5 0.5 0.5 0.5 0.5 0.5 0.5 0.5 
##$TPOFFS= (0..7)
0 0 0 0 0 0 0 0 
##$TUNHIN= 0
##$TUNHOUT= 0
##$TUNXOUT= 0
##$USERA1= <user>
##$USERA2= <user>
##$USERA3= <user>
##$USERA4= <user>
##$USERA5= <user>
##$V9= 5
##$VALIST= <valist>
##$VCLIST= <CCCCCCCCCCCCCCC>
##$VD= 0
##$VDLIST= <DDDDDDDDDDDDDDD>
##$VPLIST= <PPPPPPPPPPPPPPP>
##$VTLIST= <TTTTTTTTTTTTTTT>
##$WBST= 1024
##$WBSW= 4
##$XGAIN= (0..3)
0 0 0 0 
##$XL= 0
##$YL= 0
##$YMAX_a= 9160
##$YMIN_a= -10082
##$ZGOPTNS= <>
##$ZL1= 120
##$ZL2= 120
##$ZL3= 120
##$ZL4= 120
##$ABSF1= 182.463
##$ABSF2= -187.1042
##$ABSG= 5
##$ABSL= 3
##$ALPHA= 0
##$AQORDER= 0
##$ASSFAC= 0
##$ASSFACI= 0
##$ASSFACX= 0
##$ASSWID= 0
##$AUNMP= <proc_1d>
##$AZFE= 0.1
##$AZFW= 0.5
##$BCFW= 0
##$BC_mod= 2
##$BYTORDP= 0
##$COROFFS= 0
##$CY= -3
##$DATMOD= 1
##$DC= 0
##$DFILT= <>
##$DTYPP= 0
##$F1P= 0
##$F2P= 0
##$FCOR= 1
##$FTSIZE= 65536
##$FT_mod= 6
##$GAMMA= 0
##$GB= 0
##$INTBC= 1
##$INTSCL= 5.30512e-09
##$ISEN= 30
##$LB= 1
##$LEV0= 0
##$LPBIN= 0
##$MAXI= 10000
##$MC2= 0
##$MEAN= 0
##$ME_mod= 0
##$MI= 50
##$NCOEF= 0
##$NC_proc= -5
##$NLEV= 6
##$NOISF1= 182.463
##$NOISF2= 159.3651
##$NSP= 0
##$NTH_PI= 0
##$NZP= 0
##$OFFSET= 182.463
##$PC= 4
##$PHC0= -1387.028
##$PHC1= 190.6017
##$PH_mod= 1
##$PKNL= yes
##$PPARMOD= 0
##$PSCAL= 0
##$PSIGN= 0
##$REVERSE= no
##$SF= 81.0140089999434
##$SI= 65536
##$SIGF1= 159.3651
##$SIGF2= -187.1042
##$SINO= 113.3802
##$SIOLD= 16384
##$SREGLST= <1H.CDCl3>
##$SSB= 0
##$STSI= 65536
##$STSR= 0
##$SW_p= 29940.119760479
##$SYMM= 0
##$S_DEV= 0
##$TDeff= 32768
##$TDoff= 0
##$TI= <>
##$TILT= no
##$TM1= 0
##$TM2= 0
##$TOPLEV= 0
##$USERP1= <user>
##$USERP2= <user>
##$USERP3= <user>
##$USERP4= <user>
##$USERP5= <user>
##$WDW= 1
##$XDIM= 65536
##$YMAX_p= 475837401
##$YMIN_p= -13397519
$$ End of Bruker specific parameters
$$ ---------------------------------
##NTUPLES= NMR SPECTRUM
##VAR_NAME=  FREQUENCY,     SPECTRUM/REAL,   SPECTRUM/IMAG
##SYMBOL=    X,             R,               I
##VAR_TYPE=  INDEPENDENT,   DEPENDENT,       DEPENDENT
##VAR_FORM=  AFFN,          ASDF,            ASDF
##VAR_DIM=   65536,         65536,           65536
##UNITS=     HZ,            ARBITRARY UNITS, ARBITRARY UNITS
##FACTOR=    0.456856943014862, 1,           1
##FIRST=     14782.0589164792, 0,            0
##LAST=      -15158.0608439998, 0,           0
##MIN=       -15158.0608439998, -13397519,   0
##MAX=       14782.0589164792, 475837401,    0
$$ Real data points
##PAGE= N=1
##DATA TABLE= (X++(R..R)), XYDATA
$$ [...]
##PAGE= N=2
##DATA TABLE= (X++(I..I)), XYDATA
36728f1450M05063M00780M87202N96671P11107N36117j01737p43525p69502k59835
$$ -61450 343613 744393 1231595 1828266 2539373 3075490 2973753 2230228 1460726 1200891
36718A200891J49083J89832J87713L22116K41662l11720r05886q62811j62346
$$ 1200891 1349974 1539806 1727519 2049635 2291297 1979577 1073691 210880 48534
36709D8534M67721M17341j07744m15607k06759J44134K12117J20172K44465N07599
$$ 48534 516255 933596 825852 410245 203486 347620 559737 679909 924374 1431973
36699A431973M14286j46043n93379m46264n4602p3878m09725l13001L87763P95584
$$ 1431973 1846259 1700216 1106837 660573 605971 532093 122368 -190633 197130 992714
36689I92714J27557j037609j357586m76938N24430O43574K46103K92800P56203
$$ 992714 1120271 82662 -1274924 -1751862 -1227432 -583858 -337755 -44955 711248
36680G11248O91769j55499p63072k69720P23651R73295K66619n03609p22568o67731
$$ 711248 1403017 1247518 484446 214726 938377 1911672 2178291 1674682 952114 284383
36670B84383o93962o12990j99294K93085N25752N64616N96539N13309J75607j79865
$$ 284383 -409579 -1022569 -1221863 -928778 -403026 161590 758129 1271438 1447045 1267180
36660A267180k06314L7791J89052J00007l0508r448P6311l5187m25435p19771
$$ 1267180 1060866 1098657 1287709 1387716 1357208 1347760 1424071 1388884 963449 243678
36650B43678l62040N59019J016155J82424j228898j581555m39704Q12957Q78388
$$ 243678 -118362 440657 1456812 1639236 410338 -1171217 -1610921 -797964 80424
36641H0424J54151k33795j49549k10663m28465k34738L65456P10133N16190J47765
$$ 80424 234575 780 -148769 -359432 -787897 -1022635 -657179 52954 569144 716909
36631G16909j19692l40802m67155l96031l43746m67959l42292L82906J086989
$$ 716909 597217 256415 -210740 -606771 -950517 -1418476 -1760768 -1377862 -290873
36622b90873R35309K69422Q9484L54463J62325m38031m04398L08945M21058m57522
$$ -290873 644436 913858 1003342 1357805 1520130 1082099 677701 986646 1407704 950182
36612I50182r76098l02883L89045p6470q26776m30255O75099R65426L11085p2849
$$ 950182 -25916 -328799 60246 -16224 -843000 -1273255 -598156 367270 678355 605506
36602F05506K35151M38284J25401j94091k24007k55299k91959K9113N04744M33026
$$ 605506 840657 1278941 1404342 1210251 986244 730945 438986 468099 972843 1405869
36592A405869k13282o56128n02007j53893M3983J41858K2957m83143q47887k91033
$$ 1405869 1192587 536459 34452 -119441 -75458 66400 89357 -393786 -1241673 -1532706
36582a532706Q49495J308739O99388l1625k65704n36738j126820j171042j18229
$$ -1532706 -683211 625528 1324916 1293291 1027587 490849 -635971 -1807013 -1925242
36573a925242R99052R21342K5930l64898l868J96104j70701m81676k88513J6145
$$ -1925242 -926190 -4848 21082 -343816 -347684 -151580 -322281 -803957 -1092470 -1076325
36563a076325K0625k3373K58020O72756P23940K79574l03544n79253l87648N3484
$$ -1076325 -1055700 -1079073 -821053 -148297 575643 855217 551673 -27580 -415228 -361744
36553c61744L51284L02171N7101j20186j59239j49291j31156p5938K3320J66490
$$ -361744 -10460 291711 348812 228626 69387 -79904 -211060 -286998 -263678 -97188
36543i7188L43472M15627J83163k64901m72666j50906L51367M21602k0301m25076
$$ -97188 246284 661911 845074 580173 107507 -43399 307968 729570 709269 284193
36533B84193l58240k1588J40657R1738J35558L08322K57269j39527m14727j17315
$$ 284193 -74047 -95635 45022 136760 272318 580640 837909 698382 283655 166340
36523A66340M69375O68425L46463p454j04219j44135k01814k7954K82871J82087
$$ 166340 635715 1304140 1650603 1643149 1538930 1394795 1192981 1165027 1447898 1629985
36513A629985l42931m49037K50949Q17540L09607o69885q47968k25823J10049
$$ 1629985 1287054 838017 1088966 1906506 2216113 1546228 698260 472437 582486
36504E82486j36369j62407L33251O12449K58382j63181k26926k89877n21444m19639
$$ 582486 446117 283710 616961 1229410 1487792 1324611 1097685 807808 286364 -133275
36494a33275R4471K06473l92015o69747K12600J405556J505929N46416k83335
$$ -133275 -38804 167669 -224346 -894093 -681493 724063 2229992 2776408 2493073
36485B493073m53654m74240o73746p09991l60958N4656K00943Q3063j61301l52624
$$ 2493073 2039419 1565179 891433 181442 -179516 -124860 76083 159146 -2155 -354779
36475c54779k24103K39526N41156K47868k97588l64122J46584N74927M00231j55333
$$ -354779 -578882 -339356 201800 449668 152080 -212042 -65458 509469 909700 754367
36465G54367m72453k32760K38218K63034l84212j013199p89337M9681M41226P4314
$$ 754367 281914 49154 287372 550406 166194 -847005 -1636342 -1586661 -1145435 -1071121
36455a071121k00599J17472L47956p456j84986M95654J173634O90651m24960p41871
$$ -1071121 -1271720 -1154248 -806292 -813748 -998734 -503080 670554 1361205 936245 194374
36445A94374k24094j02135o46055p87315j02485M73907L27801O2067J48146O5579
$$ 194374 -29720 -131855 -777910 -1565225 -1667710 -1193803 -866002 -803935 -655789 -590210
36435e90210m74032o84390J0850Q62852R21459M59871L27990N60502O00435L99192
$$ -590210 -1064242 -1748632 -1737782 -874930 46529 506400 834390 1394892 1995327 2394519
36425B394519L32411L41805L7425n06145p73312n46169j04688J81670R3764l31239
$$ 2394519 2726930 3068735 3106160 2600015 1826703 1280534 1175846 1357516 1451280 1120041
36415A120041n87952k7552J144319J684791P63899q09236j534655j076692l67173
$$ 1120041 532089 504537 1648856 3333647 4097546 3288310 1753655 676963 309790
36406C09790p5407P4330L79930M68466m7648p94854j015140m75819L37666Q11431
$$ 309790 234383 308713 688643 1157109 1109461 314607 -700533 -1176352 -838686 -27255
36396b7255P47864L85202O5599n9790n5543l6727o2886j36921j79160o7781J25869
$$ -27255 720609 1105811 1171410 1111620 1056077 1019350 956464 819543 640383 572602 698471
36385F98471Q3005k71125l97257J84123R04158O11813p20289j581997q13776P52008
$$ 698471 781476 510351 113094 297217 1201375 1813188 1092899 -489098 -1302874 -550866
36375e50866J353829N81512l37033l78394R8609J95095k70987p36929o91990j69559
$$ -550866 802963 1384475 1047442 669048 767657 962752 691765 -45164 -737154 -906713
36365i06713L52418L98930k776l06436j49266Q9070j72289p51250q46683j83709
$$ -906713 -554295 -155365 -158141 -464577 -613843 -524773 -697062 -1448312 -2294995 -2478704
36355b478704N71932P44032M76837L36677M92915O49787N23041Q0325m85987p95993
$$ -2478704 -1906772 -1162740 -685903 -349226 143689 793476 1316517 1396842 910855 114862
36345A14862n25803J57802O42884N72978K39262N0476l2408j79520j87630J51779
$$ 114862 -410941 -253139 389745 962723 1201985 1252461 1220053 1040533 852903 1004682
36335A004682M25686L7316p58697r90792l34132L45510K05554m04774n73195j93801
$$ 1004682 1430368 1467684 708987 -281805 -615937 -270427 -64873 -469647 -1042842 -1236643
36325a236643M2400j39575k04121K29969P26698P12969L39166J91395M18721O11334
$$ -1236643 -1194243 -1333818 -1537939 -1307970 -581272 131697 470863 662258 1080979 1692313
36315A692313M39837J3581l98670o78080p96817o68618k15959M35677R07863Q36795
$$ 1692313 2132150 2145731 1747061 1068981 272164 -396454 -612413 -176736 731127 1567922
36305A567922L02539j29353m1119K61019J85734j94184k24281J90712K90221k76815
$$ 1567922 1870461 1741108 1699989 1961008 2146742 1952558 1728277 1918989 2209210 1932395
36295A932395o66501q7515P81624O62556l67186r54568m74235K28535L25651R4641
$$ 1932395 1265894 1178379 1960003 2622559 2255373 1300805 826570 1055105 1380756 1475397
36285A475397M1565k3952l30597m20222O1419M90320J05901p09003r19044l40233
$$ 1475397 1516962 1493010 1162413 742191 803610 1293930 1399831 690828 -228216 -568449
36275e68449K51274L73339K94301K15091j14885p07886r76850m62392N12796J228083
$$ -568449 -317175 56164 350465 565556 450671 -257215 -1234065 -1696457 -1183661 44422
36265D4422J294513Q05147Q8691m58978n58346k91467k6843n622j63275l68428
$$ 44422 1338935 2144082 2232773 1773795 1215449 923982 897139 891517 728242 359814
36255C59814n65691o22873l48835J86638O02955O39429M25266J88744m3601k54664
$$ 359814 -205877 -828750 -1177585 -990947 -387992 251437 676703 865447 821846 567182
36245E67182k10110K27016O81864N76391q5417n94257l92702K18797N32771L89208
$$ 567182 357072 584088 1265952 1842343 1756926 1162669 769967 988764 1521535 1910743
36235A910743K34170K75096J55128l08614o27357l56832J34330K49668J70032
$$ 1910743 2144913 2420009 2575137 2266523 1639166 1282334 1416664 1666332 1836364
36226A836364M48370Q00061L45668q21459j422360q00632Q0040J38170k57199
$$ 1836364 2284734 3084795 3430463 2609004 1186644 386012 466052 604222 347023
36217C47023j61340K72552J82123m00096n96412j86361J35951M0715k6115J23204
$$ 347023 185683 458235 640358 240262 -356150 -542511 -406560 -365845 -391960 -268756
36207b68756M8573l48635m75437n9882L89894N49031P67775J094893Q00411l68343
$$ -268756 -220183 -568818 -1044255 -1104137 -714243 -165212 602563 1697456 2497867 2129524
36197B129524j336813j080912j82675O9326l52807l51393M06231R80013O79423
$$ 2129524 792711 -288201 -470876 -401550 -754357 -1105750 -699519 280494 959917
36188I59917j267l35455l53269l82926l26139r0K98607K07563k6248J06266M99794
$$ 959917 958650 623195 269926 -113000 -439139 -439229 -140622 66941 40693 146959 646753
36177F46753M93693j45458p89242p13400p578N48499M15714j28283l83911n8408
$$ 646753 1140446 994988 205746 -507654 -515232 33267 448981 320698 -63213 -121621
36167a21621M34103M98289N8567l75986l14616J79448O12549O27319L27286M5216
$$ -121621 312482 810771 869338 493352 178736 358184 970733 1598052 1925338 1970554
36157A970554o7617j01588j17635m2102R2598L5226l23810o28744m28985J54587
$$ 1970554 1902937 1801349 1683714 1641612 1734210 1769436 1445626 816882 387897 542484
36147E42484N01288L05021o3046j78508j51056k70421m17964k94836j2680P7094
$$ 542484 1043772 1348793 1285747 1107239 956183 685762 267798 -27038 -39718 37376
36137C7376M0504K66747O90956P28008J83040l53064l71940j98736l74141o95297
$$ 37376 77880 344627 1035583 1763591 1946631 1593567 1221627 1022891 648750 -46547
36127d6547n39550M6921L14194p3512n37369m46261M0142L31962K22240m6781
$$ -46547 -586097 -539176 -224982 -298494 -835863 -1282124 -1241982 -910020 -687780 -734561
36117g34561k54017l39037k49188j8872J19467L8572L404K94114O65438O23842
$$ -734561 -988578 -1327615 -1576803 -1595675 -1476208 -1437636 -1434232 -1140118 -474680 149162
36107A49162J99703n0636J12518K62736J131m39345n83845l70472p6795J47748
$$ 149162 348865 298229 410747 673483 674614 235269 -348576 -719048 -795843 -648095
36097f48095L09330L06958L3534l00793k65616L02850J049471J345462P85198
$$ -648095 -338765 -31807 1727 -299066 -564682 -261832 787639 2133101 2918299
36088B918299l85390j293610j190743l26509K62762M6798l57090k07836J98267
$$ 2918299 2532909 1239299 48556 -277953 -15191 31607 -325483 -533319 -335052
36079c35052P6972m59976m83980K61749Q50287M82200m01298q01610m54890Q2944
$$ -335052 -258080 -718056 -1202036 -940287 -90000 392200 -9098 -810708 -1265598 -1182654
36069a182654L03146J76581q8305k55193j05153L67090Q30948R33130O60759K22550
$$ -1182654 -879508 -702927 -791232 -1046425 -1151578 -784488 46460 979590 1640349 1862899
36059A862899k48742o36371o90011k85398K56901M31358J06105l97623p06031
$$ 1862899 1614157 977786 287775 2377 259278 690636 796741 399118 -306913
36050c06913o54182k69601K28723M99503M14335K42525K59356L27281J91059J120
$$ -306913 -961095 -1230696 -1001973 -502470 -88135 154390 413746 741027 932086 933206
36040I33206P0757K24170j5858n45599o47370r3893L47173m652o44528n30981
$$ 933206 1003963 1228133 1212275 666676 19306 -74587 272586 267934 -376594 -907575
36030i07575L93444J038404N90379m68811j012290n75867K61664O12382J55506
$$ -907575 -514131 524273 1114652 645841 -366449 -942316 -680652 -68270 87236
36021H7236o39918r97059n40222L93578J109402J172104O65432m754m08587l23377
$$ 87236 -552682 -1549741 -2089963 -1696385 -586983 585121 1250553 1245799 837212 513835
36011E13835P5539K88937J1960m27876m16222J60539P84094R94098Q27954M61729
$$ 513835 589374 878311 890271 462395 46173 206712 990806 1984904 2812858 3274587
36001C274587j20464p94479j052933n80773J56045L96180M4682l26432l71300
$$ 3274587 3154123 2359644 1306711 725938 881983 1278163 1322845 996413 625113
35992F25113l34227m56101n39880l48801o4365m5049l19710n46454l84682J80074
$$ 625113 290886 -165215 -705095 -1053896 -1118261 -1163310 -1483020 -2029474 -2414156 -2234082
35982b234082P70392Q80853M00704j46754j35289M12218Q85182Q50287L87267
$$ -2234082 -1463690 -582837 -182133 -328887 -464176 -51958 833224 1683511 2070778
35973B070778k85350j002161j403593j091867k73369K93111K91119K59475O48444
$$ 2070778 1785428 783267 -620326 -1712193 -1985562 -1692451 -1401332 -1141857 -493413
35964d93413J032070P97229J45013k38503j87341q9915j49659k26762k42214j70959
$$ -493413 538657 1335886 1480899 1242396 1055055 965140 815481 588719 346505 175546
35954A75546J68281P30701Q98415K16466p19260r01402l20378J32919J22379J98489
$$ 175546 343827 1074528 1972943 2189409 1470149 568747 248369 381288 503667 702156
35944G02156N10258L13411o86686j458341r38885M00844J138024O98310k02345
$$ 702156 1212414 1525825 839139 -619202 -1558087 -1157243 -19219 679091 476746
35935D76746p20359p31296m92887j11104L89539P91239P76839L10616j71635j28218
$$ 476746 -243613 -974909 -1467796 -1578900 -1189361 -398122 378717 689333 517698 389480
35925C89480L94604O59962J95762l73317j01935P37930Q06628l41063j416358
$$ 389480 784084 1444046 1639808 1266491 1164556 1902486 2709114 2368051 951693
35916I51693j164414j18008L52183P9672k449L41324L31940k44042m71286J48138
$$ 951693 -212721 -330729 21454 101126 98677 440001 771941 527899 56613 204751
35906B04751O86694J65246q40281r87624j69355L59779j13155p12206k77795R35564
$$ 204751 891445 1056691 216410 -771214 -940569 -580790 -693945 -1406151 -1683946 -748382
35896g48382J550156Q40313m30574j065652q24174l97745k89528k54546Q4533
$$ -748382 801774 1642087 1211513 145861 -678313 -1076058 -1365586 -1620132 -1535599
35887a535599N46064O59989L90303J64071K01548K18725m5283l30914k22020J36137
$$ -1535599 -989535 -329546 60757 224828 426376 645101 599818 268904 46884 183021
35877A83021J15257m75034r19213m20419P68198J504518J113180J33398n00095
$$ 183021 298278 -176756 -1095969 -1516388 -748190 756328 1869508 2002906 1502811
35868A502811n78015n06788m39159j49110L06878M42902K3787n65680q27417o76856
$$ 1502811 924796 418008 -21151 -170261 136617 579519 603306 37626 -789791 -1466647
35858a466647l16987O1471K96951L13919L13178N57690Q39880N96045k35807r30420
$$ -1466647 -1783634 -1722163 -1425212 -1111293 -798115 -240425 599455 1195500 959693 29273
35848B9273q61092k55511K85760N93242P86065P22138K17210l86641n05176j36590
$$ 29273 -831819 -1087330 -801570 -208328 577737 1299875 1517085 1130444 625268 488678
35838D88678J38876J5691j87664j54374p4609k56018n32437m11046K38985R06040
$$ 488678 627554 643245 455581 301207 226598 -29420 -561857 -972903 -733918 172122
35828A72122R82913N04684J04085J40380J87137k54307q03277o28103J85137N06487
$$ 172122 1155035 1659719 1763804 1904184 2091321 1837014 1033737 405634 590771 1097258
35818A097258k57051j188944j057285O0380J017303J076049M66440k30884n44515
$$ 1097258 840207 -348737 -1406022 -1345642 -328339 747710 1214150 983266 438751
35809D38751j60843P59550J394754J040812L0752o90856p72583n98998m05681
$$ 438751 277908 1037458 2432212 3473024 3503776 2812920 2040337 1441339 1035658
35800A035658o3376K75769J78987k54314l49716J33888O27720O11664K07349k71886
$$ 1035658 972282 1248051 1427038 1172724 823008 956896 1584616 2196280 2403629 2131743
35790B131743o64045o62575Q86P68356N50983o84465j513819r24897K54299O62385
$$ 2131743 1467698 805123 806009 1574365 2125348 1440883 -72936 -997833 -743534 -81149
35780h1149L42530K33425L45574j02032r25487r12826J86361J001564N22900m04539
$$ -81149 261381 494806 840380 738348 -187139 -1099965 -913604 87960 610860 206321
35770B06321m53389K21591M92249J46004J9302M11368N77807L4831o22359o53747
$$ 206321 -247068 -25477 466772 612776 632078 1043446 1621253 1656084 1033725 379978
35760C79978j97241J44527J79545P2302j31032l83150l93691l4604L07261K80842
$$ 379978 182737 327264 506809 579111 448079 64929 -328762 -363366 -56105 224737
35750B24737J49534K71547L68802J3070m72261m42153o8055j07953o03870q07726
$$ 224737 374271 645818 1014620 1027690 555429 113276 45221 -62732 -666602 -1474328
35740a474328m55662o3757J74802O12481J009936N22956o41694r86555K733P69599
$$ -1474328 -1929990 -1993747 -1818945 -1206464 -196528 326428 -315266 -1301821 -1299088 -529489
35730e29489P7417q76598l70419R42892J075333k6255m84536L78797J126149P27422
$$ -529489 -452072 -1328670 -1699089 -756197 319136 292881 -191655 187142 1313291 2040713
35720B040713k4100k35077k48002m63235m47371j11971k63848r78884r22060M87909
$$ 2040713 2016613 1781536 1533534 1070299 622928 510957 247109 -731775 -1653835 -1165926
35710a165926J648702J024907l61370m66590N99828R04613j92983j227394j028147
$$ -1165926 482776 1507683 1146313 679723 1279551 2184164 1991181 763787 -264360
35701b64360j79236L51010N55763P10321N28887j80181p98180o07609K22094Q88534
$$ -264360 -443596 -92586 463177 1173498 1702385 1522204 724024 116415 338509 1227043
35691A227043Q43619R6954r31086j529263j126167j694P95322O11396o7677l88904
$$ 1227043 2070662 2167616 1236530 -292733 -1418900 -1420594 -625272 -13876 -81553 -470457
35681d70457k46304j12225q1128J94152O29428N27209l72853j205191r46788J54266
$$ -470457 -716761 -828986 -910114 -715962 -86534 440675 67822 -1137369 -2084157 -1929891
35671a929891Q09021M07710j98843m234P08097R16853M50179J08879K85009M19446
$$ -1929891 -1120870 -713160 -912003 -916237 -208140 708713 1158892 1267771 1552780 1972226
35661A972226O6518l79894m66393m28981n79634n85596p2905N28823N17255j5403
$$ 1972226 2038744 1658850 1192457 763476 183842 -401754 -474659 54164 571419 556016
35651E56016l87353l68983k74852j89764Q3070L36794O7499n75915p22710R355
$$ 556016 168663 -200320 -475172 -664936 -581866 -245072 -177573 -753488 -1476198 -1466843
35641a466843Q57832Q88895J67292m83803n51847j99149K34318N90776P37068
$$ -1466843 -609011 279884 447176 -36627 -588474 -787623 -553305 37471 774539
35632G74539M56038k62890r65102j027438l25013N14805P16788K17469k82617
$$ 774539 1230577 967687 2585 -1024853 -1349866 -835061 -118273 99196 -183421
35623a83421j89439K96727N28634K42828k14154l96449k38308m771O4464j8480
$$ -183421 -372860 -76133 452501 695329 481175 84726 -153582 -158353 -93889 -112369
35613a12369q7303q5095j03603r1405K43147R45021J422805J032054N246p52490
$$ -112369 -199672 -284767 -388370 -479775 -236628 708393 2131198 3163252 3168498 2416008
35603B416008q51617p71985q55993o89650N8665Q23377Q23489J62500l87929m31599
$$ 2416008 1564391 792406 -63587 -753237 -694572 128805 952294 1114794 726865 295266
35593B95266j92469N4948K16178J81808o7896k47055p3562L21835O25718P36930
$$ 295266 102797 157745 373923 555731 487835 240780 167218 489053 1114771 1851701
35583A851701N87969k9521r45149j334888o81243K80115L73980m09130r51789
$$ 1851701 2439670 2410149 1465000 130112 -551131 -271016 102964 -306166 -1257955
35574a257955o10260R2270M83885N80149N76401K82896l74015p96959l23440P65314
$$ -1257955 -1868215 -1775945 -1292060 -711911 -135510 147386 -226629 -1023588 -1347028 -581714
35564e81714J383888R02431o7229m22607P259K38803m30240j265734j078536n1916
$$ -581714 802174 1704605 1637376 1214769 1222028 1460831 1030591 -235143 -1313679 -1365595
35554a365595M92556J93734J66053R13405J210383J67969r18924m29818Q29841
$$ -1365595 -873039 -679305 -513252 400153 1610536 1778505 859581 429763 1259604
35545A259604P36460p56175j508545n56809N78498N18252k9017N6622L74199O5395
$$ 1259604 1996064 1239889 -268656 -825465 -246967 271285 242268 298890 673089 738484
35535G38484m56931k91291K76615K63470l52733o77545k99643L59191Q41098R37648
$$ 738484 281553 -9738 266877 530347 177614 -499931 -799574 -440383 400715 1338363
35525A338363M58159m47745r86145n65715K40741L72023k44940o91401m36789
$$ 1338363 1796522 1348777 362632 -203083 37658 409681 164741 -526660 -963449
35516i63449R0456L54425L72324L29210J58468j77619l82316j11793N76683J200329
$$ -963449 -872993 -518568 -146244 182966 341434 163815 -218501 -330294 246389 1446718
35506A446718J225314N24047m30235r34493p51384l05938r9387j57664k10065
$$ 1446718 2672032 3196079 2765844 1831351 1079967 774029 674642 516978 306913
35497C06913j46921o8496p2707j79512k92277j54881L69486R07572Q63276K36597
$$ 306913 159992 91496 18789 -160723 -453000 -607881 -238395 669177 1532453 1769050
35487A769050k86264k51606L8650J65600K05344L34087L54012R4183j61050j49596
$$ 1769050 1482786 1231180 1269830 1435430 1640774 1974861 2328873 2423056 2262006 2112410
35477B112410j37866m31636p64734p34927m96747m17013l57198L1956N35875O08894
$$ 2112410 1974544 1542908 778174 43247 -453500 -870513 -1227711 -1195755 -659880 -50986
35467e0986K67176N6291J48816J49978j06425k08580J33268N26428M03558j55398
$$ -50986 216190 272481 421297 571275 464850 256270 389538 915966 1319524 1164126
35457A164126m67455j17090M47289L94026m14430j123432r21401q5644M85568
$$ 1164126 696671 579581 1026870 1420896 1006466 -116966 -1038367 -1124011 -638443
35448f38443N40268N41578N87663K58030k87233j79597O63607J012577J18781
$$ -638443 -98175 443403 1031066 1289096 1001863 822266 1485873 2498450 2617231
35439B617231r43549q02518J61293N74595K69335K27824O16614M76000m71500
$$ 2617231 1673682 871164 1032457 1607052 1876387 2104211 2720825 3196825 2725325
35430B725325j151874p54556J25786N17417L18758l3921l42669n08865k87984
$$ 2725325 1573451 818895 944681 1462098 1780856 1746935 1404266 895401 607417
35421F07417K28674M22358k4454n66600n53682j13495K13019L00328L37714K26167
$$ 607417 836091 1258449 1233995 667395 113713 218 213237 513565 851279 1077446
35411A077446k76464r08672r90226k74036O56189J018518O74111J59003n5252
$$ 1077446 800982 -107690 -1097916 -1371952 -715763 302755 976866 1135869 1080617
35402A080617q9780k77321m64959j87477M09641M86966k26018p35057j25412Q82261
$$ 1080617 990837 713516 248557 61080 470721 957687 731669 -3388 -128800 753461
35392G53461P93681m21260j191787o41581K37054K77883j41827l3171M25102K81935
$$ 753461 1547142 1125882 -65905 -707486 -470432 -192549 -334376 -367547 57555 339490
35382C39490m37706o83720r3055M21911J32898m30525m40765o3571k3949l22530
$$ 339490 -98216 -781936 -874991 -453080 -320182 -750707 -1191472 -1255043 -1278992 -1601522
35372a601522k45010M44745J113107J200807Q79286M81709o8212p53403r51382
$$ -1601522 -1846532 -1401787 -288680 912127 1791413 2273122 2204910 1451507 500125
35363E00125k04632P83855Q21995j05982p46857l76041K20760P9429m33637k73155
$$ 500125 295493 1079348 1901343 1795361 1048504 672463 893223 972652 539015 265860
35353B65860O06628J165507P64490o6666m70448k74147M9712M6131l14134p01916
$$ 265860 872488 2037995 2802485 2735819 2265371 1991224 2040936 2087067 1772933 1071017
35343A071017p83984n44024k06297J08678L82942L86959j18908p26354n84691
$$ 1071017 287033 -256991 -463288 -354610 28332 415291 296383 -429971 -1014662
35334a014662L46031R24983L31876o69014p72067M2961O77568O00536L22042K56526
$$ -1014662 -668631 256352 588228 -80786 -852853 -809892 -132324 468212 790254 1046780
35324A046780J46273k03657m68938l62632k1402L46975O43612O22644P0258o42752
$$ 1046780 1193053 989396 520458 157826 136424 483399 1127011 1749655 1819913 1177161
35314A177161p92927k57661K85221K60367j59163m17314k00373L34850O54412
$$ 1177161 384234 126573 411794 672161 512998 95684 -104689 230161 884573
35305H84573L11550l80557n17465J16964N25102l7932p53861m61623M25414O09084
$$ 884573 1196123 815566 298101 415065 940167 902235 148374 -313249 112165 721249
35295G21249Q2448k9626L69302K03123n81113o25019M36369J046353J59100j037630
$$ 721249 803697 774071 1143373 1346496 765383 140364 576733 1623086 1782186 744556
35285G44556r99042l0060O39491P73151P92528N56784j56485p78216q12728p73875
$$ 744556 -254486 -284546 354945 1128096 1920624 2477408 2320923 1542707 729979 -43896
35275d3896j068310q91457L62398J516893J122146j53865m74417K78371N25155
$$ -43896 -1112206 -2003663 -1641265 -124372 997774 843909 369492 647863 1173018
35266A173018k18091n84407K47933J188126R78072n1666p58585p29143l38317
$$ 1173018 954927 370520 618453 1806579 2784651 2732985 1974400 1245257 906940
35257I06940r525J0310l14835o24801m74730J2878K97385J93834q8995n01486
$$ 906940 897415 907725 592890 -31911 -506641 -493763 -196378 -2544 -91539 -593025
35247e93025r66388q97652N2726R61807O38213l74790l11718J057130J864755
$$ -593025 -1559413 -2457065 -2404339 -1442532 -804319 -1179109 -1490827 -433697 1431058
35238A431058J008758j12137J27214J022555Q29237m04163j073153n97466j0480
$$ 1431058 2439816 2327679 2454893 3477448 4306685 3902522 2829369 2231903 2221423
35229B221423k9870j52574L8968Q3415k77355l79552K24859P77040L64082n88906
$$ 2221423 2191553 2038979 2077947 2161362 1884007 1504455 1729314 2506354 2870436 2281530
35219B281530q38888j03696O06752M91571n8803l18689l56549o74945j134070
$$ 2281530 1442642 1338946 1945698 2437269 2378466 2059777 1703228 1028283 -105787
35210a05787j038540k63465M73938O97096Q17373J225792J363088M97201q81658
$$ -105787 -1144327 -1407792 -933854 -236758 580615 1806407 3169495 3666696 2785038
35201B785038j396270o07764L43128K83842m84796p96795k80819K86543J67200
$$ 2785038 1388768 781004 1124132 1407974 923178 126383 -154436 132107 299307
35192B99307m24922p40362m12301K73084P94617Q46220M69876l0201k81982j30788
$$ 299307 -125615 -865977 -1278278 -1005194 -210577 635643 1105519 1075318 793336 662548
35182F62548J71221J81820j92058m83930k05765M74644Q80500O58700J45246j73062
$$ 662548 833769 1015589 823531 339601 133836 608480 1488980 2147680 2292926 2119864
35172B119864k03780j10142j3912o7099m24302q36058o88194J33104Q24825O53904
$$ 2119864 1916084 1805942 1792030 1724931 1300629 464571 -223623 -90519 734306 1388210
35162A388210j5274l38058k82877m40887p43443m46645M58894Q97841K51247o34366
$$ 1388210 1372936 1034878 752001 311114 -432329 -878974 -420080 477761 729008 94642
35152I4642o34374J41993P61182Q42633O98925M76020O3358k84771j31819K94106
$$ 94642 -539732 -397739 363443 1206076 1905001 2381021 2444379 2159608 2027789 2321895
35142B321895K67273k57327m61167K907L15478k48464j030263q44588K24068Q73654
$$ 2321895 2589168 2331841 1870674 1873581 2189059 1940595 910332 65744 289812 1163466
35132A163466M27988l27514m41887q9465k0447l47212n72126m63410k21378L8953
$$ 1163466 1591454 1263940 822053 732588 712141 364929 -207197 -670607 -891985 -853032
35122h53032L56332N81445N11643K74079Q8717j61356n56685o12212Q0446Q59511
$$ -853032 -496700 84745 596388 870467 959184 797828 241143 -371069 -290623 568888
35112E68888O41003l99298q74638j82111O54109O16348Q6135j16370r6202l40231
$$ 568888 1209891 810593 -64045 -246156 407953 1024301 1110436 994066 897864 557633
35102E57633n99750l87559k6107j16995l80144j10090N02159O07578J15080j99481
$$ 557633 -42117 -429676 -455783 -572778 -952922 -1063012 -560853 46725 161805 -37676
35092c7676J5386K83319K55486J49210J16942K9161J1756L70705Q30355O69004
$$ -37676 -22290 261029 516515 665725 782667 811828 823584 1194289 2024644 2693648
35082B693648j76031r10162j008593p82982n79605k07265M52843R67837R52459
$$ 2693648 2517617 1607455 598862 -184120 -763725 -970990 -518147 449690 1402149
35073A402149O17572L10784j1534m45616o92504m04398K38981O29514L24302n43063
$$ 1402149 2019721 2330505 2318971 1873355 1180851 776453 1015434 1644948 1969250 1426187
35063A426187j298760j228410k82788P97815J280542J128046O47795m4172o93279
$$ 1426187 127427 -1100983 -1383771 -585956 694586 1822632 2470427 2426255 1732976
35054A732976o46609K19514Q29376K56704o77945m97003N18978O42636n00336
$$ 1732976 1086367 1305881 2135257 2391961 1714016 1217013 1735991 2378627 1878291
35045A878291j247246n53683M08315K60363m86236n82103p2493K16770L09810
$$ 1878291 631045 77362 485677 746040 259804 -322299 -394792 -178022 131788
35036A31788P25234J102153O50418l26741o94798j85916L13258J85989k08064
$$ 131788 857022 1959175 2609593 2282852 1588054 1402138 1715396 1901385 1693321
35027A693321l51127k37794n9448J25080K51264K39120J53661N2033j55119l60568
$$ 1693321 1342194 1104400 1044952 1170032 1421296 1660416 1814077 1866110 1710991 1350423
35017A350423j49562M93103Q12544K74243m87180n08683K8291Q5555o10416j192691
$$ 1350423 1200861 1693964 2506508 2780751 2293571 1784888 1813179 1898734 1288318 95627
35007I5627r83806l42141O7872J63414K72656N48795Q53847R60584P33901L10358
$$ 95627 -888179 -1230320 -1162448 -999034 -726378 -177583 676264 1636848 2370749 2681107
34997B681107P2417K06708L91080J97685l34400q13993r81286p66505j54024N95695
$$ 2681107 2753524 2960232 3351312 3548997 3214597 2400604 1419318 652813 498789 1094484
34987A094484Q78421M13206k41620l51909K3160K54408J10286j00866j82485j99234
$$ 1094484 1972905 2386111 2144491 1792582 1815742 2070150 2180436 2079570 1897085 1697851
34977A697851p4799L06291O14810L24590m86535j109251j048773m77577J33654
$$ 1697851 1623052 1929343 2544153 2868743 2382208 1272957 224184 -253393 -119739
34968a19739M06829J56671m20375p24255l91284J44659K29151k9553K3917M85566
$$ -119739 287090 443761 23386 -700869 -1092153 -947494 -718343 -747896 -723979 -238413
34958b38413P21989L90796l8727j0332L79626O09322L64547j96263n79933l86952
$$ -238413 483576 874372 835645 825313 1204939 1814261 2178808 1982545 1402612 1015660
34948A015660J69008L63081j00985n77033l88395J24253J67824k03625k44380
$$ 1015660 1184668 1547749 1446764 869731 481336 605589 773413 569788 325408
34939C25408J67833L48389K883l35634k77128j17718j23149o1649K09101M08462
$$ 325408 493241 841630 844513 508879 231751 114033 -9116 -70765 138336 546798
34929E46798M26799N57348P88965N91120j64205p62310o44996k23611j22954j91053
$$ 546798 973597 1530945 2319910 2911030 2746825 1984515 1339519 1115908 992954 801901
34919H01901N5068M30058K82431m78115j177424j178524m92717L45100P31098
$$ 801901 856969 1287027 1569458 1091343 -86081 -1264605 -1757322 -1412222 -681124
34910f81124M54594n8242j34067L27842O80696L87352k55647n47400k75136J53699
$$ -681124 -226530 -284772 -418839 -90997 589699 977051 721404 174004 -101132 52567
34900E2567K99050J15935j06667n1245K87323N09085K51905k65665m57816j61916
$$ 52567 351617 467552 360885 309640 596963 1106048 1357953 1092288 634472 472556
34890D72556J80294K22010J46308K32949M25426N43953N34660L22099j63643o46282
$$ 472556 652850 874860 1021168 1254117 1679543 2223496 2758156 3080255 2916612 2270330
34880B270330o84703l89370l87474q12935r80293m57962K01271L38417J66312
$$ 2270330 1585627 1196257 808783 -4152 -984445 -1442407 -1241136 -902719 -736407
34871g36407K05546L07579L9190l83191m01519p6841R8061J27404L86337P19995
$$ -736407 -530861 -223282 -184092 -567283 -968802 -1045643 -947582 -820178 -433841 286154
34861B86154N99288J47607N6009L73877L56505k25667n85303j66162M69890N76199
$$ 286154 885442 1033049 1089058 1462935 1819440 1593773 1008470 842308 1312198 1888397
34851A888397K82580M8171k58391q76405j257142o53768N86270J265572Q92834
$$ 1888397 2170977 2219148 1960757 1084352 -172790 -826558 -240288 1025284 1918118
34842A918118J69071j72917j93468j75632l4352K47312K34930l14177q57694p20494
$$ 1918118 2087189 1914272 1720804 1545172 1510820 1758132 1993062 1678885 821191 100697
34832A00697n8020M09798M35899M25247O32754P37705L31230n18666j262734j251708
$$ 100697 42677 452475 888374 1313621 1946375 2684080 3015310 2496644 1233910 -17798
34822a7798k84503R42774J222750J63027j111876j204174j96686O01591N44055
$$ -17798 -302301 640473 1863223 2026250 914374 -289800 -486486 115105 659160
34813F59160K92326M31674N33277J17550l82792l63111m7955K2756p0763n008
$$ 659160 951486 1383160 1916437 2033987 1651195 1288084 1240129 1262885 1192122 1187114
34803A187114n033l77266o74657k95917L69973M22902o3310j03886N87980J106199
$$ 1187114 1182081 804815 130158 -165759 204214 627116 563806 459920 1047900 2154099
34793B154099P49618j4345m27341n01801o25715o87033k85294M43421Q34844N46557
$$ 2154099 2903717 2889372 2462031 1960230 1334515 647482 362188 805609 1640453 2187010
34783B187010n662j99395K6735J84747r991k16439o3267J27008k05144p88703
$$ 2187010 2181348 1981953 2008688 2193435 2183444 1967005 1903738 2030746 1825602 1036899
34773A036899p37950J1579M44275P0785k53286J42239M71585j08478p80251k66756
$$ 1036899 298949 310528 754803 825588 572302 714541 1186126 1077648 297397 30641
34763C0641Q90628J014406k5292o66429k62965O5287l58125n56102K23473R98467
$$ 30641 921269 1935675 1910383 1243954 980989 1046276 688151 132049 355522 1353989
34753A353989N97991m56274q42396l75074R8374J28901m1961j80430j89109Q4696
$$ 1353989 1951980 1495706 653310 278236 376610 505511 463550 283120 94011 178707
34743A78707M88371M67738n4796k79472L06108R64905P14588k33129q87263q82155
$$ 178707 667078 1134816 1080020 800548 1106656 2071561 2786149 2553020 1665757 783602
34733G83602n85644j80357M10615Q80461P44872J80464j13263N1335J10401l22376
$$ 783602 197958 17601 428216 1308677 2053549 2234013 2120750 2172085 2282486 1960110
34723A960110q18372o81221J18897P93196N94863j90082m33876L29259J023985
$$ 1960110 1141738 460517 579414 1372610 1967473 1777391 1343515 1672774 2696759
34714B696759M26856q83284j155562o3316P59578K24338o48127n41024J38552
$$ 2696759 3123615 2240331 1084769 1021453 1781031 2005369 1357242 816218 954770
34705I54770K90353O7809L11335Q03334O64647N7771m3096L93162L75292l90447
$$ 954770 1245123 1312932 1624267 2427601 3092248 3150019 3106923 3500085 3875377 3484930
34695C484930r91133p31311j3972M40477M05531J4671m44616n24796p7692L18846
$$ 3484930 2493797 1762486 1748514 2188991 2594522 2609193 2164577 1639781 1562089 1880935
34685A880935P4188m28853l62253J87180L22671k10898o25157k85750M86888R82806
$$ 1880935 1955123 1526270 1164017 1351197 1673868 1462970 837813 552063 1038951 2021757
34675B021757Q23440O6384p89589r56658j78021P17201P85361K86293J71821M82653
$$ 2021757 2845197 2911581 2121992 1165334 987313 1704514 2489875 2776168 2947989 3430642
34665C430642L54383m01264r17427p17188m26285o11116q62579n90379J7422L98693
$$ 3430642 3785025 3383761 2466334 1749146 1322861 711745 -150834 -741213 -723791 -325098
34655c25098M49460M71918O54376R19840J027397P32803J40262k18378o7900J09501
$$ -325098 124362 596280 1250656 2170496 3197893 3930696 4070958 3852580 3784680 3894181
34645C894181j54143m11389k9914N17497K36599o62146r26435k44222L01299P9082
$$ 3894181 3740038 3328649 3298735 3816232 4052831 3390685 2464250 2220028 2521327 2600409
34635B600409j68910J62897M17827q9720p90353p89354k68429Q762l5009N8714
$$ 2600409 2431499 2594396 3012223 2922503 2132150 1342796 1074367 1083129 1048120 1106834
34625A106834L30635M33035K73933k2016m25921p23755m09493N20454J160266
$$ 1106834 1437469 1870504 2144437 2122421 1696500 972745 563252 1083706 2243972
34616B243972P79859j08283m80053k10765R026j29568k57675j24358L5700k3009
$$ 2243972 3023831 2915548 2435495 2224730 2233756 2104188 1846513 1722155 1757855 1734846
34606A734846k27150l70475k96915K5652L55667L10035q2565k70467M1844L75900
$$ 1734846 1507696 1137221 840306 865958 1221625 1531660 1449095 1178628 1220472 1596372
34596A596372J87477k73277l71115o5211J61876J79517L14927N76995M50889k90866
$$ 1596372 1783849 1510572 1139457 1074246 1236122 1415639 1730566 2307561 2758450 2467584
34586B467584j057196j091293m47592L4620k23466p60935o16668L56145J127338
$$ 2467584 1410388 319095 -128497 -93877 -317343 -1078278 -1694946 -1338801 -211463
34577b11463P78203j99152n19834J25751P29166N12571l6245r4032K82418N00835
$$ -211463 566740 367588 -152246 -26495 702671 1215242 1178997 1084965 1367383 1868218
34567A868218M42693M10318M13684K20485o1631q7322J20495J99404L2710j53984
$$ 1868218 2310911 2721229 3134913 3355398 3293767 3206445 3326940 3526344 3559054 3405070
34557C405070k30619k75055k97097k41122k04602k80571k76718n639K51242Q8850
$$ 3405070 3174451 2899396 2602299 2361177 2156575 1876004 1599286 1593647 1844889 1933739
34547A933739k33410K9832R43815J496378Q21879n52894j265386q00495k5224
$$ 1933739 1700329 1730161 2673976 4170354 4992233 4439339 3173953 2373458 2348234
34538B348234P2230l90601o10096l17839M3403K09453M23867P25144O16348j15615
$$ 2348234 2420464 2029863 1419767 1101928 1145331 1354784 1778651 2503795 3120143 3004528
34528C004528p96868o75197K0894M50617L39176J19945L6878j59563n39129o65036
$$ 3004528 2207660 1532463 1553357 2003974 2343150 2463095 2499973 2340410 1801281 1136245
34518A136245k00324N63703J000971P41841o5481q35814r43177l31517L48765
$$ 1136245 935921 1499624 2500595 3242436 3176955 2341141 1397964 1066447 1415212
34509A415212M90470K31004P0350Q1459Q246j08859l4353R8171j9833k14683l9462
$$ 1415212 1905682 2136686 2207036 2288495 2296741 2187882 2153529 2251700 2231867 2017184 1977722
34498A977722M02310N10369R5117l58874l71007P4004O62554R02169L79800o08541
$$ 1977722 2380032 2890401 2985518 2626644 2255637 2329641 2992195 3894364 4274164 3665623
34488C665623j061925n41832P1124j04388n19794k17767L49872M0000q45528q91577
$$ 3665623 2603698 2061866 2132990 2028602 1508808 1291041 1640913 1680913 835385 -56192
34478e6192N5667O66988M17437K21752M46123K35617n55146o92851K85453J061502
$$ -56192 -525 666463 1083900 1305652 1751775 1987392 1432246 739395 1024848 2086350
34468B086350O99149P1392p062k58659j139008j345752N1319J506825J102557
$$ 2086350 2785499 2856891 2849829 2591170 1452162 106410 157729 1664554 2767111
34459B767111m11103q54930k9233L99057j05834l88655M6213L01128j5333m7029
$$ 2767111 2356008 1501078 1471845 1870902 1765068 1376413 1422626 1723754 1708421 1661392
34449A661392O31261J138021P03585k10841p35013o03865j3785O75682Q66435
$$ 1661392 2292653 3430674 4134259 3923418 3188405 2584540 2570755 3246437 4112872
34440D112872J86712p74279r74101k85762L87952M15725P3171j60606j54108Q0232
$$ 4112872 4299584 3525305 2551204 2265442 2653394 3069119 3142290 2981684 2827576 2907808
34430B907808L99219L43640l10170q91355n84438K18486L08402m96642r50944
$$ 2907808 3307027 3650667 3340497 2449142 1864704 2083190 2391592 1894950 944006
34421I44006j93917R61813J165347L31293l90304k07827L63355K95851n28983
$$ 944006 750089 1711902 2877249 3208542 2818238 2610411 2973766 3269617 2740634
34412B740634j119684p20406J18254L83896J48425K95835Q24941P28354j55376
$$ 2740634 1620950 900544 1018798 1402694 1551119 1846954 2671895 3400249 3244873
34403C244873o16502q3437K95412l71490j038385m29482P42667R34307K42546
$$ 3244873 2628371 2544934 2840346 2468856 1430471 1000989 1743656 2677963 2920509
34394B920509q7314M9530k36708p90774n32073M40924P93501J98827j51546L49324
$$ 2920509 2833195 2882725 2646017 1855243 1323170 1764094 2557595 2756422 2604876 2954200
34384B954200P83080M23956r2055k0610K93203K04489k04446n27007o79547o43705
$$ 2954200 3737280 4161236 4069181 4048571 4341774 4546263 4341817 3814810 3135263 2491558
34374B491558k63571K91624M85327J45547k93762m34117k79318L7805L42694L36163
$$ 2491558 2227987 2519611 3004938 3150485 2856723 2422606 2143288 2181093 2523787 2859950
34364B859950j5465k43980j04719q3658m71778n88594R0301P52798M60295j56788
$$ 2859950 2844485 2600505 2495786 2412128 1940350 1351756 1442057 2194855 2655150 2498362
34354B498362N6118O44413K74415p84286r28755P5793P09053K36531l33810k56377
$$ 2498362 2554480 3198893 3473308 2689022 1760267 1836060 2545113 2781644 2447834 2191457
34344B191457j32753m14311n52156k87477j95128l29547R4900J060572J384050
$$ 2191457 2058704 1644393 1092237 804760 609632 280085 374985 1435557 2819607
34335B819607O64833O863Q9071J39903l60553n94262J5614O56475N63261J92277
$$ 2819607 3484440 3491303 3580374 3720277 3359724 2765462 2781076 3437551 4000812 4193089
34325D193089J5456l85727j021534q38177M47027J331249O85528m20187m70227
$$ 4193089 4208545 3822818 2801284 1963107 2410134 3741383 4426911 4006724 3536497
34316C536497J67244J98401l78433o14900l57470j42193O353L22474M53081Q8531
$$ 3536497 3703741 3902142 3523709 2908809 2551339 2409146 2415499 2737973 3191054 3279585
34306C279585j95916J14497M03017p666m76670p4250O84034N85606k68751o62063
$$ 3279585 3083669 3198166 3601183 3593517 3116847 3042597 3726631 4312237 4043486 3381423
34296C381423k23730J65461r7475n42328m70196K01469R75564J154872L92593
$$ 3381423 3157693 3323154 3225679 2683351 2213155 2414624 3390188 4545060 4937653
34287D937653p37212j145925n79410O5007J44044J01986L58750M29005k8607l25926
$$ 4937653 4200441 3054516 2475106 2540113 2684157 2786143 3144893 3573898 3545291 3219365
34277C219365P8147M80631J40458l39925j07924L12125o2238p86200o07518L92745
$$ 3219365 3297512 3778143 3918601 3578676 3470752 3782877 3720639 2934439 2326921 2719666
34267B719666Q51922K52712m20035l05227K41657M77353K83817J6939n2328J05463
$$ 2719666 3571588 3824300 3404265 3099038 3340695 3818048 4101865 4118804 4066476 4171939
34257D171939L25977L63690J32801k48972o76919j004488q58911j15970N29141
$$ 4171939 4497916 4861606 4994407 4745435 4068516 3064028 2205117 2089147 2618288
34248B618288L41072j45887K37685J256776J330502L1081j077534q32380j07638
$$ 2618288 2959360 2813473 3051158 4307934 5638436 5669517 4591983 3759603 3651965
34239C651965o4207l13192p9780K08031p2860l55825J5302L85320k1351n22820
$$ 3651965 3587758 3274566 3194786 3402817 3329957 2974132 2989434 3374754 3353403 2830583
34229B830583j29155O51124P01638J61116j09066r3178j65986N9576Q70762J312053
$$ 2830583 2701428 3352552 4054190 4215306 4106240 4013062 3847076 3906652 4777414 6089467
34219F089467N38560n32613o05066j56020l88651r15393n48434L02593K48024
$$ 6089467 6628027 6095414 5490348 5334328 4945677 4030284 3481850 3784443 4032467
34210D032467n06722m59883M93377Q68311J45756n38333m66236k09313j35960
$$ 4032467 3525745 3065862 3559239 4427550 4573306 4034973 3568737 3359424 3223464
34201C223464J95188P63516P66035M77p15815q10458n27039j36689L29476N78990
$$ 3223464 3418652 4182168 4948203 4948680 4232865 3422407 2895368 2758679 3088155 3667145
34191C667145L34064l5077j02655j78270m77655k58610Q58617J572166O27582
$$ 3667145 4001209 3966132 3863477 3685207 3207552 2948942 3807559 5379725 6007307
34182F007307q99999j031148M7220N29467J24924J95759R22204R03874j30602
$$ 6007307 5107308 4076160 4123380 4652847 4777771 4973530 5895734 6799608 6669006
34173F669006o49764O5788Q02379N97677J02378L5351K9937k66715m94550n56537
$$ 6669006 6019242 6085030 6887409 7485086 7587464 7622815 7652752 7386037 6891487 6334950
34163F334950q45755j128078p14837J5450m1273o37782l51799Q07405J059189
$$ 6334950 5489195 4361117 3646280 3661730 3620457 2982675 2630876 3438281 4497470
34154D497470k13399j251501o28765O67058J024311N24391K35000M11040N67922
$$ 4497470 4284071 3032570 2403805 3070863 4095174 4619565 4854565 5265605 5833527
34145E833527M74981J95835j64017k56013J99114O92298M63113k13045m25839
$$ 5833527 6308508 6504343 6340326 6084313 6283427 6975725 7438838 7225793 6799954
34136F799954k37180m68940r57236p10460J07182K04965n47286p84427m8795M29977
$$ 6799954 6562774 6093834 5136598 4426138 4533320 4738285 4190999 3406572 3357777 3787754
34126C787754K025k93047K64143P78230M72275P4688L67298P69450M83642j33789
$$ 3787754 3789779 3496732 3760875 4539105 5011380 5086068 5453366 6222816 6706458 6572669
34116F572669l48159j80784L6163K94747M92355L23720J4429J54263N45987L68135
$$ 6572669 6224510 6043726 6079889 6374636 6866991 7190711 7205140 7359403 7905390 8273525
34106H273525l56680p52695o51403p07153q66218l56199O21209R13505L84072
$$ 8273525 7916845 7164150 6512747 5805594 4939376 4583177 5204386 6117891 6501963
34097F501963J02406L30857J94689l48942k25350O29392Q85543J34761l95551
$$ 6501963 6604369 6935226 7129915 6780973 6555623 7185015 8070558 8205319 7809768
34088G809768n4999K66525K3502r4961J87790J41841k87216j70898M31542K48993
$$ 7809768 7754769 8021294 8044796 7949835 8137625 8279466 7992250 7821352 8252894 8501887
34078H501887q30922j285305n19947K38092K85055M45896J007111R44645N1735
$$ 8501887 7670965 6385660 5865713 6103805 6388860 6834756 7841867 8786512 8838247
34069H838247m20963p1211j5562n03696k89980P93826J162552K89601l38867K512
$$ 8838247 8417284 8346073 8330511 7826815 7536835 8330661 9493213 9782814 9443947 9446459
34059I446459J60509l25838k86966M61271M29324n61710o88560M58833R06543
$$ 9446459 9606968 9281130 8994164 9455435 9884759 9323049 8634489 9093322 9999865
34050I999865l6089m59853M09179O73742m00380o82643P22590J394935o3770j274652
$$ 9999865 9963776 9503923 9913102 10586844 10186464 9503821 10226411 11621346 11557576 10282924
34040A0282924k94332R66560M28407m58529J66426R50761J35086r41280m77806
$$ 10282924 9988592 10955152 11383559 10925030 11091456 12042217 12177303 11236023 10758217
34031A0758217L71044m843m33949M79444J217080J54974j052444l36423J000847
$$ 10758217 11129261 11124418 10690469 11169913 12386993 12541967 11489523 11153100 12153947
34022A2153947Q07952k5462L26014R87327L55036n59807k05756L34619l97831
$$ 12153947 12961899 12936437 13262451 14249778 14604814 14045007 13839251 14173870 13776039
34013A3776039j133268l65246M83655k40093j089363k87771Q33829O28445M79457
$$ 13776039 12642771 12277525 12761180 12521087 11431724 11143953 11977782 12606227 13085684
34004A3085684J722746K302569M61656j331433l81324J360159Q49466o43046l26008
$$ 13085684 14808430 17110999 17572655 16241222 15859898 17220057 18069523 17426477 17100469
33995A7100469Q44112M81213m27921J80651J100236M65894k25820O80046J119311
$$ 17100469 17944581 18425794 17997873 18178524 19278760 19744654 19518834 20198880 21318191
33986B1318191n70055j447223Q52160K830799Q73552j917101j042927J431411
$$ 21318191 20748136 19300913 20153073 22983872 23857424 21940323 20897396 22328807
33978B2328807J187830k39301Q38612K484313J022152j133534J63057K398878
$$ 22328807 23516637 23277336 24115948 26600261 27622413 26488879 26651936 29050814
33970B9050814J026140j406519P1056K977250J980148n67450Q13869L553623J717262
$$ 29050814 30076954 28670435 28741491 31718741 33698889 33131439 33945308 37498931 39216193
33961C9216193j890393m27473L699473L129211k33703R72049M749635L490536
$$ 39216193 37325800 36898327 40597800 43727011 43493308 44465357 49214992 52705528
33953E2705528m52815J224420N976559M663611l0684K005885Q027377P012543
$$ 52705528 52252713 53477133 59453692 64117303 64086619 66092504 74119881 81132424
33945H1132424K127508N571997J3100183J0213948K393987P856097K0031944J5563416
$$ 81132424 83259932 88831929 101932112 112146060 114540047 122396144 142428088 157991504
33937A57991504L612326J8160274M4986099J4103698r4738988j89091317j66512130
$$ 157991504 161603830 179764104 224750203 238853901 144114913 -44976404 -211488534
33930b11488534n0520805M0753070M6455432J5667829R197577K0426418J7340058
$$ -211488534 -262009339 -221256269 -174800837 -159133008 -149935431 -129509013 -112168955
33923a12168955M401208L289501R267377N352168l022829k66837Q780702Q748142
$$ -112168955 -107767747 -104478246 -95210869 -89858701 -92881530 -93148367 -84367665 -75619523
33915g5619523J837928J199353O033659N731360J126671J264985M973094L996079
$$ -75619523 -73781595 -72582242 -66548583 -60817223 -59690552 -58425567 -53452473 -49456394
33907d9456394l57441k85699L055561K430304r51293j10808L768956L623548J664
$$ -49456394 -49813835 -50099534 -47043973 -44613669 -45564962 -45675770 -41906814 -38283266 -38281602
33898c8281602m51778K250811K224056n82468p96526J690288K038613K32540N81509
$$ -38281602 -38733380 -36482569 -34258513 -34840981 -35637507 -33947219 -31908606 -31676066 -31094557
33889c1094557K598778J874521r44681j114370J186015J464116l44272j79250
$$ -31094557 -28495779 -26621258 -27565939 -28680309 -27494294 -26030178 -26374450 -26553700
33881b6553700J879251J863490j75615m21552J096820Q29395q87511l44387K007711
$$ -26553700 -24674449 -22810959 -22986574 -23408126 -22311306 -21481911 -22369422 -22713809 -20706098
33872b0706098K031129k80698p90829J007203J398158k28646n36800R01388Q14766
$$ -20706098 -18674969 -18955667 -19746496 -18739293 -17341135 -17569781 -18106581 -17205193 -16390427
33863a6390427j080693j273452Q29841J735441L48736m29031M54450O20639m87447
$$ -16390427 -17471120 -18744572 -17914731 -16179290 -15830554 -16259585 -15805135 -15184496 -15671943
33854a5671943m50290J004209J203048j66679l36675J035737J062174o67821j037124
$$ -15671943 -16122233 -15118024 -13914976 -14081655 -14418330 -13382593 -12320419 -12988240 -14025364
33845a4025364P15680J456359m9574j030475k6829P15362p2409m30268N55050
$$ -14025364 -13309684 -11853325 -11902899 -12933374 -12960203 -12244841 -12317250 -12747518 -12192468
33836a2192468Q54126k42711m53121R75832J464830j29941j208080r2252J051280
$$ -12192468 -11338342 -11581053 -12034174 -11058342 -9593512 -9723453 -10931533 -11023785 -9972505
33827i972505L08070p46492l35812M28122J28809l92553k47136l27485r53852
$$ -9972505 -9664435 -10410927 -10746739 -10318617 -10189808 -10582361 -10829497 -11156982 -12110834
33818a2110834o30457R61944J680687N01629n50592N5228Q13108J78125p18932
$$ -12110834 -12741291 -11779347 -10098660 -9597031 -10147623 -10092395 -9279287 -9101162 -9820094
33809i820094m75809N7316k25450n22255M0369N90155L52448K03470P34360Q91125
$$ -9820094 -10295903 -10238587 -10464037 -10986292 -10945923 -10355768 -10003320 -9799850 -9065490 -8174365
33799h174365Q9536m71672p1083J74435l94512o30728O3456M08808k65467o21172
$$ -8174365 -8084829 -8556501 -8627584 -8453149 -8847661 -9478389 -9414933 -9006125 -9271592 -9892764
33789i892764J14490O36266J52394o6848O35696P50156m27672r83656K97472J423934
$$ -9892764 -9778274 -9142008 -8989614 -9056462 -8420766 -7670610 -8098282 -9081938 -8784466 -7360532
33779g360532M68539j057789q22021M40493N60428k42739j73818P18959Q47817
$$ -7360532 -6891993 -7949782 -8771803 -8331310 -7770882 -8013621 -8187439 -7468480 -6620663
33770f620663O9819k44234K81431O63452M49555J47681l758k04730l10011o7570
$$ -6620663 -6550844 -6795078 -6513647 -5850195 -5400640 -5252959 -5256717 -5461447 -5771458 -5839028
33760e839028K38413K87869K84486L17660L2111m40803l68555J13805j68588j331053
$$ -5839028 -5600615 -5312746 -5028260 -4710600 -4678489 -5119292 -5487847 -5374042 -5542630 -6873683
33750f873683j749357n33894Q99235R60783R7595m19481m56419l96591M5935R57526
$$ -6873683 -8623040 -9156934 -8257699 -7296916 -7199321 -7618802 -8075221 -8471812 -8425877 -7468351
33740g468351J421223R40258M46173O32503O36048k70573j066098n85330M95595
$$ -7468351 -6047128 -5106870 -4660697 -4028194 -3392146 -3662719 -4728817 -5314147 -4818552
33731d818552P99687K76406l09790p99233j192970r37917P875N51142J59708j05695
$$ -4818552 -4018865 -3742459 -4052249 -4851482 -6044452 -6982369 -6974494 -6423352 -6263644 -6369339
33721f369339M81824Q50418O2104q44826o59786j46029m58651q16968P7070J445380
$$ -6369339 -5887515 -5037097 -4974993 -5819819 -6479605 -6625634 -7084285 -7901253 -7824183 -6378803
33711f378803J552531N77520J01516L37448J10430p42702j089007n51602O35O3485
$$ -6378803 -4826272 -4248752 -4147236 -3809788 -3699358 -4442060 -5531067 -6082669 -6082034 -6018549
33701f018549M2773J60013J42521j2459n6612q6657j84851Q8655Q72981J296768
$$ -6018549 -5975776 -5815763 -5673242 -5685701 -5742313 -5828970 -6013821 -5925166 -5052185 -3755417
33691c755417O71945k73668m85839j68337q8734j21068J87267M04467J7593l16401
$$ -3755417 -3083472 -3357140 -3842979 -4011316 -4100050 -4221118 -4033851 -3629384 -3611791 -3928192
33681c928192J50858O62324Q9587r64342r62816R0929P42662M09266p8859j63380
$$ -3928192 -3777334 -3115010 -3025423 -3989765 -4952581 -4861652 -4118990 -3709724 -3788583 -3951963
33671c951963j94994l26940j68861L12500O57279P00991N85253J99945m59538
$$ -3951963 -4146957 -4473897 -4642758 -4330258 -3672979 -2971988 -2386735 -2186790 -2646328
33662b646328p52864k20878M72259M58680L6353K9898L38486L13586L3743o7428
$$ -2646328 -3399192 -3620070 -3147811 -2689131 -2652778 -2622880 -2284394 -1970808 -1937065 -2004493
33652b004493l07217j127832j838239j409341j93736N06898L06191r9466k76423
$$ -2004493 -2311710 -3439542 -5277781 -6687122 -6880858 -6373960 -6067769 -6167235 -6443658
33643f443658k88767M1446Q01844J258165P23223k11341n29830l67345m22538
$$ -6443658 -6732425 -6690979 -5889135 -4630970 -3907747 -4119088 -4648918 -5016263 -5438801
33634e438801m33315K02772Q48249M26980n53721n98735L41221Q55597M64100
$$ -5438801 -5872116 -5669344 -4821095 -4394115 -4947836 -5546571 -5205350 -4349753 -3885653
33625c885653J88749N49013P30686J81316m51958m88649j41995J26832K22558
$$ -3885653 -3696904 -3147891 -2417205 -2235889 -2687847 -3176496 -3318491 -3191659 -2969101
33616b969101J53632k4496n62L05457L36417j90614n38627j69635O7822o21611
$$ -2969101 -2815469 -2839965 -2840527 -2535070 -2198653 -2389267 -2927894 -3097529 -3029707 -3651318
33606c651318j181971j93386J463801J599578J22349q07686j43969P49049N83501
$$ -3651318 -4833289 -5026675 -3562874 -1963296 -1840947 -2648633 -2792602 -2043553 -1460052
33597a460052j36457n33602o62315o69920k67512K66339L9073q56995j123334
$$ -1460052 -1596509 -2130111 -2792426 -3462346 -3729858 -3463519 -3424446 -4281441 -5404775
33588e404775k38915P19909Q14291M19405J18177j75607m16553j64239K90461
$$ -5404775 -5643690 -4923781 -4109490 -3690085 -3571908 -3747515 -4164068 -4328307 -4037846
33579d037846k1321r48885j005577K89255J396790J045132P9138r6221L75105
$$ -4037846 -4059167 -5008052 -6013629 -5724374 -4327584 -3282452 -3203314 -3299535 -2924430
33570b924430N03079J99215K1654l5495k96006n45033m53158l15381m40992l48087
$$ -2924430 -2421351 -2222136 -2200482 -2235977 -2531983 -3077016 -3530174 -3845555 -4286547 -4634634
33560d634634M81205J457070J440228K81153r28940j119633l06117N77646O79786
$$ -4634634 -4153429 -2696359 -1256131 -974978 -1903918 -3023551 -3329668 -2752022 -2072236
33551b072236Q2850m03451l87010l87508p66586q32768O8408J143584J108363
$$ -2072236 -1989386 -2392837 -2779847 -3167355 -3933941 -4766709 -4698301 -3554717 -2446354
33542b446354K12833j52649K61224K93165m88612j041773o62029L014L04960N24360
$$ -2446354 -2233521 -2386170 -2124946 -1831781 -2320393 -3362166 -4024195 -4021181 -3716221 -3191861
33532c191861Q25420O48509j34013o78453m84722j27734q3533O543L29370L85520
$$ -3191861 -2366441 -1717932 -1851945 -2530398 -3015120 -3142854 -3226387 -3219844 -2890474 -2504954
33522b504954Q1344R2032N38632O04994P3824j75043J32319K5920q03502j116054
$$ -2504954 -2423610 -2331578 -1792946 -1187952 -1114128 -1289171 -1156852 -1130932 -1934434 -3050488
33512c050488k34849N80175K04479m45106j39086M34384j2850r39566q30513K62912
$$ -3050488 -3285337 -2705162 -2500683 -2945789 -3084875 -2650491 -2663341 -3602907 -4433420 -4170508
33502d170508R43935P43228L66624J6454p22565j411737r39260N55486J421851
$$ -4170508 -3226573 -2483345 -2116721 -2100267 -2822832 -4234569 -5173829 -4618343 -3196492
33493c196492O61056p51087j235906n12248M06535O33527L21735K22919N99554
$$ -3196492 -2535436 -3286523 -4522429 -5034677 -4628142 -3994615 -3672880 -3449961 -2850407
33484b850407Q70360N29885J8981L4035K93268L776o05161n33984J37055K10859
$$ -2850407 -1980047 -1450162 -1431181 -1397146 -1103878 -1100102 -1705263 -2239247 -2102192 -1891333
33474a891333m63555n42447L90178Q08692j97208j144830n14219O77025N55110
$$ -1891333 -2354888 -2897335 -2507157 -1698465 -1895673 -3040503 -3554722 -2877697 -2322587
33465b322587n71414r42002k83278J12747j87462k66726L23568R65540J177227
$$ -2322587 -2894001 -3836003 -4119281 -4006534 -4193996 -4460722 -4137154 -3171614 -1994387
33456a994387R90754K98578p99116j280371l27426J069670J185021O9731o06555
$$ -1994387 -1003633 -705055 -1504171 -2784542 -3111968 -2042298 -857277 -787546 -1394101
33447a394101j60789L36542O2851m16189m31388k56960l45677n75853o76513n63794
$$ -1394101 -1554890 -1218348 -1155497 -1571686 -2003074 -2260034 -2605711 -3181564 -3858077 -4421871
33437d421871q4654P46599J281713R32893K10372M1946K68401K8465n52166m83238
$$ -4421871 -4506525 -3759926 -2478213 -1545320 -1334948 -1293002 -1024601 -996136 -1548302 -2031540
33427b031540K94529P27463M19217J12709J50459n0461n85270o04447J50890P09268
$$ -2031540 -1737011 -1009548 -590331 -477622 -327163 -377624 -962894 -1567341 -1416451 -707183
33417g07183M20602r0853j89075k23413n17772n33546Q9866O84887O39415M08580
$$ -707183 -286581 -377434 -566509 -789922 -1307694 -1841240 -1751374 -1066487 -427072 -18492
33407a8492N49834O33602J05145n36742m96165l6313l365l86107l93625K09296
$$ -18492 531342 1164944 1270089 733347 237182 200869 197504 -188603 -582228 -372932
33397c72932P70647P58142L74122N6968j47879n80231j503552k615625l046280
$$ -372932 397715 1155857 1529979 1586947 1439068 858837 -644715 -3260340 -6306620
33388f306620k203070o69461K79042K31731P4325N45306J103189Q59662M2893
$$ -6306620 -8509690 -9179151 -8900109 -8668378 -8594053 -8048747 -6945558 -6085896 -6043003
33379f043003l26645N0296M13924J44768m01577n01806n2058L99034M39515K88906
$$ -6043003 -6369648 -6319352 -5905428 -5760660 -6162237 -6664043 -6716101 -6317067 -5877552 -5588646
33369e588646L82439O44566N43967k1569l53376Q7280P01470M61960n01519q90904
$$ -5588646 -5206207 -4561641 -4017674 -4039243 -4392619 -4305339 -3603869 -3141909 -3643428 -4534332
33359d534332m7155J032602J007948m4586q40802n65591L04929Q13791O24501
$$ -4534332 -4581487 -3548885 -2540937 -2585523 -3426325 -3991916 -3686987 -2873196 -2248695
33350b248695J54235q2752k2233J5661k08992n62612p05339m37041J57670P52457
$$ -2248695 -2094460 -2177212 -2199445 -2183784 -2392776 -2955388 -3660727 -4097768 -3940098 -3187641
33340c187641R06637M02142l66310n97248K9345Q54317R40538J40362q13554j137882
$$ -3187641 -2281004 -1878862 -2245172 -2842420 -2813075 -1958758 -1018220 -877858 -1691412 -2829294
33330b829294o47672K44251Q51858O72590j55663q99120r16205k21324O62162
$$ -2829294 -3476966 -3232715 -2380857 -1708267 -1863930 -2763050 -3679255 -3900579 -3238417
33321c238417J132914P96991j79978r03638n51187M72059Q99549L58211j81970
$$ -3238417 -2105503 -1308512 -1488490 -2392128 -2943315 -2471256 -1571707 -1213496 -1395466
33312a395466j08287j26303p34627r85668k9498J125843R53561k02990p44222
$$ -1395466 -1503753 -1630056 -2364683 -3350351 -3379849 -2254006 -1300445 -1503435 -2247657
33303b247657l34037m9638k67430k35619K03328K62384j27040J3405Q94840J350102
$$ -2247657 -2581694 -2631332 -2898762 -3134381 -2931053 -2668669 -2795709 -2782304 -1887464 -537362
33293e37362O46894m19813q66789p65210n75692l61606k00933l34894m75275k4857
$$ -537362 109532 -310281 -1177070 -1942280 -2517972 -2879578 -3080511 -3415405 -3890680 -3915537
33283c915537P11376P52055J44489J4486N49407N68347l04516p88674j43709N23853
$$ -3915537 -3204161 -2452106 -2307617 -2293131 -1743724 -1175377 -1479893 -2268567 -2412276 -1888423
33273a888423K68688q2352L03067N27985l14545j129566m93024P72656P97150
$$ -1888423 -1619735 -1702087 -1399020 -871035 -1185580 -2315146 -2808170 -2035514 -1238364
33264a238364l19838q10646j34119M84946K82085j71808m02087o54854q97123
$$ -1238364 -1558202 -2368848 -2502967 -2018021 -1735936 -1907744 -2309831 -2964685 -3861808
33255c861808o49895p711M35483O88766J104304J164015R1870j329648j329321
$$ -3861808 -4511703 -4519414 -4083931 -3395165 -2290861 -1126846 -1034976 -2364624 -3693945
33246c693945J48766J081797L13077q38272p97359L352K77467K0188O8752L99759
$$ -3693945 -3545179 -2463382 -2150305 -2988577 -3785936 -3782584 -3505117 -3484929 -3416177 -3016418
33236c016418L16803j49815l44250k18719k83680m60127j19067O73857J001523
$$ -3016418 -2699615 -2849430 -3193680 -3412399 -3696079 -4156206 -4275273 -3601416 -2599893
33227b599893M44453k89225m58311k73700k97178m54876k94265J27405L03291
$$ -2599893 -2155440 -2444665 -2902976 -3176676 -3473854 -3928730 -4222995 -4095590 -3792299
33218c792299J25693L9820K72884M81962L93186K78735M25696N58916L08625n0638
$$ -3792299 -3666606 -3626786 -3353902 -2871940 -2478754 -2200019 -1774323 -1215407 -906782 -957420
33208i57420L5451M27505L79820l22143r66541q95940l40996L4134j3824k20244
$$ -957420 -921969 -494464 -114644 -436787 -1403328 -2299268 -2640264 -2606130 -2619954 -2840198
33198b840198k32510J38286P52389J041882M88546n88297j185482q16992p3159
$$ -2840198 -3072708 -2934422 -2182033 -1140151 -651605 -1239902 -2425384 -3242376 -3315535
33189c315535L07111L52800M32071M83872K72556j4341n1649K5751j23515m28655
$$ -3315535 -3008424 -2655624 -2223553 -1739681 -1467125 -1481466 -1533115 -1507364 -1630879 -2059534
33179b059534n45998m01101j55232J19374L39803L11486J11207J53561M59643
$$ -2059534 -2605532 -3006633 -3161865 -3042491 -2702688 -2391202 -2279995 -2126434 -1666791
33170a666791M11026k13183n98527q2081O34581M82387k40634l53085K46499M62833
$$ -1666791 -1255765 -1468948 -2067475 -2149556 -1514975 -1032588 -1273222 -1626307 -1379808 -916975
33160i16975r7300m94484j17967K79365j09471p98238q08669j27283M69721N79931
$$ -916975 -1014275 -1508759 -1626726 -1347361 -1456832 -2255070 -3063739 -3191022 -2721301 -2141370
33150b141370M04526J55648n4259L0031M79139P52704K61476o77575j080307n79810
$$ -2141370 -1736844 -1581196 -1635455 -1605424 -1126285 -373581 -112105 -789680 -1869987 -2449797
33140b449797J06294K02227j47759k83880k3390K39344K42688J51873J30784Q0948
$$ -2449797 -2343503 -2141276 -2289035 -2572915 -2596305 -2356961 -2114273 -1962400 -1831616 -1750668
33130a750668n6857j39402j56624l43237o82370o96598j34632M94356N86105L33292
$$ -1750668 -1807525 -1946927 -2103551 -2446788 -3129158 -3825756 -3960388 -3466032 -2879927 -2546635
33120b546635L32950N55704M71100Q1649l6905K04291J89582l19850p16692n21456
$$ -2546635 -2213685 -1657981 -1186881 -1105232 -1142137 -937846 -748264 -1068114 -1784806 -2306262
33110b306262q7611P5074J0049o6253k03699l58159k37778Q3218R3364j94571
$$ -2306262 -2393873 -2318799 -2308750 -2375003 -2578702 -2936861 -3174639 -3091421 -2998057 -3192628
33100c192628k7619P87548J249762O00005m12421o29601j67356L9196j77584k26423
$$ -3192628 -3220247 -2432699 -1182937 -582932 -995353 -1624954 -1792310 -1753114 -1930698 -2157121
33090b157121j5266m9505l68820m07866K1549M33292M46131K13432J2803q3611
$$ -2157121 -2172387 -2221892 -2590712 -2998578 -2977029 -2543737 -2097606 -1884174 -1871371 -1954982
33080a954982j11140j34630j74967l6017M47510Q55641N25093l05914n73953l8456
$$ -1954982 -2066122 -2200752 -2375719 -2411736 -1964226 -1108585 -583492 -889406 -1463359 -1501815
33070a501815K13453m18444r27314l89843M22514M22241P7974L44572P17744J87788
$$ -1501815 -1288362 -1706806 -2634120 -3023963 -2601449 -2179208 -2101234 -1756662 -1038918 -851130
33060h51130o40728m04294N50650O53064k09552o26253k13258o8656n23401n70488
$$ -851130 -1491858 -1896152 -1345502 -692438 -901990 -1528243 -1741501 -1810157 -2333558 -2904046
33050b904046J01607N36463M13005N30151R03085M46922p84074j150198r7187
$$ -2904046 -2802439 -2265976 -1852971 -1322820 -419735 27187 -756887 -1907085 -2004272
33041b004272P67709L04670m46213l68534j14868m34641n23785L10549R93039
$$ -2004272 -1236563 -931893 -1378106 -1746640 -1861508 -2296149 -2819934 -2509385 -1516346
33032a516346M52008m06761k93561K53338J30407j38315M54871J148320N49334
$$ -1516346 -1064338 -1471099 -1764660 -1511322 -1380915 -1519230 -1064359 83961 633295
33023F33295p32976q67071K27182Q59595L17390m04130n55095m10530q4724O07036
$$ 633295 -99681 -966752 -739570 120025 437415 33285 -521810 -932340 -1017064 -410028
33013d10028J031991K86547r82669j088635J02767Q72820L42643l41850j63118
$$ -410028 621963 908510 -74159 -1162794 -1060027 -187207 155436 -186414 -349532
33004c49532J76687k08235p38698m62421K67867M11061j56333o75767o71790k64708
$$ -349532 -172845 -381080 -1119778 -1582199 -1314332 -903271 -1059604 -1735371 -2407161 -2671869
32994b671869K81838O54523M93378j38540o22659n55335k60244j53202q9775J80207
$$ -2671869 -2390031 -1735508 -1242130 -1380670 -2003329 -2558664 -2818908 -2972110 -3061885 -2881678
32984b881678L90013J84534j66434j07851L17075N04162J98761j24504M8626N18350
$$ -2881678 -2491665 -2307131 -2473565 -2581416 -2264341 -1760179 -1561418 -1685922 -1637296 -1118946
32974a118946N86083k7730p48566q23284k63366K68422M68500O92882J037206
$$ -1118946 -532863 -560593 -1309159 -2132443 -2395809 -2127387 -1658887 -966005 71201
32965G1201Q48608k23841j270933j114734J9970P67328M81608j08549k09484K1613
$$ 71201 919809 695968 -574965 -1689699 -1669729 -902401 -420793 -529342 -738826 -717213
32955g17213J05610N2892J8314k21404q00926j157541n66800P74147J717746J381138
$$ -717213 -611603 -558711 -540397 -761801 -1562727 -2720268 -3287068 -2512921 -795175 585963
32945E85963J39158q00841p55672k51453j87892n72948n95214N9438O60033N29136
$$ 585963 725121 -75720 -831392 -1082845 -1270737 -1843685 -2438899 -2379461 -1719428 -1190292
32935a190292L7426p9078J23457N7520l21814n02476l19327j31032j36470j44937
$$ -1190292 -1152866 -1231944 -1108487 -1050967 -1372781 -1875257 -2194584 -2325616 -2462086 -2607023
32925b607023k750K70488O59186R81301P90033J5088o19688n00898q7639j60581
$$ -2607023 -2609773 -2339285 -1680099 -698798 91235 106323 -513365 -1014263 -1101902 -1262483
32915a262483n04050l54685J57649K36325p1549N7638N99138N50906k88419q34341
$$ -1262483 -1766533 -2121218 -1963569 -1727244 -1798793 -1741155 -1142017 -591111 -879530 -1713871
32905a713871m89996k1043k5831O5605O02133P19638o4972n21110M72358J690068
$$ -1713871 -2203867 -2224910 -2250741 -2185136 -1583003 -863365 -928337 -1449447 -977089 712979
32895G12979J003705j309097k597974j400084O87741J348806M61659l03013J5937
$$ 712979 1716684 407587 -2190387 -3590471 -2902730 -1553924 -1092265 -1395278 -1379341
32886a379341P29769Q67371M68151J69925J17882r5882n43273o73888k01554K52700
$$ -1379341 -649572 217799 685950 855875 973757 877875 334602 -339286 -540840 -288140
32876b88140j1422o25680o11447J04327N27646J26934l90943k67002J85016K78981
$$ -288140 -299562 -925242 -1536689 -1432362 -904716 -777782 -1168725 -1435727 -1250711 -971730
32866i71730P9849M1525N6509k51673o22510m46310J76865M97444K39231p0225
$$ -971730 -891881 -850356 -793847 -1045520 -1668030 -2114340 -1937475 -1440031 -1200800 -1271025
32856a271025J9167L02028L70808J38888k33179n23797m75665k4735M26898L45617
$$ -1271025 -1251858 -949830 -579022 -440134 -673313 -1197110 -1672775 -1697510 -1270612 -924995
32846i24995k37913o88415m93899K14573Q58156Q85988J69610p63357j035144
$$ -924995 -1162908 -1851323 -2345222 -2130649 -1272493 -386505 -216895 -980252 -2015396
32837b015396l46717N39368O74025R7527l99470m86918n04350n02758p137R81132
$$ -2015396 -2362113 -1822745 -1148720 -1051193 -1450663 -1937581 -2441931 -2944689 -2951826 -1970694
32827a970694J592507J202460K76671m17762q02544j057759q50151R3504J041505
$$ -1970694 -378187 824273 1100944 683182 -119362 -1177121 -2027272 -1933768 -892263
32818h92263R31595q9015p70251m94862K4351K5527k33810j45237K80245O73001
$$ -892263 39332 -49683 -819934 -1314796 -1290445 -1264918 -1498728 -1643965 -1363720 -690719
32808f90719R04373Q50332J84022r04375j380840o28678M40798N25005k02210
$$ -690719 213654 1063986 1248008 343633 -1037207 -1665885 -1225087 -700082 -902292
32799i02292n08619j44688p7225n95433o87469J63655R44474P29291J65456K71970
$$ -902292 -1410911 -1555599 -1632824 -2228257 -2915726 -2752071 -1807597 -1078306 -912850 -640880
32789f40880P14566N28084j53789m50620l56014n91165j040974p65730L25632
$$ -640880 73686 601770 447981 -2639 -358653 -949818 -1990792 -2756522 -2430890
32780b430890J116054R02986K71348l6388j23771l44188n69731o00386o24360
$$ -2430890 -1314836 -411850 -140502 -176890 -300661 -644849 -1214580 -1814966 -2439326
32771b439326p67581p41473l63125P5613L04727M51224O41273P47865P70680Q91022
$$ -2439326 -3206907 -3948380 -4311505 -4235892 -3931165 -3479941 -2838668 -2090803 -1320123 -429101
32761d29101R27164M06232n31046j018287o50368q6995j9363k20096j51562J30702
$$ -429101 498063 904295 373249 -645038 -1295406 -1382401 -1401764 -1621860 -1773422 -1642720
32751a642720K91690L72113N06479M75224J40729j25437l4111N7254k37215n96584
$$ -1642720 -1351030 -978917 -472438 2786 143515 18078 -16033 41221 -195994 -792578
32741g92578m89654k705M06939N68321M73487J5915n54463n25859J92706N32993
$$ -792578 -1282232 -1284937 -877998 -309677 163810 179725 -374738 -900597 -707891 -174898
32731a74898k61453j237511r64460K80372R00602L81090j33790J68748N79046
$$ -174898 -436351 -1673862 -2638322 -2357950 -1457348 -1076258 -1210048 -1041300 -462254
32722d62254K00818o27574r85185o93638k61507J5525K40987M49901M67322J93357
$$ -462254 -261436 -889010 -1874195 -2567833 -2829340 -2813815 -2572828 -2122927 -1655605 -1462248
32712a462248j97930l22646R8632Q01107J016347L31022o37428r00773l25771
$$ -1462248 -1660178 -1982824 -1884192 -1083085 -66738 264284 -373144 -1273917 -1599688
32703a599688L29223M87032K33340j96481o80470r23990o52249j90659j23270
$$ -1599688 -1270465 -783433 -550093 -746574 -1427044 -2351034 -3003283 -3193942 -3317212
32694c317212k90171L3860Q15652J106545N53183L7048K41822N81600L39428m5906
$$ -3317212 -3607383 -3573523 -2757871 -1651326 -1098143 -1061095 -819273 -237673 101755 55849
32684E5849J52488N37853K51187m33570m70501J94738N07851J6535n10387m43311
$$ 55849 208337 746190 997377 563807 93306 288044 795895 812430 302043 -141268
32674a41268j64187j41173j28621J13590J59013l03979p18571m78292M5088J27293
$$ -141268 -305455 -446628 -575249 -461659 -302646 -606625 -1325196 -1803488 -1758400 -1631107
32664a631107r9234P961L48517K18793l59262n19078M9231N77450M80851K14149
$$ -1631107 -1730341 -1722380 -1373863 -1155070 -1514332 -2033410 -1984179 -1406729 -925878 -711729
32654g11729K94628L10094k86037j008374r27825r5590N66541O58783O50445P92419
$$ -711729 -417101 -107007 -393044 -1401418 -2329243 -2424833 -1858292 -1199509 -549064 243355
32644B43355O12694j77649r94544j063033l68761M30957P43631M38212k05450
$$ 243355 856049 678400 -316144 -1379177 -1747938 -1316981 -573350 -135138 -340588
32635c40588p09084p54726m58183j39008J05975L20066L51043P2174j90199l3887
$$ -340588 -1049672 -1804398 -2262581 -2401589 -2295614 -1975548 -1624505 -1552331 -1742530 -1776417
32625a776417L04450K85169K6697Q7316L08263n8979q72975r62560J9680Q13124
$$ -1776417 -1471967 -1186798 -1160101 -1072785 -764522 -823501 -1696476 -2659036 -2639356 -1826232
32615a826232M31563k85478r3071O26474N89561k63216q07539n90363k42967j06654
$$ -1826232 -1394669 -1680147 -1773218 -1146744 -557183 -820399 -1627938 -2218301 -2461268 -2567922
32605b567922K21893P99856R68634M31557k08094l43628r1250J37949J64742m1788
$$ -2567922 -2346029 -1546173 -577539 -145982 -354076 -697704 -788954 -651005 -486263 -528051
32595e28051l98960n60703k77451J16847J73029J37472N22562J003155P11240
$$ -528051 -927011 -1487714 -1765165 -1648318 -1475289 -1337817 -815255 187900 899140
32586H99140l27510j058376q85775l34492J5842K67211N17564M11174j15252m55436
$$ 899140 571630 -486746 -1372521 -1707013 -1691171 -1423960 -906396 -495222 -610474 -1065910
32576a065910k16577K19574M16075M11038J88996m64067j128671q10744M87638
$$ -1065910 -1282487 -1062913 -646838 -235800 -46804 -510871 -1639542 -2450286 -1962648
32567a962648J276847N65094n84911n91558L21813O60245L2007m56920j07216
$$ -1962648 -685801 -120707 -705618 -1297176 -975363 -315118 -283111 -740031 -847247
32558h47247M25454L61491r9024l44168k36506K2616L37959O02013N50748J23266
$$ -847247 -421793 -60302 -159326 -503494 -740000 -717384 -379425 222588 773336 896602
32548H96602l16600m22485l08897k85320l18477o3338N67902J092903Q89450n6919
$$ 896602 580002 157517 -151380 -436700 -755177 -818515 -250613 842290 1731740 1674821
32538A674821r92410j137718n15185J64497L74608K42091J46888K02888K66212
$$ 1674821 682411 -455307 -970492 -805995 -431387 -189296 -42408 160480 426692
32529D26692J92476n1643l46048m37396k00614J39420K67608J48251j31175o13557
$$ 426692 619168 567525 221477 -215919 -416533 -277113 -9505 138746 7571 -605986
32519f05986j108199r36766J75288J201811Q44944n52882j273808n94847L44147
$$ -605986 -1714185 -2650951 -2475663 -1273852 -428908 -981790 -2255598 -2850445 -2506298
32510b506298M68516K52975N07723Q81671O44399M9104k09559j92283l05435l56230
$$ -2506298 -2037782 -1784807 -1277084 -395413 248986 298090 88531 -103752 -409187 -765417
32500g65417q7381L623m81371q21795k66899M89518L49787k31544J2492Q31701
$$ -765417 -852798 -849175 -1330546 -2152341 -2419240 -1929722 -1579935 -1811479 -1798987 -967286
32490i67286P42830l73687r07883j34512O51631L26937l90478m30933j19527k61899
$$ -967286 -224456 -598143 -1506026 -1640538 -988907 -661970 -1052448 -1483381 -1602908 -1864807
32480a864807n82691l37954K62387M34396J34513m1843P3281J61239J67567L20382
$$ -1864807 -2447498 -2785452 -2523065 -2088669 -1954156 -1995999 -1922718 -1761479 -1593912 -1273530
32470a273530N70786O50626N24436K96423p6948n31120o79044l30020J01441J61683
$$ -1273530 -702744 -52118 472318 768741 691793 160673 -518371 -848391 -746950 -585267
32460e85267j6923j00326j51369l40929m74719l63594k72460m10350l64710K80272
$$ -585267 -602190 -702516 -853885 -1194814 -1669533 -2033127 -2305587 -2715937 -3080647 -2800375
32450b800375J074233J173344N06758j80004l25201k8204L35093M48657J60027
$$ -2800375 -1726142 -552798 -46040 -226044 -551245 -579449 -244356 204301 364328
32441C64328k83452l26822J13550L22154k08491q79222q25200k41128L7673m7454
$$ 364328 80876 -245946 -132396 189758 -18733 -897955 -1723155 -1964283 -1926610 -1974064
32431a974064J52581O55964P36601K29560j67905j25899j35443m00606l52970
$$ -1974064 -1821483 -1165519 -428918 -199358 -367263 -493162 -628605 -1029211 -1382181
32422a382181K31707O45527M12767J12573K82602L63461l14906j166297j054276
$$ -1382181 -1150474 -504947 -92180 20393 302995 666456 351550 -814747 -1869023
32413a869023K178Q54324Q01848K56940j10488j04243J33605L21948R4854n56178
$$ -1869023 -1866845 -1012521 -210673 46267 -64221 -168464 -34859 287089 381943 -174235
32403a74235r41683l95487O81117J135968M97988m77335p98942k94259M08177
$$ -174235 -1115918 -1511405 -830288 305680 803668 326333 -472609 -766868 -358691
32394c58691N42622j46663j048409j115352j00046R04381P82042n8803l23449
$$ -358691 183931 37268 -1011141 -2126493 -2226539 -1322158 -540116 -598919 -922368
32385i22368K20570N53918J64569k59593j93399q7692k88015l05561J35538M16947
$$ -922368 -701798 -147880 16689 -242904 -436303 -523995 -812010 -1117571 -982033 -565086
32375e65086K02447K04291P90703R32374j69277j367917j081591J59348M63222
$$ -565086 -362639 -158348 632355 1564729 1395452 27535 -1054056 -894708 -431486
32366d31486m51099r31909j38841P40820N41478k05324m28222j02487J61773J60807
$$ -431486 -882585 -1814494 -1953335 -1212515 -671037 -876361 -1304583 -1407070 -1245297 -1084490
32356a084490l1026m38225q06030o01214Q8899M72017L33516M36360J070742J300624
$$ -1084490 -1115516 -1553741 -2359771 -2960985 -2872086 -2400069 -2066553 -1630193 -559451 741173
32346G41173M80885n14180n98126r5662P2935Q956L47325Q00577N91494o7014
$$ 741173 1222058 707878 109752 14090 87025 95981 443306 1243883 1835377 1768363
32336A768363k95152p9642j44923m95364m78597k09607m54502j009408p43408
$$ 1768363 1473211 1393569 1248646 753282 274685 65078 -389424 -1398832 -2142240
32327b142240L96727R68510K68064m50461M9485R92538Q20205l75636j005374
$$ -2142240 -1745513 -777003 -508939 -959400 -909915 82623 902828 527192 -478182
32318d78182k75933Q58230J110969L57046n30908p88411m32092o0696j31049m37407
$$ -478182 -754115 104115 1215084 1572130 1041222 252811 -179281 -239977 -371026 -808433
32308h08433m37573o9066J38712r6674l34962j28019K06515O1767m30468m55915
$$ -808433 -1246006 -1315072 -1176360 -1273034 -1607996 -1736015 -1529500 -1467733 -1898201 -2354116
32298b354116L38158J229709J216870K26461p56842q25527k16850L6659m78151
$$ -2354116 -2015958 -786249 430621 657082 -99760 -925287 -1142137 -1105478 -1583629
32289a583629r43421m51431O51487J209100Q52824L44965K62032K29042j50017
$$ -1583629 -2527050 -2978481 -2326994 -1117894 -265070 79895 341927 570969 420952
32280D20952m32464j13259L23887K3852q16008j040856j42689R75415J141884
$$ 420952 -11512 -124771 199116 222968 -593040 -1633896 -1776585 -801170 340714
32271C40714L12094n53564o89579k08680K74638L33171O218l53851m06203j31648
$$ 340714 652808 99244 -590335 -799015 -524377 -191206 -184988 -538839 -945042 -1076690
32261a076690J11385j6676l28454k45472L75439Q56940N45913j94249m45099r3710
$$ -1076690 -965305 -981981 -1310435 -1555907 -1180468 -323528 222385 28136 -416963 -510673
32251e10673O2190k96364m55307J7136L36783k59261j081789r12964R2642O63289
$$ -510673 -448483 -744847 -1200154 -1183018 -846235 -1105496 -2187285 -3100249 -3007607 -2344318
32241b344318L84816J41918M83298P76784L87513l11447o13201m03209R052L27427
$$ -2344318 -1959502 -1817584 -1334286 -557502 -169989 -481436 -1094637 -1497846 -1488794 -1161367
32231a161367K40754l47031q12577l23399Q70683J502070R63697K0366n14099
$$ -1161367 -920613 -1267644 -2080221 -2403620 -1532937 -30867 932830 953196 439097
32222D39097p71779r85796p77733q1477K46177k95143q35302m28512M40351P58818
$$ 439097 -332682 -1318478 -2096211 -2177688 -1931511 -2226654 -3061956 -3490468 -3050117 -2291299
32212b291299O38486P84302R40969L29560p15900j035893m81502p1357k57427
$$ -2291299 -1652813 -868511 72458 402018 -313882 -1349775 -1831277 -1902634 -2160061
32203b160061l78980o5942J03464k18317m24557J0843O33851P40163L72828O0764
$$ -2160061 -2539041 -2604983 -2501519 -2719836 -3144393 -3133550 -2499699 -1759536 -1386708 -1325944
32193a325944N098n2324l94283r23523j025202p6060J481839K038082O51687j345700
$$ -1325944 -1320846 -1373170 -1767453 -2690976 -3716178 -3792238 -2310399 -272317 379370 -966330
32183i66330j738053l07503R79878P87452n3789k93592q1984j37637k94170k3004
$$ -966330 -2704383 -3011886 -2032008 -1244556 -1298345 -1591937 -1673921 -1811558 -2105728 -2128732
32173b128732M15584M69459L37426M59368M85598j45969r69419r41982J3875R02391
$$ -2128732 -1713148 -1243689 -906263 -446895 38703 -107266 -1076685 -2018667 -2004792 -1102401
32163a102401J024496N87884J3457n07219p51413n56162k14742r1886Q3849P51319
$$ -1102401 -77905 509979 523436 16217 -735196 -1291358 -1506100 -1597986 -1514137 -762818
32153g62818J436018J139502p8215r58780q11591l85172m59634n97892j26806
$$ -762818 673200 1812702 1734487 775707 -35884 -421056 -880690 -1478582 -1605388
32144a605388M77070K74055n34441q09442j44136O67473Q71828N75416J67259
$$ -1605388 -1128318 -854263 -1388704 -2198146 -2342282 -1674809 -802981 -227565 -60306
32135f0306k48714n37697l61755K54182P15879O24131K98227J64002P8248k93405
$$ -60306 -309020 -846717 -1208472 -954290 -238411 385720 683947 847949 926197 632792
32125F32792q25132j138012j124067q10815q9543Q70368J326644P98230p0126
$$ 632792 -192340 -1330352 -2454419 -3265234 -3354777 -2484409 -1157765 -359535 -429661
32116d29661k56560J93481L17769k40607q07864q81669p75947p52547m49119L16103
$$ -429661 -686221 -492740 -174971 -415578 -1223442 -2105111 -2881058 -3633605 -4082724 -3766621
32106c766621R65734R84955O67485M76954L13136R411j21549N6208k3525o63362
$$ -3766621 -2800887 -1815932 -1148447 -671493 -358357 -348946 -470495 -414287 -437812 -1101174
32096a101174j059486m37314N18069N62295j43327l08090L63745P62000L01268
$$ -1101174 -2160660 -2597974 -2079905 -1517610 -1660937 -1969027 -1605282 -843282 -542014
32087e42014j50083J40467M71963q6838j047606j116762p1123R26577Q49931l4707
$$ -542014 -692097 -551630 -79667 -166505 -1214111 -2330873 -2401996 -1475419 -625488 -660195
32077f60195o74056m89391Q5938K43985j79608n37347k98238K12853L70661K03367
$$ -660195 -1334251 -1823642 -1737704 -1493719 -1673327 -2210674 -2508912 -2296059 -1925398 -1722031
32067a722031J87296L23544K03134p0046R4183O83437R05496M13210j16355n5426
$$ -1722031 -1534735 -1211191 -1008057 -1078103 -983920 -300483 605013 1018223 901868 846442
32057H46442K77586L10589J18386L0286o3632l45051m87479j45390L16625K52366
$$ 846442 1124028 1434617 1553003 1583289 1519657 1174606 687127 541737 858362 1110728
32047A110728l23557p90884p60782l94083l9635P0031p3636j98674m7872J46870
$$ 1110728 787171 -3713 -764495 -1158578 -1198213 -1128182 -1201818 -1400492 -1448364 -1301494
32037a301494n4154m27245k27930N06743P26208R186n62044o4398O91625M75818
$$ -1301494 -1355648 -1782893 -2010823 -1504080 -777872 -768686 -1330730 -1395128 -703503 -227685
32027b27685k85940k87152L52937L44140l89009n03716L22640O88357j02212p38814
$$ -227685 -513625 -800777 -447840 -103700 -492709 -996425 -673785 14572 -87640 -826454
32017h26454j61102N10912j42323j269158r45011P34770J715416R96598k30157
$$ -826454 -987556 -476644 -618967 -1888125 -2833136 -2098366 -382950 613648 383491
32008C83491p02635o93548q89487j048405o67259k3466L40981M78460O04842M74471
$$ 383491 -319144 -1012692 -1902179 -2950584 -3617843 -3641309 -3300328 -2821868 -2217026 -1742555
31998a742555m094j70567M14248R36901L90356o97935q74509k183M88556j48312
$$ -1742555 -1746649 -1917216 -1502968 -566067 -175711 -873646 -1748155 -1750338 -1261782 -1410094
31988a410094q38903m63119M12898N53239m9730m20739k33085m9131j37622j09295
$$ -1410094 -2248997 -2712116 -2299218 -1745979 -1795709 -2216448 -2449533 -2498664 -2636286 -2745581
31978b745581K32339N48412O01196N34894M20271J57438q3833L7015L76883L68307
$$ -2745581 -2513242 -1964830 -1363634 -828740 -408469 -251031 -334864 -297849 79034 447341
31968D47341j14682n24968m43686p3572K29649L84079L62313O8830l49321n20595
$$ 447341 332659 -192309 -635995 -709567 -479918 -95839 266474 335304 -14017 -534612
31958e34612l51529j05864Q3301L03205M39156K35753j60431l19952k39177k79883
$$ -534612 -886141 -992005 -908704 -605499 -166343 69410 -91021 -410973 -650150 -930033
31948i30033l91240j70609K57042L24396R7296K38123O77888M82904n42029j308593
$$ -930033 -1321273 -1491882 -1234840 -910444 -813148 -575025 102863 585767 43738 -1264855
31938a264855j078989m65076j31248K28028P63989O88495k24565o55096K98867
$$ -1264855 -2343844 -2808920 -2940168 -2712140 -1948151 -1259656 -1484221 -2139317 -1840450
31929a840450J344609Q75247l96760o44526N1104J38911m15250r8486J116668
$$ -1840450 -495841 379406 -17354 -661880 -610776 -471865 -887115 -985601 131067
31920A31067J271315l63706j868780j567623l79951O0272l8805M13520J121441
$$ 131067 1402382 1038676 -830104 -2397727 -2777678 -2717406 -2756211 -2342691 -1221250
31911a221250R12963j28680p08119k86940L34836M08685J30425o312N6752J08239
$$ -1221250 -308287 -436967 -1145086 -1432026 -1097190 -688505 -558080 -564392 -507640 -399401
31901c99401J02333K13747N75565R53391P83361j14658r63303p99498J48041O42445
$$ -399401 -297068 -83321 492244 1445635 2228996 2114338 1151035 351537 499578 1142023
31891A142023J60182m90487n82756m50440m92544k85380M44238R09428L97961
$$ 1142023 1302205 811718 228962 -221478 -714022 -999402 -555164 354264 752225
31882G52225m39506n89882l22766n42608r90564n91075N49398J021931K45430
$$ 752225 312719 -277163 -599929 -1142537 -2133101 -2724176 -2174778 -1152847 -907417
31873i07417o38031n21423J40003K86310j08475k35182J62799M49876J01925n37375
$$ -907417 -1545448 -2066871 -1926868 -1640558 -1749033 -1984215 -1821416 -1371540 -1269615 -1806990
31863a806990o88155q9245O69163Q15180L16736r9856O2155L97903K24210m00223
$$ -1806990 -2495145 -2584390 -1915227 -1100047 -783311 -883167 -821012 -423109 -198899 -599122
31853e99122p35495l36040M56504R69872Q19423J33179n27210n65144J8474N18392
$$ -599122 -1334617 -1670657 -1214153 -244281 575142 708321 181111 -384033 -365559 152833
31843A52833L58166j80205m43228l50810l03091l45854j25812L25157M55391L2011
$$ 152833 510999 330794 -112434 -463244 -766335 -1112189 -1238001 -912844 -457453 -425442
31833d25442m33473l53078K22907P50505P56676J69390o10670r26343m75882K80877
$$ -425442 -858915 -1211993 -989086 -238581 518095 687485 76815 -849528 -1325410 -1044533
31823a044533O54232N83770N26326N76060L13468l76781r54657r39668m89632
$$ -1044533 -390301 193469 719795 1295855 1609323 1232542 277885 -661783 -1151415
31814a151415j8612L17286M93898L99066M5584l03545m53236m43449k82194J09902
$$ -1151415 -1170027 -852741 -358843 40223 85807 -217738 -670974 -1114423 -1396617 -1286715
31804a286715N63741P13261N33471L42851J37114m32124j159554j161072j85052
$$ -1286715 -722974 -9713 523758 866609 1003723 571599 -587955 -1749027 -1934079
31795a934079P01032N18780j49450r0775N84051O46571j86717p25335j92294N46894
$$ -1934079 -1233047 -714267 -863717 -954492 -370441 276130 89413 -635922 -828216 -281322
31785b81322L68464l89367n48637Q6584N54799K35470l98340o42260m35814j26495
$$ -281322 87142 -302225 -850862 -764278 -209479 25991 -372349 -1014609 -1450423 -1576918
31775a576918O7310N7098j99404m76785l66021J19837M24224K77907J89759N79557
$$ -1576918 -1509608 -1452510 -1651914 -2128699 -2494720 -2374883 -1950659 -1672752 -1482993 -903436
31765i03436Q64083K23074r26193j216184k62830O59115L97887m25601l79030
$$ -903436 -39353 183721 -742472 -1958656 -2221486 -1562371 -1164484 -1590085 -1969115
31756a969115O56739J323951P11473m54685q73699l24784K54386J24661l29181
$$ -1969115 -1312376 11575 723048 268363 -605336 -930120 -675734 -551073 -880254
31747h80254k19699N44337J038500O00963j29204r7507M79177L25774q02378j448275
$$ -880254 -1099953 -555616 482884 1083847 954643 857136 1336313 1662087 859709 -588566
31737e88566o21490M77428J79715r95191j077729K59815J214208P11341q0918
$$ -588566 -1210056 -732628 -552913 -1548104 -2625833 -2366018 -1151810 -440469 -521387
31728e21387J11069O37439K77071n91453o79920N1824M29305l8244o19270o59607
$$ -521387 -410318 227121 504192 -87261 -767181 -715357 -286052 -324296 -943566 -1603173
31718a603173k92841J82029O45038Q03414L86688k15359l18971P818Q9941j57543
$$ -1603173 -1896014 -1713985 -1068947 -265533 121155 -94204 -413175 -405357 -315416 -472959
31708d72959j24855K91357M16042K1929j90789J79367M64342K0085o95861q70337
$$ -472959 -597814 -306457 109585 131514 -59275 120092 584434 604519 -91342 -961679
31698i61679n42425l18221l42751k80374q636K78741M25695L39904j8819l58114
$$ -961679 -1504104 -1822325 -2165076 -2445450 -2454086 -2175345 -1749650 -1409746 -1428565 -1786679
31688a786679k42039J48690J51785j18463L29857J515420J761468R0625j750185
$$ -1786679 -2028718 -1880028 -1728243 -1846706 -1516849 -1429 1760039 1850664 100479
31679A00479j439535M57224J286960K90499n84561j38946L02854m22516j140705
$$ 100479 -1339056 -881832 405128 695627 111066 -27880 274974 -147542 -1288247
31670a288247m84455N89163M27639m54901l18249P92911J200300M27074k61238
$$ -1288247 -1772702 -1183539 -755900 -1210801 -1529050 -736139 464161 891235 629997
31661F29997k00428j94392o54905p14411J04897Q64285O94791R8451o3043J29525
$$ 629997 429569 235177 -419728 -1134139 -1029242 -164957 529834 628285 565242 694767
31651F94767J37347j17970m94759r62601j130104l83353Q99634J326794M37088
$$ 694767 832114 714144 219385 -743216 -1873320 -2256673 -1357039 -30245 406843
31642D06843m32743j62774M05394j7818r23355q39669K39403R33307O79125K46726
$$ 406843 -25900 -188674 216720 198902 -724453 -1564122 -1324719 -391412 287713 534439
31632E34439J15181j18251n43586n72886j07720J51557p1189k10868j5919M373
$$ 534439 649620 531369 -12217 -585103 -692823 -541266 -612455 -823323 -839242 -834869
31622h34869k86170j91975N62560J141105Q27473P4095l53676m65401n68608m66583
$$ -834869 -1121039 -1313014 -750454 390651 1218124 1292219 938543 473142 -95466 -562049
31612e62049O6615O00423N95837J77638k42363n85336p82611m70270L16827P61367
$$ -562049 -495434 104989 700826 878464 636101 50765 -731846 -1202116 -885289 -123922
31602a23922L16248m23113o25469l82282j73235J17874O70716Q93012L03191l11762
$$ -123922 192326 -230787 -856256 -1238538 -1411773 -1293899 -623183 269829 573020 261258
31592B61258M6890Q11222O19376l96734p66313j39820J84354m22976q39431k06797
$$ 261258 308148 1119370 1738746 1342012 575699 435879 620233 197257 -642174 -848971
31582h48971N47843L08561l86419l79550J82908L14136p3919k22587N6827K28260
$$ -848971 -301128 7433 -378986 -758536 -575628 -261492 -335411 -557998 -501171 -272911
31572b72911R7792k1262q9098l45049o25765n27224j41282J46621L80882P10735
$$ -272911 -175119 -196381 -285479 -630528 -1256293 -1783517 -1924799 -1778178 -1397296 -686561
31562f86561O47078k69931j245224r57806L93878J101740L60081o16629m95517
$$ -686561 -39483 -309414 -1554638 -2512444 -2118566 -1016826 -656745 -1273374 -1768891
31553a768891L38662P07405M16278O7661j91143o05597r12367n85137J60716N13724
$$ -1768891 -1430229 -722824 -306546 -238885 -430028 -1035625 -1947992 -2533129 -2372413 -1858689
31543a858689J91214k93795m33199j57138M21904J046231J194873N92220k36879
$$ -1858689 -1667475 -1961270 -2394469 -2551607 -2129703 -1083472 111401 703621 466742
31534D66742n57847m40681m53983n01884O3226J087643J434466N68576n67833
$$ 466742 -91105 -531786 -985769 -1487653 -1424427 -336784 1097682 1666258 1098425
31525A098425q41095l74106n5622j72715k77169p8988K26017L78009K73024j18932
$$ 1098425 257330 -116776 -172398 -345113 -622282 -701270 -475253 -97244 175780 56848
31515E6848o28340q24275m72673Q5782L57644L09621K25856J93955J22741M3438
$$ 56848 -571492 -1395767 -1868440 -1782658 -1425014 -1115393 -889537 -695582 -572841 -529403
31505e29403j4711k19780n90195p18031l15440K37909M28336L84155M77488M85107
$$ -529403 -544114 -763894 -1354089 -2072120 -2387560 -2149651 -1721315 -1337160 -859672 -374565
31495c74565P691m92786j41201Q30819J152935M04536k98142o7639L71317p2377
$$ -374565 -366874 -859660 -1000861 -170042 982893 1387429 1089287 1021648 1392965 1320588
31485A320588j077009j432461q02989P7402O00009O56861J37522q35000j341049
$$ 1320588 243579 -1188882 -1991871 -1914469 -1314460 -657599 -520077 -1355077 -2696126
31476b696126n42594Q55651J261788M90481N8719P44511J284216M17959j019511
$$ -2696126 -3238720 -2383069 -1121281 -630800 -572081 172430 1456646 1874605 855094
31467H55094j360061n77082j4922j62862k66717K91M0912l12804l74244P5304
$$ 855094 -504967 -1082049 -1096971 -1259833 -1526550 -1526259 -1485347 -1798151 -2172395 -2097091
31457b097091L20662P4758P5475O72825J017527M95029j57876j79579j54630q08998
$$ -2097091 -1776429 -1701671 -1626196 -953371 64156 559185 401309 221730 67100 -741898
31447g41898j383292p40656N69556J043528O32862O40434J312476J404034M10717
$$ -741898 -2125190 -2865846 -2296290 -1252762 -619900 20534 1333010 2737044 3147761
31438C147761n75122p95928r10721j345792j189710J31703J434731J355931L27004
$$ 3147761 2572639 1776711 865990 -479802 -1669512 -1537809 -103078 1252853 1579857
31429A579857l14348k98404k07701j05785K07807K40887m15222q86841j50299
$$ 1579857 1265509 967105 759404 653619 861426 1102313 687091 -199750 -350049
31420c50049J028010R51802l64372j135181m97529M25315N25959J78374O4817
$$ -350049 677961 1629763 1265391 130210 -367319 57996 583955 762329 827146
31411H27146m3981m80479p73942m60092M2611J63397O2886Q3493K7978k98401
$$ 827146 783165 302686 -471256 -931348 -888737 -725340 -662454 -578961 -550983 -849384
31401h49384m82439j71334K26498K09644J2545O9342J73376p6625m32984l77393
$$ -849384 -1331823 -1503157 -1276659 -1067015 -1054470 -985128 -811752 -888377 -1321361 -1698754
31391a698754j4530J48162O0808Q2847K72798L68908L32994L31396K89715j660
$$ -1698754 -1713284 -1565122 -1504314 -1421467 -1148669 -779761 -446767 -115371 174344 172684
31381A72684m13610n62102l19681P1223K88758J39772k66638l98000J97982J031879
$$ 172684 -240926 -803028 -1122709 -1051486 -762728 -622956 -889594 -1287594 -1089612 -57733
31371e7733R37385l51063j531323j304598n9586P96366P24289L60778K45564K36362
$$ -57733 879652 528589 -1002734 -2307332 -2366918 -1570552 -846263 -485485 -239921 -3559
31361c559J45604Q5691Q8649N1408P8338K75544K99830j99493p90906o97072N314
$$ -3559 142045 227736 316385 367793 446131 721675 1021505 822012 31106 -665966 -660652
31350f60652M47075K71840J1771K6328o648k40001k10200K73721N94032K73295
$$ -660652 -213577 58263 70034 96362 89714 -150287 -360487 -86766 507266 780561
31340G80561k29663l45518l87106q67866j287442o49576Q69211J774192J094478
$$ 780561 550898 205380 -181726 -1049592 -2337034 -2986610 -2117399 -343207 751271
31331G51271l65480j102217p37028j54005p1640k03787J2078M57039N65528K14804
$$ 751271 385791 -716426 -1453454 -1607459 -1679099 -1882886 -1870808 -1413769 -848241 -633437
31321f33437j63147k88975l20597l48464j45789L18719N95003L76434M1257R5144
$$ -633437 -796584 -1085559 -1406156 -1754620 -1900409 -1581690 -986687 -610253 -568996 -473852
31311d73852L52882K35399k66161n42324l24705j10573l81521q27727p37859J7123
$$ -473852 -120970 114429 -151732 -694056 -1018761 -1129334 -1510855 -2338582 -3076441 -3059318
31301c059318P69230Q72893M67785K02692L32322M78853L83519L76464O54610
$$ -3059318 -2290088 -1417195 -949410 -746718 -414396 64457 447976 824440 1479050
31292A479050N76213m87613j812770j907577n89215O37661P15757M12761P89279
$$ 1479050 2055263 1567650 -245120 -2152697 -2741912 -2104251 -1388494 -975733 -186454
31283a86454J348855Q97546m38934j361006j235918o11320p6568K65760K90442
$$ -186454 1162401 2059947 1621013 260007 -975911 -1587231 -1663799 -1398039 -1107597
31274a107597q6103l36906J30448Q41647P36985j61565p16888m83894l16606p64224
$$ -1107597 -1193700 -1530606 -1400158 -558511 178474 16909 -699979 -1183873 -1500479 -2264703
31264b264703j069258m58248N48396R37116O00458J56069p6067j70367r5950J72822
$$ -2264703 -3333961 -3792209 -3243813 -2306697 -1706239 -1550170 -1626237 -1796604 -1892554 -1719732
31254a719732L23289P6014l08336l65988q7444J67551K47130L34123N77749Q43751
$$ -1719732 -1396443 -1320429 -1628765 -1994753 -2082197 -1914646 -1667516 -1333393 -755644 88107
31244H8107Q12271K96068m32206p58490m38345K23l2155l09765j99547K80648
$$ 88107 900378 1196446 764240 5750 -432595 -432372 -464527 -774292 -973839 -693191
31234f93191N54364M84227M05926K40960m01449j154327j053723q5502N23179
$$ -693191 -138827 345400 751326 992286 590837 -563490 -1617213 -1702715 -1179536
31225a179536N1546o76253n94735J67752Q13944J019923Q63861L50446k90086
$$ -1179536 -1127990 -1804243 -2398978 -2231226 -1417282 -397359 466502 816948 526862
31216E26862m72641p9623J95565r8533m43795k55371K02724M13487L83258K17779
$$ 526862 54221 -25402 170163 71630 -372165 -627536 -424812 -11325 371933 589712
31206E89712k53939p72480n11017N19316R14996j94499j562531j441580p6315
$$ 589712 335773 -436707 -947724 -428408 486588 292089 -1270442 -2712022 -2788337
31197b788337Q08310N28921K3705J17013N24990O39082K99795k57138n49568j73186
$$ -2788337 -1980027 -1451106 -1427401 -1310388 -785398 -146316 153479 -103659 -653227 -826413
31187h26413M46585K16266r77173j637597p47334M72930L62095n01796l02213
$$ -826413 -379828 -163562 -1140735 -2778332 -3525666 -3052736 -2690641 -3192437 -3494650
31178c494650R31631J428675O93957J20025L27248K08412o71811r39041J59613
$$ -3494650 -2563019 -1134344 -440387 -320362 6886 215298 -456513 -1395554 -1235941
31169a235941J096997L65316j036752j119759J04883Q96802N06925l9041J83678
$$ -1235941 -138944 226372 -810380 -1930139 -1825256 -928454 -421529 -460570 -276892
31160b76892P19916O64363j3844n46248m23012m3709k18397j015291j437368o84203
$$ -276892 443024 1107387 1093543 547295 124283 80574 -137823 -1153114 -2590482 -3274685
31150c274685N75978R75622L37712j97905K2656L83852L03772J24813J65709K0124
$$ -3274685 -2698707 -1723085 -1385373 -1583278 -1560622 -1176770 -872998 -748185 -582476 -562352
$$ [...]
##END NTUPLES=NMR SPECTRUM
##END=
