##TITLE=31Pdec_LY-TMF-17.2.l.t
 D2O, 24 sc
 23.3.2020
##JCAMPDX= 6.0         $$ Bruker NMR JCAMP-DX V2.0
##DATA TYPE= NMR SPECTRUM
##DATA CLASS= NTUPLES
##ORIGIN= UXNMR, Bruker Analytische Messtechnik GmbH
##OWNER= root
$$ XWIN-NMR		Version 3.5
$$ Mon Mar 23 14:34:17 2020 Russian Standard Time (UT+4h)  she@DPX200
##.OBSERVE FREQUENCY= 81.013821
##.OBSERVE NUCLEUS= ^31P
##.ACQUISITION MODE= SIMULTANEOUS
##.ACQUISITION SCHEME= undefined
##.AVERAGES= 24
##.DIGITISER RES= 17
##SPECTROMETER/DATA SYSTEM= spect
##.PULSE SEQUENCE= zgpg30
##.SOLVENT NAME= D2O
##.SHIFT REFERENCE= (INTERNAL, D2O, 0, 182.463)
##AUDIT TRAIL= $$ (NUMBER, WHEN, WHO, WHERE, WHAT)
$$ ##TITLE= Audit trail, XWIN-NMR		Version 3.5
$$ ##JCAMPDX= 5.01
$$ ##ORIGIN= Bruker BioSpin GmbH
$$ ##OWNER= she
$$ F:/spectra/data/she/nmr/P31/1/pdata/1/auditp.txt
$$ ##AUDIT TRAIL=  $$ (NUMBER, WHEN, WHO, WHERE, WHAT)
(   1,<2020-03-23 14:33:13.81 +0400>,<she>,<DPX200>,
      <created by zg, POWCHK disabled, PULCHK disabled
       configuration hash MD5:
       00 E9 B6 7A A2 85 ED C7 34 08 36 98 17 FE 4E 26
       data hash MD5: 32K
       BB 4E 63 AD 9F A1 F9 67 29 2A 1B D8 85 F7 D7 C8>)
(   2,<2020-03-23 14:33:16.26 +0400>,<she>,<DPX200>,
      <Start of raw data processing
       efp BC_mod = 2 LB = 1 FT_mod = 6 PKNL = 1 PHC0 = -1314.375 PHC1 = 107.2017 SI = 64K 
       data hash MD5: 64K
       83 E2 C5 55 C1 6D BA 5C 28 9E 86 16 8E 8D 5F 7C>)
(   3,<2020-03-23 14:33:30.15 +0400>,<she>,<DPX200>,
      <pk PHC0 = -26.03038 PHC1 = 0 
       data hash MD5: 64K
       B7 9C C1 43 28 CC E5 82 86 6C 33 73 7D 5F 79 80>)
$$ ##END=
$$ 
$$ hash MD5
$$ 1F 58 AA CA EC 7E 32 4C 8D 5C F3 1E 11 D7 EB 12
##$RELAX= 
##$RELAX= 
##$RELAX= 
##$RELAX= 
##$RELAX= 
##$RELAX= 
##$RELAX= 
##$RELAX= 
$$ Bruker specific parameters
$$ --------------------------
##$DU= <F:/spectra>
##$EXPNO= 1
##$NAME= <P31>
##$PROCNO= 1
##$TYPE= <nmr>
##$USER= <she>
##$AMP= (0..31)
100 100 100 100 100 100 100 100 100 100 100 100 100 100 100 100 100 100 
100 100 100 100 100 100 100 100 100 100 100 100 100 100 
##$AQSEQ= 0
##$AQ_mod= 1
##$AUNM= <au_zg>
##$AUTOPOS= <>
##$BF1= 81.014009
##$BF2= 200.13
##$BF3= 200.13
##$BF4= 200.13
##$BF5= 200.13
##$BF6= 200.13
##$BF7= 200.13
##$BF8= 200.13
##$BYTORDA= 1
##$CFDGTYP= 0
##$CFRGTYP= 5
##$CHEMSTR= <none>
##$CNST= (0..31)
1 1 145 1 1 1 1 1 1 1 1 1 1 1 1 1 1 1 1 1 1 1 1 1 1 1 1 1 1 1 1 1 
##$CPDPRG= <waltz16>
##$CPDPRG1= <>
##$CPDPRG2= <waltz16>
##$CPDPRG3= <>
##$CPDPRG4= <mlev>
##$CPDPRG5= <mlev>
##$CPDPRG6= <mlev>
##$CPDPRG7= <mlev>
##$CPDPRG8= <mlev>
##$CPDPRGB= <>
##$CPDPRGT= <>
##$D= (0..31)
0 1 0 0 0 0 0 0 0 0 0 0.03 2e-05 3e-06 0 0 0 0 0 0 0 0 0 0 0 0 0 0 0 0 
0 0 
##$DATE= 1584959593
##$DBL= (0..7)
120 120 120 11 120 120 24 19 
##$DBP= (0..7)
150 150 150 150 150 150 150 150 
##$DBP07= 0
##$DBPNAM0= <>
##$DBPNAM1= <>
##$DBPNAM2= <>
##$DBPNAM3= <>
##$DBPNAM4= <>
##$DBPNAM5= <>
##$DBPNAM6= <>
##$DBPNAM7= <>
##$DBPOAL= (0..7)
0.5 0.5 0.5 0.5 0.5 0.5 0.5 0.5 
##$DBPOFFS= (0..7)
0 0 0 0 0 0 0 0 
$$ [...]
##$SUBNAM2= <"">
##$SUBNAM3= <"">
##$SUBNAM4= <"">
##$SUBNAM5= <"">
##$SUBNAM6= <"">
##$SUBNAM7= <"">
##$SUBNAM8= <"">
##$SUBNAM9= <"">
##$SW= 369.568048894756
##$SWIBOX= (0..15)
0 1 3 0 0 0 0 0 0 0 0 0 0 0 0 0 
##$SW_h= 29940.119760479
##$TD= 32768
##$TD0= 1
##$TE= 0
##$TE2= 300
##$TE3= 300
##$TEG= 300
##$TL= (0..7)
0 120 53 12 22 120 120 120 
##$TP= (0..7)
150 150 150 150 150 150 150 150 
##$TP07= 0
##$TPNAME0= <>
##$TPNAME1= <>
##$TPNAME2= <>
##$TPNAME3= <>
##$TPNAME4= <>
##$TPNAME5= <>
##$TPNAME6= <>
##$TPNAME7= <>
##$TPOAL= (0..7)
0.5 0.5 0.5 0.5 0.5 0.5 0.5 0.5 
##$TPOFFS= (0..7)
0 0 0 0 0 0 0 0 
##$TUNHIN= 0
##$TUNHOUT= 0
##$TUNXOUT= 0
##$USERA1= <user>
##$USERA2= <user>
##$USERA3= <user>
##$USERA4= <user>
##$USERA5= <user>
##$V9= 5
##$VALIST= <valist>
##$VCLIST= <CCCCCCCCCCCCCCC>
##$VD= 0
##$VDLIST= <DDDDDDDDDDDDDDD>
##$VPLIST= <PPPPPPPPPPPPPPP>
##$VTLIST= <TTTTTTTTTTTTTTT>
##$WBST= 1024
##$WBSW= 4
##$XGAIN= (0..3)
0 0 0 0 
##$XL= 0
##$YL= 0
##$YMAX_a= 8711
##$YMIN_a= -8476
##$ZGOPTNS= <>
##$ZL1= 120
##$ZL2= 120
##$ZL3= 120
##$ZL4= 120
##$ABSF1= 0
##$ABSF2= 0
##$ABSG= 0
##$ABSL= 0
##$ALPHA= 0
##$AQORDER= 0
##$ASSFAC= 0
##$ASSFACI= 0
##$ASSFACX= 0
##$ASSWID= 0
##$AUNMP= <proc_1d>
##$AZFE= 0.1
##$AZFW= 0.5
##$BCFW= 0
##$BC_mod= 2
##$BYTORDP= 0
##$COROFFS= 0
##$CY= -3
##$DATMOD= 1
##$DC= 0
##$DFILT= <>
##$DTYPP= 0
##$F1P= 0
##$F2P= 0
##$FCOR= 1
##$FTSIZE= 65536
##$FT_mod= 6
##$GAMMA= 0
##$GB= 0
##$INTBC= 1
##$INTSCL= 5.30512e-09
##$ISEN= 30
##$LB= 1
##$LEV0= 0
##$LPBIN= 0
##$MAXI= 10000
##$MC2= 0
##$MEAN= 0
##$ME_mod= 0
##$MI= 50
##$NCOEF= 0
##$NC_proc= -5
##$NLEV= 6
##$NOISF1= 182.463
##$NOISF2= 159.3651
##$NSP= 0
##$NTH_PI= 0
##$NZP= 0
##$OFFSET= 182.463
##$PC= 4
##$PHC0= -1340.405
##$PHC1= 107.2017
##$PH_mod= 1
##$PKNL= yes
##$PPARMOD= 0
##$PSCAL= 0
##$PSIGN= 0
##$REVERSE= no
##$SF= 81.0140089999434
##$SI= 65536
##$SIGF1= 159.3651
##$SIGF2= -187.1042
##$SINO= 113.3802
##$SIOLD= 16384
##$SREGLST= <1H.CDCl3>
##$SSB= 0
##$STSI= 65536
##$STSR= 0
##$SW_p= 29940.119760479
##$SYMM= 0
##$S_DEV= 0
##$TDeff= 32768
##$TDoff= 0
##$TI= <>
##$TILT= no
##$TM1= 0
##$TM2= 0
##$TOPLEV= 0
##$USERP1= <user>
##$USERP2= <user>
##$USERP3= <user>
##$USERP4= <user>
##$USERP5= <user>
##$WDW= 1
##$XDIM= 65536
##$YMAX_p= 426947088
##$YMIN_p= -27623702
$$ End of Bruker specific parameters
$$ ---------------------------------
##NTUPLES= NMR SPECTRUM
##VAR_NAME=  FREQUENCY,     SPECTRUM/REAL,   SPECTRUM/IMAG
##SYMBOL=    X,             R,               I
##VAR_TYPE=  INDEPENDENT,   DEPENDENT,       DEPENDENT
##VAR_FORM=  AFFN,          ASDF,            ASDF
##VAR_DIM=   65536,         65536,           65536
##UNITS=     HZ,            ARBITRARY UNITS, ARBITRARY UNITS
##FACTOR=    0.456856943014862, 1,           1
##FIRST=     14782.0589164792, 0,            0
##LAST=      -15158.0608439998, 0,           0
##MIN=       -15158.0608439998, -27623702,   0
##MAX=       14782.0589164792, 426947088,    0
$$ Real data points
##PAGE= N=1
##DATA TABLE= (X++(R..R)), XYDATA
$$ [...]
39029 1093286 843271 693991 575400 466051 363451 114873 -483802 -1277106 -1698771
39020 -1698771 -1418556 -879343 -848746 -1465485 -2025393 -1762598 -631497 734110 1639932
39011 1639932 1808170 1393702 728174 96777 -332713 -507000 -475377 -305644 45085 667234
39001 667234 1413245 1840147 1659111 1151722 895521 1131742 1638840 2124293 2397477 2215043
38991 2215043 1406162 264109 -557291 -706977 -449567 -257218 -380225 -829951 -1390867
38982 -1390867 -1599164 -1164188 -504819 -363392 -763122 -950464 -583546 -253494 -400169
38973 -400169 -461111 181126 978409 851607 -229581 -1178363 -1224136 -633193 6169 459460
38963 459460 663628 532139 199024 -12853 -54821 -165004 -297362 -33920 694649 1239541
38953 1239541 941481 -26374 -811714 -763907 -1736 775185 910136 307452 -571977 -1210914
38943 -1210914 -1463120 -1474935 -1391862 -1271671 -1066238 -550111 399893 1243030 1007577 -399297
38933 -399297 -1575323 -1107986 543907 1528877 947443 -197639 -601563 -290215 -119414
38924 -119414 -318343 -278748 419666 1342271 1618600 839807 -451786 -1196251 -901570 -173681
38914 -173681 136336 81956 333630 882354 888610 35746 -784216 -603723 408377 1348740
38904 1348740 1669543 1371144 604268 -313623 -812418 -578226 21941 414552 479597 406390
38894 406390 241172 206 -84382 120712 346737 307117 85237 -180359 -558994 -884075
38884 -884075 -604927 327245 948449 403530 -815557 -1518676 -1350764 -886512 -579405
38875 -579405 -544614 -1042740 -2073117 -2687612 -1940419 -503179 -34713 -790431 -1257197
38866 -1257197 -574359 153033 -230393 -1011850 -770466 475800 1530993 1798095 1577522
38857 1577522 1052486 232102 -338740 -64218 516458 181497 -1171197 -2210972 -1959286
38848 -1959286 -978566 -381894 -430486 -599110 -441341 98156 803718 1214191 881435 -62080
38838 -62080 -893779 -1089921 -798758 -384785 26668 314350 187424 -370901 -879503 -938620
38828 -938620 -691857 -444750 -281024 -362686 -1000068 -1889951 -1889161 -355993 1657310 2441924
38818 2441924 1703461 736423 579779 914027 971119 676589 449217 465079 596107 711956
38808 711956 678053 335023 -245619 -718440 -838506 -628853 -137188 565929 1074722 878539
38798 878539 149379 -202770 392831 1428822 1978240 1725068 1049090 488601 439582 966690
38788 966690 1543692 1393272 470999 -322787 -321105 35148 39306 -112722 226854 912780
38778 912780 1108188 523751 -236531 -577457 -495894 -252856 -70701 -162348 -502792 -609314
38768 -609314 -99693 634944 917137 785274 799245 1014047 1016788 898477 1172624 1654709
38758 1654709 1524504 764601 401186 846594 1128511 469494 -406844 -481710 -98834 -301459
38748 -301459 -1084835 -1486246 -1152520 -723165 -675371 -702887 -352818 408448 1337840 2063144
38738 2063144 2118323 1411921 623547 536257 992806 1136695 698660 332256 486038 632000
38728 632000 46037 -1088552 -1859718 -1747043 -1157923 -818081 -910192 -1023352 -883287 -804475
38718 -804475 -1163264 -1662996 -1634938 -1050439 -625448 -738183 -881261 -565086 -164032 -300596
38708 -300596 -833483 -1069866 -682368 110992 955298 1429904 1098114 86643 -749279
38699 -749279 -866435 -838407 -1423494 -2293529 -2583667 -2311783 -2189884 -2276336 -1982293 -1330688
38689 -1330688 -989500 -988242 -660501 -78772 -216296 -1205571 -1725527 -883649 380018 682218
38679 682218 116371 -210132 94259 452890 379824 -129026 -978606 -1927150 -2368631 -1919906
38669 -1919906 -1099298 -774957 -1053106 -1288965 -1070499 -624884 -331306 -331537 -559923 -756394
38659 -756394 -582669 -97904 109919 -297190 -765579 -542061 183604 454535 -168594 -1066909
38649 -1066909 -1390296 -996019 -451776 -374145 -810544 -1151990 -795966 8833 352043 -68675
38639 -68675 -407268 88195 830987 719299 -113365 -371610 558677 1780416 2157550 1636135
38629 1636135 924332 499733 384786 417019 281551 -348130 -1262095 -1635112 -978698 62498
38619 62498 394636 -134023 -559746 -107977 817124 1247285 930175 536863 653973 1059974
38609 1059974 1212110 1044754 855116 645515 168010 -402932 -485261 25461 482142 454294
38599 454294 426810 1007649 1864431 2117135 1571858 883447 534863 296950 -177770 -755225
38589 -755225 -1050520 -923398 -537892 -148072 12274 -236734 -942773 -1922957 -2707384 -2715836
38579 -2715836 -1813026 -698369 -299105 -644439 -879905 -620593 -546030 -1115701 -1481918
38570 -1481918 -633127 904607 1651383 1229661 671033 700346 919159 902440 927316 1164904
38560 1164904 1194711 904341 935606 1540263 1829688 1005762 -308929 -863177 -429730 204962
38550 204962 522866 616471 475455 -79892 -707136 -669136 73115 553490 -44517 -1336585
38540 -1336585 -2165438 -1826599 -621834 621359 1327101 1501297 1470133 1440378 1387651 1260268
38530 1260268 1045315 629375 -95427 -883808 -1227688 -986135 -620923 -585132 -791715 -931675
38520 -931675 -935857 -762157 -135651 939263 1693233 1329562 230344 -233677 707422 2296578
38510 2296578 3138459 2647912 1371809 179335 -516813 -819369 -931732 -854525 -520220
38501 -520220 -131088 -113533 -572080 -980388 -719329 122663 776974 655544 -66804 -802379
38491 -802379 -1241717 -1518988 -1800487 -1911274 -1468960 -394889 781604 1277307 790277
38482 790277 -203613 -956074 -1151642 -1038245 -998375 -1160335 -1387928 -1499567 -1447932 -1309829
38472 -1309829 -1126128 -847952 -538138 -492133 -901200 -1441554 -1528800 -1044295 -488787 -297995
38462 -297995 -317871 -117206 474576 1317361 2154428 2663578 2603673 2121844 1659956 1412126
38452 1412126 1210380 1070468 1336670 1983391 2309960 1812097 931249 424155 391474 499015
38442 499015 735049 1208975 1510996 1128652 382596 111831 431022 621175 349360 166659
38432 166659 532063 1073436 1195877 859999 393717 3531 -196792 -98372 144885 140905
38422 140905 -195820 -487069 -483286 -384418 -343982 -147676 286775 572228 442197 268912
38412 268912 502995 911909 899170 380604 -160635 -382608 -385566 -344430 -264951 -164181
38402 -164181 -171681 -341967 -553715 -669082 -677042 -628370 -487015 -111461 524030 1055389
38392 1055389 894560 -68681 -1090404 -1296641 -724991 -196415 -175656 -325886 -279452 -178741
38382 -178741 -162190 33323 489315 683186 234814 -350812 -320148 261433 709580 733107
38372 733107 584403 390170 48042 -283200 -306305 -215129 -480658 -896523 -600263 630904
38362 630904 1770933 1730148 700248 -202010 -323223 31138 314923 398193 468815 702548
38352 702548 1155662 1689411 1890619 1361580 279858 -575378 -626559 -162667 112799 55943
38342 55943 132107 485307 585145 138110 -217354 245146 1157663 1500329 1094327 797738
38332 797738 1118369 1509090 1381178 1011790 902737 899944 613421 213011 105209 191944
38322 191944 148039 126005 456873 889676 896933 585784 505428 606889 254314 -601373
38312 -601373 -1088908 -600343 313579 629966 16404 -1006454 -1710321 -1690328 -1054055 -354504
38302 -354504 -153634 -485651 -870382 -852691 -337117 507940 1355623 1808096 1735432 1457480
38292 1457480 1266850 980999 407491 -70836 -73584 -108528 -930046 -2113082 -2413573 -1727665
38282 -1727665 -1440936 -2290172 -3081678 -2452340 -945927 -155732 -384837 -422323 518794
38273 518794 1754779 2151095 1384316 -1455 -1229420 -1825390 -1895016 -1915072 -2036441
38264 -2036441 -1818287 -952852 146359 981707 1760850 2817996 3577722 3036133 1251982
38255 1251982 -503599 -1222959 -1076597 -743269 -567955 -609735 -848789 -1025411 -793354
38246 -793354 -281696 -11345 -65065 101293 785093 1541218 1839470 1664282 1174920 395181
38236 395181 -359772 -410572 320880 801821 84628 -1314824 -1984120 -1387017 -341116
38227 -341116 227665 279591 271000 406855 608309 822225 1014463 1046755 806327 363765
38217 363765 -124745 -570015 -923550 -1121246 -1155767 -1134340 -1188751 -1354586 -1548662 -1617656
38207 -1617656 -1422605 -955878 -397588 -13060 30650 -228766 -563617 -671361 -378671 185750
38197 185750 650706 684813 242214 -405160 -829217 -758843 -378289 -198444 -432788 -664179
38187 -664179 -458162 -122560 -299936 -853716 -918105 -285270 91894 -452971 -1119914 -823959
38177 -823959 -12366 -89294 -1160757 -1679286 -693052 726343 1026807 257732 -318995
38168 -318995 -110474 363069 650542 942299 1362897 1557113 1273990 750530 247465 -262334
38158 -262334 -685544 -635656 -27277 619037 849512 826877 808347 565347 -99647 -689105
38148 -689105 -618946 -211578 -211386 -440740 29177 1213163 1810295 990177 -359488 -926636
38138 -926636 -732123 -642589 -764216 -548662 -193208 -542393 -1451642 -1587407 -405398 792119
38128 792119 597108 -537731 -1037481 -364370 579808 930049 725561 326097 -108491
38119 -108491 -351551 -81401 534197 755801 121541 -969579 -1763958 -1939379 -1712525
38110 -1712525 -1469162 -1450177 -1550520 -1370160 -760839 -249699 -403195 -820990 -566104 212538
38100 212538 106611 -1438719 -2779824 -1995858 384977 1957061 1633405 824326 1064803
38091 1064803 1847369 1707759 476883 -710711 -1136944 -1073777 -818883 -249194 524900
38082 524900 942226 735195 277031 -48314 -252151 -299262 114907 979111 1692576 1826422
38072 1826422 1739977 1962704 2302597 2099724 1181988 100516 -499725 -411639 93666 464014
38062 464014 286773 -212857 -344424 108245 518459 388273 180790 515318 983711 702493
38052 702493 -190510 -665935 -440411 -359885 -894322 -1383587 -1310514 -1269097 -1868047 -2537166
38042 -2537166 -2410993 -1774970 -1545981 -1694488 -1323689 -231093 677614 703715 218377
38033 218377 -67613 -13397 90132 42942 -196270 -598962 -985250 -1112358 -950744 -635410
38023 -635410 -181595 419749 916620 1049481 1020693 1205936 1455020 1271810 685408 278989
38013 278989 286369 380603 483652 934852 1537331 1339616 -21604 -1479511 -1756238 -883823
38003 -883823 180958 911422 1350727 1356291 722457 -96480 -330436 30946 332081 427706
37993 427706 871175 1774901 2397825 2248454 1807245 1630174 1393682 496701 -813343
37984 -813343 -1601570 -1355989 -419254 548859 1090515 1065599 711950 544159 797478 1014461
37974 1014461 581884 -328187 -782275 -177258 1018008 1786027 1605565 818087 122556
37965 122556 -104684 -14743 77287 153793 441253 886110 1013885 603168 219760 553160
37955 553160 1314184 1444798 577366 -376745 -487889 -74975 -89786 -631391 -872181 -383807
37945 -383807 237594 261002 -248788 -665532 -548697 89630 912033 1429928 1378228 1107974
37935 1107974 1253151 1811455 1974909 1173016 -104261 -884784 -783539 -141631 546674
37926 546674 923713 810943 428821 305154 547414 569380 27717 -450193 -187050 354245
37916 354245 265158 -235729 -118414 599806 630584 -591894 -1911060 -2088828 -1438341 -1033269
37906 -1033269 -1125840 -1247162 -1232276 -1201595 -991048 -513920 -310080 -810855 -1358929 -943985
37896 -943985 239720 968475 739005 394146 811016 1787774 2535481 2610512 2025892 975590
37886 975590 -184618 -1014356 -1296070 -1086424 -511293 147127 315568 -331594 -1222875
37877 -1222875 -1423423 -883520 -471668 -618770 -694408 -87337 783549 1058689 546965 -259376
37867 -259376 -884054 -1093127 -767446 -75490 441741 423266 172651 200913 460169 463412
37857 463412 74646 -255697 -106092 359689 590248 330325 44727 534063 1952102
37848 1952102 3337762 3511508 2426059 1153329 478217 148122 -219404 -244844 512338
37839 512338 1457932 1467010 407521 -611411 -662519 -72282 204522 -137262 -473173 -114522
37829 -114522 819922 1478737 1190317 208737 -584031 -666638 -302358 39932 276899 514399
37819 514399 667973 653356 663133 852922 993393 840511 598552 551488 509482 224118
37809 224118 118418 779844 1715030 1533708 -227698 -2193951 -2675568 -1658222 -616162
37800 -616162 -591158 -1173475 -1435599 -1221340 -1116525 -1449158 -1789550 -1509443 -577015 386556
37790 386556 764527 491625 -46322 -457171 -571073 -393467 -82072 28662 -383525 -1264283
37780 -1264283 -2100770 -2371927 -2106093 -1864943 -2076198 -2479700 -2439226 -1796166 -1109945 -874737
37770 -874737 -798101 -239188 789801 1528667 1399379 618711 -200677 -672293 -734657 -496087
37760 -496087 -149402 233411 867612 1855352 2647949 2502517 1602930 1025037 1253754 1442359
37750 1442359 684867 -594281 -1220501 -801429 35920 627708 802483 653480 412004
37741 412004 364374 385569 -124581 -1288474 -2183701 -1960516 -1084909 -582336 -451736 83835
37731 83835 1013893 1463405 1150518 703702 417289 -87872 -738870 -802260 -198575 184140
37721 184140 2963 86040 887550 1501453 1091805 256965 -46199 -29441 -403284 -948827
37711 -948827 -1003004 -821915 -1165166 -1819822 -1791443 -899718 -78415 -18649 -443922 -821095
37701 -821095 -949526 -714174 -7726 897648 1449483 1396423 868090 2450 -987623 -1566602
37691 -1566602 -1345508 -694022 -280659 -176026 -74209 -155820 -863011 -1931160 -2583914
37682 -2583914 -2709740 -2893346 -3167941 -2744749 -1292097 426745 1581246 2101042 2064144
37673 2064144 1168977 -492171 -1834679 -1808991 -709417 205101 195468 -374836 -761178
37664 -761178 -639663 -218158 103815 107565 -141485 -560982 -1233947 -2054199 -2434817 -1915473
37654 -1915473 -931191 -312803 -109267 248120 607531 56214 -1393283 -2224414 -1322573
37645 -1322573 406861 1240693 788905 -7151 -453559 -601342 -526739 -223342 -81098
37636 -81098 -471747 -910846 -591798 256796 554950 27825 -365071 11805 473233 166234
37626 166234 -550481 -636548 148728 988349 1055682 316357 -620866 -1087843 -854396 -283726
37616 -283726 74603 132856 284995 687797 899210 508408 -211134 -684322 -855878 -1161550
37606 -1161550 -1729877 -2073078 -1728934 -919734 -340573 -386335 -770921 -937162 -714468 -415216
37596 -415216 -279585 -77994 481314 1097742 1073788 282556 -471607 -387894 297304 637091
37586 637091 229691 -339486 -421272 -216170 -406444 -1104765 -1622682 -1332121 -407569 461150
37576 461150 839081 779029 470835 24262 -402343 -611339 -650155 -827661 -1244706 -1494486
37566 -1494486 -1075992 -26049 1059539 1585270 1383402 685522 -85408 -496111 -327089
37557 -327089 240245 742110 836811 589409 333925 269275 235690 -37043 -448985 -465676
37547 -465676 274077 1380778 2016765 1765888 934995 37998 -614598 -796468 -410188
37538 -410188 102905 -30820 -861078 -1359141 -694873 544315 1113822 783000 405476
37529 405476 450242 418762 -85795 -564022 -332832 529711 1355040 1604899 1168435 378686
37519 378686 -42685 431783 1322225 1449124 423097 -702177 -719482 284632 1289199
37510 1289199 1660527 1475087 935241 246229 -135554 82335 409465 70818 -859144
37501 -859144 -1480792 -1277295 -626329 2766 622188 1194122 1223688 436730 -554184 -830194
37491 -830194 -225658 628444 1167035 1350226 1293941 882620 -33325 -1208263 -1974444 -1751746
37481 -1751746 -628926 628688 1271233 1230792 979073 849790 799708 780759 888773 981409
37471 981409 597597 -372395 -1237957 -1199439 -375425 317069 323134 46469 118645 461169
37461 461169 454687 -101007 -626440 -506580 86187 421725 190941 -99844 159085 890119
37451 890119 1544906 1888415 2128688 2322028 2158559 1504911 737412 263142 38256 -136558
37441 -136558 -152907 179082 669616 954865 1021037 1076713 1019931 564070 -115153 -437003
37431 -437003 -253587 -78669 -247290 -392278 -121709 286641 370354 243061 243173 126162
37421 126162 -628351 -1793313 -2472934 -2315006 -1885820 -1585799 -978054 286998 1542621
37412 1542621 1860447 1365852 1024200 1289384 1729794 1965154 2179555 2511955 2643667
37403 2643667 2365439 2031374 2029265 2186880 2123200 1883331 1784046 1825421 1671384 1121675
37393 1121675 295302 -542616 -1074014 -1028325 -523854 -167684 -446730 -1081012 -1305330 -754342
37383 -754342 194801 867560 813568 48580 -861895 -1096817 -383929 557529 791523 299524
37373 299524 -131574 -75553 90835 -6525 -122495 140738 728134 1302746 1679189 1850222
37363 1850222 1869803 1828178 1619603 780371 -860647 -2377345 -2469993 -1273899 -463750
37354 -463750 -966323 -1584371 -877111 488211 695169 -384824 -972807 -73825 1216319
37345 1216319 1626015 1503112 1755526 2092534 1578203 364630 -393779 -221527 172946
37336 172946 185496 150897 513097 899899 631513 -212457 -841303 -806948 -512768 -526829
37326 -526829 -769719 -741069 -388455 -257019 -620000 -904537 -421630 556795 1003308 435027
37316 435027 -502283 -911632 -657141 -231497 14103 130549 266121 459778 679811 838817
37306 838817 811705 568833 209217 -209322 -719304 -1248784 -1565895 -1506229 -1094962 -459976
37296 -459976 112276 128182 -603553 -1388861 -1238286 -269909 197595 -610795 -1816905 -2181384
37286 -2181384 -1826484 -1753776 -2147170 -2280962 -1910552 -1586945 -1527247 -1277191 -734408 -469560
37276 -469560 -652396 -627738 -48446 485578 497307 414173 525472 87202 -1433619 -2899801
37266 -2899801 -2634326 -758512 905718 1288192 1140987 1368395 1568564 991926 5477
37257 5477 -417651 -191080 -109346 -498767 -758111 -354572 438879 1062866 1366440 1424878
37247 1424878 1114445 372773 -365713 -569580 -426010 -702523 -1620914 -2379078 -2180593
37238 -2180593 -1364011 -955481 -1269711 -1587126 -1280935 -650657 -355912 -506081 -707493
37229 -707493 -676656 -388405 132663 721497 939885 495124 -269767 -708730 -658329 -505934
37219 -505934 -507822 -469200 -160004 334730 765612 888212 449838 -585885 -1709377 -2193504
37209 -2193504 -1922017 -1483840 -1265235 -943576 -219110 436204 316228 -496658 -1210433
37200 -1210433 -1318053 -1008708 -633037 -272442 71911 286527 302882 171864 -89331 -447497
37190 -447497 -636865 -360633 206283 496643 276573 -83774 -246584 -398822 -804254 -1231297
37180 -1231297 -1246712 -853676 -440431 -261569 -330780 -635695 -1046713 -1186414 -854198 -441868
37170 -441868 -430884 -628598 -507708 -168981 -171167 -393779 -43485 907721 1312345 509868
37160 509868 -505277 -477379 269386 483584 -22954 -307637 -6752 232668 123073 208524
37150 208524 590678 444477 -524730 -1229456 -713652 292835 337516 -768881 -1893125
37141 -1893125 -2150706 -1636739 -836947 -178279 -41173 -436030 -721616 -302140 510403
37132 510403 957894 942132 927096 951880 631947 56068 -257258 -314374 -601680 -1020371
37122 -1020371 -914332 -355003 -261910 -842891 -1072219 -357448 384215 191414 -382145 -269763
37112 -269763 326838 426312 27241 22600 558827 802461 399581 -51827 -215887 -561561
37102 -561561 -1271346 -1630060 -1121538 -343100 -147172 -480751 -767215 -929566 -1238756 -1455819
37092 -1455819 -992717 57162 775628 548715 -143771 -379263 57063 517874 396470
37083 396470 -147720 -494370 -390126 -188842 -260902 -479244 -503291 -341071 -297874 -474216
37073 -474216 -667020 -741796 -761855 -746273 -651246 -607996 -775928 -886019 -381899 793043
37063 793043 1953535 2454535 2345511 1997498 1497919 796682 106843 -297945 -457105
37054 -457105 -483131 -198752 508882 1196757 1306072 974624 797353 824695 511791 -200207
37044 -200207 -501030 181529 1264060 1730303 1383516 820083 436400 100807 -280017
37035 -280017 -512477 -546648 -628098 -817672 -814727 -546366 -523872 -1156069 -1925672 -1786451
37025 -1786451 -450938 1101425 1592161 724276 -648841 -1480285 -1477434 -1146583 -1061452
37016 -1061452 -1205873 -1102367 -535973 95504 336460 347065 613335 1072649 1112876 616442
37006 616442 362746 888242 1472903 1055703 -106236 -665699 -144476 364186 -85052
36997 -85052 -797913 -530541 533418 994172 273082 -625970 -604302 165168 783801 857132
36987 857132 628920 361141 181617 284830 734197 1191487 1280971 1096947 950922 795917
36977 795917 384190 -171316 -592724 -1089537 -2049229 -2981538 -2666753 -829943 1081023
36968 1081023 1495936 556924 -450644 -1025562 -1703508 -2532941 -2611644 -1567867 -401089
36959 -401089 -80438 -123443 477145 1486478 1737960 1013260 438899 818994 1585488 1833438
36949 1833438 1564233 1296221 1062807 518379 -291493 -898841 -974478 -456948 618492
36940 618492 1896615 2561982 2066354 899533 30967 -340207 -808220 -1548894 -1907661
36931 -1907661 -1482656 -887924 -916546 -1429341 -1635665 -1189772 -506146 -163863 -411824 -1103026
36921 -1103026 -1739035 -1741170 -1059171 -361727 -254666 -511094 -533666 -365451 -580970 -1185242
36911 -1185242 -1359749 -599675 460370 793216 204730 -616913 -1058196 -1144096 -1186421 -1226909
36901 -1226909 -960245 -121585 1074715 1917071 1792498 874349 24120 -112715 276481
36892 276481 575901 485189 105916 -453095 -1125533 -1614897 -1532454 -949167 -481946 -610092
36882 -610092 -1112103 -1409198 -1307620 -1094062 -948786 -672131 -198013 -29323 -675715 -1732230
36872 -1732230 -2100305 -1354564 -367092 -124181 -371484 -139389 640026 969342 352743
36863 352743 -392264 -341869 249623 503659 218167 -110427 -224461 -314811 -444102 -448024
36853 -448024 -394699 -569602 -982356 -1359897 -1608665 -1840923 -2012377 -1996743 -1914463 -1878087
36843 -1878087 -1557228 -631248 409195 635776 -102431 -1027732 -1536960 -1695949 -1555648
36834 -1555648 -886440 93482 584475 271960 -184732 -184073 2144 -73743 -265556 -354968
36824 -354968 -623901 -1194238 -1433506 -808601 187265 715536 681892 398971 -208707 -1116521
36814 -1116521 -1501356 -684665 607988 1113535 873985 962026 1556026 1688493 988059
36805 988059 294362 250272 549365 951001 1781114 2893755 3318574 2614327 1560570
36796 1560570 877427 300030 -388387 -531912 249568 1076858 1049831 641618 749176 1133867
36786 1133867 1061530 834957 1261574 2006185 1961352 1114276 606485 879343 1131565 843289
36776 843289 529338 572874 517352 104508 -10758 717154 1779661 2361293 2375788 2135926
36766 2135926 1608259 681205 -298291 -915005 -1261393 -1574777 -1675647 -1341672 -901683
36757 -901683 -846774 -1101582 -1266218 -1353078 -1644303 -1939383 -1609554 -479315 841102 1604131
36747 1604131 1542707 834667 -114934 -746627 -598849 254387 1171724 1502365 1128539 464455
36737 464455 41012 91607 432041 711309 763149 624486 289008 -245133 -641174 -391468
36727 -391468 419139 965062 735025 341625 660563 1432135 1500111 424342 -913240
36718 -913240 -1473033 -1133152 -362089 469528 1025327 884552 99079 -528241 -306381 483997
36708 483997 1098009 1352546 1531154 1580479 1213726 736421 927371 1914309 2844247 2928088
36698 2928088 2267855 1429058 753256 375032 387972 641781 791599 804854 958424 1158675
36688 1158675 938044 415784 396453 953863 867768 -595220 -2186189 -2231276 -1079955
36679 -1079955 -490828 -918199 -1157985 -715167 -561533 -956786 -469730 1609086 3482879
36670 3482879 3132133 1294614 364975 1003444 1745547 1708220 1674626 2174894 2285664 1156319
36660 1156319 -540057 -1566350 -1643578 -1257397 -726669 -241086 -179340 -585735 -796104
36651 -796104 -300451 442498 735558 742926 1057632 1517329 1393292 665574 182905 415815
36641 415815 869123 1019029 1092000 1426197 1630781 1059805 -105384 -877950 -594801 431914
36631 431914 1466688 2124149 2393169 2273209 1786605 1210937 911308 916305 925019 734918
36621 734918 391291 -63342 -612059 -979515 -776329 -135179 218974 -158313 -848866 -1188551
36611 -1188551 -1087708 -855506 -633216 -515299 -801567 -1434992 -1546828 -446466 1096353
36602 1096353 1528296 538857 -526346 -508920 191338 470174 -43092 -900176 -1560445
36593 -1560445 -1692308 -1234002 -580536 -278127 -248005 120160 822412 948551 28718 -1092839
36583 -1092839 -1413073 -1107957 -882727 -594731 405090 1839505 2494683 1728727 237228
36574 237228 -784029 -703238 273405 1351072 1716635 1312823 911984 1042817 1220992
36565 1220992 813571 196132 190952 684009 821319 453610 313345 680998 913436 537405
36555 537405 -117751 -663951 -1140197 -1421353 -1039902 -67626 633064 577191 344453 514177
36545 514177 626797 -30389 -1114706 -1538339 -869942 234281 896638 830238 385342
36536 385342 151047 403896 733914 451035 -462495 -1192566 -1141962 -683239 -498013 -627012
36526 -627012 -664640 -509640 -367835 -288695 -236150 -395395 -890957 -1383627 -1440507 -1150950
36516 -1150950 -928777 -887596 -867728 -872331 -957115 -852379 -249922 611504 1147523 1150774 867484
36505 867484 486363 63323 -168115 -3108 248381 60905 -505253 -868847 -825533 -776423
36495 -776423 -955737 -1050659 -808925 -468416 -302625 -218231 -87696 -21463 8975 368587
36485 368587 1169055 1836879 1726009 938465 132148 -298889 -443847 -425389 -207348 115081
36475 115081 228659 -16988 -349776 -377882 -87436 100856 -181218 -776360 -1156363 -1083413
36465 -1083413 -908076 -1017249 -1195896 -931933 -305128 -86399 -758787 -1793307 -2174002
36456 -2174002 -1454490 -116838 914952 967321 85166 -960423 -1320359 -908266 -394186
36447 -394186 -246242 -165713 231599 606382 335843 -459467 -975014 -803177 -361435 -132796
36437 -132796 -51700 108063 246668 220793 225844 445600 584352 240984 -385775 -664885
36427 -664885 -389332 6826 150640 170977 257397 242737 -36915 -331489 -370942 -418036
36417 -418036 -890520 -1537360 -1605994 -943771 -344882 -478806 -950802 -914478 -313858 73036
36407 73036 -247635 -889747 -1214940 -1074208 -695099 -231421 208257 328136 -106737 -796470
36397 -796470 -1050478 -547636 279629 794198 909980 1042320 1381389 1575424 1292364 788482
36387 788482 552375 509582 50660 -1034083 -2065288 -2214132 -1474713 -585372 -159721
36378 -159721 -217326 -434029 -478734 -136545 543319 1159141 1266999 832287 219558 -197407
36368 -197407 -236186 99430 516442 527382 80906 -99658 595991 1561974 1545931 418613
36358 418613 -475092 -69484 1118060 1931064 2042328 1774185 1155013 139071 -636429
36349 -636429 -377881 662825 1416802 1412848 1104046 779164 129257 -856874 -1484785 -1292793
36339 -1292793 -690072 -224828 118771 435008 411251 -32487 -211305 428739 1271540 1228048
36329 1228048 301081 -354924 32510 959486 1457965 1252433 835308 736992 990337 1180304
36319 1180304 894064 178573 -469033 -640448 -436535 -248661 -301105 -555365 -840507 -900696
36309 -900696 -605475 -334037 -747714 -1808793 -2467613 -1896779 -672929 -22910 -166969
36300 -166969 -262731 120230 445895 284129 15999 96294 355512 447169 335944 -65885
36290 -65885 -1062852 -2448849 -3258044 -2917750 -2147876 -1970555 -2212297 -1829796 -538165
36281 -538165 755237 1220171 1063952 948770 992495 776319 135442 -442971 -332562 414974
36271 414974 969562 609999 -432988 -1332331 -1726750 -1900713 -1928360 -1393720 -260056
36262 -260056 707082 898833 650427 515720 371469 -36811 -222665 435916 1546312
36253 1546312 2084979 1751867 1082086 384471 -488282 -1370183 -1755535 -1650841 -1594956 -1697959
36243 -1697959 -1476195 -787256 -112617 282122 689513 1264478 1738339 2000728 2196888
36234 2196888 2108838 1316373 173502 -330928 -2477 225924 -218661 -694315 -457438
36225 -457438 305422 1076094 1689809 1885210 1220682 134494 15676 1332001 2669997
36216 2669997 2614883 1647591 1107015 1198627 1261333 1159391 1043895 481186 -707711 -1404509
36206 -1404509 -592316 760290 947279 202021 174087 970230 931215 -400631 -1305109
36197 -1305109 -592279 665212 1075313 883385 842132 640969 -182996 -934449 -734578
36188 -734578 44512 517430 673601 904249 935296 418710 -124880 -162306 -264582 -1085330
36178 -1085330 -1879811 -1523116 -530065 -420352 -1258407 -1533998 -652293 125461 -227597
36169 -227597 -915545 -665641 414129 1277070 1506669 1497292 1497997 1349014 1027255 778882
36159 778882 692529 592843 413268 376194 706146 1271461 1573153 1182664 310002 -200242
36149 -200242 274034 1346242 2035555 1920728 1438357 1016894 510969 -231627 -799710
36140 -799710 -748440 -384253 -414718 -890091 -1072414 -492859 347436 643598 325548 5947
36130 5947 33854 94038 -160731 -537666 -667709 -626237 -783998 -1201823 -1587018 -1764090
36120 -1764090 -1763063 -1493432 -826610 -53008 249701 -50196 -486800 -700085 -785547 -802472
36110 -802472 -564455 -210468 -319158 -997394 -1480835 -1218672 -759093 -837245 -1128459 -811577
36100 -811577 26063 589233 777240 1238330 1949642 1922053 788922 -253091 189550
36091 189550 1934510 3474466 3712099 2903272 2004984 1540531 1211639 492921 -503079
36082 -503079 -966190 -386794 636155 1032567 594257 139145 338065 933235 1245740
36073 1245740 961873 264842 -364343 -368585 366161 1093115 848115 -328762 -1376379
36064 -1376379 -1575578 -1262778 -940205 -472486 318892 966183 952763 500956 103355 -262872
36054 -262872 -747357 -929585 -398129 296167 264245 -265730 -170511 777512 1396849 782099
36044 782099 -406523 -976961 -844073 -833877 -1234212 -1399665 -792869 256459 1029906
36035 1029906 1232097 1106635 1007734 1055691 1070232 709641 -215703 -1465838 -2484189 -2845171
36025 -2845171 -2519613 -1731353 -778533 -63672 17222 -485136 -919310 -685807 4687 379392
36015 379392 97319 -410667 -649733 -626255 -510897 -245266 138636 240531 -163111 -620916
36005 -620916 -615612 -414703 -665239 -1295823 -1555210 -1156686 -659839 -574408 -775721 -1039244
35995 -1039244 -1460468 -1957955 -1975417 -1216359 -262109 74652 -242101 -540043 -294383 453456
35985 453456 1302957 1743576 1388382 338737 -765841 -1295152 -1115893 -455962 384970
35976 384970 1015188 1059812 598491 131233 -176094 -749824 -1730788 -2379932 -1972774 -875656
35966 -875656 -27713 351019 778350 1444355 1963013 2163503 2321176 2478104 2265813 1622429
35956 1622429 1039002 811675 614259 138016 -339426 -408113 -176517 -80074 -272925 -519223
35946 -519223 -527114 -179611 399073 844389 798796 308236 -180884 -310806 -127695 128616
35936 128616 301517 302688 75348 -299097 -649879 -958531 -1363362 -1869458 -2264678 -2380719
35926 -2380719 -2242174 -1937426 -1556081 -1242516 -1056130 -795571 -246825 420557 826078
35917 826078 909270 915778 898814 695882 394091 259047 116161 -550460 -1623387 -2122546
35907 -2122546 -1426213 -248039 157817 -516010 -1435407 -1721108 -1275981 -620139 -293649
35898 -293649 -403352 -526363 -134557 750696 1522857 1736201 1560896 1283821 793260 -12308
35888 -12308 -669698 -612089 -47720 207763 -187339 -670252 -564638 43153 417544 25804
35878 25804 -831967 -1254033 -678128 429520 1068051 900740 538129 471354 311712 -433289
35868 -433289 -1337060 -1532528 -941046 -250615 212592 758510 1403373 1509086 707466 -445949
35858 -445949 -1175794 -1387829 -1442998 -1415986 -1088742 -507289 -89028 -161094 -640365 -1167952
35848 -1167952 -1411421 -1282455 -984886 -813188 -832703 -819103 -564973 -175323 927 -274003
35838 -274003 -825613 -1148589 -922404 -431240 -204180 -213800 91507 743122 884176 19334
35828 19334 -962264 -919376 -207121 -131871 -808390 -951250 -60741 651738 259705 -280766
35818 -280766 314491 1513700 1823114 1198028 1041860 1925791 2777663 2584943 1663141
35809 1663141 786151 88677 -575606 -978778 -880689 -537609 -324249 -247658 -227137 -413527
35799 -413527 -819404 -1050858 -836861 -454102 -209786 125771 909622 1965221 2790008
35790 2790008 3141244 2975699 2149360 767685 -401708 -557576 100689 543702 177745
35781 177745 -559253 -944234 -811978 -477528 -241124 -214299 -339668 -363306 -18019 590968
35771 590968 1007918 997203 842618 854255 820955 314696 -547328 -1061048 -817633 -345037
35761 -345037 -536461 -1479023 -2209256 -1838858 -663707 237190 407674 473841 1010288 1504026
35751 1504026 1012697 -394043 -1529852 -1525936 -823551 -450860 -701925 -964156 -708306
35742 -708306 -185451 13932 -193018 -317086 -89773 19308 -614367 -1800175 -2562016
35733 -2562016 -2225590 -1100622 87720 1017906 1681959 1891600 1461548 723023 276265
35724 276265 248125 292123 297183 528703 1002926 1327874 1364379 1467025 1757720 1704413 895881
35713 895881 -148646 -488263 84694 843292 1016868 550141 5956 -42843 457032 978513
35703 978513 948786 392006 -140990 -299979 -255915 -205297 -22367 318404 440056 132132
35693 132132 -146852 115933 619110 595592 -78673 -724731 -840082 -695963 -800432 -1178563
35683 -1178563 -1410269 -1162432 -531500 53257 259769 226757 344786 601972 516930 -50404
35673 -50404 -524109 -530862 -678003 -1627992 -2752643 -2738425 -1485613 -332810 -180691 -438653
35663 -438653 -268321 128394 151262 -101071 -233004 -437862 -1054785 -1661074 -1562853 -952729
35653 -952729 -647021 -787789 -740332 -284999 55315 67660 297063 1048572 1749408 1846016
35643 1846016 1681374 1852198 2206833 2176361 1739353 1332985 1031651 559293 31208 -68611
35633 -68611 283388 549716 523678 612103 918690 769290 -258825 -1365406 -1354542 -211466
35623 -211466 877465 1036625 546021 85743 -179744 -436073 -640715 -558597 -152902 367095
35613 367095 729377 653989 -8024 -932136 -1359287 -815604 306882 1137444 1211117 784434
35603 784434 388539 258672 142636 -391783 -1318982 -1878696 -1333189 -53284 731738
35594 731738 527049 234239 693510 1271590 830129 -354656 -837777 -139567 571755
35585 571755 287572 -401193 -334704 498839 1091993 875830 303803 102450 499743 1194036
35575 1194036 1716542 1811108 1663873 1698425 2025836 2275196 2111686 1692779 1413963 1405174
35565 1405174 1471085 1350134 894954 219140 -226818 -40273 512436 629549 -15446 -763525
35555 -763525 -827689 -354555 -180025 -676340 -1272219 -1140860 -127103 1014947 1228399
35546 1228399 142228 -1455634 -2334525 -2078264 -1343446 -826354 -472320 32616 506093
35537 506093 508382 38908 -496546 -857708 -1120932 -1387607 -1641669 -1750180 -1405184 -353024
35527 -353024 1064079 1948639 1772732 951364 201698 -245332 -438277 -256633 255398
35518 255398 558685 277238 -179801 -292265 -300104 -644016 -966760 -625261 88717 290107
35508 290107 -75664 -248333 -81851 -284109 -1025086 -1459038 -1048221 -321709 206866 882295
35498 882295 1960100 2667100 2109956 617856 -622877 -953809 -629626 -148585 165042
35489 165042 144980 -63742 25784 658372 1369697 1505863 1063144 652829 760332 1323019
35479 1323019 1894355 2005406 1546105 949325 770036 1008545 1200425 1204825 1356222 1716311
35469 1716311 1860151 1668039 1581628 1687886 1379777 501806 -38370 373267 889842 450231
35459 450231 -463094 -587176 14991 37431 -954661 -1909739 -2024238 -1803365 -1925781 -2165967
35449 -2165967 -2083792 -1894326 -1937225 -1943151 -1519927 -887414 -520771 -427509 -270723 114388
35439 114388 699098 1375783 1779157 1471724 658391 172836 345760 513030 173675 -89556
35429 -89556 349895 853073 349790 -875913 -1456505 -946669 -335656 -344129 -424529 -8568
35419 -8568 320636 -216619 -1199608 -1574275 -1231842 -1017193 -1260577 -1253896 -396950 879674
35409 879674 1707685 1798163 1489529 1146051 922419 921798 1180561 1514411 1646877 1525795
35399 1525795 1375781 1442392 1759578 2093785 2029164 1241112 -126422 -1407434 -1917516
35390 -1917516 -1527565 -658706 198666 791728 1022782 858647 427702 23667 -130335
35381 -130335 -49613 145983 432828 850185 1323198 1627967 1566516 1170710 717519 478587
35371 478587 417056 240735 -130731 -295657 159661 950694 1211940 490016 -653798 -1283819
35361 -1283819 -1137291 -725371 -514525 -411169 -129695 289054 568965 613707 560683 484355
35351 484355 294363 -32923 -312101 -335957 -96280 262958 613663 870030 942029 800868
35341 800868 550068 312007 83096 -183144 -422128 -560036 -704178 -994362 -1290007 -1302138
35331 -1302138 -1081720 -1040715 -1343653 -1598486 -1368774 -712030 28710 670923 1127756 1202535
35321 1202535 861768 486364 397359 315069 -203915 -939335 -1229204 -1004175 -941569 -1413973
35311 -1413973 -1875040 -1618162 -725501 83994 282768 -54054 -458238 -508614 -234159 -125342
35301 -125342 -505878 -963403 -836238 -226137 81056 -211071 -546127 -585076 -813493 -1526252
35291 -1526252 -1969104 -1347885 -191738 268549 -147494 -421022 69679 751443 883224
35282 883224 555934 249501 26909 -294913 -568829 -458879 9661 472196 729029 879945
35272 879945 965102 799080 296028 -241702 -382581 -101473 132362 -78447 -520268 -594936
35262 -594936 -60783 679419 1086454 1071407 981964 1185165 1747916 2342794 2407407 1649131
35252 1649131 498248 -213902 -162530 180503 309761 353646 692452 1253506 1575046 1363719
35242 1363719 669762 -271851 -1067225 -1291910 -961140 -652294 -805767 -1140746 -1126145 -745008
35232 -745008 -353904 -64808 219016 382576 260549 42449 6143 70029 147270 609966
35222 609966 1650620 2469452 2080948 870195 280690 786716 1272314 850185 230382
35213 230382 515065 1445636 1823782 1244555 472023 244711 523506 949823 1348901 1575790
35203 1575790 1365623 644164 -237203 -780080 -767365 -370033 33896 87464 -354485 -1101815
35193 -1101815 -1683243 -1654753 -1008203 -266659 6562 -153853 -196398 111740 257722 -288783
35183 -288783 -1184402 -1527709 -995210 -218192 -1394 -534211 -1407837 -2068992 -2194579 -1883568
35173 -1883568 -1507265 -1216946 -784232 -172013 105888 -279551 -690698 -216988 973707
35164 973707 1759441 1535168 770050 55504 -510283 -797631 -458915 302467 605651 76124
35154 76124 -538561 -489869 -118195 -214067 -857781 -1525591 -1853164 -1680403 -857033 288802
35144 288802 757850 -13006 -1134154 -1168555 80938 1421601 1841032 1528200 1270760
35135 1270760 1436277 1755514 1785205 1429516 1056989 974566 805103 -128218 -1608056 -2379195
35125 -2379195 -1707210 -482341 -68868 -545767 -918597 -703603 -359372 -336313 -638956
35116 -638956 -1267969 -2179806 -2792917 -2457847 -1533961 -1099851 -1420297 -1635925 -1256280 -952526
35106 -952526 -1316755 -1732741 -1269134 -65383 1003827 1603565 2024635 2279929 2033632
35097 2033632 1425414 1131671 1386693 1598465 1245221 592201 90389 -456163 -1471724
35088 -1471724 -2574283 -2731491 -1619140 -176407 596765 877310 1444441 2232051 2332776
35079 2332776 1484028 664447 776836 1378805 1333958 356061 -717346 -1033218 -567230
35070 -567230 101084 419633 231972 -179442 -368031 -190752 62893 94752 -75357 -356108
35060 -356108 -827453 -1452249 -1864688 -1822641 -1605280 -1558706 -1504164 -1064120 -370461 61811
35050 61811 52547 -115549 -179978 -51457 409231 1254367 2079672 2225674 1425661 18888
35040 18888 -1377617 -2166417 -2007388 -1179633 -501057 -454413 -608933 -341004 209883 512360
35030 512360 644114 1123977 1913701 2449228 2624752 2834947 2951595 2250792 714008
35021 714008 -497749 -459052 280930 521473 18629 -422667 -264335 18413 -354532 -1375573
35011 -1375573 -2144597 -1874505 -833742 -30115 34087 -146389 -36180 61145 -376994 -1062959
35001 -1062959 -1271716 -985678 -816669 -876707 -593038 282959 1264961 1844953 1920872 1471184
34991 1471184 565752 -250374 -422675 -329695 -859257 -1913602 -2372111 -1832973 -1282294
34982 -1282294 -1501726 -1862939 -1446809 -468806 276493 694298 1202303 1748079 1875324
34973 1875324 1502050 977287 585374 436173 515002 507984 71204 -427553 -157323 759947
34963 759947 985006 -165087 -1446265 -1259708 204584 1472644 1861130 1858428 1839567
34954 1839567 1691767 1599439 1995716 2647196 2788086 2253373 1582585 976353 104374 -959868
34944 -959868 -1583434 -1557990 -1362698 -1233575 -835691 -107449 446747 630377 867705 1273928
34934 1273928 1311023 897380 967357 2130918 3447044 3471893 2174084 927400 757457
34925 757457 1397716 2051530 2291276 2014437 1219869 279053 -15961 746933 1865950
34916 1865950 2109032 1148838 7360 -197901 389964 735442 446274 254472 812725
34907 812725 1708713 2163584 2174500 2260925 2406541 2117442 1487373 1286295 1690868 1726403
34897 1726403 564063 -1151545 -1990819 -1522396 -689483 -409612 -521270 -417849 -117586
34888 -117586 -88385 -289722 -118302 617751 1316637 1462721 1338958 1422113 1555490 1354582
34878 1354582 1078638 1296134 1827966 1899247 1406747 1144680 1500226 1772287 1262378 351419
34868 351419 -71364 265423 957775 1501466 1452610 553781 -732709 -1303347 -645817 404546
34858 404546 722618 295000 -51485 88008 400761 523148 361124 3828 -162341 354167
34848 354167 1316844 1689072 1084673 619918 1363094 2563000 2648370 1548792 614739
34839 614739 430325 225026 -429619 -836165 -503960 13105 138750 38698 -143201 -745157
34829 -745157 -1706784 -2228428 -1932706 -1432974 -1146915 -576946 468453 1008836 309206
34820 309206 -709257 -716845 -9310 53598 -712438 -1079134 -454208 176243 -201876 -1170809
34810 -1170809 -1639372 -1391792 -1121659 -1205570 -1165758 -476596 564016 1143962 1003546 772685
34800 772685 1050560 1517329 1437039 843866 534234 781324 799488 -86107 -1314400 -1747942
34790 -1747942 -1135696 -295170 29052 -96808 -226596 -195973 -134829 -87861 112871 575613
34780 575613 1046396 1054023 505911 -30652 -3880 232584 -264392 -1678062 -2972198 -3150498
34770 -3150498 -2479521 -1923009 -1754965 -1459587 -841118 -389770 -357626 -222131 438400 1060945
34760 1060945 799073 -94364 -391101 431797 1377510 1301746 505850 136208 316546 -24012
34750 -24012 -1313760 -2435817 -2259418 -1217903 -553390 -617410 -831826 -885074 -962789 -1020576
34740 -1020576 -806762 -531998 -627290 -890048 -748935 -322748 -265808 -556745 -478391 63369
34730 63369 273031 -202587 -718840 -801395 -854453 -1190975 -1322646 -864645 -308790 -196423
34720 -196423 -254072 -58622 126897 -43413 -151464 389757 1290026 1687976 1244700 356162
34710 356162 -433957 -744328 -433100 154815 365915 68971 -110391 245378 685094 633349
34700 633349 214369 -173335 -507046 -803088 -740928 -252400 102536 660 -21280 471802
34690 471802 868772 387007 -653961 -1338309 -1465198 -1433533 -1241575 -584422 334080 985172
34680 985172 1258240 1242798 682002 -457534 -1311203 -1067733 -262716 -27171 -333998 -189621
34670 -189621 597043 1113724 853477 330671 29026 -182782 -379756 -317732 -58213 36889
34660 36889 66089 433022 859368 575706 -357746 -980685 -891021 -691092 -723860 -538903
34650 -538903 -39245 27954 -632598 -1125099 -672937 207553 600150 471195 291757 106899
34640 106899 -184860 -237171 189333 544048 199281 -488037 -590101 154976 1146424 1693721
34630 1693721 1423960 277258 -1230924 -2023200 -1456775 -186616 556093 397590 -40143
34621 -40143 -240081 -317586 -460151 -525426 -376714 -123920 156589 557007 1026707 1263977
34611 1263977 1116052 834185 722838 699938 420253 -205286 -780837 -810375 -303931 113212
34601 113212 -150346 -910940 -1335901 -907300 -43630 441208 317770 41419 -88694 -417820
34591 -417820 -1297551 -2278820 -2495709 -1864300 -1292655 -1388216 -1538487 -905126 113466 354682
34581 354682 -311011 -760648 -414564 -106486 -566298 -1079746 -614282 462761 889459
34572 889459 300294 -531456 -957688 -950536 -520031 338653 1132127 1212988 690023 244347
34562 244347 101511 -31650 -128558 160729 713906 1024337 1055873 1123966 1014413 245018
34552 245018 -820887 -1246069 -980881 -886242 -1155616 -992725 -174084 393724 199658 -61735
34542 -61735 114321 55394 -798696 -1673580 -1558966 -745399 -259219 -343367 -406769 -55283
34532 -55283 561918 1052830 922495 -55500 -1189900 -1337822 -512374 -131822 -1015360 -2098949
34522 -2098949 -1999633 -908086 108663 782605 1373392 1491575 664711 -366195 -400210
34513 -400210 333598 400415 -725057 -2005094 -2404366 -1985062 -1272280 -574545 -197771
34504 -197771 -409913 -861848 -788517 -65567 574584 576354 193123 -69087 -31169 275260
34494 275260 700330 816970 278800 -502692 -643699 36245 689964 564546 -41251 -267863
34484 -267863 194839 791473 739041 -157374 -1240081 -1607028 -1111039 -537255 -562755 -895874
34474 -895874 -870838 -511864 -353416 -461546 -412748 -151462 -50794 -69916 316085 1127179
34464 1127179 1600637 1277737 704791 566951 650869 243143 -769875 -1767921 -2204283
34455 -2204283 -2056509 -1537045 -823321 -151551 214595 315010 531314 1042986 1449505
34446 1449505 1302207 905667 1039882 1725138 1883429 755569 -803768 -1224861 -240269
34437 -240269 826823 827409 18924 -662213 -761088 -375447 233028 622006 291213 -719396
34427 -719396 -1720192 -2125321 -1911075 -1244226 -310872 352389 194357 -408296 -436831 213665
34417 213665 500741 7767 -279071 271868 671290 -79615 -1227166 -1483863 -1093640
34408 -1093640 -1129251 -1425109 -943641 144475 501222 -236410 -915497 -682905 4301
34399 4301 453545 600760 465223 -160873 -1058788 -1503604 -1217536 -710144 -447785 -331091
34389 -331091 -109720 306849 958809 1651556 1814154 1226241 625430 793103 1371884 1522086
34379 1522086 1335001 1426705 1511844 814263 -275512 -496896 279911 873840 767348 703623
34369 703623 1043758 1155292 902539 1115974 1909364 2111528 1242281 567763 1121706 1994800
34359 1994800 1817723 861286 361950 577050 767293 520009 -25479 -782314 -1559051
34350 -1559051 -1747176 -1059800 -172226 144785 62972 155495 397871 506906 691325 1169437
34340 1169437 1448884 1022181 341751 140770 164576 -377855 -1325732 -1609423 -804878 289143
34330 289143 806733 804863 837286 1078793 1194459 852958 197922 -175311 183049 975079
34320 975079 1418168 1181810 677137 289861 -155055 -866989 -1523671 -1660826 -1300196 -839871
34310 -839871 -596942 -687013 -1006671 -1150476 -776432 -219481 -200957 -724414 -918676 -325257
34300 -325257 327778 133347 -772652 -1537870 -1702702 -1471546 -1220048 -1168293 -1286408 -1264757
34290 -1264757 -874626 -427204 -370109 -411753 187507 1301635 1831375 1266682 445371 261885
34280 261885 501809 546607 376406 181041 -229913 -876301 -1196906 -962462 -892964 -1530203
34270 -1530203 -2152770 -1735055 -470020 557836 791861 468447 -123715 -813377 -1275794
34261 -1275794 -1303830 -1077329 -661786 247969 1519320 2200628 1747436 1027126 1194908
34252 1194908 2062642 2528032 2221601 1750717 1567714 1518715 1395001 1183882 883112 620684
34242 620684 697540 1019600 932345 191730 -437605 -234416 380478 563639 336395 321615
34232 321615 665563 1045402 1289996 1203470 333972 -1185534 -2162107 -1757505 -852069 -845008
34222 -845008 -1552173 -1612045 -732320 -122499 -585238 -1412715 -1533953 -857978 -98270 144079
34212 144079 -137193 -425642 -197464 403193 649322 262356 -100073 213059 958991 1526247
34202 1526247 1719004 1493328 666701 -446131 -914132 -485837 -175346 -712884 -1344663
34193 -1344663 -1170601 -650390 -537751 -351612 544610 1237584 461187 -1087251 -1535120
34184 -1535120 -657016 -51765 -556044 -1257984 -1253818 -794903 -392666 -120550 -63737 -328779
34174 -328779 -510901 -207501 62494 -385356 -970309 -536746 699441 1363343 1015999
34165 1015999 557950 548510 633889 726198 1233122 1932281 2062010 1735284 1870044 2532923
34155 2532923 2759656 2226211 1693064 1550516 1300801 747481 381779 354780 315175 359331
34145 359331 825794 1177449 601081 -299723 -118572 956102 1227326 282606 -233503
34136 -233503 761910 2201521 2675541 2245723 1661259 1186269 963288 1252647 1655366
34127 1655366 1310029 344409 -133144 180022 441515 405359 850579 1841683 2307549 1939387
34117 1939387 1770261 2206273 2245747 1405452 643679 533622 319944 -277899 -176436 1030796
34107 1030796 1912528 1365333 349820 164871 484200 431559 187473 164683 -100611 -887841
34097 -887841 -1357000 -972458 -652177 -1199867 -1772211 -1246105 -43054 694281 746018 455793
34087 455793 -241624 -1267679 -1869576 -1730671 -1605888 -1878875 -1670765 -457992 673638
34078 673638 633932 57493 151762 807601 1076985 659471 -152455 -1146389 -1900785 -1745062
34068 -1745062 -780229 45945 418858 940217 1502503 1096356 -98395 -392821 670048
34059 670048 1282444 300831 -839180 -614704 160775 122914 -245478 134949 864445 1093505
34049 1093505 1251212 2018969 2865976 3150364 3334875 3710038 3431787 2210334 1272527
34040 1272527 1247374 957176 -241589 -1020387 -609314 -479566 -1595277 -2328021 -1283704
34031 -1283704 98417 120580 -300518 157545 484341 -437994 -1177850 -314836 577661
34022 577661 -281142 -1290603 -173291 1729965 1641734 128779 -188416 706763 793987
34013 793987 93769 262930 990493 564882 -667366 -935028 -378878 -398889 -616050 138463
34003 138463 930809 334776 -330855 901290 2664504 2389452 1078950 1585210 3283656
33994 3283656 3143942 1289475 698738 1855657 2421469 1926509 2138465 2957540 2503114
33985 2503114 1119458 866497 1365047 631432 -519089 319283 2145286 1835668 -92249
33976 -92249 -273029 1416675 2032660 1400353 2050015 3633485 3327872 1601121 1552322
33967 1552322 2813983 2389513 1064683 2162944 4413144 3497928 407883 301194 3150875
33958 3150875 3982098 2439992 3027080 5611947 5527575 3586539 5409739 10090269 11029204
33949 11029204 8918043 11117935 17005999 18471978 16695731 21702826 32585622 37764699
33941 37764699 39061269 51829120 74423149 88435039 104830054 172262533 303535021
33934 303535021 421290500 426947088 317323805 187672227 117633943 99006435 85493750
33927 85493750 65151354 54020799 52135639 44311217 30430343 23734383 25092582 23108228
33919 23108228 15944845 12517549 14161849 13015920 7788731 5526989 7690900 8135585
33911 8135585 5362635 4571538 6783045 6938198 3834227 2036411 2835136 2419465 167267
33902 167267 168853 3097278 4484669 2711969 1484332 2658227 3295726 1725167 475515
33893 475515 1198672 1965786 1419076 936716 1209358 959797 168802 467904 1525086
33884 1525086 1103866 -678297 -1247888 -221446 33289 -983684 -997625 577534 1462936
33875 1462936 783765 542708 1700623 2480290 1771564 843228 537198 -90126 -1305461
33866 -1305461 -1825231 -1259729 -676039 -206184 1042561 2374184 1920061 47173 -852052
33857 -852052 -355861 -442671 -1506453 -1583938 -301087 158405 -837352 -975591 776877
33848 776877 2064127 1133709 -218578 187326 1526971 1927587 1506834 1322719 1218399
33839 1218399 719134 496662 1183008 2041195 2181772 1804824 1203349 33737 -1441630
33830 -1441630 -1962161 -1095708 41068 644663 1148561 1635629 1275910 178237 -231810
33821 -231810 336628 292598 -1002907 -1819036 -925271 155761 -464950 -2080414 -2671461
33812 -2671461 -1846696 -733872 15473 473181 528736 206666 215885 951094 1576406 1145463
33802 1145463 3634 -804907 -864707 -396411 297285 713553 288926 -697367 -1161927
33793 -1161927 -689613 -84424 4968 -25766 248589 448650 191174 -234775 -535853 -840896
33783 -840896 -1056762 -795936 -279920 -223933 -525129 -255772 743619 1526608 1566268 1288010
33773 1288010 886479 133017 -420294 218458 1575040 1977643 1178125 732810 1220453
33764 1220453 1300381 403685 14447 968094 1702000 851155 -382719 -291280 638057 1020792
33754 1020792 1057976 1655436 2289895 1852177 734649 157177 144795 -64893 -300504 133693
33744 133693 906630 1118693 805596 558012 219134 -637051 -1515985 -1664507 -1346779 -1174191
33734 -1174191 -847531 89393 971302 941794 508430 705328 1334693 1542869 1536329 2128447
33724 2128447 3059511 3351856 2956991 2555891 2149091 1385510 848466 1325317 2108089
33715 2108089 1796192 677828 517807 1832056 3060507 2837057 1658484 830587 911162
33706 911162 1622227 2359858 2462620 1735588 837871 469180 316699 -355553 -1330679 -1720611
33696 -1720611 -1480114 -1485610 -2068251 -2552789 -2400216 -1866193 -1377121 -1062345 -971435 -1018666
33686 -1018666 -768239 -23459 533890 134359 -817999 -1179941 -645555 2984 115205
33677 115205 -218383 -645721 -797880 -239049 958459 1805435 1455920 431079 -109456
33668 -109456 41369 285207 511546 992780 1323330 869035 119052 154593 819704 913030
33658 913030 271910 76359 757342 1168361 455329 -589954 -795355 -156504 595976
33649 595976 1062409 1119534 583239 -388148 -1103759 -1057988 -421310 380474 1014049 1094053
33639 1094053 441590 -382534 -582946 -278042 -304630 -806874 -1026484 -679674 -438118 -670213
33629 -670213 -778623 -311962 232038 306364 166221 224091 331783 305906 438238 842659
33619 842659 938083 258368 -703286 -1055576 -564194 266551 798432 654892 -57818 -696190
33609 -696190 -703173 -390625 -504264 -976952 -961438 -259948 298309 284077 386255 1049017
33599 1049017 1417564 610677 -704790 -1122905 -473533 91460 -136693 -565132 -399482
33590 -399482 142638 168240 -639238 -1539345 -1614827 -912598 -349050 -452485 -744152 -708944
33580 -708944 -723718 -1245425 -1610879 -814394 678529 1182322 66284 -1401298 -1875173
33571 -1875173 -1493762 -1077493 -818630 -539635 -436844 -707864 -965970 -751097 -230052
33562 -230052 157614 324258 332706 54079 -486983 -896535 -1009595 -1218616 -1716938 -1903010
33552 -1903010 -1114761 376418 1607079 1935666 1500636 928738 794330 1084217 1155632
33543 1155632 619819 121359 534611 1505673 1785127 1070474 363217 237809 33016
33534 33016 -711594 -1298089 -1140945 -859156 -1175080 -1704136 -1787317 -1614901 -1555929 -1271528
33524 -1271528 -521141 37380 -54568 -55518 680698 1316347 825848 -149444 -326779 18745
33514 18745 -348559 -1270252 -1340873 -310644 520935 488658 390325 765357 989084 645856
33504 645856 324289 365120 155209 -568691 -950663 -431271 164584 -58874 -606538 -529819
33494 -529819 -66438 -142443 -722430 -896900 -453543 -206731 -637531 -1199855 -1336103 -1377528
33484 -1377528 -1847967 -2402541 -2240887 -1461148 -1197171 -2066673 -3081844 -2769380 -1100153
33475 -1100153 481445 920146 560308 97203 -457609 -1140287 -1287425 -433422 625234
33466 625234 771446 245153 250025 1034571 1548577 1111044 291303 -187849 -425482 -746544
33456 -746544 -950580 -736527 -321657 -120638 -167129 -198084 -20384 359908 631525 223315
33446 223315 -995287 -2082018 -1843361 -427025 710912 688481 191832 170815 442313
33437 442313 328716 1842 241901 1119830 1741392 1343621 164200 -818884 -773964 260104
33427 260104 1380741 1730786 1439737 1303289 1533006 1461962 679391 -306830 -962680 -1507120
33417 -1507120 -2152101 -2291498 -1366409 -36269 564492 486411 806828 1861452 2738756
33408 2738756 2772804 2530704 2810266 3411924 3509405 2737893 1380682 -92549 -1119410
33399 -1119410 -1057840 207984 1797188 2558602 2275436 1702817 1474846 1526614 1638190
33390 1638190 1902251 2343284 2591595 2385931 2035126 1883050 1610567 697035 -555161
33381 -555161 -1173697 -809873 -224300 -194361 -508740 -484539 -35724 331129 336065 183679
33371 183679 83483 -18500 -222315 -545423 -1012079 -1570737 -1949938 -1901210 -1585112 -1446561
33361 -1446561 -1692508 -2095539 -2286220 -2076355 -1589626 -1223968 -1292073 -1505100 -1110649 115258
33351 115258 1299076 1361821 316011 -778957 -1019548 -382656 575208 1231036 1218353
33342 1218353 726625 374351 367272 69050 -1010226 -2164523 -2289590 -1501299 -936506
33333 -936506 -1005214 -998324 -589191 -464639 -969122 -1285095 -721633 126369 366698 186725
33323 186725 329384 805788 1057726 934671 635578 113326 -580510 -789235 -74763 789636
33313 789636 709039 -72578 -325139 250336 686072 470657 340906 872493 1396028 1075159
33303 1075159 238958 -220992 -214737 -323447 -642634 -656310 -199915 244419 345322 369704
33293 369704 579274 701469 400994 -43962 -17089 549221 978354 666002 -180558 -812727
33283 -812727 -782435 -292631 197300 455541 548064 635201 777031 843175 634417 218670
33273 218670 47941 488284 1281623 1783530 1734333 1459247 1302221 1282919 1369137 1572557
33263 1572557 1604419 1006203 -57010 -683390 -348265 377250 723145 792944 1057905 1280015
33253 1280015 871718 78043 -213705 147933 341359 -132828 -813603 -1191842 -1376348
33244 -1376348 -1451614 -1033555 -68726 646495 482664 -33659 -32970 328390 204923 -468324
33234 -468324 -799565 -286718 500436 812547 598259 170817 -395214 -1070327 -1488962 -1289682
33224 -1289682 -672341 -206412 -140006 -183991 64170 703893 1487565 2016627 2056333 1809377
33214 1809377 1754304 2028635 2134921 1536978 426460 -451189 -691736 -578420 -508730 -492672
33204 -492672 -382900 -231845 -147783 -43027 216332 592702 992033 1342530 1360333 619299
33194 619299 -743244 -1731077 -1497921 -500126 5009 -397370 -828806 -475749 300169
33185 300169 623725 338046 14660 42476 269157 422483 400789 175641 -172272 -290138
33175 -290138 195704 1148819 1916012 1986779 1475525 842722 323545 -178311 -706830 -1000084
33165 -1000084 -764368 -141218 291844 98999 -534795 -1028887 -1023799 -630144 -177297 73101
33155 73101 58114 2771 269938 832576 1066108 514950 -271772 -303349 442874 932478
33145 932478 618083 260288 711158 1615636 2066974 2004220 2055254 2307719 2230875 1798510
33135 1798510 1733036 2350175 2902612 2528871 1413311 559565 604379 1166842 1323974 588371
33125 588371 -590692 -1314095 -1203956 -699063 -349830 -218572 -210644 -485613 -1008524 -1127704
33115 -1127704 -362135 634290 760576 46333 -408353 -195906 -262597 -1316794 -2483123
33106 -2483123 -2391822 -1128277 -208059 -678987 -1915971 -2439301 -1531619 130986 1262009
33097 1262009 1208246 389426 -423609 -999991 -1561466 -2021270 -1846681 -798095 589942
33088 589942 1443842 1239769 89402 -1265292 -1760536 -872398 658781 1448059 989808
33079 989808 91321 -343530 -333844 -343318 -446185 -454199 -365573 -198427 171363 541813 253665
33068 253665 -916105 -2189168 -2720195 -2661958 -2645190 -2652725 -2230075 -1486023 -981385 -788936
33058 -788936 -533874 -253076 -305314 -470803 -122658 605028 832012 378589 186724 816922
33048 816922 1447883 1073568 -10077 -707703 -626487 -272140 -41614 185817 521203 790334
33038 790334 860790 788926 579441 159170 -340401 -543160 -156475 755261 1757168 2232816
33028 2232816 1805591 765963 -106536 -337573 -172172 -34082 94671 431892 827474
33019 827474 877283 462734 -195511 -890595 -1490693 -1809557 -1792090 -1676930 -1610972 -1332169
33009 -1332169 -688348 -176316 -297363 -579177 -95969 1032442 1616164 1128370 498143
33000 498143 632206 1028251 700884 -164375 -535289 -190602 61023 -159117 -184898 487417
32990 487417 1237496 1181010 462401 21834 308233 823564 924907 599127 311187 401466
32980 401466 837625 1415120 1983919 2436224 2589617 2243226 1420185 462556 -238495 -572042
32970 -572042 -662285 -571443 -250130 209909 498473 393290 49499 -114224 198860 888022
32960 888022 1518105 1701519 1478409 1227815 1141579 1008663 718047 678180 1282362 2111952
32950 2111952 2266791 1553780 775620 648851 978900 1186584 1103675 830184 302964 -436250
32940 -436250 -919477 -820229 -581788 -829684 -1332350 -1256052 -428592 356350 427876 26778
32930 26778 -187807 93300 746182 1399910 1477642 544700 -1058062 -2300980 -2481779 -1845022
32920 -1845022 -1001083 -192060 538627 938250 857639 691737 943782 1462396 1601495 1111490
32910 1111490 460117 246540 615868 1262500 1739798 1758119 1381846 904400 426608 -212284
32900 -212284 -889330 -981697 -185053 752243 801290 64625 -325730 211852 1015075 1306271
32890 1306271 1192340 1034110 576385 -475431 -1493326 -1515481 -668582 -88255 -319410
32881 -319410 -623462 -158701 872770 1688568 1960036 1864777 1541640 1077776 778701 886179
32871 886179 1144560 1106366 759330 442008 306908 330147 639536 1212991 1400491 543097
32861 543097 -870628 -1511552 -943357 -231333 -386158 -1017560 -1207613 -977665 -922943 -888848
32851 -888848 -185990 984041 1477192 824183 -62030 -199288 254165 615455 785273
32842 785273 1037717 1194999 832803 148581 -101316 402166 1140196 1470529 1314309 972635
32832 972635 639526 367259 266061 390399 476897 110326 -722110 -1428498 -1372207 -593595
32822 -593595 208227 422831 85464 -318601 -354387 143470 1034670 1808538 1818544 954117
32812 954117 -42089 -289658 244132 798096 812292 509363 439394 760650 1094753 940510
32802 940510 202326 -613770 -857372 -490018 -114777 -80062 -11489 371643 525415 -119529
32792 -119529 -1069825 -1416476 -1282202 -1508868 -2006692 -1718555 -447131 603787 606247 166821
32782 166821 -78184 -660278 -2053457 -3342734 -3412214 -2698763 -2395369 -2425373 -1631746 241129
32772 241129 2095672 3004630 3032159 2507585 1587871 664627 196910 -24886 -569701 -1284482
32762 -1284482 -1482147 -1222675 -1290898 -1763022 -1809892 -1232210 -908546 -1170916 -1013679 230067
32752 230067 1536561 1601713 773840 407932 869146 1374725 1460997 1375387 1089745 111262
32742 111262 -1465027 -2642030 -2689052 -2022914 -1534789 -1481969 -1443959 -1096415 -605646 -272207
32732 -272207 -69572 280763 818477 1165490 1024821 664885 544524 578646 301406 -242728
32722 -242728 -431358 -64638 282508 256998 323407 817661 1170218 892196 684815 1481148
32712 1481148 2769690 3090203 2112580 1007213 611633 461231 53169 -125179 392007
32703 392007 937145 600252 -325674 -765033 -419031 -5074 -85842 -494382 -905034 -1216134
32693 -1216134 -1310605 -1139205 -1106042 -1613585 -2098896 -1441216 263530 1285193 424745
32684 424745 -1124434 -1186944 477005 1907305 1645297 449229 -158158 50398 257985
32675 257985 139444 64988 126785 23789 -150887 14620 283469 -173760 -1435562 -2400603
32665 -2400603 -2220980 -1458366 -1157798 -1338687 -1226297 -650993 -301758 -596548 -1119818
32656 -1119818 -1387220 -1475268 -1532297 -1245778 -356546 623591 843502 236699 -311192 -56080
32646 -56080 761455 1407176 1633262 1766388 2006828 2139289 1979292 1649418 1237853 600044
32636 600044 -211090 -700981 -555136 -237848 -453749 -1159084 -1665302 -1674977 -1593847 -1705036
32626 -1705036 -1660553 -1106902 -331753 110840 100392 -83873 -244761 -373154 -454209 -462093
32616 -462093 -422054 -298299 -19560 234266 73346 -557095 -1201338 -1516275 -1676080 -1805490
32606 -1805490 -1478537 -379934 866035 1277633 820008 380313 410558 389658 -112809
32597 -112809 -614600 -509073 -113744 -197265 -720267 -846841 -283359 134445 -392653 -1369983
32587 -1369983 -1551571 -590228 523362 830665 611169 779362 1511957 2140591 2262447
32578 2262447 2219563 2320535 2242334 1592171 607473 -162139 -590125 -964134 -1433934 -1859349
32568 -1859349 -2069496 -1925648 -1281743 -272140 486238 433770 -200839 -640737 -584333 -536412
32558 -536412 -927228 -1328471 -971756 127905 1058373 1141605 794467 919212 1644156 2176212
32548 2176212 1949784 1365923 1094749 1163696 1241331 1361051 1635680 1598258 775627 -201818
32538 -201818 -143111 905080 1505596 855285 -117201 -268290 173265 338244 126221 -82940
32528 -82940 -369978 -865158 -1010120 -348759 438682 433827 -22297 66865 643762 829703
32518 829703 591119 690654 1047003 712002 -337630 -947069 -714676 -648041 -1278624 -1593767
32508 -1593767 -735425 499614 888633 480263 24986 -359220 -828314 -914460 -208177
32499 -208177 619944 639065 56450 -306420 -489798 -1110464 -1878912 -1747728 -604864 380296
32489 380296 366729 -204472 -598947 -825128 -1186482 -1488935 -1299231 -652523 -43690 145599
32479 145599 -28141 -207122 -95887 204124 245254 -234389 -920239 -1240944 -945707 -203359
32469 -203359 603869 929421 281222 -1131424 -2229896 -2079493 -920874 256772 904640
32460 904640 1103318 868555 102887 -813656 -1237277 -1209931 -1433829 -2084614 -2411554 -1877827
32450 -1877827 -995577 -509328 -310067 204758 1042245 1550050 1340625 739928 270356
32441 270356 76853 -18066 -144889 -244809 -230188 -168264 -221683 -395955 -486269 -416374 -497334
32430 -497334 -1079399 -1963310 -2426647 -1908426 -514284 1127771 2302139 2556464 1949449
32421 1949449 1041278 423676 204414 110759 14007 46953 237978 402038 457169 513315
32411 513315 575305 502166 352973 402841 665122 758251 456349 54577 -54248 95380
32401 95380 175689 87 -386103 -822767 -1033438 -744041 -52490 510879 528100 135751
32391 135751 -256878 -452857 -435529 -124939 471525 1033655 1228459 1144712 1089419 1047744
32381 1047744 738011 178557 -211394 -146218 246985 757210 1304915 1685726 1539066 894909
32371 894909 407019 614034 1199939 1474874 1429248 1682548 2343865 2619718 1891794 621120
32361 621120 -312355 -730823 -1016559 -1187840 -879098 -146170 453439 632511 552141 201801
32351 201801 -594676 -1407269 -1359914 -439971 274816 235459 272664 1004149 1398692 222428
32341 222428 -1754245 -2538446 -1655037 -552426 -240757 -140580 319186 554360 126489
32332 126489 -131845 558730 1414692 1147305 -81713 -1002205 -1171989 -1325104 -1856434
32323 -1856434 -2143992 -1650113 -773018 -163891 156344 504584 771093 496823 -339752
32314 -339752 -1014822 -787414 118391 582750 -69432 -1036745 -928181 348709 1356387
32305 1356387 1049723 115442 -166479 346584 872793 1051939 1085117 907710 300073 -338864
32295 -338864 -396603 -196157 -663318 -1752575 -2314130 -1791536 -961580 -585422 -414681 -103172
32285 -103172 -10874 -287591 -152173 858938 1719582 1221892 -81110 -558432 164302
32276 164302 916815 975236 914747 1188036 1218587 567503 -106041 -110976 89864 -276937
32266 -276937 -873953 -737006 127347 682250 390858 -106176 -34485 517584 933205 854746
32256 854746 342633 -334511 -788581 -712349 -232820 173544 245996 135929 -27838 -344320
32246 -344320 -735057 -801538 -416409 -73012 -259050 -793443 -1178732 -1301526 -1320712 -1149288
32236 -1149288 -630840 -70542 27650 -284248 -497145 -510093 -766579 -1404939 -1920031 -1951928
32226 -1951928 -1827443 -1904809 -1862666 -1179545 -38275 784390 832467 363827 -111151 -333794
32216 -333794 -365220 -439853 -741285 -1104361 -1009158 -147230 1009303 1478033 735095 -676366
32206 -676366 -1578788 -1219767 50234 1159260 1421777 1159091 1057288 1129727 779713
32197 779713 -177961 -1196786 -1837902 -2217526 -2286820 -1492819 133719 1265277 714108
32188 714108 -778436 -1332100 -406389 684121 828021 412671 134693 -196604 -792766
32179 -792766 -867446 294774 1847873 2239504 1318724 394415 242321 281097 -49459 -322154
32169 -322154 -136532 -77731 -753763 -1524476 -1199516 270908 1707310 2222525 2018288
32160 2018288 1628491 1184006 693036 377619 325114 267234 62822 -22894 121758 80618
32150 80618 -404054 -769566 -310161 706323 1302991 1120526 778147 822459 1011556 910787
32140 910787 594027 352621 169369 -70071 -173844 103692 613648 964126 932914 496939
32130 496939 -219802 -738282 -410252 720180 1666945 1710805 1436662 1777921 2403442 2154953
32120 2154953 997899 238852 461406 533466 -551522 -1933413 -2117068 -1196750 -517941
32111 -517941 -508378 -309929 395331 675570 -10037 -712532 -415780 344466 340447 -442506
32101 -442506 -914271 -657731 -433558 -797364 -1269967 -1292528 -1152845 -1351829 -1649356 -1442081
32091 -1442081 -755339 -200977 -116293 -327332 -668798 -1154274 -1614699 -1730009 -1567815 -1615240
32081 -1615240 -2050920 -2385380 -2130168 -1528964 -1240597 -1409433 -1425557 -713128 456400
32072 456400 1164894 893256 175612 -20370 522661 1100777 1165823 1011747 1013633 769789
32062 769789 -224901 -1381516 -1491893 -441080 534610 599403 405942 895185 1804873
32053 1804873 2137080 1588888 723126 25161 -463913 -731769 -671071 -333668 153374 806484
32043 806484 1527697 1885882 1649921 1283647 1351553 1669695 1660038 1330290 1207124 1431688
32033 1431688 1640192 1677776 1717936 1705240 1402532 976007 774218 542086 -255604 -1234377
32023 -1234377 -1234299 -33432 1027164 719808 -516032 -1349764 -1276341 -822162 -455969 -73175
32013 -73175 529336 1202658 1503998 1020235 -195167 -1408862 -1781849 -1303861 -749743
32004 -749743 -598283 -572018 -444521 -556615 -1068159 -1374995 -899582 46245 784408 1155418
31994 1155418 1259522 864035 -129687 -1048117 -1154522 -731546 -604182 -806312 -653018
31985 -653018 -47923 273364 -56825 -489102 -508036 -395787 -649791 -1178774 -1482254 -1287901
31975 -1287901 -713485 -40901 472337 720487 749222 528393 -63218 -754272 -762441 226709
31965 226709 1232146 984020 -263060 -870437 -27101 1104558 1013381 -140697 -938741
31956 -938741 -717229 -272009 -538996 -1301085 -1563071 -882357 86543 419978 40814 -270527
31946 -270527 38703 569508 574649 -24245 -644050 -892372 -919563 -945041 -908590 -698133
31936 -698133 -385646 -152802 -203395 -667221 -1312927 -1559665 -1198844 -866522 -1210760 -1811642
31926 -1811642 -1715995 -935180 -429602 -479452 -168066 1036891 2197502 2187856 1325312 806533
31916 806533 978055 1105459 662158 -24111 -451484 -598432 -743151 -1053105 -1455299 -1645413
31906 -1645413 -1262524 -336168 513663 626768 25666 -641968 -830065 -572331 -308447
31897 -308447 -391917 -716392 -805816 -430035 -42489 -223942 -741432 -764289 -135680 308982
31887 308982 47765 -259864 195364 1132377 1724787 1840171 1856676 1675858 960852 161905
31877 161905 200030 1029129 1493975 885022 -207660 -936890 -1323446 -1835587 -2424719 -2592040
31867 -2592040 -2159487 -1503115 -1096535 -1081571 -1237303 -1262782 -1155034 -1270477 -1847723 -2564082
31857 -2564082 -2831597 -2463815 -1772120 -1107889 -636357 -436056 -431097 -339957 -102167 -189276
31847 -189276 -976927 -1965742 -2262386 -1765052 -1186026 -916562 -646743 -211671 21011 -109786
31837 -109786 -188993 46358 300539 420694 793093 1544633 2010282 1600172 662496 -108169
31827 -108169 -594099 -931885 -807954 39410 913867 731157 -440913 -1198700 -432484
31818 -432484 1356376 2654761 2570527 1605334 879818 806952 761997 138745 -661598 -812989
31808 -812989 -392210 -301903 -828561 -1227222 -1037027 -791343 -874348 -737072 -102722 81060
31798 81060 -897826 -1941825 -1529913 -158902 260977 -724538 -1567436 -1206477 -403586
31789 -403586 -78307 111174 671642 1076709 717983 70399 -138832 -128901 -408097 -632658
31779 -632658 -237558 332495 180093 -589528 -1072815 -1021682 -1024713 -1327615 -1521819 -1457989
31769 -1457989 -1481804 -1601904 -1350278 -729109 -431613 -757801 -1091767 -907382 -591348 -712655
31759 -712655 -1071066 -1149046 -1098321 -1520030 -2395652 -2908469 -2425976 -1214770 -56158 528714
31749 528714 545400 284722 36784 -11079 253354 874723 1720982 2396046 2434606 1694598
31739 1694598 487714 -712313 -1551662 -1751928 -1077253 344527 1770944 2294049 1688803
31730 1688803 624394 -84514 -239324 -109883 203810 815324 1482572 1558676 850581
31721 850581 114905 141183 549723 210737 -1068594 -2017981 -1456787 189598 1463715
31712 1463715 1577613 957281 379908 247165 606350 1221809 1584170 1421247 1228469
31703 1228469 1673856 2408348 2217716 664840 -1107493 -1702788 -1069224 -235384 82880
31694 82880 -57058 -438860 -975787 -1399910 -1316893 -710655 56623 815131 1687464 2511895
31684 2511895 2692753 1947412 850947 253030 317574 474954 255357 -165900 -351058
31675 -351058 -296098 -485086 -1210592 -2051252 -2286459 -1811751 -1308754 -1325274 -1498327 -1067898
31665 -1067898 7752 934209 1109923 818147 700249 890657 963664 548619 -264293
31656 -264293 -1053910 -1451020 -1471078 -1533632 -2004345 -2680695 -2979817 -2701770 -2237526 -1846530
31646 -1846530 -1226163 -241397 386841 -111051 -1244143 -1644482 -864769 90091 346556
31637 346556 336942 713655 945914 127653 -1257895 -1695365 -774759 278130 502824 399760
31627 399760 628973 739212 237264 -71705 749551 1840487 1438376 -375225 -1517759
31618 -1517759 -893753 59009 -340428 -1559673 -1953688 -1338418 -922631 -1131171 -1078507
31609 -1078507 -265273 578060 721537 420571 171474 -117644 -612036 -939984 -796173
31600 -796173 -626044 -975360 -1501615 -1379394 -548694 137779 61826 -437424 -659596 -433402
31590 -433402 -154445 -185139 -487999 -791980 -936758 -990287 -1064453 -1096548 -909675 -485230
31580 -485230 -38863 248529 473177 885798 1579741 2362330 2894519 2944427 2575377 2086851
31570 2086851 1696474 1335839 891208 530834 500159 614383 342405 -451833 -1185277 -1226698
31560 -1226698 -666988 -160645 -157374 -532598 -860609 -830281 -476077 -176203 -328116 -880955
31550 -880955 -1324941 -1293307 -992855 -842023 -889218 -876283 -725052 -618115 -648889 -711288
31540 -711288 -755717 -887570 -1147244 -1382303 -1413636 -1239261 -1056553 -1099538 -1355512 -1430528
31530 -1430528 -931588 -85415 347391 34274 -365619 -3241 1012959 1755683 1664172
31521 1664172 1080813 589536 330910 148719 20518 73418 345631 677090 749346 283788
31511 283788 -592215 -1255830 -1168323 -511214 70116 307076 505353 911686 1328002 1451072
31501 1451072 1208848 674294 39489 -253878 177422 1073407 1699414 1748933 1602043 1533323
31491 1533323 1264622 617587 5390 -199611 -283917 -649992 -1100601 -1239647 -1172235 -1150752
31481 -1150752 -903417 -113519 673101 524171 -495370 -1257300 -1031319 -246998 428413
31472 428413 1004941 1734179 2380332 2511593 2187915 1850286 1695138 1546056 1240690 851422
31462 851422 582532 608895 897643 1095565 810656 127255 -418457 -518092 -425052 -403357
31452 -403357 -235915 318292 879279 819109 220381 -77278 446978 1247358 1311959 353438
31442 353438 -846168 -1294143 -841440 -242564 -169677 -403194 -263806 301319 563007 58895
31432 58895 -744073 -1215550 -1507446 -2090587 -2635840 -2220559 -751945 613195 855270
31423 855270 295284 -77811 18215 100847 -93688 -347356 -608895 -1116186 -1700593 -1701101
31413 -1701101 -963422 -314613 -478037 -977325 -836318 -96966 213109 -359180 -1034910
31404 -1034910 -1029038 -686756 -810529 -1343358 -1418329 -526568 950641 2276321 2904983 2589498
31394 2589498 1529696 472429 139202 413291 511567 42275 -577274 -853619 -805449
31385 -805449 -589326 -107166 618784 1142790 1127945 822723 571981 249210 -280321 -515829
31375 -515829 107539 1168209 1574123 985424 204102 -28169 66244 -67950 -374404 -376829
31365 -376829 28278 463167 603698 450273 156562 -101124 -115273 244402 859840 1383986
31355 1383986 1454389 972052 320817 209636 979201 2072039 2569248 2297267 1939451
31346 1939451 1939038 1903497 1438842 944032 957029 1184981 969327 433215 280932 528064
31336 528064 377939 -444453 -1130257 -991491 -486428 -451590 -870901 -1086578 -855497 -493157
31326 -493157 -195521 81682 174792 -155540 -620630 -603224 -91625 235296 105397 194975
31316 194975 1119951 2373939 2859373 2226519 1138486 341841 6704 -42043 28000 45993
31306 45993 -110487 -260633 -25880 610976 1103310 932928 264874 -188192 92322 909946
31296 909946 1512620 1271730 330094 -453560 -392560 250951 657558 553008 466026 818576
31286 818576 1315660 1511395 1441708 1270913 828450 102969 -236985 388478 1410888 1675680
31276 1675680 1005861 337423 239717 258189 16663 4394 660812 1420887 1409819 606315
31266 606315 -338671 -1004689 -1273150 -951291 -118206 467664 153323 -579777 -691466 -90393
31256 -90393 290902 -64666 -643977 -897639 -959737 -1020701 -793560 -149700 335725 101906
31246 101906 -542616 -872797 -770616 -729433 -994708 -1229426 -1038769 -450796 186723 570996
31236 570996 665123 640103 575022 265899 -457602 -1252432 -1458504 -899980 -170241 47877
31226 47877 -320111 -823729 -956839 -483291 297696 552697 -271525 -1499621 -1768923 -784611
31216 -784611 255757 440155 414118 1048104 1714532 1200203 -130363 -600067 317108
31207 317108 1241081 1012308 294647 306772 953421 1203791 727771 145550 -103319 -247650
31197 -247650 -534607 -784881 -759412 -534877 -369997 -463877 -889927 -1527786 -2039369 -2129174
31187 -2129174 -1853855 -1519165 -1306018 -1168754 -1039908 -907777 -703643 -353314 6631
31178 6631 94374 -100286 -152362 293334 895932 805981 -331745 -1754472 -2284156 -1640017
31168 -1640017 -721575 -507745 -1053246 -1792359 -2408200 -2901867 -3032651 -2349973 -921178
31159 -921178 424558 834077 224891 -746417 -1318224 -1194876 -708720 -467098 -687745
31150 -687745 -943125 -758030 -301404 -133855 -383146 -620522 -540053 -303082 -172003 -251873
31140 -251873 -631951 -1288611 -1791313 -1676695 -1237805 -1284658 -1858858 -1896016 -667733 1033466
31130 1033466 1824855 1481099 1037636 1298046 1925391 2128460 1756775 1428590 1707797
31121 1707797 2343574 2469526 1650714 531965 95664 422677 759883 794043 1062689
31112 1062689 1810220 2252949 1612501 308083 -599746 -791438 -833548 -1184817 -1684532
31103 -1684532 -1903353 -1538739 -638787 215606 297576 -313678 -672941 -368962 -314527 -1306133
31093 -1306133 -2419103 -2039913 -231403 1199800 1038813 -103220 -1069614 -1511537 -1556398
31084 -1556398 -1183731 -580081 -349430 -700592 -951689 -406480 690682 1523321 1633122
31075 1633122 1104830 241324 -536249 -805768 -535324 -115079 188271 446399 599558
31066 599558 305753 -446929 -1087038 -1204396 -1130041 -1391032 -1952390 -2365306 -2345254 -1883343
31056 -1883343 -1104488 -307601 162984 324178 510395 782521 830091 611702 517297 653441
31046 653441 600046 204212 -55268 86302 160271 -196128 -575515 -581362 -570371 -881090
31036 -881090 -999365 -377868 493361 808995 729143 856883 875878 -8527 -1446457 -2092212
31026 -2092212 -1486944 -602280 -290590 -335839 -373493 -610051 -1067414 -1095808 -353021 468654
31016 468654 588379 221783 77675 292485 510592 582660 541264 247517 -315499 -719320
31006 -719320 -680279 -672398 -1270676 -2109856 -2264690 -1615182 -1058945 -1215746 -1617481 -1519386
30996 -1519386 -969845 -601569 -689088 -921309 -975230 -820655 -421499 389836 1497281 2315333
30986 2315333 2405651 2080551 1934874 1878673 1243860 -18466 -922750 -677147 198479 597022
30976 597022 288149 -74418 -169499 -357284 -785200 -994640 -667514 -71134 507284 1091374
30966 1091374 1477648 1125403 96107 -583527 -183116 640735 778966 263802 36118
30957 36118 367142 505817 -43477 -796438 -1113393 -1019901 -855021 -713343 -647334 -900968
30947 -900968 -1451179 -1716629 -1255534 -476808 -117958 -209376 -142169 305523 636487 448084
30937 448084 15172 -213484 -248670 -316250 -317116 9465 558729 950932 1095105 1265481
30927 1265481 1633905 2102715 2573388 2937255 2802995 1826966 496363 -66431 479318
30918 479318 1015994 334799 -1181712 -1959069 -1146011 562383 1936834 2315797 1657912
30909 1657912 304416 -984273 -1381336 -826082 -136110 -10082 -315832 -594039 -735024
30900 -735024 -773346 -525562 25862 354240 -34437 -872628 -1464051 -1513953 -1168476 -536041
30890 -536041 236033 659791 385313 -129279 -114523 415979 800607 909608 1287696 1965617
30880 1965617 2127321 1440713 826811 1163926 1905553 1879492 1021383 348255 400916 678868
30870 678868 679500 616466 819582 1088689 1013138 512681 -178176 -695552 -606593 236234 1259219
30859 1259219 1612164 1219389 796475 631393 142976 -903082 -1595403 -1100861 -35374
30850 -35374 381717 107629 103923 610684 811168 314125 -189186 -106127 204662 236210
30840 236210 150824 260862 399127 340573 229340 108163 -305810 -853253 -685162 506604
30830 506604 1660810 1582307 529172 -241296 -97023 597118 1328545 1792666 1704587 1102618
30820 1102618 600152 585534 530135 -90170 -667868 -320844 536788 745774 273302 144009
30810 144009 574142 662155 88093 -386073 -442494 -711433 -1243263 -1036041 138426 931004
30800 931004 451295 -262301 -13184 577767 324982 -350424 -201719 593768 750186 97852
30790 97852 -248009 94630 227242 -334474 -907905 -1027870 -1281647 -2132741 -2960047 -2995415
30780 -2995415 -2440898 -1939963 -1517605 -753142 348870 1290302 1733601 1764837 1550247
30771 1550247 1067011 269314 -595898 -1003542 -673901 -57763 74576 -321039 -411165 275242
30761 275242 1003078 840397 52274 -337942 -109871 -35685 -545992 -1121968 -1191820 -851791
30751 -851791 -431271 6525 436667 681474 725244 798447 960769 991877 799640 517478
30741 517478 146814 -407816 -885462 -797505 -154714 434305 557707 448926 498346 736276
30731 736276 936584 876423 427046 -288479 -868576 -1092975 -1221952 -1435619 -1353397 -766333
30721 -766333 -414427 -1048931 -1992726 -1835506 -529300 498487 495402 283660 578933 775800
30711 775800 173913 -738530 -1152696 -1176973 -1272967 -1236741 -724789 -193927 -356111 -1095775
30701 -1095775 -1692148 -1716685 -1105847 80489 1297353 1557742 628341 -426105 -707255
30692 -707255 -809471 -1686674 -2831640 -2835916 -1452452 98769 768247 558179 -157065
30683 -157065 -1135248 -1988605 -2279103 -2067151 -1770282 -1505285 -1127128 -719511 -405894 56368
30673 56368 778394 1164841 666013 -206265 -512789 -226955 27723 227995 780981 1365561
30663 1365561 1259996 752382 868960 1631448 1965438 1518726 1121971 1097794 626852 -579753
30653 -579753 -1407481 -1011893 -162437 49122 -179236 -40664 470976 879534 1242181 1813348
30643 1813348 2245041 2071444 1537274 1125437 759038 274166 132692 768725 1703312
30634 1703312 2204433 2366747 2614848 2624077 1828733 672825 194877 490888 686907 431754
30624 431754 344159 810319 1296005 1188288 636906 263970 480113 1155205 1569627 883923
30614 883923 -761137 -1885667 -1214069 612061 1777370 1608230 1060204 895541 679049
30605 679049 -3688 -547147 -300400 344689 636894 569102 543455 518086 291796 197212
30595 197212 684547 1469560 1828562 1583317 1161333 820979 428552 -73682 -541121 -951418
30585 -951418 -1385858 -1696778 -1580634 -948168 64815 1261684 2198919 2148731 868345
30576 868345 -711726 -1217380 -312272 1042040 1790098 1696581 1069539 260998 -352697
30567 -352697 -500096 -436431 -762332 -1546651 -2108551 -1975656 -1553085 -1436272 -1536822 -1409134
30557 -1409134 -1054823 -795074 -597205 -155140 486697 979649 1280849 1649942 2042656
30548 2042656 2070338 1633802 1079670 636454 216274 -101489 43275 673974 1244439 1318710
30538 1318710 1048140 693985 171558 -530119 -937591 -637323 73375 588364 788344
30529 788344 924138 959317 641475 109397 -174559 -83837 103421 257023 460353 544270
30519 544270 203613 -303497 -226505 626341 1448464 1398137 593442 -165074 -285414 293741
30509 293741 1253112 1979609 1859079 925964 -19637 -324788 -250929 -418317 -783060 -757206
30499 -757206 -228013 178184 -40572 -635370 -1030889 -971635 -511932 267994 1146477 1549748
30489 1549748 945818 -402689 -1391381 -1108219 134177 1104559 1063831 533503 414006
30480 414006 693608 580590 -200549 -928333 -895512 -312167 175535 392848 560190 650319
30470 650319 432337 39636 -86878 111449 137660 -380894 -1150138 -1529615 -1228223 -558449
30460 -558449 -84807 -72987 -248733 -117048 482373 1239469 1754606 1809934 1270168 155002
30450 155002 -985058 -1243747 -350662 833128 1277879 969871 644494 656587 790450
30441 790450 976447 1357244 1633916 1226439 327649 -25598 622630 1347463 1063857 22579
30431 22579 -608203 -339657 178714 200167 -270552 -760878 -969838 -944210 -920844 -1125324
30421 -1125324 -1517086 -1689726 -1257771 -376012 392445 783114 1083534 1525424 1786389
30412 1786389 1478741 912428 808693 1190659 1148015 84526 -1260147 -1664451 -1065124
30403 -1065124 -542269 -623008 -530750 413275 1486034 1521645 649575 34042 79224 3610
30393 3610 -678780 -1341503 -1344509 -1016781 -887879 -688803 49131 913644 1072902 594651
30383 594651 386048 807561 1206407 1054100 771593 939656 1240095 858001 -242203
30374 -242203 -1081886 -841963 177816 1052118 1365060 1402364 1331781 829271 -191129 -1036006
30364 -1036006 -1071451 -819316 -1364890 -2616590 -3095501 -1946868 -374206 -217903 -1528629
30355 -1528629 -2551172 -2097089 -961681 -605961 -1186619 -1608830 -1228172 -707962 -962809
30346 -962809 -1757012 -1904657 -854709 437277 610091 -381612 -1216810 -911377 48392
30337 48392 584626 470211 299335 362095 293221 -175851 -763659 -1102050 -1179801 -1146459
30327 -1146459 -1060849 -1003172 -1089141 -1205685 -1051923 -592266 -145095 106877 298895 401160
30317 401160 50740 -749808 -1197979 -540554 828568 1688258 1382988 414398 -362227
30308 -362227 -611427 -453540 -43277 444091 725356 687660 602215 760793 1028672 1055424
30298 1055424 811354 561386 362306 73 -504925 -747423 -496231 -63252 154377
30289 154377 217983 422222 774743 1061795 1211697 1172498 649741 -464726 -1522841 -1669332
30279 -1669332 -1010427 -506358 -525633 -348227 458647 1053477 546850 -419102 -418623 667006
30269 667006 1430604 919525 -171093 -641605 -304000 151426 202945 -136927 -600783 -830140
30259 -830140 -558996 -21669 124455 -366547 -927039 -999900 -850818 -1011338 -1280759 -1025448
30249 -1025448 -317456 36368 -293011 -639713 -322041 445016 992565 1092406 969212 767362
30239 767362 515985 439665 784184 1344130 1595680 1369515 1032736 898298 806059 496379
30229 496379 110318 8854 245721 547209 782252 1131187 1689660 2153598 2095871 1458211
30219 1458211 616959 24873 -68219 390537 1275252 2157040 2361166 1502787 80296
30210 80296 -747540 -308844 746275 1157696 647222 283262 947508 1970768 1983996 858935
30200 858935 -98743 6009 524027 406546 -293852 -763113 -704471 -420619 57766 959699
30190 959699 1902074 1954445 862133 -482122 -1129730 -1077297 -819484 -456587 202754 988079
30180 988079 1430207 1418569 1316956 1345502 1205412 529372 -457517 -1001218 -656021 88260
30170 88260 290803 -301824 -944984 -909770 -427408 -252037 -626273 -1204141 -1718301 -2056297
30160 -2056297 -1871417 -946595 69956 192972 -461446 -664279 173730 1135617 1184691
30151 1184691 567145 145258 49424 -189128 -680849 -1165397 -1582021 -1929930 -1913913 -1407385
30141 -1407385 -883615 -710854 -487027 150918 590272 102271 -809497 -1070966 -742311
30132 -742311 -787905 -1275161 -1182566 -132480 1028429 1675178 2114136 2413333 1890457 514855
30122 514855 -394061 141156 1287356 1632378 1119988 699211 660186 461591 -135968 -825570
30112 -825570 -1458789 -2059769 -2247785 -1518893 -106851 1155208 1826453 2100733 2166495
30103 2166495 2007920 1787238 1719866 1536522 742517 -472019 -1185841 -811368 228359
30094 228359 1026216 1052523 459959 -115900 -58353 599044 1101796 839647 85181 -531159
30084 -531159 -971259 -1574138 -2121732 -1960597 -1078686 -241308 128155 447808 1085976 1694670
30074 1694670 1842443 1698271 1588188 1355434 712510 -102116 -577700 -679916 -853354
30065 -853354 -1293390 -1601302 -1283977 -409669 390530 607479 449254 529425 909499 836660
30055 836660 -235295 -1707232 -2438426 -2071109 -1177078 -282600 530829 1144738 1361550
30046 1361550 1439786 1863539 2414823 2311484 1499894 895761 968437 1056487 654866 394776
30036 394776 899283 1503430 1176658 162888 -384264 -58111 529679 883190 1014309
30027 1014309 844315 219659 -479368 -655524 -441481 -465459 -685238 -428532 309386 664906
30017 664906 313090 66638 554888 1172435 1005445 148876 -584952 -788488 -646770 -384021
30007 -384021 -142264 -150229 -469922 -769593 -791280 -817976 -1237817 -1866880 -2163943 -1952294
29997 -1952294 -1511958 -1121171 -906102 -954179 -1135310 -984466 -240958 640747 1035365 1071242
29987 1071242 1382069 1952115 1953931 995193 -141615 -491151 -154625 57744 -61190 75779
29977 75779 685369 1007693 310970 -942500 -1534978 -970190 56249 706097 924589
29968 924589 1043527 1017725 625705 106214 -110338 -229821 -911644 -2098392 -2753663 -2199013
29958 -2199013 -1148025 -801045 -1255226 -1498675 -865282 196141 920134 1191868 1387029
29949 1387029 1634660 1682481 1401497 1071394 1059202 1366347 1629712 1572894 1355685 1355974
29939 1355974 1612682 1666934 1089818 50621 -825743 -1123248 -980823 -797254 -796015 -939323
29929 -939323 -1093783 -1139698 -985919 -609701 -112091 313576 519025 543156 605924 884049
29919 884049 1248207 1305557 819410 67295 -353968 -145879 354486 563797 344850 143851
29909 143851 360531 773270 857375 593970 537501 918252 1120693 491074 -617157 -1194493
29899 -1194493 -903465 -435005 -440438 -744872 -907846 -964973 -1129533 -1224724 -1019057 -819835
29889 -819835 -1072075 -1530850 -1530804 -1067617 -893662 -1354117 -1784631 -1438645 -520503 155548
29879 155548 190138 -197418 -758332 -1471209 -2235957 -2765334 -2895745 -2726216 -2395241 -2005202
29869 -2005202 -1822616 -2187300 -3002669 -3597710 -3402273 -2591101 -1758286 -1133555 -553754
29860 -553754 -113171 -221625 -815987 -1103327 -550652 292542 544534 265387 259163 725627
29850 725627 960840 573030 160041 305944 568951 135071 -928751 -1775022 -1931164
29841 -1931164 -1706099 -1497420 -1271504 -806533 -33141 915990 1663065 1647829 655642 -713804
29831 -713804 -1530339 -1542567 -1326705 -1400449 -1620228 -1559999 -1071831 -312989 417038 713579
29821 713579 324581 -411588 -719452 -221651 646088 1253860 1501547 1660212 1783523 1651360
29811 1651360 1170223 508208 -126502 -602360 -777249 -491888 283081 1316580 2125384
29802 2125384 2210575 1487816 476309 -164499 -298774 -274163 -256608 -12026 541648 1001251
29792 1001251 952859 435322 -324276 -1254732 -2160895 -2479269 -1865111 -853332 -375383
29783 -375383 -618782 -852451 -483696 130009 141482 -755002 -1961741 -2571462 -2238866 -1487773
29773 -1487773 -1127412 -1351183 -1579243 -1290815 -742029 -569268 -893571 -1244645 -1305451 -1271390
29763 -1271390 -1382407 -1491662 -1283365 -663916 186491 904839 1016575 278263 -841045
29754 -841045 -1354889 -775650 256086 685557 246308 -394123 -583030 -350612 -98384
29745 -98384 -57160 -259711 -717223 -1320590 -1765547 -1869167 -1808906 -1747409 -1395613 -400785
29735 -400785 878033 1532955 1220296 620702 493798 733467 793100 629220 603113 712309
29725 712309 656715 583908 963015 1588242 1515768 358866 -1033696 -1669228 -1594651 -1432743
29715 -1432743 -1295293 -922475 -540586 -693308 -1291790 -1638762 -1480027 -1311786 -1478556
29706 -1478556 -1665340 -1586545 -1542980 -1842669 -2159016 -1996962 -1469269 -1074922 -936002 -822795
29696 -822795 -813809 -1281057 -2098104 -2446330 -1768608 -565682 162831 89628 -224249 -197402
29686 -197402 136282 451137 668325 890783 1072035 1094663 1033626 1006185 872232 472593
29676 472593 102654 263167 861606 1178963 871712 517124 753010 1266798 1209706 448609
29666 448609 -182626 45280 855760 1294538 731408 -548801 -1602425 -1665799 -866143
29657 -866143 -43813 214937 150045 244104 398689 144288 -514742 -1021156 -1029699 -739786
29647 -739786 -388907 75208 621182 882557 595364 17041 -364866 -369904 -175759 10516
29637 10516 146334 287553 422182 371866 -20473 -491821 -414283 395582 1148422 902068
29627 902068 -187193 -1053536 -1157358 -1009931 -1124627 -1260994 -1107050 -954951 -1087750
29618 -1087750 -1089883 -483918 372380 762790 683489 698842 933082 954539 580464 96186
29608 96186 -315053 -723127 -1044130 -1115049 -1160523 -1501427 -1775050 -1219048 108304 1177561
29598 1177561 1350879 1139457 1191603 1267595 828047 55758 -417200 -419285 -229103 8975
29588 8975 201565 -45318 -926228 -1762515 -1649116 -774666 -302545 -784459 -1427342 -1231572
29578 -1231572 -236832 737823 1089601 761808 -8460 -829528 -1307946 -1416562 -1480417 -1556500
29568 -1556500 -1216975 -323151 413546 248770 -460005 -625302 86827 804625 654077
29559 654077 -131554 -619626 -325983 412848 1029624 1324718 1442281 1477209 1303501 838949
29549 838949 320893 61618 -47348 -408107 -966655 -1064493 -385856 417267 605212 457129
29539 457129 743092 1354273 1398271 644702 -109723 -317865 -347517 -499310 -350067 290751
29529 290751 643484 36313 -906633 -1070194 -413478 163470 211423 95369 129255 188429
29519 188429 159177 105060 48916 139463 779666 1930009 2648591 2219080 1427775 1595574
29509 1595574 2463535 2341507 566670 -1456373 -2145496 -1552536 -690562 -106399 79684
29500 79684 -388269 -1426643 -2144118 -1796511 -867219 -403475 -582698 -701846 -349894 174727
29490 174727 510985 628756 586877 415014 229747 99318 -105687 -421593 -578133 -416355
29480 -416355 -226169 -273823 -336624 -184275 -152028 -616408 -1186561 -1126239 -450995 72065
29470 72065 -11558 -388891 -607880 -617922 -617285 -779047 -1142355 -1461467 -1319361 -760398 -514569
29459 -514569 -1044412 -1671259 -1388125 -357609 245253 -149194 -919310 -1366370 -1487594
29450 -1487594 -1367904 -728725 375503 1136219 942636 306616 220537 883030 1602105
29441 1602105 1779145 1529081 1407768 1826645 2637972 3129017 2653535 1451297 534883
29432 534883 520041 916665 919093 540543 443338 828810 1077501 565159 -568279 -1594618
29422 -1594618 -1892534 -1400133 -598406 -105359 -93932 -86437 436449 1179331 1143805 -113342
29412 -113342 -1584260 -1680239 -65938 1842090 2489402 1903572 1329300 1437812 1637578
29403 1637578 1216630 394383 -165968 -314603 -336034 -291223 -12886 461430 959854 1499700
29393 1499700 2069441 2301954 1922089 1378078 1420801 2064987 2511488 2150579 1192589 286998
29383 286998 -63317 267109 946353 1359442 1246461 1045521 1194775 1373352 1049692 494681
29373 494681 397471 618855 329270 -556204 -1151081 -1074921 -1074785 -1641525 -1990930 -1221415
29363 -1221415 204014 989351 628417 -218883 -719106 -661767 -442798 -644662 -1421797
29354 -1421797 -2086251 -1711839 -389083 665806 585382 -171890 -728303 -972506 -1236937
29345 -1236937 -1461911 -1483625 -1646643 -2245702 -2705107 -2221850 -1043785 -250683 -327071 -724029
29335 -724029 -824111 -605640 -275145 106578 473822 703357 800452 778833 427037 -378972
29325 -378972 -1233564 -1558860 -1349655 -1115431 -1167035 -1410587 -1719715 -1996745 -1960046 -1401680
29315 -1401680 -598049 21394 489159 1043636 1429562 1150694 374429 -153907 -180081 -209707
29305 -209707 -546269 -775517 -520405 -91184 41634 -28321 111794 518622 871643 982543
29295 982543 1001096 1129592 1313253 1275042 868895 361360 186982 369702 463216 219096
29285 219096 -26092 121912 576072 1065671 1526811 1799227 1492154 750135 556150 1411782
29275 1411782 2224761 1615157 23229 -743003 -13691 989910 1094477 575248 183111
29266 183111 -35483 -292708 -416222 -371418 -616902 -1241457 -1490227 -874325 -76905 -976
29256 -976 -514544 -901557 -994771 -1043097 -940007 -456501 99796 268674 190581 232262 207275
29245 207275 -195124 -516637 -40169 929243 1270762 592986 -310116 -683310 -646234 -571032
29235 -571032 -428200 -147078 8152 -147522 -422981 -730547 -1343291 -2226148 -2610732 -1873525
29225 -1873525 -550416 202724 67181 -190376 7008 229014 -137318 -809990 -988402
29216 -988402 -540894 -109215 -32723 108214 619803 1028899 793456 199177 -73417 37211
29206 37211 58814 -116893 -144203 29646 54296 -126890 -157572 38828 135750 148757 590195
29195 590195 1578823 2445120 2589741 2167254 1575232 859785 31575 -604937 -900142 -1129439
29185 -1129439 -1394216 -1305762 -728962 -246863 -313816 -505984 -270281 82620 -130108 -854979
29175 -854979 -1402500 -1376916 -893467 -190314 384200 382073 -120118 -342638 79686 340296
29165 340296 -328479 -1247292 -1201121 -348734 77515 -200073 -206629 408114 622560 -292474
29155 -292474 -1538163 -1957924 -1584858 -1252491 -1271502 -1245913 -871123 -327449 -20923 -205634
29145 -205634 -664154 -725332 -28775 719616 401425 -969874 -2107327 -2144932 -1678667 -1627561
29135 -1627561 -1835753 -1581536 -939576 -710832 -1164268 -1670449 -1684772 -1485011 -1683668 -2355315
29125 -2355315 -2917830 -2784500 -1974529 -1040799 -456650 -215954 -87088 -38962 -209701 -632500
29115 -632500 -1217446 -1787933 -1921473 -1175325 106712 729063 100626 -703748 -302802
29106 -302802 929950 1411736 818804 490263 1082255 1419591 481631 -853418 -1179346
29097 -1179346 -611828 -193936 -51466 463017 1253275 1504154 1096416 781905 884726
29088 884726 842201 194419 -778373 -1549627 -1836197 -1560747 -922320 -464563 -493739 -555846
29078 -555846 -106862 532404 671176 477421 736749 1428848 1608729 903684 129927 62278
29068 62278 480864 873004 1233865 1598587 1526070 777503 -6503 -55056 403327 438498
29058 438498 -282432 -1063977 -1060209 -187558 895395 1482638 1426278 1093251 719000 2755
29048 2755 -1316796 -2622471 -2781796 -1532606 72368 943526 1146503 1351499 1606200
29039 1606200 1408240 787495 468753 758337 919217 114178 -1353149 -2258567 -1898493
29030 -1898493 -864807 -181482 -38747 149947 596832 743375 256909 -224332 81367
29021 81367 949526 1522384 1556412 1504443 1504980 1222916 757872 698882 951124 509490 -991171
29010 -991171 -2357298 -2279478 -1061716 -40068 223840 202782 207460 29167 -257278 -166861
29000 -166861 304826 511769 177286 -153041 -51238 52703 -441738 -1365782 -2053785 -2227674
28990 -2227674 -2106486 -1846932 -1371845 -700031 -47423 438852 785967 1016666 1086301 1039746
28980 1039746 1053406 1231486 1438963 1417533 1081983 674306 544420 723966 825734 523860
28970 523860 56189 -8130 462648 898839 704908 23254 -410336 -144076 446539 578586
28960 578586 -44878 -893346 -1238306 -1009005 -765112 -797693 -651496 161071 1296741 1947251
28950 1947251 1938481 1873623 2129313 2331492 2093194 1715763 1693734 1883270 1681421 879095
28940 879095 -82504 -622118 -480361 179290 812040 815023 189135 -288915 8535 619689
28930 619689 520944 -478127 -1509171 -1888636 -1877905 -1901477 -1696160 -842710 286316 829561
28920 829561 555729 46311 -240570 -470364 -816715 -913655 -359235 528486 947294 574103
28910 574103 -75697 -318406 -16451 540182 1178187 1902946 2488089 2427585 1510021 200994
28900 200994 -810253 -1308434 -1529094 -1573023 -1267545 -683791 -357008 -657467 -1156511 -1024985
28890 -1024985 -94172 794585 694404 -331967 -1250958 -1252799 -668506 -461296 -947243 -1441875
28880 -1441875 -1262085 -599567 -70376 165223 283311 133035 -532458 -1258536 -1191836 -335787
28870 -335787 337677 322471 230658 524379 573759 -140990 -717572 28314 1555786 2119592
28860 2119592 1246919 327947 458719 986978 817970 83264 -355185 -295794 -160772 -77784
28850 -77784 78639 32821 -596275 -1423225 -1523646 -641844 424174 780043 336463 -323423
28840 -323423 -579277 -211319 435876 671093 161398 -560134 -625705 119856 973597 1312542
28830 1312542 1260312 1276078 1464988 1559792 1357779 933747 533029 393783 565051 807648
28820 807648 786372 411945 -131985 -695342 -1274858 -1772926 -1905418 -1513251 -801902 -131850
$$ [...]
##END NTUPLES=NMR SPECTRUM
##END=
