##TITLE=31Pdec_LY-TMF-17.100
 D2O, 24 sc
 26.3.2020
##JCAMPDX= 6.0         $$ Bruker NMR JCAMP-DX V2.0
##DATA TYPE= NMR SPECTRUM
##DATA CLASS= NTUPLES
##ORIGIN= UXNMR, Bruker Analytische Messtechnik GmbH
##OWNER= root
$$ XWIN-NMR		Version 3.5
$$ Thu Mar 26 14:23:42 2020 Russian Standard Time (UT+4h)  she@DPX200
##.OBSERVE FREQUENCY= 81.013821
##.OBSERVE NUCLEUS= ^31P
##.ACQUISITION MODE= SIMULTANEOUS
##.ACQUISITION SCHEME= undefined
##.AVERAGES= 24
##.DIGITISER RES= 17
##SPECTROMETER/DATA SYSTEM= spect
##.PULSE SEQUENCE= zgpg30
##.SOLVENT NAME= DMSO
##.SHIFT REFERENCE= (INTERNAL, DMSO, 0, 182.463)
##AUDIT TRAIL= $$ (NUMBER, WHEN, WHO, WHERE, WHAT)
$$ ##TITLE= Audit trail, XWIN-NMR		Version 3.5
$$ ##JCAMPDX= 5.01
$$ ##ORIGIN= Bruker BioSpin GmbH
$$ ##OWNER= she
$$ F:/spectra/data/she/nmr/P31/1/pdata/1/auditp.txt
$$ ##AUDIT TRAIL=  $$ (NUMBER, WHEN, WHO, WHERE, WHAT)
(   1,<2020-03-26 14:22:31.84 +0400>,<she>,<DPX200>,
      <created by zg, POWCHK disabled, PULCHK disabled
       configuration hash MD5:
       00 E9 B6 7A A2 85 ED C7 34 08 36 98 17 FE 4E 26
       data hash MD5: 32K
       39 51 65 77 7A A7 76 7B F7 69 20 9B 9F F5 4E CF>)
(   2,<2020-03-26 14:22:34.07 +0400>,<she>,<DPX200>,
      <Start of raw data processing
       efp BC_mod = 2 LB = 1 FT_mod = 6 PKNL = 1 PHC0 = -1894.671 PHC1 = 621.6019 SI = 64K 
       data hash MD5: 64K
       AE 5A E5 0A 84 75 44 56 D3 D0 B6 77 BE 41 98 D2>)
(   3,<2020-03-26 14:22:50.07 +0400>,<she>,<DPX200>,
      <pk PHC0 = -57.53329 PHC1 = 0 
       data hash MD5: 64K
       98 DA C8 13 B8 72 3C C3 21 32 68 9C 74 C2 AE B6>)
(   4,<2020-03-26 14:22:52.98 +0400>,<she>,<DPX200>,
      <abs ABSG = 5 
       data hash MD5: 64K
       8D C3 CC 46 30 28 B0 24 B3 16 81 58 CE D9 F9 61>)
(   5,<2020-03-26 14:23:09.37 +0400>,<she>,<DPX200>,
      <pk PHC0 = -0.7972357 PHC1 = 0 
       data hash MD5: 64K
       60 70 E2 B0 00 AB 09 7B 1A 95 E7 76 59 02 16 F9>)
$$ ##END=
$$ 
$$ hash MD5
$$ 14 A9 01 A6 D6 EA 97 13 CD 59 69 97 6F 44 80 67
##$RELAX= 
##$RELAX= 
##$RELAX= 
##$RELAX= 
##$RELAX= 
##$RELAX= 
##$RELAX= 
##$RELAX= 
$$ Bruker specific parameters
$$ --------------------------
##$DU= <F:/spectra>
##$EXPNO= 1
##$NAME= <P31>
##$PROCNO= 1
##$TYPE= <nmr>
##$USER= <she>
##$AMP= (0..31)
100 100 100 100 100 100 100 100 100 100 100 100 100 100 100 100 100 100 
100 100 100 100 100 100 100 100 100 100 100 100 100 100 
##$AQSEQ= 0
##$AQ_mod= 1
##$AUNM= <au_zg>
##$AUTOPOS= <>
##$BF1= 81.014009
##$BF2= 200.13
##$BF3= 200.13
##$BF4= 200.13
##$BF5= 200.13
##$BF6= 200.13
##$BF7= 200.13
##$BF8= 200.13
##$BYTORDA= 1
##$CFDGTYP= 0
##$CFRGTYP= 5
##$CHEMSTR= <none>
##$CNST= (0..31)
1 1 145 1 1 1 1 1 1 1 1 1 1 1 1 1 1 1 1 1 1 1 1 1 1 1 1 1 1 1 1 1 
##$CPDPRG= <waltz16>
##$CPDPRG1= <>
##$CPDPRG2= <waltz16>
##$CPDPRG3= <>
##$CPDPRG4= <mlev>
##$CPDPRG5= <mlev>
##$CPDPRG6= <mlev>
##$CPDPRG7= <mlev>
##$CPDPRG8= <mlev>
##$CPDPRGB= <>
##$CPDPRGT= <>
##$D= (0..31)
0 1 0 0 0 0 0 0 0 0 0 0.03 2e-05 3e-06 0 0 0 0 0 0 0 0 0 0 0 0 0 0 0 0 
0 0 
$$ [...]
##$SUBNAM3= <"">
##$SUBNAM4= <"">
##$SUBNAM5= <"">
##$SUBNAM6= <"">
##$SUBNAM7= <"">
##$SUBNAM8= <"">
##$SUBNAM9= <"">
##$SW= 369.568048894756
##$SWIBOX= (0..15)
0 1 3 0 0 0 0 0 0 0 0 0 0 0 0 0 
##$SW_h= 29940.119760479
##$TD= 32768
##$TD0= 1
##$TE= 0
##$TE2= 300
##$TE3= 300
##$TEG= 300
##$TL= (0..7)
0 120 53 12 22 120 120 120 
##$TP= (0..7)
150 150 150 150 150 150 150 150 
##$TP07= 0
##$TPNAME0= <>
##$TPNAME1= <>
##$TPNAME2= <>
##$TPNAME3= <>
##$TPNAME4= <>
##$TPNAME5= <>
##$TPNAME6= <>
##$TPNAME7= <>
##$TPOAL= (0..7)
0.5 0.5 0.5 0.5 0.5 0.5 0.5 0.5 
##$TPOFFS= (0..7)
0 0 0 0 0 0 0 0 
##$TUNHIN= 0
##$TUNHOUT= 0
##$TUNXOUT= 0
##$USERA1= <user>
##$USERA2= <user>
##$USERA3= <user>
##$USERA4= <user>
##$USERA5= <user>
##$V9= 5
##$VALIST= <valist>
##$VCLIST= <CCCCCCCCCCCCCCC>
##$VD= 0
##$VDLIST= <DDDDDDDDDDDDDDD>
##$VPLIST= <PPPPPPPPPPPPPPP>
##$VTLIST= <TTTTTTTTTTTTTTT>
##$WBST= 1024
##$WBSW= 4
##$XGAIN= (0..3)
0 0 0 0 
##$XL= 0
##$YL= 0
##$YMAX_a= 10641
##$YMIN_a= -11387
##$ZGOPTNS= <>
##$ZL1= 120
##$ZL2= 120
##$ZL3= 120
##$ZL4= 120
##$ABSF1= 182.463
##$ABSF2= -187.1042
##$ABSG= 5
##$ABSL= 3
##$ALPHA= 0
##$AQORDER= 0
##$ASSFAC= 0
##$ASSFACI= 0
##$ASSFACX= 0
##$ASSWID= 0
##$AUNMP= <proc_1d>
##$AZFE= 0.1
##$AZFW= 0.5
##$BCFW= 0
##$BC_mod= 2
##$BYTORDP= 0
##$COROFFS= 0
##$CY= -3
##$DATMOD= 1
##$DC= 0
##$DFILT= <>
##$DTYPP= 0
##$F1P= 0
##$F2P= 0
##$FCOR= 1
##$FTSIZE= 65536
##$FT_mod= 6
##$GAMMA= 0
##$GB= 0
##$INTBC= 1
##$INTSCL= 5.30512e-09
##$ISEN= 30
##$LB= 1
##$LEV0= 0
##$LPBIN= 0
##$MAXI= 10000
##$MC2= 0
##$MEAN= 0
##$ME_mod= 0
##$MI= 50
##$NCOEF= 0
##$NC_proc= -5
##$NLEV= 6
##$NOISF1= 182.463
##$NOISF2= 159.3651
##$NSP= 0
##$NTH_PI= 0
##$NZP= 0
##$OFFSET= 182.463
##$PC= 4
##$PHC0= -1953.001
##$PHC1= 621.6019
##$PH_mod= 1
##$PKNL= yes
##$PPARMOD= 0
##$PSCAL= 0
##$PSIGN= 0
##$REVERSE= no
##$SF= 81.0140089999434
##$SI= 65536
##$SIGF1= 159.3651
##$SIGF2= -187.1042
##$SINO= 113.3802
##$SIOLD= 16384
##$SREGLST= <1H.CDCl3>
##$SSB= 0
##$STSI= 65536
##$STSR= 0
##$SW_p= 29940.119760479
##$SYMM= 0
##$S_DEV= 0
##$TDeff= 32768
##$TDoff= 0
##$TI= <>
##$TILT= no
##$TM1= 0
##$TM2= 0
##$TOPLEV= 0
##$USERP1= <user>
##$USERP2= <user>
##$USERP3= <user>
##$USERP4= <user>
##$USERP5= <user>
##$WDW= 1
##$XDIM= 65536
##$YMAX_p= 508221702
##$YMIN_p= -44360200
$$ End of Bruker specific parameters
$$ ---------------------------------
##NTUPLES= NMR SPECTRUM
##VAR_NAME=  FREQUENCY,     SPECTRUM/REAL,   SPECTRUM/IMAG
##SYMBOL=    X,             R,               I
##VAR_TYPE=  INDEPENDENT,   DEPENDENT,       DEPENDENT
##VAR_FORM=  AFFN,          ASDF,            ASDF
##VAR_DIM=   65536,         65536,           65536
##UNITS=     HZ,            ARBITRARY UNITS, ARBITRARY UNITS
##FACTOR=    0.456856943014862, 1,           1
##FIRST=     14782.0589164792, 0,            0
##LAST=      -15158.0608439998, 0,           0
##MIN=       -15158.0608439998, -44360200,   0
##MAX=       14782.0589164792, 508221702,    0
$$ Real data points
##PAGE= N=1
##DATA TABLE= (X++(R..R)), XYDATA
$$ [...]
##PAGE= N=2
##DATA TABLE= (X++(I..I)), XYDATA
36706I12625J24278L47953K40199l02110p74480o40513k00295j70421m59690k75511
36696a197965M50312P86956K95780k49653j78986M8872j26251k66140J57109N43943
36686B63977N7376p76012o55767M70157J226234P79432j16266l87378l6502K37255
36676A062506J38540r9276k96746m74649n65385m10192n2968K34320K82322K08967
36666B7439J67470M1741l52400p47836n10534M39423J163281P65337k79856o43192
36656G0873K2310O66938M78271o4365k56173k96007n63679o27444L004P59827
36646A93555P68005K62543R3090J65862k94305j051398q93262L64758J275145
36637H83993P72793l16393n88566l6633K33071k51450q21039p68027j89610L70962
$$ y = [912625, 1036903, 1384856, 1625055, 1322945, 548465, -92048, -292343, -462764, -922454, -1197965, -747653, 39303, 335083, 85430, -93556, -44684, -170935, -437075, -279966, 263977, 321353, -454659, -1110426, -640269, 585965, 1365397, 1249131, 861753, 825251, 1062506, 1201046, 1101770, 805024, 330375, -235010, -645202, -698170, -463850, -181528, 27439, 194909, 236650, -115750, -863586, -1374120, -934697, 228584, 993921, 714065, 70873, 93183, 760121, 1238392, 1174027, 917854, 621847, 58168, -569276, -566272, 193555, 961560, 1224103, 1317193, 1483055, 1188750, 137352, -755910, -391152, 883993, 1656786, 1340393, 751827, 715194, 948265, 696815, -124224, -892251, -1081861, -710899]
36627g10899O32417P25811Q35993Q49275M37672m21708j148713j094750l66321
36618b61223K49944K69065M7011J70408O36530R05964N99011q1852n79695n55152
36608A400011k44395j63139l98395m59540p2802K25141j93348r50833r91537m5717
36598a894554R28496J020561M87966J88641L29566L29547j96353p96766p11457
36589c14353J21645Q39160O11347k84755p48406k99818L01572K46651j02378J07885
36579D78550P35410Q02209O1531n76668l96112J96564M52967K92656P9853p7032
36569B049928l14770o18361q03575p12805k75023L86248Q62543Q18404M56877
36560A849466K41026J92077m4536m76177p01078n88905m08686k58423k8334P7835
$$ y = [-710899, -78482, 647329, 1483322, 2332597, 2770269, 2348561, 1199848, 105098, -261223, -11279, 257786, 304797, 475205, 1111735, 2017699, 2616710, 2534858, 1955163, 1400011, 1155616, 992477, 594082, 134542, 61740, 286881, 93533, -857300, -1848837, -1894554, -966058, 54503, 542469, 731110, 1060676, 1390223, 1193870, 397104, -314353, -192708, 646452, 1257799, 973044, 224638, -75180, 226392, 473043, 370665, 478550, 1213960, 2016169, 2077700, 1501032, 1104920, 1301484, 1754451, 2047107, 2126960, 2049928, 1735158, 1116797, 313222, -399583, -674606, -288358, 574185, 1392589, 1849466, 2090492, 2282569, 2238033, 1761856, 1060778, 471873, 63187, -195236, -223570, -145735]
36550a45735k29756n55168j87880O45426R30292M83366K60397O45328P09043j15973
36540B439340q65234n62885J45080R5564m79583m82577J72507N68825L69937J28761
36530A529735J39158R8711j21828l34501n84638r61750j023395l39781N63699
36521a034590P97604M66606L67531N07667J91802m21848k81492P15609J210765
36512B519654L42653r36515j284400p66718l62019l91835l75181k7474M09831
36503h72004O40421N55695J90943j93643k59027p3516m7766j65484J03671P64371
36493F43661R34509J76495n30066r7141Q95108R03005k55749j039576m22284O44065
36483A852027O83374k25831p85754m67325o1808j76848k38802M06438J147004
$$ y = [-145735, -375491, -930659, -1118539, -473113, 457179, 940545, 1200942, 1846270, 2555313, 2439340, 1574106, 1011221, 1156301, 1251865, 772282, 289705, 462212, 1031037, 1400974, 1529735, 1668893, 1767604, 1645776, 1311275, 726637, -235113, -1258508, -1598289, -1034590, -236986, 229620, 597151, 1104818, 1296620, 874772, 593280, 1308889, 2519654, 2862307, 1925792, 641392, -125326, -487345, -879180, -1254361, -1281835, -872004, -231583, 324112, 515055, 321412, 62385, -11131, -58897, -224381, -120710, 643661, 1578170, 1754665, 1224599, 1127458, 2022566, 2925571, 2669822, 1630246, 1207962, 1852027, 2535401, 2309570, 1523816, 1056491, 994683, 817835, 579033, 985471, 2132475]
36474B132475Q42900l50729j014796n42355q1911o93241j483632q09728J077416
36465i23601K043911R45276q12585j249304l50274L24060l9053o71766o04041
36456a337377O1089N02309K54622l73070p15071m21140J99872N21426L36800O3785
36446i06755Q1806J91722O6369p1326K47579Q86468J140282O87309J189l26124
36436A998519k20442R2351M64958O75844L28800n95791j325079j004582J60211
36427E74789R66156N89090m67511j036195o11107K92382Q91619Q50299K99615
36418B349137m10289q33622o53507n3075L46827J96264j03166L8542M70540M14073
36408A761724l77558j053445o72602M76009J110416N54726m18156o34956o971
$$ y = [2132475, 2975375, 2624646, 1609850, 1067495, 985584, 292343, -1191289, -2001017, -923601, 1120310, 2065586, 1253001, 3697, -346577, -22517, -61570, -733336, -1337377, -1276288, -773979, -519357, -892427, -1607498, -2028638, -1828766, -1307340, -970540, -906755, -824949, -633227, -566858, -638184, -390605, 495863, 1636145, 2323454, 2324643, 1998519, 1778077, 1870428, 2335386, 3011230, 3340030, 2744239, 1419160, 414578, 574789, 1540945, 2130035, 1662524, 626329, 15222, 307604, 1199223, 2049522, 2349137, 1938848, 1105226, 451719, 398644, 745471, 941735, 838569, 877111, 1347651, 1761724, 1384166, 330721, -341881, 134128, 1244544, 1799270, 1381114, 746158, 739187]
36399G39187N46975M68440J78527J97611L00795P215n30935p28152m36488k5275
36389G17900K88991N71717O74153L10310k62249l55442J04861L43869r0794o18102
36379A685214n87242k81729k84002m15908j53271L10510L36654n2291k58112j81999
36369A17824k70233m90133k53839M54304Q32205M80052r067j05068j33200m32154
36359A90691n19130J06413R08538R59945L00103k22114k71917l13637n83239o48866
36349i3213k40549J95070J73153r2458p2040K83296N55918M78333J42288k89669
36339A040129o89979q19148m72490J42479N19786M84358L78668M36724L64073
36330A384600r5293n30806l71051J77753L66669L9919j90417n368J82036J23718
$$ y = [739187, 1286162, 1754602, 1933129, 2130740, 2431535, 2438750, 1907815, 1179663, 743175, 717900, 1006891, 1578608, 2252761, 2563071, 2300822, 1945380, 2050241, 2394110, 2303316, 1685214, 1097972, 816243, 532241, 116333, -36938, 273572, 610226, 557935, 299823, 117824, -152409, -642542, -896381, -442077, 390128, 870180, 861113, 756045, 622845, 190691, -328439, -222026, 686512, 1646457, 1946560, 1724446, 1452529, 1138892, 555653, -93213, -333762, -138692, 34461, -57997, -130037, 153259, 709177, 1187510, 1329798, 1040129, 350150, -468998, -941488, -799009, -279223, 205135, 583803, 1020527, 1384600, 1289307, 758501, 387450, 565203, 931872, 971791, 781374, 776006, 958042, 1081760]
36320A081760K25070O35289O72654j06902r76667j064031o97077o87772q00478
36311a718154k16351P71205R75168K67704j31277L66039Q31401M72344j15290
36302A502789j26065J37487N5740j30415M3070K04886j82190o68636m54893K09811
36292E91584L66036j40550n19633l23016P1627K58968K48582Q3250k30991l98709
36282G148j49088J46656r3384o40464o69612m0340M82468M39020K55017L37426
36272G4847M10225J70858j01614r8126n7479k62367m36208j97134K44445L78417
36262A25864J38204j10939j27713M8834K85610L45602l7735o74356q13935o5913
36252h86477Q17514P51200j62825o67309n5084Q77091R77473K58686l24976k58613
$$ y = [1081760, 1306830, 1942119, 2614773, 2507871, 1531204, 467173, -229904, -917676, -1718154, -1934505, -1163300, -188132, 79572, -51705, 314334, 1145735, 1618079, 1502789, 1376724, 1514211, 1569951, 1439536, 1482606, 1687492, 1505302, 836666, 381773, 591584, 957620, 817070, 297437, -25579, 46048, 305016, 553598, 636848, 405857, 7148, -141940, 4716, -88668, -729132, -1398744, -1439084, -956616, -517596, -262579, 74847, 485072, 655930, 554316, 456190, 398711, 136344, -299864, -496998, -252553, 125864, 264068, 153129, 25416, 74250, 359860, 705462, 667727, -6629, -820564, -886477, -68963, 682237, 519412, -147897, -202981, 674110, 1651583, 1910269, 1585293, 1326680]
36242A326680O9380J78345P8483q6656l80190p49216q16230l81900J73930L72547
36232b14827K55211J36261J9858k34227l81139n1870N18420O67052K74202o1639
36222I27302M9344L13845M12026M63287N05640J80513n60757j015477o15216J86510
36212H47017N45126L56568P5575k35713q30383j409562j235695k32227P59731
36203a359563J031600P36930L89441J83135N4164m2939j80484m23233n68066k78891
36193d57906L57762P89305O85871L04347n54k09169l50025k24587K12935N42921
36183A650900L74864o3138k40154q2841j2391k80001o45149p39365m38690J57005
36173c18960P92636J016906M34183p24403j510632j133084Q6863R70021P81540
$$ y = [1326680, 1396060, 1574405, 1652888, 1566232, 1186042, 436826, -379404, -761304, -587374, -214827, 40384, 176645, 196503, -37724, -418863, -470733, 47687, 714739, 988941, 927302, 976646, 1290491, 1702517, 2165804, 2671444, 2851957, 2291200, 1275723, 660507, 847017, 1392143, 1748711, 1824286, 1588573, 758190, -651372, -1887067, -2119294, -1359563, -327963, 408967, 798408, 981543, 1035707, 992768, 812284, 389051, -179015, -457906, -100144, 689161, 1375032, 1679379, 1678825, 1469656, 1119631, 895044, 1107979, 1650900, 2025764, 1962626, 1722472, 1639631, 1627240, 1347239, 702090, -37275, -475965, -318960, 473676, 1490582, 1924765, 1200362, -310270, -1443354, -1356491, -386470, 395070]
36164C95070k8484n39930m56955j35820J78714N59618Q87641P70238J86014k98960
36154A517146k82816r4870k41364o13662o74709k24291M13982Q19555P64408K63898
36144A647277l17587m12483J01078N61817K71807n31138r13130m40647L04912
36135B71906N03984O0156l67624j55332N31848Q03443L5080j215783j682235r16670
36125b131227J63167N57173M07547M02119N56832M24221J08758R2660K28681p2598
36115G37333o42846n83571K83119R67319P29714J05132l4932K49926K90606p8653
36105B023147m00027l53397r0219J09171J27363j4232k26796l87755l78915j00037
36095C08303M16104P81876M57219m64861j018819n14151L61743L99936l46332
$$ y = [395070, 366586, -173344, -630299, -766119, -587405, -27787, 859854, 1630092, 1816106, 1517146, 1234330, 1139460, 898096, 284434, -390275, -614566, -200584, 618971, 1383379, 1647277, 1329690, 917207, 1018285, 1580102, 1851909, 1320771, 407641, -33006, 271906, 775890, 836046, 468422, 313090, 844938, 1648381, 1683461, 467678, -1214557, -2131227, -1968060, -1410887, -1003340, -601221, -44389, 379832, 488590, 581250, 809931, 737333, 94487, -489084, -205965, 761354, 1491068, 1596200, 1561268, 1811194, 2101800, 2023147, 1623120, 1269723, 1179504, 1288675, 1416038, 1401806, 1175010, 787255, 408340, 308303, 724407, 1506283, 1963502, 1498641, 479822, -34329, 327414, 727350, 381018]
36086C81018o70594j55534K08081k30528o20183k3881R64585J104691L93787p7377
36076A274065J67637N47913O15110O18626O93215M09743m24616j165372j071617
36067A664704l13070K40274J05226l21801l76215O3033N35018O19850L40792p6277
36057B481534n36932r44875r87733m58060K97803O66894N10270K29959R6697k8682
36047A326875k20196k28063Q0652M11428M24464J49679j61949l51798l94751l56553
36037F79788l49233l08687M8955O87527R27471K96626n10611m16139L53449M66715
36027A875861m06626r30902j63620Q85130P51520l04081q35512m01960O4931o8467
36017D66274l14663j24336J92070O3581l90642n02005M4674P74470R53235M77145
$$ y = [381018, -289576, -445110, -237029, -467557, -1087740, -1111621, -147036, 957655, 1351442, 1274065, 1441702, 1989615, 2604725, 3223351, 3916566, 4326309, 3901693, 2736321, 1664704, 1351634, 1591908, 1697134, 1375333, 999118, 1062151, 1597169, 2217019, 2557811, 2481534, 1944602, 999727, 11994, -446066, -148263, 518631, 1028901, 1258860, 1355557, 1326875, 1106679, 878616, 959268, 1370696, 1795160, 1944839, 1782890, 1431092, 1036341, 679788, 330555, 21868, 70823, 758350, 1685821, 1982447, 1471836, 1055697, 1409146, 1875861, 1469235, 538333, 374713, 1259843, 2011363, 1707282, 871770, 469810, 534741, 466274, 151611, 27275, 219345, 282926, -107716, -609721, -565047, 209423, 1162658, 1639803]
36007A639803L6228J96933N59573L35056l63133n67131O9488O88321N10731q2667
35997C023202l18764j89406j76302l73418n53798o53799n99754j47069N31197
35988E42089O79317M9144m60684m6093P13210P31115Q5616k27012J02608L84426
35978B553736J27656l34617m32370M5583Q24417J166065M21359r38013j473032
35969A960784o46272K41765q4968r35389q44247M9147M13430L8856l1602M59671
35959F21175O04811J44632l8223L74739N00746j24064o72954m23606J59809L71554
35949A518619K45197J7663m00592q70400q50827k77583K18741L17383L41724L71434
35939F31359Q9154k56827K3467O56663N11595m23061o88995K89969J063224M00218
$$ y = [1639803, 1676031, 1872964, 2432537, 2767593, 2404460, 1837329, 1906817, 2595138, 3105869, 3023202, 2704438, 2515032, 2338730, 1965312, 1411514, 757715, 157961, 10892, 542089, 1221406, 1270550, 809866, 763773, 1476983, 2208098, 2293714, 2066702, 2169310, 2553736, 2681392, 2346775, 1914405, 1959988, 2784405, 3950470, 4371829, 3433816, 1960784, 1314512, 1556277, 1471309, 535920, -308327, -259180, 154250, 193106, 161504, 621175, 1225986, 1370618, 1332395, 1707134, 2207880, 2083816, 1410862, 987256, 1147065, 1518619, 1763816, 1781479, 1380887, 510487, -340340, -617923, -399182, -81799, 259925, 631359, 720513, 463686, 487153, 1143816, 1655411, 1232350, 543355, 833324, 1896548, 2296766]
35929B296766p43907q00451O0471N67242M08684K12426J37742j33217m58612m69072
35919A078072l21234k42761R9249P80926Q94080j57023j281773r98879L50505
35910B01162J082828N60814k90206o77369p38659o18249q8250O41308Q32068K74321
35900A179768l79509n44211k71618J66102N60179O16964J99935l05793m65761
35891G56056m42701n30773m15477K27800P60794L11806p11366j017447l10104
35882a371412M19709N52817N39223O70024M17001m34722j046319o53525K95750
35873f11454Q08041O08047J53438j73579l31200l35034j56604J63709M72759N25392
35863A123515J63531l30225l37847K53720O79276L37903j83157O7518Q64938J083118
$$ y = [2296766, 1552859, 752408, 812879, 1380121, 1788805, 2001231, 2138973, 2005756, 1547144, 1078072, 756838, 514077, 613326, 1394252, 2288332, 2131309, 849536, -149343, 201162, 1283990, 1844804, 1554598, 877229, 138570, -479679, -567929, 73379, 905447, 1179768, 800259, 256048, -15570, 150532, 710711, 1327675, 1527610, 1221817, 756056, 313355, -217418, -632895, -405095, 355699, 667505, -43861, -1061308, -1371412, -951703, -398886, 140337, 810361, 1227362, 792640, -253679, -907204, -611454, 196587, 804634, 958072, 784493, 453293, 118259, -38345, 125364, 598123, 1123515, 1287046, 956821, 618974, 872694, 1551970, 1889873, 1706716, 1774234, 2639172, 3722290]
35853C722290L86303m02584o48145n69831m41381j79265M0334k11828o79927m93973
35843E21993M35123J047315N95912m07718j109534j255424q32857J87456J218335
35834D00601J218831J69136o03228k93310K13765r2124o73826m84866K08168L89728
35824D52875P5274J12264N21813M27428l83618j036061q55497j27388N65653R36569
35814F89312Q22222K00071m81726o43286l24104k6842J20615L76200O44008N19349
35804A895819J02847l5823J68058J16803m32659r30673q75646m27288P6981N44791
35794B03210P67058L35332o26800j230783q30450J67210R18529J116843R15769
35785A735918L91480l12484o96043m54421q5989k49937o60989m00407O32322J386387
$$ y = [3722290, 4108593, 3706009, 3057864, 2488033, 2046652, 1867387, 1907721, 1695893, 1015966, 521993, 957116, 2004431, 2600343, 2192625, 1083091, -172333, -1005190, -817734, 400601, 1619432, 1788568, 1185340, 892030, 1105795, 1013671, 339845, -145021, 63147, 452875, 528149, 640413, 1162226, 1589654, 1206036, 169975, -685522, -812910, -247257, 689312, 1511534, 1711605, 1229879, 586593, 262489, 235647, 356262, 732462, 1376470, 1895819, 1998666, 1962843, 2130901, 2247704, 1815045, 884372, 8726, -418562, -341581, 203210, 970268, 1305600, 678800, -551983, -1382433, -1215223, -296694, 820149, 1735918, 2127398, 1814914, 1118871, 664450, 578461, 328524, -332465, -732872, -100550, 1285837]
35775A285837J075550K26869j85075r7973j60475m93825n06143N894L61359l1743
35765A480275p72586j026301o10907j0964M13909O60133O97187M76674K60285
35756A567705L11172K87195l26108j107382r18078M15287J516726J187787j8124
35747B916180p35088o55816m63434l58341J02355P66606P52933j17272q08590
35738A399533n34208J13091J55994l03070m07480N9901M36065K41446k06947l60465
35728E93860j34818J53737K63758K33780K00355J47126p6932m42096n83068k12615
35718A43087L69373N48165K21445p0081K9403K30547K34834K83842N91228P06726
35708C288569J32197p20626r56417m71139k4149j6604j5472K99533N26143L02310
$$ y = [1285837, 2361387, 2588256, 2403181, 2305208, 2144733, 1650908, 1144765, 1150659, 1512018, 1480275, 707689, -318612, -929519, -940483, -526574, 133559, 830746, 1307420, 1567705, 1878877, 2166072, 1839964, 732582, -185496, 229791, 1746517, 2934304, 2916180, 2181092, 1525276, 1061842, 703501, 805856, 1572462, 2325395, 2208123, 1399533, 865325, 978416, 1134410, 831340, 423860, 483761, 919826, 1161272, 954325, 593860, 459042, 612779, 876537, 1110317, 1310672, 1457798, 1380866, 938770, 355702, 143087, 512460, 1060625, 1282070, 1211989, 1241392, 1471939, 1706773, 1990615, 2581843, 3288569, 3420766, 2700140, 1743723, 1272584, 1248435, 1231831, 1216359, 1515892, 2042035, 2344345]
35698B344345j3681J752O3863k45322n46285j42381P28165R87420K11563o95075
35688B694364o77184J18771O19334K03746o20456r14611m06286K56264L17264
35679A591206j66016m36018q2237L87900K85571k99819p39604q04771p39638n17539
35669a520965J98241J199650J592488Q98155k60788r67832j001356o29167J1125
35660d80449P55288J104395P54741J51195j01888j06736l18167o23713n56932
35651E77734k52747l16440p20918p00313M7605Q17646Q91427M67245K30918M62119
35641A504276Q81978J018365N30432m21673j021993n61636M83982P97737p1896
35632C139572j054500j059610m21995j72623m63020n98535l07119k7466K1896
$$ y = [2344345, 2330664, 2332416, 2396279, 2150957, 1604672, 1462291, 2190456, 3177876, 3389439, 2694364, 2017180, 2135951, 2755285, 2959031, 2338575, 1423964, 1017678, 1273942, 1591206, 1425190, 989172, 906935, 1294835, 1580406, 1280587, 540983, -263788, -1003426, -1520965, -1322724, -123074, 1469414, 2367569, 2106781, 1138949, 137593, -491574, -480449, 274839, 1379234, 2133975, 2285170, 2183282, 2076546, 1758379, 1134666, 577734, 324987, 8547, -712371, -1412684, -1365079, -547433, 343994, 811239, 1042157, 1504276, 2386254, 3404619, 3935051, 3513378, 2491385, 1929749, 2413731, 3211468, 3139572, 2085072, 1025462, 603467, 430844, -32176, -630711, -937830, -965296, -943400]
35623i43400J90052O22761Q47182M77051j27748k88229J35752O12222N81284N3124
35613B160051m40270m37557n5620J74416k7705l73354m29314j48283J70362K60307
35603H53033P5633k14837k90762K9803M42700M17906l4661k84520l6356J44491
35593A102430k56633p44431m72049M31647R96482P88134L49255J86322J03067
35584B484224j80936m24541l10328k7759L6920j00969j28352L9866J50285n1209
35574A487201n26438q98415o89420J57091R80032R73686J54156o10179o66777
35565C60937k67165J9043J16212K83355M98561M90941K20047r7601l41486n13254
35555G69590n19995k92574l4656N009p0557j4191N5143j65803m79693k73045N15104
$$ y = [-943400, -753348, -130587, 716595, 1193646, 1065898, 777669, 913421, 1525643, 2106927, 2160051, 1719781, 1282224, 1226604, 1401020, 1373315, 999961, 570647, 422364, 592726, 853033, 928666, 713829, 423067, 452870, 895570, 1313476, 1278815, 994295, 957939, 1102430, 845797, 101366, -370683, 60964, 1057446, 1845580, 2194835, 2381157, 2484224, 2303288, 1878747, 1568419, 1540660, 1577580, 1476611, 1348259, 1388125, 1538410, 1487201, 960763, 62348, -627072, -469981, 510051, 1483737, 1637893, 1027714, 360937, 93772, 112815, 229027, 512382, 1010943, 1501884, 1721931, 1624330, 1282844, 769590, 249595, -42979, -77635, -72626, -143183, -157374, -102231, -268034, -747727, -1020772, -505668]
35544e05668J071151P54060K4370k14577R1027J87127k25743n26990k26714J75436
35534F03479p3554p79296j008396l97370L92379O43444M33775K33936J27405j12611
35524F3191m41440n37630l00960N8409L95874O97647P88202M63305L0149J62538
35514A379285Q68787J105042M5910j521624j881347n76866Q51083P58056n66197
35505D62129j425264r15574K43065R98111J151591R69655M62854l12498q15431
35496H18638o29750j61377l669P0288O04931J165012O67124q26778j784289j206173
35486a286043J2552M82648K50699L05103P34337O56287j24395o33916k07903N48363
35476G37732P77865N54505M14298L20741j15670p28416r30512o80377n43134o78997
$$ y = [-505668, 565483, 1319543, 1343913, 1129336, 1220363, 1407490, 1181747, 654757, 428043, 603479, 529925, -249371, -1257767, -1655137, -1262758, -619314, -185539, 48397, 175802, 63191, -378249, -915879, -1216839, -1158430, -762556, -64909, 723293, 1186598, 1216747, 1379285, 2248072, 3353114, 3399024, 1877400, -3947, -580813, 270270, 1028326, 462129, -963135, -1878709, -1635644, -637533, 514058, 1483713, 1946567, 1634069, 818638, 188888, 27511, 23842, 94130, 699061, 1864073, 2531197, 1704419, -79870, -1286043, -1273491, -790843, -540144, -235041, 499296, 1155583, 1031188, 397272, 189369, 737732, 1515597, 2070102, 2484400, 2805141, 2689471, 1961055, 1030543, 350166, -192968, -871965]
35466h71965n15349K27134Q42466N88763j04564j70562N04374Q90115L55848m52995
35456A293265o97407n15242m33665k88841L08015Q59693N01845m62739p52553
35447a87629k7539N59725J94212l50863o2024O61443P20227M9318m52585l99053
35437G05232k85630m76347p14295o99306m60887r5247L26396O07306O54140P15032
35427B76394Q98004P27384j48974j055035r29625J78377J079917R81954L11179
35418B319575j06646j533L42667M48600n7544r45104j274533n08556M41049K48593
35408I06568q08512j076590L2338J152279J058196L60119K20712M86673K74286
35399B606069l42300n10606q6911K24477P9968j40905j38843k1123J53633M07314
$$ y = [-871965, -1387314, -1160180, -317714, 271049, 166485, -4077, 500297, 1390412, 1746260, 1293265, 595858, 80616, -353049, -641890, -333875, 525818, 1027663, 564924, -187629, -215168, 344557, 538769, 187906, 125882, 787325, 1507552, 1556870, 1104285, 705232, 419602, -56745, -771040, -1470346, -1931233, -2026480, -1700084, -1092778, -438638, 276394, 1174398, 1901782, 1752808, 697773, -231852, -53475, 1026442, 2008396, 2319575, 2212929, 2211396, 2554063, 3002663, 2945119, 2000015, 725482, 216926, 657975, 906568, 98056, -978534, -946196, 206083, 1264279, 1624398, 1845110, 2331783, 2606069, 2263769, 1753163, 1666252, 1890729, 1970697, 1829792, 1690949, 1669826, 1823459, 2230773]
35389B230773M49443k4400o53621p38277k57225J29736J12905K5422L1916j52235
35379A154437m77392l10620N40980J207714Q01804l12813r44135n67437K01481
35370A294019N67401M15215Q7593k12543m83858o42860n28087j67780J74330K56961
35360G60391M9711l12983o09841n82444j41270M03773N67086K94715R5725L35731
35350H60594O71860N65570J35437l2198J47602J02636m30906q81953o56781m3578
35340D38283J91663j05224l07023O1238O35872O74909K0680o63010o75641j14832
35330A56915L03111J88951j11269j46102L0689J50024K01588K05637p0335o09059
35320C00150p52828m0391Q76146J002349M59600J86714L25927R8506o08001q32380
$$ y = [2230773, 2680216, 2655816, 2002195, 1263918, 1006693, 1136429, 1249334, 1274756, 1306672, 1154437, 677045, 366425, 907405, 2115119, 2916923, 2604110, 1659975, 1092538, 1294019, 1861420, 2276635, 2364228, 2151685, 1667827, 1024967, 496880, 329100, 503430, 760391, 810102, 497119, -112722, -695166, -836436, -432663, 134423, 429138, 524863, 860594, 1532454, 2098024, 2233461, 2201263, 2348865, 2451501, 2020595, 1138642, 481861, 438283, 629946, 524722, 217699, 278937, 914809, 1589718, 1610398, 947388, 271747, 156915, 460026, 648977, 537708, 391606, 422295, 572319, 773907, 979544, 909209, 300150, -452678, -493069, 383077, 1385426, 1845026, 2031740, 2357667, 2456173, 1848172, 1015792]
35310A015792j48887N34802M35007M8878O7392J42808k95139q24687o99842j32976
35300A43148J08004p3893j99908j12665O9333M39390R19810R16019K25391l07499
35290B127130l0034K96775k61326r86055m70061R42160J400592K97994q78462
35281B438713q17038l1507L41263J44725j15320k34742k59559j61178o3123j88141
35271A054093l08852K4979N30263L75742m12386p58809j80841M19332J95731l91957
35261E47295n06120k38356j41778j57678R7081M65042M94720K12592k3000j35935
35251F13863k47566k95540k07713j22094n9744K07704O44486Q26768O48906N25825
35241B534895N52090K33121m79661p49447j13355O31046N78412J2421k82752k81244
$$ y = [1015792, 866905, 1401707, 1836714, 1885592, 1952984, 2095792, 1800653, 975966, 276124, 143148, 251152, 177259, -22649, -135314, -65981, 373409, 1293219, 2209238, 2434629, 2127130, 2097096, 2393871, 2132545, 1146490, 676429, 1618589, 3019181, 3317175, 2438713, 1621675, 1590168, 1931431, 2076156, 1960836, 1726094, 1466535, 1305357, 1242234, 1054093, 745241, 770220, 1300483, 1676225, 1263839, 505030, 324189, 743521, 939252, 547295, 41175, -197181, -338959, -496637, -399556, 65486, 560206, 772798, 749798, 613863, 366297, 70757, -136956, -259050, -318794, -111090, 533396, 1360164, 2009070, 2534895, 3086985, 3320106, 2840445, 2090998, 1977643, 2608689, 3187101, 3199522, 2916770, 2635526]
35231B635526l63846l98173j89470k24098q61064j334413p42936M19932R41929
35222a16613P02712N35488O19231M01212n8943j02895J92623R8564l01584j72442
35212A797353L92572K70339p33729j306562o07476M85670P97136L53059k17009
35203A231353o47487o98703J7754J080033J214382Q3305r38509p00916R2826K55325
35193I89363q37J19155K82453k49421q77339l97412Q40380J213375K42439q28523
35183A333633r91931n57939m2935N97432J186642J060806J80382n22454m58826
35174A784810j29959r4515j54460r7029k61959p04338p09265Q0631Q58094Q04924
35164A376934L30055K48971L73758k5013p88284j020893n23629o2056j48876l85266
$$ y = [2635526, 2271680, 1873507, 1684037, 1459939, 598875, -735538, -1478474, -1058542, -116613, 586099, 1121587, 1740818, 2142030, 2083087, 1980192, 2172815, 2271379, 1969795, 1797353, 2189925, 2460264, 1726535, 419973, -187503, 298167, 1095303, 1448362, 1231353, 583866, -114837, -97083, 982950, 2197332, 2280637, 1342128, 641212, 734038, 989363, 988526, 1107681, 1390134, 1140713, 263374, -134038, 706342, 1919717, 2162156, 1333633, 341702, -216237, -259172, 338260, 1524902, 2585708, 2766090, 2243636, 1784810, 1654851, 1560336, 1405876, 1308847, 1046888, 342550, -366715, -286084, 572010, 1376934, 1706989, 1955960, 2329718, 2304705, 1516421, 495528, -28101, -90157, -239033, -624299]
35154f24299j88436M20169R16404P94089M31q39371q36497J25154J049829J016606
35144A834079L65377P3287L07131M37374K72016K79780N47446M93060j26070p55726
35134C727754r20008q10947o58103k55046M12248P33381K77183m48568o41260
35125A416634k65711P9867Q0420p2174j93656k94729k87829K5194N72154R07683
35115A967853O26478k00401j016235j199611n98452L11425Q71501Q06788K79572
35106A848918l91563p94345m87146M74987J233913R84899R1064l63543j31671
35097B465513l6326m78141p35287k50838L49423K93810p8380k4165K64137Q3144
35087A852890m27805m73558K7796L37957J59836j1639P0916M867l27866l40800
$$ y = [-624299, -812735, -392566, 523838, 1317927, 1318358, 478987, -357510, -232356, 817473, 1834079, 2199456, 2272743, 2579874, 3017248, 3289264, 3569044, 4116490, 4609550, 4483480, 3727754, 2807746, 1996799, 1338696, 1083650, 1495898, 2229279, 2506462, 2057894, 1416634, 1150923, 1230790, 1311210, 1239036, 1045380, 750651, 462822, 488016, 1060170, 1967853, 2594331, 2393930, 1377695, 178084, -420368, -108943, 762558, 1569346, 1848918, 1457355, 663010, 175864, 650851, 1884764, 2869663, 2960727, 2597184, 2465513, 2429187, 1951046, 1215759, 964921, 1314344, 1608154, 1529774, 1505609, 1769746, 1852890, 1425085, 951527, 979323, 1317280, 1477116, 1465477, 1536393, 1541260, 1213394, 872594]
35077H72594K52279P65789N03059j52476l02273J25773L15381k10120r25626j053319
35067A91061n33170O9044L68073M66947N05319L54042k7835k95639j57533J31994
35057A072303J66268P2948K36169M73724K32612l68823n37041o6235K69570R138
35047A560633j82186L47962J027472Q34508j98136j073837j123632n25240J79086
35038H46630M82150J46190m18486l88737L60743R00406N39910j87404n08005n93234
35028A180163q62390q96772k00212O16201O73211K83728K57167L34921j54959
35019A231058o12139N9028J270669J316608J23850n81554j15868K40481k63250
35010B668883n21658K64953R69353L94162p30288r99787m36877M922J03232K45829
$$ y = [872594, 1124873, 1890662, 2393721, 2241245, 1938972, 2064745, 2380126, 2170006, 1244380, 191061, -342109, -273065, 95008, 561955, 1067274, 1421316, 1393481, 1097842, 940309, 1072303, 1238571, 1311519, 1547688, 2021412, 2254024, 1885201, 1348160, 1281925, 1551495, 1560633, 1378447, 1726409, 2753881, 3588389, 3390253, 2316416, 1192784, 667544, 846630, 1328780, 1474970, 1056484, 667747, 1028490, 1928896, 2468806, 2281402, 1773397, 1180163, 317773, -578999, -779211, -163010, 510201, 793929, 1051096, 1386017, 1231058, 618919, 677947, 1948616, 3265224, 3389074, 2807520, 2691652, 2932133, 2668883, 2147225, 2412178, 3381531, 3775693, 3045405, 2045618, 1608741, 1613663, 1716895, 1962724]
35000A962724L73621K09250j7096j1754k5687k47545k59774J63166M53015J76801
34990B776721k06455k18969j40663k14574m7133M24913M25157l20771q27783m09926
34980A240517J49359O2832o4817M14950P35575J55392l74170J87701Q06315l9288
34970C274366j441103j172555O66759J635547O93111m49825k71216M31759K80072
34961C646915n45847j001102p91151l04292J97979N48543M97331J09021j95642
34952B161755k46542k14684j02852J35234J02076n13532j079574p48737J22027
34943c84829M66787K42663K75637N10780Q9114p24337n49215P12612J349640M93994
34933B482846m66715j87392N61880M54620j72715k29554Q6656j46131o82607m81465
$$ y = [1962724, 2336345, 2545595, 2528499, 2516745, 2491058, 2243513, 1983739, 2146905, 2599920, 2776721, 2570266, 2351297, 2210634, 1996060, 1948927, 2373840, 2798997, 2478226, 1650443, 1240517, 1389876, 1452708, 1387891, 1802841, 2538416, 2693808, 2319638, 2507339, 3313654, 3274366, 1833263, 660708, 1327467, 2963014, 3656125, 3206300, 2935084, 3366843, 3646915, 3101068, 2099966, 1308815, 1004523, 1202502, 1751045, 2248376, 2357397, 2161755, 1915213, 1700529, 1597677, 1732911, 1834987, 1321455, 241881, -506856, -384829, 81958, 324621, 600258, 1111038, 1200152, 475815, -73400, 639212, 1988852, 2482846, 2016131, 1828739, 2390619, 2845239, 2672524, 2442970, 2529626, 2383495, 1700888, 1219423]
34923A219423L74506O99852J01589n04443m11814r614J24895Q2663J83842L57854
34913B218753L78303L08123L61645N15500M87261Q2121m89302p07333l13078K52500
34903C094493K70169l44709q86664p41245r4952M01165L92569O9966j38831j1518
34893B010443K17801J18555k81150l85229Q6517M94346J47230n78371p76423m07151
34883F46568k12396l70331l02956J23866L12185N9837q9956O9190L7765k85991
34873a2219k19957M48006Q68603M70859o5748L9540M06392K66351k05046k77537
34863A719244J00671L52173K42950N2411p744N6341K45865M68818M36213L5909
34853C702851m19656n64236l18140K10253P06129N69652m06643j266032p96484
$$ y = [1219423, 1593929, 2293781, 2395370, 1890927, 1479113, 1469499, 1594394, 1677057, 1860899, 2218753, 2597056, 2905179, 3266824, 3782324, 4269585, 4351706, 3862404, 3155071, 2841993, 3094493, 3364662, 3019953, 2133289, 1392044, 1297092, 1698257, 2090826, 2160792, 2021961, 2010443, 2228244, 2346799, 2065649, 1680420, 1766937, 2261283, 2408513, 1830142, 1053719, 646568, 434172, 63841, -239115, -115249, 196936, 256773, 166817, 236007, 273772, -12219, -232176, 215830, 1084433, 1555292, 1489544, 1529084, 1935476, 2201827, 1996781, 1719244, 1819915, 2172088, 2415038, 2467449, 2459705, 2516046, 2761911, 3230729, 3666942, 3702851, 3283195, 2718959, 2400819, 2611072, 3317201, 3886853, 3480210, 2214178, 1417694]
34844A417694N81938J032682r5571j162076o16816O77586P90931l98376j162226
34835A065766n05699N86135P24935l2935m37656K50636J286276J327505J83186
34826D448149q25178o15106J40844J16447n58012o25275N6222K46648m65269r06557
34816A012913l73744K27775J66440J98066R60142J520178Q94441j99055n27878
34807C879278k55855k55987m33043j60082L64917N12312K85717r5294p86446j438594
34797A616923r20690P80122J713603O29134q58383o78985M21190L30586p83888
34788B249612r62901L6465N21224K918j64536M89469P24505k2639o89312o08083
34778A576722m26670m55193o8334O77528P58744J01867j02663M27637N32091j31982
$$ y = [1417694, 1999632, 3032314, 2936743, 1774667, 1157851, 1835437, 2626368, 2227992, 1065766, 560067, 1146202, 1871137, 1838202, 1400546, 1651182, 2937458, 4264963, 4448149, 3622971, 3007865, 3148709, 3265156, 2707144, 2081869, 2138091, 2384739, 1919470, 1012913, 639169, 866944, 1033384, 1231450, 2191592, 3711770, 4606211, 4407156, 3879278, 3623423, 3367436, 2934393, 2774311, 3139228, 3651540, 3937257, 3841963, 3055517, 1616923, 696233, 1476355, 3189958, 3819092, 2960709, 2281724, 2702914, 3033500, 2249612, 1286711, 1323176, 1844400, 1847318, 1682782, 2172251, 2896756, 2874117, 2184805, 1576722, 1150052, 694859, 626525, 1304053, 2062797, 2164664, 2062001, 2489638, 3021729, 2889747]
34768B889747l44121L57512O78914q2675o94931k04988L94931R2781l18882J09538
34758B877826N97846Q9030p45747p01361j47066k02163o78691n60253J05059M05056
34748A039536K18843K18372N08625N33170J52586j98618k48519m2189K90359L58518
34738B830683k72667j126896r65861L72516J314448O88556n26082p59027j42587
34729A413083J46681l5707L0351L09752J95589p0309K55627Q67517P28893j30654
34719C710823n83419k23128J25463j23321n43683o20293l97335r10N61399R75302
34709B880898Q48136M39113L42346M63367J95715m34245p80876p38926q42404
34700B373124j101538q23382J30089Q90791P77758J37705l41279m26638j78758
$$ y = [2889747, 2545626, 2903138, 3582052, 3499377, 2804446, 2599458, 2994389, 3087170, 2768288, 2877826, 3475672, 3564702, 2818955, 2117594, 1970528, 1768365, 1089674, 529421, 634480, 1039536, 1258379, 1476751, 1985376, 2518546, 2671132, 2472514, 2223995, 2181806, 2472165, 2830683, 2558016, 1431120, 465259, 837775, 2152223, 2840779, 2314697, 1555670, 1413083, 1559764, 1524057, 1554408, 1864160, 2059749, 1989440, 2245067, 3112584, 3841477, 3710823, 3127404, 2904276, 3029739, 2906418, 2362735, 1742442, 1345107, 1344197, 1905596, 2880898, 3729034, 4168147, 4510493, 4973860, 5169575, 4735330, 3954454, 3215528, 2373124, 1271586, 448204, 578293, 1469084, 2246842, 2384547, 2043268, 1616630, 1437872]
34691A437872K80988N69715L02091k31277l52244j09085k44076q22870r01802
34682g0688m1796Q14152O93133L0702q8142M62248Q97653P96171M29842L6179
34672C959454l83962n89541k20509M86295P72386L51710k20075l89083k90840
34663C475835k89792l21702j50752O9507L0328j44051j11408K485k02534m96245
34653A861671j05419R70637J528001P09258o20283r47982k05078K74609j80207
34644C285207p03388m06771K67153L81207l6415j89302K05614N96226M43857j78123
34634C665265q12199j034884o81791O208M81523L97098q520k22191p9744J14633
34624A825398M0559k45362l87627j35702L45374O07986M06323m0907l27659k44395
$$ y = [1437872, 1718860, 2288575, 2590666, 2359389, 2007145, 1898060, 1653984, 831114, -70688, -112484, 701668, 1394801, 1425503, 1337361, 1799609, 2697262, 3493433, 3923275, 3959454, 3575492, 2985951, 2765442, 3251737, 4024123, 4375833, 4155758, 3766675, 3475835, 3186043, 2864341, 2713589, 2783096, 2813424, 2669373, 2557965, 2560450, 2357916, 1861671, 1756252, 2726889, 4254890, 4964148, 4343865, 3395883, 3190805, 3465414, 3285207, 2581819, 2175048, 2442201, 2823408, 2786993, 2597691, 2803305, 3399531, 3843388, 3665265, 2853066, 1818182, 1136391, 1142599, 1624122, 2021220, 2012700, 1790509, 1710765, 1825398, 1865957, 1620595, 1232968, 1097266, 1442640, 2050626, 2456949, 2416042, 2088383, 1843988]
34614A843988J59215O02168N90501j06187q16394n15471N80380Q95654k27420
34605C006434j164074k78224J309625J154257o95686j590037k77141J289076J072381
34596C826611j68307n48598K1899K97575l8361k85057k19444j63297l6479L34700
34586C021242M10306l05459j103293r02096P8183O65729M92922K36271K87028
34577B880833L28168J97765J63489K87743L08950J39980j25466n01263q34553
34568B845646o42455J14732N90242J51756n86738o63298j48017K69465M66297
34559B397630O48913N49266L10k75130K95991Q65502L14465q16027j061533l25513
34549B593874J89864R8122J40337M38605K36841m24331n28969L9832J33398o19376
$$ y = [1843988, 2003203, 2605371, 3195872, 3089685, 2273291, 1757820, 2338200, 3233854, 3006434, 1842360, 1564136, 2873761, 4028018, 3332332, 1742295, 1465154, 2754230, 3826611, 3658304, 3109706, 3131605, 3429180, 3390819, 3105762, 2886318, 2723021, 2686542, 3021242, 3431548, 3126089, 2022796, 1120700, 1198883, 1864612, 2357534, 2593805, 2880833, 3209001, 3406766, 3570255, 3857998, 4166948, 4306928, 4181462, 3680199, 2845646, 2203191, 2317923, 2908165, 3059921, 2473183, 1809885, 1661868, 1931333, 2397630, 3046543, 3595809, 3596119, 3320989, 3616980, 4482482, 4796947, 3980920, 2919387, 2593874, 2783738, 2881860, 3022197, 3460802, 3697643, 3273312, 2744343, 2784175, 2917573, 2298197]
34539B298197j035688l87973L14398M597p31891o77742K34457J140857J494672
34530B653884J231647L62102p52866j239252o10801M94479J038337P25731K6851
34521C930112n40001p38105n68383k62419j05457j02052m0122J38021L47759N98699
34511B658052Q03206O03251p0033n95126m85865k01758k97732k77531N48180J473027
34501D157671J112164m00272j411887j058469j60421L51972M69912L04278k73454
34492C091494p91298m02603N94163Q62203J05174m48995j65155K9448m58269o90901
34482A725261N3380Q70676Q06461M82294P83154J114210M74403o54458j008064
34473D647317m73404M9084J77285J80760N3168l64929p07993n51635j84166p0768
$$ y = [2298197, 1262509, 874536, 1188934, 1193531, 461640, -216102, 18355, 1159212, 2653884, 3885531, 4247633, 3494767, 2255515, 1644714, 2139193, 3177530, 3903261, 3930112, 3390111, 2652006, 2083623, 1821204, 1715747, 1613695, 1573573, 1711594, 2059353, 2658052, 3461258, 4064509, 3994476, 3399350, 2913485, 2711727, 2413995, 2136464, 2684644, 4157671, 5269835, 4869563, 3457676, 2399207, 2238786, 2590758, 3060670, 3364948, 3091494, 2300196, 1897593, 2491756, 3353959, 3459133, 3010138, 2844983, 2874431, 2416162, 1725261, 1778641, 2649317, 3455778, 3938072, 4721226, 5835436, 6309839, 5655381, 4647317, 4173913, 4222997, 4400282, 4581042, 4634210, 4269281, 3561288, 3009653, 2825487, 2754719]
34463B754719p6453k0208k66264q31137p61144M22094J470191R97387l32161p29881
34453B627143P2547P06544M33222j15096m36616p87249j073863o21910M85589
34444A290311J116055P04453Q3262R4198L41184N4630n73070p45294k91372K24654
34434B299011M03040L72334L00267P2423l82953p64579o62588r8583M32660N53021
34424B524053M18743L44463K51251j09488n43256n76071k17221K7307k8193l5433
34414B056155J57785K27896M3786m5480J34848K82631K45304K78151L91670J82060
34404C954806l29837m64574O6172O20388O04944K60134J4041j55311k47588j2941
34394D310234K86121j08730j030491j119337J20674J152306N23107q38607r44431
$$ y = [2754719, 2678266, 2658058, 2391794, 1560657, 799513, 1221607, 2691798, 3689185, 3357024, 2627143, 2699690, 3406234, 3839456, 3724360, 3287744, 2500495, 1426632, 804722, 1290311, 2406366, 3110819, 3194081, 3288279, 3629463, 3684093, 3111023, 2365729, 2074357, 2299011, 2702051, 3074385, 3374652, 3447075, 3064122, 2299543, 1636955, 1538372, 1971032, 2524053, 2942796, 3287259, 3538510, 3429022, 2885766, 2309695, 2092474, 2119781, 2091588, 2056155, 2213940, 2441836, 2485622, 2440142, 2574990, 2857621, 3102925, 3381076, 3772746, 3954806, 3624969, 3160395, 3226567, 3846955, 4451899, 4712033, 4726074, 4570763, 4323175, 4310234, 4596355, 4487625, 3457134, 2337797, 2458471, 3610777, 4133884, 3295277, 2350846]
34385B350846L23914J233037Q26180o0772m40372m19350m91781o57734o57095
34376B006873m09046K3347M46773N11075J04933l46080l86557r4748K38152N74389
34366B669111Q27552O40111L4113l02792k5804K25119p2429l30686R2780N85165
34356D342240K08974o23898p19417j89M68276J90826k40481l02223j14384J34835
34346C344559L60052K30108m16652r23588n34084L81049P89700N20063K65307
34337D016514K31664l4281m81089m28383K12243O75053N41597K40815J23457k8300
34327E069290k98992l27957k7005J48583l5589k15919r8887Q1276L3407j56001
34317D172206k74516k80040k14512j18884m7976M2310K54935M06761J10598n08283
$$ y = [2350846, 2674760, 3907797, 4733977, 4673205, 4232833, 3813483, 3321702, 2663968, 2006873, 1597827, 1621174, 2067947, 2579022, 2683955, 2337875, 1951318, 1856570, 2094722, 2669111, 3496663, 4136774, 4170887, 3868095, 3842291, 4067410, 3994981, 3664295, 3757075, 4342240, 4551214, 3927316, 3207899, 3207710, 3675986, 3866812, 3626331, 3324108, 3209724, 3344559, 3704611, 3934719, 3518067, 2594479, 2060395, 2441444, 3231144, 3751207, 4016514, 4248178, 4213897, 3732808, 3304425, 3516668, 4191721, 4733318, 4974133, 5097590, 5069290, 4770298, 4442341, 4415336, 4563919, 4528330, 4312411, 4213524, 4294800, 4328207, 4172206, 3897690, 3617650, 3403138, 3284254, 3236278, 3278588, 3533523, 3940284, 4050882, 3542599]
34307C542599p10504j79337M37175N17255L06340J79520j13155o83926q54100
34298B441867k38900L37782J06952k88788O6939O97566O34421K27000M32834R18406
34288E336079O30962j91233m28901j70330m23514r15703l27297J112286J445736
34279F068085j4024j478384j324108k44009K44495K4158j3550M27998Q76698Q93576
34269E460935L59607n01924j009918n77232L58187O71762L2209p08428p70347
34260C314851l08150J49209L73199L92385L75881N44074P03733K57841o73542
34251E129481q55928K98591J374899Q06779o17077q87268P6324M78263k80228
34242E523836p71233j05223O85264M64421m28860j042667r33604n4434J208737
$$ y = [3542599, 2832095, 2652758, 3089933, 3607188, 3913528, 4093048, 3979893, 3295967, 2441867, 2202967, 2540749, 2647701, 2358913, 2425852, 3123418, 3757839, 3984839, 4417673, 5336079, 5967041, 5775808, 5346907, 5176577, 4753063, 3837360, 3510063, 4622349, 6068085, 6054061, 4575677, 3251569, 3007560, 3252055, 3276213, 3262663, 3690661, 4567359, 5460935, 5820542, 5318618, 4308700, 3731468, 4089655, 4761417, 4793626, 4085198, 3314851, 3006701, 3155910, 3529109, 3921494, 4297375, 4841449, 5545182, 5803023, 5129481, 4273553, 4572144, 5947043, 6753822, 6136745, 5249477, 5325801, 5804064, 5523836, 4752603, 4647380, 5332644, 5797065, 5368205, 4325538, 3391934, 3337500, 4546237]
34233D546237J731558P45430p35509j048344l19765o3638n15266m33461L81598
34224D288840O18433j31447o54074k96918J93060M46628R43914J303493M43792
34215G155721j022758j072585L50024R03427k63177j011979O6429J252721P74404
34206G132227l09873l49789P9183j87225m76859J82408Q22628J64219r40711r06878
34196E209330k1944L99068K98181L66982L86165n9125l03446J94357N15478j43783
34186F841263q06218l69142L86793K74820j61847N8404K81741m42157j201615
34177D862042o52127M87025O40030R5773K21038Q46454P97162K79627L60958O82413
34167H620395O7838j063877j241435n39801l27445o66612k90525Q58510J314967
$$ y = [4546237, 6277795, 7023225, 6287716, 5239372, 4919607, 4855969, 4340703, 3907242, 4288840, 4907273, 4775826, 4121752, 3824834, 4017894, 4464522, 5408436, 6711929, 7155721, 6132963, 5060378, 5410402, 6313829, 6050652, 5038673, 5105102, 6357823, 7132227, 6822354, 6472565, 6551748, 6364523, 5887664, 6070072, 6892700, 7056919, 6116208, 5209330, 5187386, 5586454, 5884635, 6251617, 6637782, 6578657, 6275211, 6469568, 6985046, 6841263, 6035045, 5665903, 6052696, 6327516, 6165669, 6224073, 6505814, 6063657, 4862042, 4209915, 4696940, 5336970, 5432743, 5653781, 6500235, 7297397, 7577024, 7937982, 8620395, 8688233, 7624356, 6382921, 5843120, 5515675, 4849063, 4558538, 5417048, 6732015]
34158F732015N38927k92864k68104J67015L87551M18241L45839Q9715j67199k65644
34148G685492n21710r82348q63279J54926Q94699L39680n08711p2360J207523
34139G333912J505494L81007q32583j127730p33451j46910L51859M38226J33223
34130G303047N9729L90270L19707m57372q88446l63440P052o01808r53893J51457
34120D966303J454813J101237k94443p83042k57898j02320n07597n24726j03883
34111D948444J55836N58300J446239J698864L96326j003142o39467N89755N31642
34102H682797n26326o11560K80302M42508j60735P72Q06706N95683n55574q11337
34092H143236N2220L15391m29298o81108J780L54749Q6489L32908J018634O36921
$$ y = [6732015, 7270942, 6978078, 6709974, 6876989, 7264540, 7682781, 8028620, 8118335, 7951136, 7685492, 7163782, 6181434, 5318155, 5473081, 6367780, 6707460, 6198749, 6126389, 7333912, 8839406, 9220413, 8387830, 7260100, 6526649, 6379739, 6731598, 7169824, 7303047, 7362776, 7753046, 8072753, 7615381, 6726935, 6363495, 6370547, 5768739, 4814846, 4966303, 6421116, 7522353, 7227910, 6444868, 6186970, 6084650, 5577053, 5052327, 4948444, 5104280, 5662580, 7108819, 8807683, 9204009, 8200867, 7561400, 8151155, 8682797, 8156471, 7544911, 7825213, 8267721, 8106986, 8107758, 8914464, 9510147, 8954573, 8143236, 8195456, 8510847, 8081549, 7400441, 7402221, 7756970, 7843459, 8176367, 9195001, 9831922]
34082I831922p85358j284001j74353R32237R49485O38751N43621J08032n46213
34073A0214123l93904L60829K77237o98553r53581r163P48045N65076K23304Q2819
34063A0416232m10030r39469m40375O95497R10264J72773n8577L64033J59255
34054A0869603n96059l75605Q31998J276542N15784j0217K10746J29118m02277
34045A2449633k94419L86102M23896k4979K85916R44597M07614q50792r18353
34036A2809215j0084l1708p67812k27537J287017J427998J92415o4392Q02878
34027A5417990M76579j138041j462567p6720N40082j74171N7668J578524J837660
34018A7057004K92494m37227N09196Q50297j52802m32175L38356n8463j466365
$$ y = [9831922, 9046564, 7762563, 7588210, 8520447, 9469932, 10108683, 10652304, 10760336, 10214123, 9820219, 10181048, 10458285, 9759732, 8806151, 8796988, 9545033, 10110109, 10333413, 10416232, 10006202, 9066733, 8626358, 9321855, 10232119, 10404892, 10346315, 10710348, 10869603, 10273544, 9897939, 10729937, 12006479, 12522263, 12512046, 12722792, 12851910, 12449633, 12155214, 12541316, 12965212, 12940233, 13226149, 14170746, 14578360, 13727568, 12809215, 12799131, 12767423, 11999611, 11772074, 13059091, 14487089, 14679504, 14615112, 15417990, 15894569, 14756528, 13293961, 13217241, 13757323, 13583152, 13640820, 15219344, 17057004, 17349498, 16912271, 17421467, 18271764, 18118962, 17686787, 18025143, 17966680, 16500315]
34009A6500315r16260J575726K276989L02342p96281L54111P37808p42897j022445
34000A8269408P91767J248180o86059j223583R95829J969055j07259j209095Q80170
33991B0928413K244974L12425j245143L42395J699311J28329j033324Q78426K375359
33982B6631165N40856j208495K78116J910576P05763l56057J301969K236678j54405
33973C1886166j865402L03517K401686Q81554n97622J367696L082292J386054
33965C8845941L30772K861719M100462P68212j485477J450001L793681J030012
33957E1695323q26161K870766N307720J294194j401651L479775P515063L321964
33949G3256993p1594N820918J1053881N630012N57872P916414J5805846R910908
$$ y = [16500315, 15584055, 17159781, 19436770, 19739112, 18942831, 19296942, 20034750, 19291853, 18269408, 19061175, 20309355, 19623296, 18399713, 19395542, 21364597, 21257338, 20048243, 20928413, 23173387, 23485812, 22240669, 22583064, 24282375, 24410704, 23377380, 24255806, 26631165, 27172021, 25963526, 26241642, 28152218, 28857981, 28501924, 29803893, 32040571, 31886166, 30020764, 30324281, 32725967, 33607521, 33009899, 34377595, 37459887, 38845941, 39176713, 42038432, 46138894, 46907106, 45421629, 46871630, 50665311, 51695323, 50869162, 53739928, 59047648, 60341842, 58940191, 62419966, 69935029, 73256993, 73185399, 79006317, 90060198, 95690210, 96248082, 104164496, 119970342, 129881250]
33941A29881250L350001J2822111K2610490J3046299P316271L4395386N4106606
33934B77528414q643680j38918882k14101409j52736263k3201023M9093637L6784695
33927a74194511R895786J3801249K3794344J4628114L797997R127139J6111108
33920h3038774J0093079K740676N349941O435723m018155j3346365q457887J599320
33912h2642442L169018K92345K667771O621976M412070R7738J130645M268733
33904e9982146L071724M38848J842711M312827K944285O96871J839181L084477
33896d1751222N85886j539409J185031M437080K589178j084964n91483K275316
33888c3894587K299793M29580N84254J602108L97979j077602L96989K515591J525819
$$ y = [129881250, 133231251, 146053362, 168663852, 181710151, 189026422, 223421808, 277528414, 268884734, 129965852, -84135557, -236871820, -260072843, -210979206, -174194511, -164298725, -150497476, -126703132, -112075018, -108277021, -99149882, -83038774, -72945695, -70205019, -64855078, -58419355, -62437510, -75783875, -84241762, -82642442, -79473424, -79181079, -76513308, -69891332, -65479262, -65381524, -64250879, -59982146, -56910422, -56471574, -54628863, -50316036, -47371751, -46674880, -44835699, -41751222, -41165336, -42704745, -41519714, -37082634, -34493456, -35578420, -36169903, -33894587, -31594794, -31165214, -30580960, -28978852, -28580873, -29658475, -29261486, -26745895, -25220076]
33879b5220076o48863j48539J622856J128507m66415k8925J237806M52447j035836
33870b3107038l71776J087562N15981p64984J5481J536502R95011m18747J7606
33861b0494402J205718N53929q20077l12877J102513R63002J31602P39360J653216
33852a5278016P21900p54937m21921N86232J0192j040602m77784L99441m67706
33843a6723201j484697l74008J049583O0679j554773n15825J830903J860260J21042
33834a5730037j14910R66799O06669q48354p09259O91869P98320J9330P67967
33825a3551606K185192J300412j125159j422441N56575J250701k89675j184997
33817a2280998k45126L73392k40245k53725Q70284J199707J92763k73566L61838
$$ y = [-25220076, -25868939, -26017478, -24394622, -23266115, -23732530, -23761455, -22523649, -22071202, -23107038, -23478814, -22391252, -21875271, -22640255, -22624774, -21088272, -20093261, -20512008, -20494402, -19288684, -18734755, -19554832, -19867709, -18765196, -17802194, -17670592, -16931232, -15278016, -14556116, -15311053, -15732974, -15146742, -15136550, -16177152, -16654936, -16255495, -16723201, -18207898, -18581906, -17532323, -17471644, -19026417, -19542242, -17711339, -15851079, -15730037, -15844947, -14878148, -14271479, -15119833, -15829092, -15137223, -14338903, -14319573, -13551606, -11366414, -10066002, -11191161, -12613602, -12057027, -10806326, -11096001, -12280998, -12526124, -12152732, -12392977, -12646702, -11776418, -10576711, -10383948, -10657514, -10295676]
33808a0295676L91190n55881o72853M03633P13106m03025j169101o86580j57666
33799a2432853j15888L73317J146327Q07638k50471K1014J536185J761677L356
33790g149698j313828o72227L86507L00962k41809l11150l57309o39214m04348
33781a0402114L50493N16812K9041J43318R72142J077763Q5834o61106n75288
33772h463105n58238q21301m46333M39340N79391Q5266L90185J333076J124765
33763f336954k68009p07679L91631R55216j34046j252008j059708n06364n12092
33754i430013l46801K99913K40452p56184r45547M13828J472100P90169l67593
33745h629676m03747J54976K90644M56979J078325J070464k01402j245059o64512
$$ y = [-10295676, -9904486, -10460367, -11133220, -10729587, -10016481, -10419506, -11588607, -12275187, -12432853, -12548741, -12175424, -11029097, -10221459, -10471930, -10450916, -8914731, -7153054, -7149698, -8463526, -9135753, -8749246, -8448284, -8690093, -9001243, -9358552, -9997766, -10402114, -10051621, -9534809, -9505768, -9362450, -8390308, -7312545, -7226711, -7887817, -8463105, -9021343, -9842644, -10288977, -9849637, -9270246, -9184980, -8794795, -7461719, -6336954, -6604963, -7312642, -6921011, -5965795, -6099841, -7351849, -8411557, -8917921, -9430013, -9776814, -9476901, -9236449, -9992633, -10938180, -10524352, -9052252, -8262083, -8629676, -9033423, -8878447, -8587803, -8130824, -7052499, -5982035, -6183437, -7428496, -8093008]
33736h093008M95132N18895k76363m89716m5135J86289J41377K35742J68890l87246
33726g545143p08062m6361R76602J262545Q15546L27193o4033n32809p95466n69324
33716f879312j86123L5545L49674Q66371J065427O50064R2572j98023m08406n96971
33706e209182l90509J80492N09500M09033K93964K24219p8965k39806L24306R42896
33696c034052L71109r58405j274333l02817L51120O0149M3051O70320M71999r67696
33686d569555j654079l89096R43289L05082j225488j344294j29502N91023L69221
33677g103399L09981P68738R71992O37104K66508J9042l49330o41718m40694Q7586
33667e474190M72475O15779N19980q198p22371q07980p3890N97787O17064M71223
$$ y = [-8093008, -7597876, -7078981, -7355344, -7845060, -7890195, -7703906, -7562529, -7326787, -7157897, -7545143, -8253205, -8299566, -7322964, -6060419, -5244873, -4917680, -4981713, -5514522, -6309988, -6879312, -7065435, -7029890, -6680216, -5813845, -4748418, -4098354, -4005782, -4203805, -4612211, -5209182, -5599691, -5419199, -4909699, -4500666, -4206702, -3982483, -4061448, -4301254, -3976948, -3034052, -2662943, -3621348, -4895681, -5198498, -4847378, -4787229, -4744178, -4073858, -3601859, -4569555, -6223634, -6612730, -5669441, -5364359, -6589847, -7934141, -8063643, -7472620, -7103399, -6793418, -6024680, -5052688, -4415584, -4149076, -4130034, -4479364, -5121082, -5561776, -5474190, -5001715, -4385936, -3865956, -3874154, -4596525, -5404505, -5478395, -4880608, -4263544, -3792321]
33657c792321N30560L26977k09248j78341O58542J073909L04574o00497n71776
33648b457621k30163m21219m75819L93211J202716N74729r17204j603717j216467
33639e151554p98419p19058m93879j65719k41632m77902j31377P24251J269417
33630f185872J114952N07566k31619o71604l00226N91779Q38547N7676n91942
33621d870743k62682J52907l25102r19173m67878M37056M73021r9651l1694O11939
33611e302000O57793q128l12088P8362L49304R0728j78726j12715K9266P2959
33601d635245P9606o3800l68530l98097J5337K75857O4358O3303O62161R29213
33591c375837J18099q22015p11466j16107j89284n07463R97P77807M59151n43969
$$ y = [-3792321, -3261761, -2934784, -3144032, -3322373, -2663831, -1589922, -1285348, -1885845, -2457621, -2687784, -3109003, -3584822, -3191611, -1988895, -1414166, -2331370, -3935087, -5151554, -5949973, -6669031, -7162910, -7328629, -7570261, -8048163, -8179540, -7455289, -6185872, -5070920, -4563354, -4794973, -5466577, -5766803, -5175024, -4336477, -4278801, -4870743, -5133425, -4980518, -5305620, -6224793, -6692671, -6255615, -5782594, -5882245, -5913939, -5302000, -4644207, -4652335, -4964423, -4886061, -4536757, -4446029, -4624755, -4737470, -4708204, -4635245, -4555639, -4619439, -4987969, -5386066, -5370729, -5094872, -5030514, -4967211, -4305050, -3375837, -3257738, -4079753, -4791219, -4907326, -5096610, -5604073, -5603076, -4825269, -4366118, -4910087]
33581d910087n47112N53656J149354O32668Q9347R8359o7970o52269p59112o3654
33571d476820N02491L52658O4605J11380J55716L8693J37046L51116N0011o20139
33561c333243o86471L8047N86623M28403J31516R1274p4671m40742l92575J57674
33551c494165L85278p8405m94827k58740K22070L69566K29693J7863k54477l88160
33541c744304r1403L18654J83374m07566p03456m82686j56416K25283Q79413J281371
33531b697736O37260n66109r22263j85809M54547L66821J83948K53143O1011l32495
33521b747682j7049R33873J058493j63952j189618p20916L04611L12461n33527
33512b763306r41138n69540j23784M2065J90289L93332M10789J84664j29143l61061
$$ y = [-4910087, -5457199, -4903543, -3754189, -3121521, -3032174, -2933815, -3001785, -3654054, -4413166, -4476820, -3974329, -3621671, -3557066, -3445686, -3289970, -3251277, -3114231, -2763115, -2713104, -3333243, -4019714, -3981667, -3395044, -2966641, -2835125, -2743851, -2818522, -3259264, -3651839, -3494165, -3108887, -3187292, -3682119, -3940859, -3718789, -3349223, -3119530, -3101667, -3356144, -3744304, -3835707, -3517053, -3333679, -3741245, -4444701, -4927387, -5083803, -4858520, -3979107, -2697736, -2060476, -2626585, -3548848, -3734657, -3280110, -2913289, -2729341, -2476198, -2415187, -2747682, -2764731, -1830858, -772365, -936317, -2125935, -2846851, -2542240, -2229779, -2763306, -3704444, -4273984, -4397768, -4355703, -4165414, -3772082, -3361293, -3176629, -3305772, -3666833]
33502c666833k61500K76141P42997M74842k41452m00174J86220O08372L66043
33493a915344j1123j71414m64717q09034m54521M91436P73101J0035m97631N5295
33483b993917N73121N3874n64652j00400P13773N63427r9114j4329M66984O5453
33473a335780q80670p77433M53890J103149L79581n47070o49084m10771m45616
33464c109804l27764L09523P70868L72870l95715o71949m39813j59617J43009
33455c508392N81857P61950L18853k56437j98888L35481M99944R9134j78110L188
33445a541420L9328n10394r68059m31076P68676J339408P02316l64150q47339
33436a812710n61982R1758O86640P59258J4301r61127r52074K34305J117776M41484
$$ y = [-3666833, -3928333, -3652192, -2909195, -2434353, -2675805, -3075979, -2889759, -2281387, -1915344, -1926467, -2097881, -2562598, -3371632, -3826153, -3334717, -2561616, -2551581, -3049212, -2993917, -2420796, -2366922, -2931574, -3031974, -2318201, -1754774, -1853888, -1868217, -1401233, -1335780, -2216450, -2993883, -2539993, -1436844, -1057263, -1604333, -2253417, -2664188, -3109804, -3437568, -3128045, -2357177, -1984307, -2380022, -3051971, -3491784, -3651401, -3508392, -2926535, -2164585, -1845732, -2102169, -2301057, -1965576, -1465632, -1366498, -1544608, -1541420, -1502092, -2012486, -2980545, -3411621, -2642945, -1303537, -601221, -965371, -1812710, -2374692, -2282934, -1596294, -837036, -822735, -1783862, -2735936, -2501631, -1383855, -942371]
33426i42371r48695j258025k84811N28883L75904j6847J00958M26126M33407K02808
33416a382663k5280k34385k23762L25493J067066J138080M07369k67494l13890
33407D90534j04774p0573o5815N8546J39734K42032O06120Q70983M02684m08653
33397B160818m26616L56306O19616j47006q44634q13756j047851k259896l241644
33388e644663k604230j004271r4960j16167m5784M90912R33102R77205P60707
33379f348149K09981o40773j052194m08637O97631J214403J050516P71009L96852
33370d109361l55289j054663r57186j78564N34913R02228J048098P98479P5199
33361c296146m38653j19425M98304N01351K2818k19116k69409n52013o62918j1168
$$ y = [-942371, -1891066, -3149091, -3433902, -2905019, -2529115, -2545962, -2445004, -2018878, -1585471, -1382663, -1407943, -1642328, -1866090, -1540597, -473531, 664549, 1071918, 804424, 490534, 385760, 315187, 249372, 307918, 447652, 689684, 1295804, 2166787, 2569471, 2160818, 1734202, 2090508, 2710124, 2563118, 1718484, 904728, -143123, -2403019, -5644663, -8248893, -9253164, -9348124, -9464291, -9510075, -9019163, -8086061, -7108856, -6348149, -6138168, -6778941, -7831135, -8239772, -7542141, -6327738, -5277222, -4506213, -4109361, -4464650, -5519313, -6476499, -6655063, -6120150, -5217922, -4169824, -3371345, -3296146, -3734799, -3854224, -3355920, -2854569, -2831751, -3050867, -3320276, -3872289, -4535207, -4546375]
33351d546375P37093M63532l85279k98009P94257J276263L89622o76359p65986
33342c011241l01592j26866j29458J08382L20064J22304j62750m9009K80136L23848
33332b626182M8993j65662o5776L00163O59880O51414J86101l47254n78389o30841
33322b567553o36254k07923Q09735J489985Q36818n48588j062188l86104J12641
33313b159431m64833j264576j078942J5484J048815J391074J034110K91838l13472
33304a499933l92783j97087k60313m89170l44816O6174N4410l75051m02610J73645
33294c667534N36539K98707J52094M60082M12518n27346j388263j006503J82258
33285d547448P89938L96257k38221n14554n23326l93812k8875M70299P54887O63933
$$ y = [-4546375, -3809282, -3345750, -3731029, -4029038, -3234781, -1958518, -1568896, -2245255, -3011241, -3312833, -3439699, -3569157, -3460775, -3140711, -3018407, -3181157, -3230166, -2950030, -2626182, -2577189, -2742851, -2808627, -2508464, -1848584, -1197170, -1011069, -1358323, -1936712, -2567553, -3203807, -3411730, -2601995, -1112010, -275192, -823780, -1885968, -2272072, -2159431, -2624264, -3888840, -4967782, -4952298, -3903483, -2512409, -1478299, -1186461, -1499933, -1892716, -2089803, -2350116, -2839286, -3184102, -3117928, -3063518, -3438569, -3841179, -3667534, -3130995, -2832288, -2680194, -2220112, -1807594, -2334940, -3723203, -4729706, -4547448, -3757510, -3361253, -3599474, -4114028, -4637354, -5031166, -5060041, -4589742, -3834855, -3170922]
33275c170922L45122M9918N1945M44987P53394K58755q60955j334308m16143Q36271
33265c041936Q17204m08376j175957n25841N73952O86118j94632q46700n34585
33256d650753K14372N77003N41120O06583P26088K81570p45245j323231o73021
33247d445514M93024Q43866K73561q2905L31409P04250K34374o04223p93328j50604
33237c196090O57025J058357R42155L88254l68051q36901o37249K9694N58023
33228a404783N70983K08336j38402k21440j02347N290K8522L9655n2633m61029
33218a527848r50403q00260J69840J010535P96702k6484l39283n3679j9410m05236
33208b145526m76580q3924j1170m72686n77108J30569Q04243O87858K60260J90181
$$ y = [-3170922, -2825800, -2775882, -2723937, -2278950, -1525556, -1266801, -2127756, -3462064, -3878207, -3041936, -2224732, -2633108, -3809065, -4334906, -3760954, -3074836, -3269468, -4116168, -4650753, -4436381, -3859378, -3318258, -2711675, -1985587, -1704017, -2449262, -3772493, -4445514, -3952490, -3108624, -2835063, -2917968, -2586559, -1882309, -1647935, -2252158, -3045486, -3196090, -2539065, -1480708, -538553, -150299, -518350, -1355251, -1992500, -1962806, -1404783, -833800, -625464, -763866, -985306, -1087653, -1082363, -1053841, -1014186, -1066819, -1527848, -2478251, -3278511, -3108671, -2098136, -1301434, -1327918, -1667201, -1720880, -1740290, -2145526, -2622106, -2706030, -2717200, -3189886, -3766994, -3636425, -2832182, -2144324, -1884064, -1693883]
33198a693883J95561j51113m43848k56628o9080l61092o07152k43501J81991R711
33188c439034j87419L72275J024362O16723l75696m55100L78306N66579l64540
33179a863544r36180j06089J050587R86199j61266j055665r86349k80051N08972
33170b843386R87142R21016N18343L47681M86878K63753o06740j251935q09491
33161a986739J33338K75220m56323p94982o4573Q50278R08452L89010K11888L95391
33151a39040J82747m81399o57414J16248R19793O50662m17955j038616o83418
33142a548392l4762J80119L2514j29815k95564m58705k73560L94771R70456Q05267
33132c57671Q9168m08643l48312n4466J44106K54333K73269K1796m93190q97770
$$ y = [-1693883, -1498322, -1649435, -2093283, -2349911, -2418991, -2780083, -3387235, -3630736, -3448745, -3439034, -3626453, -3254178, -2229816, -1613093, -1988789, -2443889, -2065583, -1499004, -1863544, -2799724, -2905813, -1855226, -869027, -1030293, -2085958, -3072307, -3352358, -2843386, -1856244, -935228, -416885, -69204, 417674, 681427, 74687, -1177248, -1986739, -1853401, -1578181, -2034504, -2829486, -2894059, -2043781, -1135329, -746319, -534431, -139040, 43707, -437692, -1095106, -978858, -59065, 591597, 173642, -864974, -1548392, -1583154, -1403035, -1370521, -1500336, -1795900, -2254605, -2528165, -2133394, -1162938, -357671, -268503, -677146, -1025458, -1079924, -935818, -681485, -408216, -386420, -879610, -1777380]
33122a777380q32107l24805K99150O97786O62823K29144k68347m41189k65422
33113b020347j06659k27554m24274l14877J00756L78027J63641l63257p00618
33104c515162n75131j26517L86886Q10076R81721P09493O4193n01623n72203k03144
33094b541411K18077L88843K27208j63593m55309k89211K31593N34100L32829
33085a516874K2835k3517o5728l85869n90716k51072K09272J44926j54897L4436
33075b577204M80607K94406m35779n88922K08303R57889Q07740R3411n32161r31572
33065b223282r98286m26334M86724Q30032M30461J84362M94152N50074j10759
33056g82856n77817r2462N36385K28188o04659q52314m79769k06459p4946L23266
$$ y = [-1777380, -2609487, -2934292, -2635142, -1937356, -1274533, -1045389, -1313736, -1754925, -2020347, -2127006, -2354560, -2778834, -3093711, -2992955, -2614928, -2451287, -2814544, -3515162, -4090293, -4216810, -3829924, -3019848, -2038127, -1328634, -1264441, -1766064, -2338267, -2541411, -2323334, -1934491, -1707283, -1870876, -2326185, -2615396, -2383803, -1849703, -1516874, -1494039, -1517556, -1583284, -1969153, -2559869, -2810941, -2601669, -2456743, -2611640, -2577204, -2096597, -1802191, -2237970, -2826892, -2618589, -1660700, -852960, -759549, -1291710, -2223282, -3221568, -3647902, -3161178, -2331146, -1900685, -1716323, -1222171, -672097, -782856, -1360673, -1453135, -916750, -688562, -1293221, -2145535, -2625304, -2831763, -2906709, -2583443]
33046b583443O92007M18120k21008m21754j25464J33469K56926L93138J93668
33037a264341n63368j069267m76168O07615R26903M93083K79437L77895O2439
33028f25772n06595l64461M13206O35055Q154l86344j58L61615J22827j55143
33018d97616o1408j22294n79694o91786o4979M99344L38213J1806J62880L20757
33008f84777j52742p80072o75688Q8508P45257R34108P54308K47910m18077p38379
32998f79644n03357j66943n9634J08386M05477J97228o94401j213703n17739N05869
32988b618461M14516n74376r01799j4780R63044J031236N49036K90286K78257
32979e83041J29544j49391k98275l04928l09344l05623k68831k90720l15561o8790
$$ y = [-2583443, -1891436, -1473316, -1694324, -2116078, -2241542, -2108073, -1851147, -1458009, -1264341, -1827709, -2896976, -3373144, -2765529, -1838626, -1345543, -1066106, -688211, -625772, -1132367, -1496828, -1083622, -448567, -440413, -826757, -826915, -465300, -342473, -497616, -559024, -681318, -1261012, -1952798, -2017777, -1518433, -1180220, -1168414, -1005534, -684777, -837519, -1617591, -2293279, -2204771, -1459514, -525406, 228902, 476812, 58735, -679644, -1183001, -1349944, -1409578, -1301192, -895715, -698487, -1392888, -2606591, -3124330, -2618461, -2203945, -2778321, -3680120, -3694900, -2731856, -1700620, -1151584, -861298, -583041, -453497, -602888, -901163, -1206091, -1515435, -1821058, -2089889, -2380609, -2696170, -2764960]
32969b764960M28232O10369R5936n75725n26537J84885N43692M4896n11260k19304
32959b689776N22167O55025J69318M4072M66910L99049n97014j339691p67289
32950c137229L18290M72931j64745l08712K45645M20168j50475m95622l3119M60983
32940b371885K09086l47762l86937P6730M77266N66954M45615K45658J95854M91987
32930c97434Q29316O36832k3231m55073l88061k49458k13235P3788N25153M23020
32920G61617l29774p93248m29553L4873j07203l76586q8185L80348K96078j51142
32910h02775k87071j09108k9517M4179L89244O32815K30355m88178o77069k17058
32900a314183K11404J69566j29104l15597j60607M39647J195542J371282N79538
$$ y = [-2764960, -2336728, -1726359, -1630423, -2206148, -2732685, -2547800, -2004108, -1959212, -2470472, -2689776, -2167609, -1512584, -1343266, -1299194, -832284, -433235, -1030249, -2369940, -3137229, -2818939, -2346008, -2510753, -2819465, -2573820, -2153652, -2304127, -2799749, -2832868, -2371885, -2162799, -2510561, -2897498, -2820768, -2343502, -1776548, -1330933, -1085275, -889421, -397434, 431882, 1068714, 1045483, 590410, 202349, -47109, -260344, -186556, 338597, 761617, 431843, -361405, -790958, -756085, -863288, -1239874, -1328059, -947711, -651633, -802775, -1089846, -1198954, -1228471, -1184292, -795048, -162233, 68122, -420056, -1097125, -1314183, -1102779, -933213, -1062317, -1377914, -1538521, -1098874, 96668, 1467950, 2047488]
32891B047488n85872j228904j194621r38805p06679m28848j54782j5602N7958
32882c148667J68795K52577L08557M11958L03517l57771j072181p64597N33220
32873c364592J318043O85087l06958l22511K62786L24142L08K18329Q54449R58091
32863F27174M16866r9837n12065j120810j347396l61030J143374J508463N54485
32854H09224k01902K1436L09358p1914m95330l47151j12681k80747m24543k11482
32844a005732j93432p03950r78533l27366O37778Q92948M75335J92681L58369
32835f51902N94903N32041Q7338o23703j210669j205797o62125j31484J39753
32826c131645M01197O41298M55655m8000j29417L61359N73845L7587m85026k50459
$$ y = [2047488, 1461616, 232712, -961909, -1900714, -2607393, -3036241, -3191023, -3206625, -3148667, -2979872, -2727295, -2418738, -2006780, -1703263, -2061034, -3133215, -3897812, -3364592, -2046549, -1361462, -1668420, -1990931, -1728145, -1404003, -1403695, -1185366, -330917, 627174, 1044040, 944203, 432138, -688672, -2036068, -2397098, -1253724, 254739, 809224, 607322, 628758, 938116, 866202, 370872, 23721, -88960, -369707, -794250, -1005732, -1199164, -1903114, -2881647, -3209013, -2571235, -1678287, -1202952, -1010271, -651902, -56999, 475042, 562380, -61323, -1271992, -2477789, -3139914, -3271398, -3131645, -2730448, -2089150, -1633495, -1681495, -1810912, -1449553, -875708, -838121, -1323147, -1573606]
32816a573606K46190J81711k24662k36358R0614J32096j83413m23353n02714o15450
32806c108945n94394j66213M06979P07678Q74964J139763J037589Q7780j010683
32797f25482j031327o4723M62072j43238q56783n38590M22880Q14450L26087k55192
32787a489846k98837j2829J35943Q5925M8827O3428k4687k36059l47091j71835
32777b247061J65609L51834K33657n8830l05118l81804k81669j03182j9776r7646
32767b743986j48763N6903M48029P25990P57113O50034M77425K19667l4577j74137
32757B33698l33060o60315q31473l37447O18412J117858P14060N7920o7982J76928
32747F88599J29300k69268m69783k51222k2848j51150m48211m58491q513N89650
$$ y = [-1573606, -1327416, -1145705, -1370367, -1606725, -1516111, -1384015, -1567428, -1990781, -2493495, -3108945, -3703339, -3869552, -3462573, -2754895, -1879931, -740168, 297421, 385201, -625482, -1656809, -1721532, -1259460, -1402698, -2259481, -2798071, -2375191, -1560741, -1234654, -1489846, -1788683, -1801512, -1665569, -1579644, -1530817, -1467389, -1492076, -1728135, -2075226, -2247061, -2081452, -1729618, -1495961, -1554791, -1859909, -2241713, -2523382, -2626564, -2646340, -2743986, -2892749, -2835846, -2387817, -1661827, -904714, -254680, 222745, 442412, 407835, 233698, -99362, -759677, -1591150, -1928597, -1310185, -192327, 521733, 579653, 511671, 688599, 817899, 548631, 78848, -172374, -195222, -346372, -794583, -1253074, -1261587, -671937]
32737f71937P86483L50199k54246l12409J65414L23593l58881j204569j200301
32728b376654l99127K36276K38791R8254K50520M09389K43834M3924J75619L49617
32718g29557P4257m35283m87516R291L70339J53274k56561l38598j55894J2513
32708a783735K51407O67441Q71086M92815m8315p1181K30759O8324n62271q05920
32698f89590m21737k00463n01371n55602Q3031N67802K18713j45401M00404J115374
32688a28840P43619l04295o52478l18252m34357q80124l58921R93729J319478
32679b0441l495j201217q72008R317P3707k43112O344L46862j4076m00778J52834
32668b166063R35581O87969j07029r0344M15926p6023j383455j617211k17731
$$ y = [-671937, 114546, 464745, 210499, -101910, 63504, 387097, 28216, -1176353, -2376654, -2775781, -2539505, -2300714, -2202460, -1951940, -1542551, -1298717, -1254793, -1079174, -729557, -655300, -1090583, -1578099, -1568808, -1198469, -1045195, -1301756, -1640354, -1796248, -1783735, -1532328, -864887, 6199, 499014, 450699, 379518, 610277, 678601, 116330, -689590, -1111327, -1311790, -1813161, -2368763, -2285732, -1717930, -1499217, -1644618, -1244214, -128840, 614779, 310484, -341994, -660246, -1094603, -1974727, -2333648, -1339919, -20441, -23936, -1225153, -2097161, -2087844, -2014137, -2257249, -2250905, -1904043, -1918119, -2318897, -2166063, -1230482, -542513, -649542, -739886, -323960, -399983, -1783438, -3400649, -3618380]
32659c618380J096669R94135K47077r073j4693l25929m65004Q9817O13566J45911
32649a245904q89102j273681p58287j52983N7994J93436N54003R60548J164280
32640a389696J105094P20789P8p24664r43583n09672K21910P64479Q19660L64939
32630D29334l10763p45289p05194l75075j3430L60011P06830O82739L8539q10519
32620g42817j093523o21691r971J81123J35686L27524O84302O71025J33784m29069
32610g63627n76399m74935m54495l88229K1899N77648P76610O08996N58043P29406
32600F14917O12722l7248o63082o45179j27481L23128M93577N00681L28673q6012
32590A314696n13375o44755n17237l65157k35990r1690m9788j59471j91629m934
$$ y = [-3618380, -2521711, -1527576, -1280499, -1289572, -1304265, -1630194, -2095198, -2005381, -1391815, -1245904, -2135006, -3408687, -4166974, -4319957, -4261963, -4068527, -3514524, -2553976, -1389696, -284602, 436187, 436265, -288399, -1231982, -1741654, -1519744, -755265, 64395, 429334, 118571, -626718, -1331912, -1706987, -1720417, -1360406, -653576, 29163, 67702, -742817, -1836340, -2458031, -2468002, -2286879, -2151193, -1823669, -1139367, -468342, -334558, -763627, -1340026, -1814961, -2269456, -2657685, -2635786, -2058138, -1281528, -672532, -114489, 614917, 1227639, 1190391, 527309, -117870, -245351, 77777, 571354, 1072035, 1400708, 1314696, 801321, 156566, -360671, -725828, -961818, -1053508, -1103296, -1262767, -1454396, -1459330]
32580a459330J86408K60689M74124Q48166Q01495M2645o86835n93070r9805j34219
32570c59732n13836k87945M48526N08897l71858q86940j44908R07606R29515R3905
32560C23230m68438m24419l18662l29412r3364L39119M02059k1629l68391l09320
32550a269227j66318j75013l7141M01503O43189K66526k85001l18740l1831k30537
32540a202590r08559r98844M0594J150804R62528k57101q97817j99421P96765
32531a513641P79577j52290q68593p09231k1198M71480L31541l23660q38447n61878
32521c406340L23749Q78866O17671J53061K13952N81983N95421J81649l08559
32512a68547p87824j155251q51680L16544J324070J046268k5557m38153j6876
$$ y = [-1459330, -1272922, -1012233, -538109, 310057, 1111552, 1154197, 467362, -125708, -225513, -359732, -873568, -1161513, -712987, -204090, -575948, -1462888, -1607796, -700190, 229325, 323230, -145208, -569627, -888289, -1217701, -1311065, -971946, -569887, -591516, -959907, -1269227, -1435545, -1610558, -1647699, -1246196, -603007, -336481, -621482, -940222, -972053, -1202590, -2111149, -3109993, -3069399, -1918595, -956067, -1213168, -2110985, -2310406, -1513641, -734064, -886354, -1754947, -2464178, -2485376, -2013896, -1682355, -2006015, -2844462, -3406340, -3082591, -2203725, -1586054, -1432993, -1219041, -637058, -41637, 140012, -168547, -956371, -2111622, -2963302, -2646758, -1322688, -276420, -301977, -740130, -757006]
32503g57006j9711q77732j299537k75422J279012J781918J008744k2928n29028
32494B88310m74690j07827K18151O0046o12057j137993q99903j22901M48533M24316
32484a916015j1931m59565n55667j66413L93238O04640L77034Q1205j13969l88729
32474b156172o40894m23482K08560N40867K86388O6872L13776M86932M6746n53902
32464a824309o48577m45011m26468k89118M45152J216343J035884J01264l95847
32455a230687n5297L09788J80596P7947L84477M97852j20226q17409n44664N91302
32445g26321J365715R68492r8907p65778o15704j37278M3219j33653l05247k90652
32435f96114k16482q6576L00424P92807P29860j74562j124581j057283m9265P45079
$$ y = [-757006, -776717, -1654449, -2953986, -3229408, -1950396, -168478, 840266, 817338, 288310, -186380, -294207, -76056, -16010, -628067, -1766060, -2665963, -2788864, -2340331, -1916015, -1927946, -2387511, -2943178, -3109591, -2716353, -2111713, -1734679, -1653474, -1767443, -2156172, -2797066, -3220548, -3011988, -2471121, -2184733, -2117861, -1804085, -1317153, -1270407, -1824309, -2472886, -2917897, -3344365, -3633483, -3188331, -1971988, -936104, -834840, -1230687, -1285984, -976196, -795600, -717653, -333176, 164676, 44450, -772959, -1317623, -726321, 639394, 1607886, 1508979, 743201, 127497, -9781, 33438, -100215, -405462, -696114, -912596, -999172, -698748, 94059, 823919, 649357, -475224, -1532507, -1581772, -836693]
32425h36693N89273p0090n01338o33189o66863l72325M82147J300473J123735
32416D15130J2102p91813m22226M87917P46285J77350m26329n98044n59863l77587
32406a337078K17803R18455P99135k46607j006637o93515k36706p00495j286182
32397c571827n16437J097618J514100L10645o53825k51900K77517k17000o23768
32388b634877M35599J877776J587824j90389j160518n06188J05462n32794j261768
32379b279873o11636P89537J249557N29426j04558M7512L20712K9177m61837m37641
32369i29624N1619L28722P6018k92973k57162J32744L57595R5786l82256n20497
32359a340028j05229M86352O92366L88018k226p2424M7607k5422k60140k60407
$$ y = [-836693, -247420, -317510, -818848, -1452037, -2118900, -2491225, -2009078, -708605, 415130, 427232, -364581, -786807, -298890, 447395, 624745, 198416, -399628, -959491, -1337078, -1119275, -200820, 598315, 351708, -654929, -1348444, -1585150, -2285645, -3571827, -4088264, -2990646, -1476546, -1165901, -1819726, -2071626, -1794109, -2011109, -2634877, -2199278, -321502, 1266322, 1075933, -84585, -590773, -485311, -1018105, -2279873, -2891509, -2101972, -852415, -322989, -427547, -380035, -59323, -30146, -491983, -929624, -878005, -549283, -473265, -766238, -1023400, -890656, -533061, -437275, -819531, -1340028, -1445257, -958905, -266539, 121479, 119253, 46829, 94436, 69014, -191126, -451533]
32349d51533j0845J012l36440l82291K39624Q11970M57177n06000r96782o96477
32339a870585k27025P816J64935K33085K2463j13069L38258Q79459M71541o55272
32329g48394j047884k68938L95086Q9886k81418J73495P29080M64055r544K60382
32319b44194P00164J98213q16184j003250l15613J21681J4517R3748M26624K22878
32309f01416n08896o64992J79746R87894P73520r5013o15960m29742N9945L25239
32299e89675J91365m0744K4673J92161j71526r42888r97345J12052J122533P84562
32289c14832k33798n14456j66310k73803o90404l30271O29261Q88629L69584L46047
32279b90353R90301Q91212m18881j451462j084686j16224L84021N84831P96915
$$ y = [-451533, -462378, -461366, -797806, -1180097, -940473, -128503, 328674, -177326, -1174108, -1870585, -2097610, -2089794, -1924859, -1691774, -1669311, -1782380, -1444122, -564663, -93122, -748394, -1796278, -2065216, -1670130, -1580244, -1861662, -1688167, -959087, -495032, -504576, -244194, 455970, 654183, -162001, -1165251, -1480864, -1359183, -1344666, -1250918, -824294, -601416, -1110312, -1775304, -1595558, -607664, 165856, 70843, -545117, -974859, -914914, -589675, -398310, -439054, -414381, -222220, -393746, -1336634, -2333979, -2221927, -1099394, -314832, -548630, -1063086, -1229396, -1503199, -2193603, -2523874, -1894613, -1005984, -636400, -290353, 699948, 1591160, 1172279, -279183, -1363869, -1480093, -1096072, -511241, 285674]
32270B85674N09886l55313p44040k18470K4579q05450j433101m74110J103042
32261b107303J258081j01971j128090p16109L49416Q75058O35184J61845K2773
32252g51116L90349Q26613O50285j45288p50493o24716j13063L35778P29430Q80512
32242A428291K28067j004326j502406n92792O39044Q77456L16127r8217k21301
32233F9943l98875m64969k40747k51843p61581r01897m1383Q25860N08698l53907
32223b010701l28053M22248O00293J71445K99158J013633R77636j40638r22004
32214H3017m06390N07768N90641m1561n03073m19583L500M37824N01776K3335
32204G77254n20302m86562n0465P6556j39561j00916J87052Q1636l85615m13701
$$ y = [285674, 795560, 440247, -303793, -522263, -497684, -1303134, -2736235, -3210345, -2107303, -849222, -951193, -2079283, -2795392, -2445976, -1570918, -935734, -773889, -751116, -360767, 465846, 1116131, 970843, 220350, -404366, -517429, -181651, 547779, 1428291, 1656358, 652032, -850374, -1443166, -804122, 73334, 389461, 291244, 69943, -328932, -793901, -1034648, -1286491, -2048072, -2949969, -2991352, -2165492, -1656794, -2010701, -2338754, -1916506, -1316213, -1144768, -845610, 168023, 1145659, 1005021, 83017, -323373, 184395, 775036, 733475, 230402, -189181, -185681, 252143, 753919, 777254, 256952, -229610, -280075, -203519, -343080, -443996, -256944, -175308, -560923, -974624]
32194i74624Q0618J72431m22209o96731l1888O54308L12414o29840j007050n42740
32184c085311J65542P06160J017190R14992K85265m86135q83114q42357n54999
32175b762767p1301M54462N85719K17676m1146L11536Q35313P63948J66273j95123
32165B64590m199K91275K79678O8603j38284l86598o54591o34145j83075K81985
32155h14761K65927m8306o527M79645O54825N1368o08100l50667M96597O60415
32145G80416j55345p97582m76018Q1137p308l15843p6151K60239k33199j168681
32135b108335j239435k34401O85792P56139M32451L23487M11341N16377N52474
32126I5890K16548o00163j107446m62172O81707Q02219j72801o68221M4871P41229
$$ y = [-974624, -894006, -721575, -1143784, -1840515, -1872403, -1218095, -905681, -1535521, -2542571, -3085311, -2919769, -2213609, -1196419, -281427, 3838, -482297, -1365411, -2207768, -2762767, -2834068, -2379606, -1793887, -1576211, -1617357, -1305821, -470508, 293440, 459713, 264590, 260391, 551666, 831344, 899947, 761663, 375065, -279526, -913671, -1096746, -814761, -548834, -597140, -603667, -124022, 530803, 582171, -25929, -376596, 120001, 780416, 625071, -172511, -648529, -567392, -574700, -890543, -966694, -706455, -939654, -2108335, -3347770, -3582171, -2896379, -2140240, -1707789, -1384302, -972961, -456584, 95890, 312438, -287725, -1395171, -1857343, -1175636, -373417, -546218, -1214439, -1169568, -428339]
32116d28339L31049m54678m84154l8419N05k45021j26335K10653K15436O5235
32106i54068K56419N42587L75137j2342l5151Q8540k82266r21863r41335k22046
32096b106388L63158K35873k27066m37552l01929n2012R5552M2994m7459J63802
32086b271027O03943O03104j67719r40021p43639K07812Q15184O03920J09205
32077a179238j54584k20667j17710L07639P89967O95645M0013k76143K59569Q67836
32067A012327M90979o65776j318311p55000L22624P80159M05700o9189n4660K68517
32057D17370M42596L95783L17072J90060j10676m18192m39904k61029k00807k05282
32047A26991M8032L96091K12347n76080j129049p62638J17502O16959N10838L10760
$$ y = [-428339, -97290, -551968, -1036122, -1074541, -1074036, -1319057, -1445392, -1234739, -1019303, -954068, -697649, -155062, 220075, 207733, 172582, 261122, -21144, -943007, -1884342, -2106388, -1743230, -1507357, -1734423, -2171975, -2473904, -2525916, -2430364, -2387370, -2434829, -2271027, -1667084, -1063980, -1231699, -2171720, -2915359, -2707547, -1892363, -1288443, -1179238, -1333822, -1554489, -1672199, -1364560, -574593, 121052, 161065, -115078, 144491, 1012327, 1503306, 837530, -480781, -1235781, -913157, -132998, 272702, 203513, 148853, 417370, 859966, 1255749, 1572821, 1762881, 1652205, 1234013, 794109, 533080, 332273, 126991, 175023, 571114, 783461, 207381, -921668, -1684306, -1566804, -949845, -439007, -128247]
32037a28247M03223N77337L76867l12073j025204j107469m97798O8494L0263j05364
32027a719971M59094J341443J305180J41886q99064r24836n09827m07220k88842
32018a502157L31213Q74735N21389l82739q18088n43748r0179K72623N93989O46102
32008i6860K43555j36601J7851K99098l602o02110n40553L04507J022355R40584
31998A448224K71425m53669q27628n59811K08197P00070L40363l98023o88809
31989D0339n58982n59752o27114l20340J00326J0588l18066j9058Q23822J150680
31979b77557N55808k10177n23610n50541m51632p0836L27415J35883m62001n19052
31969b046300J73728O87204M36215j1397m8050R4560O7474J4456k4246l40500
$$ y = [-128247, 274976, 852313, 1229180, 917107, -108097, -1215566, -1713364, -1644870, -1614607, -1719971, -1260877, 80566, 1385746, 1527632, 628568, -296268, -806095, -1213315, -1502157, -1170944, -296209, 225180, -157559, -975647, -1519395, -1609574, -1336951, -742962, -96860, 146695, 10094, 27945, 327043, 323441, -278669, -819222, -514715, 507640, 1448224, 1719649, 1265980, 438352, -121459, 86738, 786808, 1127171, 729148, 40339, -518643, -1078395, -1705509, -2025849, -1925523, -1914935, -2233001, -2252059, -1428237, -277557, 278251, 68074, -455536, -1006077, -1457709, -1528545, -1201130, -1065247, -1527248, -2046300, -1872572, -1185368, -749153, -760550, -808600, -714040, -646566, -632110, -656356, -996856]
31959i96856p27116m51053M39883Q72451L86725j25292o714O0072n34857r79140
31949b061897l10162Q57951J184927N77585P0107J41687L06135J46484k21108
31940F91709n71493p16443m65728m5555j30546q26065j181231m75858N99128R19797
31930b202285N07906J59732N7269j31904k18149K19320P72861O57195Q2099j1314
31920a07270M65104O11147O4830m68391m23466j18149l5551k11122n23198q16629
31910a562695o58681J93185J041327Q97905l5088n39551j79573J64536j50637
31901h29272n67230m11456O4367L29923M00511M01582J16267l92578m66971J53052
31891a201805P08797N00016o1678k11624k7456m8590k28345j46279J16601J67508
$$ y = [-996856, -1723972, -2175025, -1735142, -862691, -475966, -601258, -607972, -547900, -1082757, -2061897, -2372059, -1514108, -329181, 248404, 318511, 460198, 766333, 912817, 691709, 120216, -596227, -1061955, -1107510, -1238056, -2064121, -3245352, -3721210, -3122082, -2202285, -1694379, -1534647, -1477378, -1609282, -1827431, -1608111, -835250, -178055, -95956, -107270, 357834, 968981, 1033811, 565420, 141954, 23805, -11746, -222868, -746066, -1562695, -2221376, -2028191, -986864, -88959, -124047, -663598, -843171, -678635, -829272, -1396502, -1807958, -1743591, -1413668, -1013157, -611575, -495308, -887886, -1354857, -1201805, -493008, 7008, -54670, -266294, -293750, -342340, -570685, -716964, -600363, -432855]
31881d32855P5263J56246K54084K4449l01257k41948N3287Q1891m0781K04740
31871a66881O53991N65580j18347n84252m20547j62316k66328m29383l42797k89209
31861a560489m55057m10656Q9144M69017K37065p2251K66728Q47460O62129k44038
31851a70948p15994j92392M97428L92746l05631o98889m26280Q4183L06505J28791
31841a100481j66073j57757L04502P83683O30476j09837n38879k8701Q19230Q67613
31831A303776n8760r50622r25191k07120M05671N67436M72945K41441k09620o67021
31821b7065n58319K63734R98152O86265m99124j287864q44788K06093O77966L33185
31811e1765r2822j25652n1519j67784k86678k24670j62679k17758k02990j07408
$$ y = [-432855, -357592, -201346, 52738, 77187, -224070, -466018, -412731, -330840, -371621, -166881, 487110, 1052690, 934343, 350091, -70456, -232772, -499100, -928483, -1271280, -1560489, -2015546, -2426202, -2337058, -1868041, -1630976, -1703227, -1436499, -589039, 73090, -170948, -886942, -1079334, -581906, -189160, -494791, -1193680, -1619960, -1535777, -1229272, -1100481, -1266554, -1424311, -1119809, -336126, 294350, 184513, -354366, -383067, 436163, 1303776, 1245016, 294394, -630797, -837917, -432246, 135190, 608135, 849576, 639956, -27065, -585384, -321650, 676502, 1362767, 863643, -424221, -1269009, -1062916, -384950, -51765, -144587, -270239, -321758, -489542, -776220, -1000890, -1163569, -1381327, -1584317, -1691725]
31801a691725k44897o00134o54493k65779k3424j98228j15385O66484J319613
31792a807968R25781O7362j2415N78211O26648q9579m94152j49661N0204l98719
31782g04288o72750j79459K52977k17479q96918o11225M20287R87789P07489K76057
31772f37520J64013J32764j685l9161J05433K56531L45991L79984J46795m79372
31762C73773j076452j082343n39943O5744M89753P13619N78685J09604j11732
31753d79292L11567P47706L36902n73658q31706k41293K23663Q5884L1926N22954
31743A34653Q92014M81594k66173o08752n99776n92630l76395K59172O81574K09265
31733B14546o08328o25378J12672L58632m17413j190321r00016R3724P22159P05816
$$ y = [-1691725, -1936622, -2536756, -3191249, -3457028, -3480452, -3678680, -3794065, -3127581, -1807968, -882187, -814825, -827240, -249029, 377619, 288040, -206112, -355773, -305569, -704288, -1377038, -1556497, -1303520, -1520999, -2417917, -3029142, -2608855, -1621066, -913577, -637520, -473507, -340743, -342428, -381589, -276156, -19625, 326366, 706350, 853145, 373773, -702679, -1785022, -2324965, -2259221, -1769468, -1055849, -477164, -367560, -479292, -167725, 579981, 916883, 343225, -488481, -729774, -506111, -420227, -388301, 134653, 1026667, 1508261, 1242088, 633336, 33560, -559070, -935465, -676293, 5281, 214546, -393782, -1019160, -906488, -547856, -965269, -2155590, -3055606, -2961882, -2239723, -1533907]
31723a533907N62769N21037K72419k58740o38422n64839k52107Q106K10701L52434
31713a320549K30850j53737l69301j18798K54155K58280R376j0344K30259L18582
31703f71227J55062P3731J61246J04403j38410j91350l8015k11432p69359q20669
31693b346020K10667J426940J483471M67238k49664n929L12847k45559j229329
31684a75338j421346m92085O49324J036817O38714Q3725j77202j44736O3535L78957
31674D40365N57780K46963m16156o65340r3929N24432J60844q58024j128714k05054
31664a436833P12384N88734P974K3527M60629M21950j46006n36266n33945m76500
31654i14352l50984O2674L72459N2904m11056r7327O83065O48722l50238r10384
$$ y = [-1533907, -971138, -450101, -177682, -436422, -1074844, -1639683, -1891790, -1883684, -1672983, -1320549, -1089699, -1243436, -1612737, -1731535, -1477380, -1219100, -1209724, -1220068, -989809, -671227, -516165, -442434, -281188, -176785, -315195, -506545, -544560, -755992, -1525351, -2346020, -2135353, -708413, 775058, 1242296, 992632, 986703, 1299550, 1053991, -175338, -1596684, -2088769, -1439445, -402628, 236086, 319811, 142609, -2127, 61408, 440365, 998145, 1245108, 828952, 163612, 69683, 594115, 754959, -103065, -1231779, -1436833, -724449, -135715, -127741, -104214, 356415, 778365, 632359, 96093, -437852, -914352, -1265336, -1202662, -830203, -777299, -1188355, -1285682, -602617, 46105, -304133, -1214517]
31644a214517k18025P16289O87137J7884k40692N9030L07037K86318K40557J88108
31634H29126k0649k07942p4722K78071M94879M27025J46364j87167k50640J86693
31624A621038P00409M87507m84711j242639j086784m35569R520J80437K27952
31615b2840J8295l16974j59468N18284P14914o2903p30317k45198N53196K03944
31605D70933q98174j030620Q1733Q62207M49942j14267J32504N20832J43380m76938
31595A41532l25453L53276N04411q451l12924r894L10100J44966j78155j57590
31585D61818P5090K7160l64900o22025l69474J84418N45704N65193N33677O39985
31575A676646O39728K75345k19486l83238j75847O401p0047k31291k80442k68176
$$ y = [-1214517, -1432542, -716253, -29116, -11232, -251924, -192894, 114143, 400461, 641018, 829126, 808477, 600535, 525813, 803884, 1298763, 1725788, 1872152, 1684985, 1434345, 1621038, 2321447, 2808954, 2324243, 1081604, -5180, -440749, -431229, -250792, -22840, -4545, -321519, -480987, 37297, 752211, 689308, -41009, -286207, 266989, 470933, -427241, -1457861, -1376128, -513921, -63979, -178246, -45742, 475090, 618470, 141532, -183921, 169355, 673766, 665315, 352391, 342497, 652597, 797563, 619408, 461818, 536908, 564068, 199168, -422857, -792331, -607913, -62209, 502984, 1036661, 1676646, 2316374, 2591719, 2372233, 1988995, 1813148, 1819549, 1749502, 1518211, 1237769, 969593]
31565I69593k67142j66960J33374M75565N09500J1630p95639j250661q57985j2318
31555a251043K86608k63230p40265l05428M73520M51703k78623n19387R8888N44271
31545a502986J31075l19494J70312J121393J328847O61343R6170J92407M86922
31536B365989M14772K3150l72002o01308n42264j38570K97033K66468k28309o00984
31526H83975m90460k40519k85947m44451k52091K11824L33195j73392q02505q51042
31516b111413k57643L84274N76864M32800L60726M41501L68747j4219m04028m27443
31506f49834j59225q179j60097l90290m36924l02088r5837J73063M69579N75110
31496i84722L06552j63261m15868k26000K41521O37974P00133L93246k2400j44752
$$ y = [969593, 702451, 535491, 668865, 1144430, 1653930, 1665560, 869921, -380740, -1238725, -1251043, -964435, -1227665, -1967930, -2273358, -1799838, -1348135, -1626758, -2146145, -2047257, -1502986, -1371911, -1691405, -1521093, -399700, 929147, 1590490, 1686660, 1879067, 2365989, 2780761, 2803911, 2431909, 1830601, 1288337, 1149767, 1446800, 1713268, 1484959, 883975, 393515, 152996, -132951, -577402, -829493, -617669, -284474, -457866, -1260371, -2111413, -2369056, -1984782, -1407918, -975118, -614392, -172891, 195856, 181637, -222391, -649834, -809059, -817238, -977335, -1367625, -1804549, -2106637, -2202474, -2029411, -1559832, -984722, -678170, -841431, -1257299, -1483299, -1241778, -603804, 96329, 489575, 467175, 322423]
31486C22423J07707K73554p7030o19213o14949k3777L44088L3178l72222k63836
31476h90077n4438m13116r43609o72915L13549Q51070M42603n7391J15136N06129
31466h03059L65210j29725l24166j61763l9486l1576J5175j9486k28488k16799
31456a574163L16290Q19067N09073m14239r63208o90151p3628L82304O59872P75264
31446b53519N73220J74642j646J13166J12963j61623l23180j25234M5059k68264
31436a14416q49850j003223l77683N98097J106815P60539K6654l17120j41346
31427c11533R987p5339P0303N56611N70888l55584j242411r31091P6967L84895
31417a246307n0470j1915O91774Q10896p9127o66968r0674N64281J22300o80827
$$ y = [322423, 430130, 703684, 626654, 7441, -607508, -631285, -287197, -254019, -626241, -890077, -944515, -1357631, -2301240, -2974155, -2660606, -1809536, -1366933, -1424324, -1309188, -803059, -437849, -567574, -891740, -1053503, -1092989, -1124565, -1109390, -1128876, -1357364, -1574163, -1257873, -438806, 70267, -343972, -1307180, -1997331, -2070959, -1688655, -1028783, -253519, 319701, 494343, 492697, 605863, 718826, 557203, 234023, 108789, 153848, -114416, -964266, -1967489, -2345172, -1747075, -640260, 120279, 146933, -170187, -311533, -301546, -376885, -306582, 250029, 820917, 465333, -777078, -1708169, -1631202, -1246307, -1296777, -1308692, -616918, 193978, 114851, -552117, -642791, -78510, 43790, -637037]
31407f37037m99046L50454N36997j3980j78958L11705N04236r189l95295k9708
31397e9821N08242M01005k84353r11171j071277o87584J04240P99966P53686l2099
31387d79166p01708m94295L53619R43301P52824P9818m30949m57957j77800R6278
31377e16035K83333M23980L48693j75464r14708j208050p42092Q4681P65103J181921
31367d68638J244189O49637m56704j129853o48998M43920J003687O78243j379
31358A314104n44901p41388l60348M37673O96027k29397j339857j041114M68412
31349a340789J283799N78259k28832J58350Q29468K41799j155475j487460k51442
31340a372323J003336R16618l6058n75025l45001K3717K5082k07604l20236k04304
$$ y = [-637037, -1136083, -785629, -248632, -262612, -441570, -129865, 374371, 365182, -30113, -59821, 448421, 849426, 565073, -346098, -1417375, -2104959, -2000719, -1200753, -447067, -479166, -1180874, -1675169, -1321550, -378249, 374575, 454393, 23444, -434513, -612313, -516035, -232702, 191278, 539971, 364507, -550201, -1758251, -2500343, -2415662, -1650559, -468638, 775551, 1425188, 968484, -161369, -810367, -366447, 637240, 1315483, 1314104, 769203, 27815, -332533, 105140, 801167, 571770, -768087, -1809201, -1340789, -56990, 521269, 292437, 450787, 1280255, 1522054, 366579, -1120881, -1372323, -368987, 547631, 511573, -63452, -408453, -384736, -359654, -567258, -887494, -1091798]
31330a091798j7925L5031r1170k16202q5530L35360P14775N87797j50973r80712
31320i61347j159124n31994K33232M46728K32651J98615M46780M94307J89737
31311d10415K9509L03584N47693K79759k17403l64659j54076q346p3707j92271
31301b60332l18606m12230j71283N01651R78132N59233m46472j023861p93420
31292a387188k98856L4823L33579N18094J29309o53593p89481J36004J029102
31283i48207P75412q2109k25029L77574N61757l8158m34104L7706O77333N77604
31273A279779j14357o82566q30862o10513p0693M15590K02125n46855n77636P17970
31263h18018J967168J422151n20147j763050j347582m15737j55574k45165M7949
$$ y = [-1091798, -1109723, -1074692, -1165862, -1382064, -1467594, -1132234, -417459, 170338, 19365, -961347, -2120471, -2652465, -2419233, -1972505, -1739854, -1541239, -1094459, -600152, -410415, -380906, -77322, 470371, 750130, 532727, 168068, 13992, 5646, -68061, -260332, -578938, -991168, -1162451, -660800, 317332, 876565, 430093, -593768, -1387188, -1686044, -1651221, -1317642, -799548, -670239, -1323832, -2113313, -1977309, -948207, -172795, -254904, -479933, -102359, 459398, 421240, -12864, 24842, 702175, 1279779, 1165422, 482856, -348006, -958519, -1029212, -613622, -411497, -958352, -1535988, -818018, 1149150, 2571301, 2051154, 288104, -1059478, -1475215, -1630789, -1875954, -1828005]
31254a828005M81566M90162L25434N24940Q25249N88674n4454m02618l00046k17080
31244D33822l28995l06039m1152J07297o7544k89446k37111N5588L31199L75594
31234C3213J47996j53060k57936k38705m97977j081053j352153p82942K48177
31225c934440R45719J106889J082313R84444O04458Q940m17327n10057m00335
31216e29396j47664J97839L37872R8483j36065J8834K06955j16169o57975p11550
31206a438836l79214l13469l79828J44941R70987Q41048l98543j202025n47126
31197b702065N35230O38430N9875j1565M86987O68143L68367K77659N84856O85744
31187A591661K45229l97530q81489j083661q29853j48435L21876J7193n91953
$$ y = [-1828005, -1346439, -856277, -530843, -5903, 819346, 1408020, 1353566, 950948, 650902, 433822, 104827, -201212, -242364, -135067, -202611, -492057, -729168, -673580, -342381, 33213, 181209, 28149, -229787, -468492, -966469, -2047522, -3399675, -4182617, -3934440, -2988721, -1881832, -799519, 184925, 789383, 798323, 380996, -129061, -529396, -677060, -479221, -141349, -42866, -178931, -160097, 46858, -69311, -727286, -1438836, -1818050, -2131519, -2511347, -2366406, -1395419, -554371, -952914, -2154939, -2702065, -2166835, -1528405, -1468530, -1480095, -993108, -324965, 43402, 321061, 905917, 1591661, 1836890, 1439360, 557871, -525790, -1355643, -1504078, -1182202, -1165009, -1756962]
31178a756962o04940j00946O9610j81591n2184N89428P75390M9935o32452l45912
31168b190624L99642N53739J11543j46171j1028M6860r7683l5622L22884M82228
31158e64232J22957m20222o22411l34173K00008N55097L53804l39498q53738n67824
31148b470232K38358O72331M50396K47327N75327R40797O45051n9805l39727n3312
$$ y = [-1756962, -2361902, -2462848, -2393238, -2574829, -2627013, -2037585, -1262195, -1212260, -1844712, -2190624, -1790982, -1237243, -1125700, -1271871, -1282899, -1236039, -1333722, -1369344, -1046460, -564232, -441275, -861497, -1483908, -1818081, -1618073, -1062976, -709172, -1048670, -1902408, -2470232, -2231874, -1559543, -1109147, -861820, -286493, 654304, 1299355, 1239550, 899823, 846511]
$$ [...]
##END NTUPLES=NMR SPECTRUM
##END=
