##TITLE=31Pdec_LY-TMF-15.70.3
 D2O, 24 sc
 6.3.2020
##JCAMPDX= 6.0         $$ Bruker NMR JCAMP-DX V2.0
##DATA TYPE= NMR SPECTRUM
##DATA CLASS= NTUPLES
##ORIGIN= UXNMR, Bruker Analytische Messtechnik GmbH
##OWNER= root
$$ XWIN-NMR		Version 3.5
$$ Fri Mar  6 19:13:37 2020 Russian Standard Time (UT+4h)  she@DPX200
##.OBSERVE FREQUENCY= 81.013821
##.OBSERVE NUCLEUS= ^31P
##.ACQUISITION MODE= SIMULTANEOUS
##.ACQUISITION SCHEME= undefined
##.AVERAGES= 24
##.DIGITISER RES= 17
##SPECTROMETER/DATA SYSTEM= spect
##.PULSE SEQUENCE= zgpg30
##.SOLVENT NAME= D2O
##.SHIFT REFERENCE= (INTERNAL, D2O, 0, 182.463)
##AUDIT TRAIL= $$ (NUMBER, WHEN, WHO, WHERE, WHAT)
$$ ##TITLE= Audit trail, XWIN-NMR		Version 3.5
$$ ##JCAMPDX= 5.01
$$ ##ORIGIN= Bruker BioSpin GmbH
$$ ##OWNER= she
$$ F:/spectra/data/she/nmr/P31/1/pdata/1/auditp.txt
$$ ##AUDIT TRAIL=  $$ (NUMBER, WHEN, WHO, WHERE, WHAT)
(   1,<2020-03-06 19:11:59.56 +0400>,<she>,<DPX200>,
      <created by zg, POWCHK disabled, PULCHK disabled
       configuration hash MD5:
       00 E9 B6 7A A2 85 ED C7 34 08 36 98 17 FE 4E 26
       data hash MD5: 32K
       88 E8 DE 8E 48 99 2B DF 9E 80 F0 AF 8A 19 7A EB>)
(   2,<2020-03-06 19:12:02.65 +0400>,<she>,<DPX200>,
      <Start of raw data processing
       efp BC_mod = 2 LB = 1 FT_mod = 6 PKNL = 1 PHC0 = -1334.596 PHC1 = 94.40169 SI = 64K 
       data hash MD5: 64K
       11 11 C7 21 0F 36 BD 73 EC 7D 28 11 85 DC D4 71>)
(   3,<2020-03-06 19:12:19.32 +0400>,<she>,<DPX200>,
      <pk PHC0 = 7.482605 PHC1 = 0 
       data hash MD5: 64K
       37 03 A0 2A EA 91 78 7F 40 03 82 E0 DC 78 F4 07>)
(   4,<2020-03-06 19:12:22.57 +0400>,<she>,<DPX200>,
      <abs ABSG = 5 
       data hash MD5: 64K
       65 67 4F 8C 39 74 A6 D8 3E 21 C9 C3 3E 89 D2 A0>)
(   5,<2020-03-06 19:12:38.43 +0400>,<she>,<DPX200>,
      <pk PHC0 = -3.799936 PHC1 = 0 
       data hash MD5: 64K
       80 D1 3D 44 79 AD 2C FA AA 4A 96 A7 D6 6E 22 9D>)
(   6,<2020-03-06 19:12:55.98 +0400>,<she>,<DPX200>,
      <pk PHC0 = 2.8 PHC1 = 0 
       data hash MD5: 64K
       D5 E6 C4 F6 7B 4F F3 5B 62 5E E1 B2 2C BC 71 67>)
$$ ##END=
$$ 
$$ hash MD5
$$ 6C 26 D6 73 44 6A D8 75 AD FB BC 50 62 A5 15 89
##$RELAX= 
##$RELAX= 
##$RELAX= 
##$RELAX= 
##$RELAX= 
##$RELAX= 
##$RELAX= 
##$RELAX= 
$$ Bruker specific parameters
$$ --------------------------
##$DU= <F:/spectra>
##$EXPNO= 1
##$NAME= <P31>
##$PROCNO= 1
##$TYPE= <nmr>
##$USER= <she>
##$AMP= (0..31)
100 100 100 100 100 100 100 100 100 100 100 100 100 100 100 100 100 100 
100 100 100 100 100 100 100 100 100 100 100 100 100 100 
##$AQSEQ= 0
##$AQ_mod= 1
##$AUNM= <au_zg>
##$AUTOPOS= <>
##$BF1= 81.014009
##$BF2= 200.13
##$BF3= 200.13
##$BF4= 200.13
##$BF5= 200.13
##$BF6= 200.13
##$BF7= 200.13
##$BF8= 200.13
##$BYTORDA= 1
##$CFDGTYP= 0
##$CFRGTYP= 5
##$CHEMSTR= <none>
##$CNST= (0..31)
1 1 145 1 1 1 1 1 1 1 1 1 1 1 1 1 1 1 1 1 1 1 1 1 1 1 1 1 1 1 1 1 
##$CPDPRG= <waltz16>
##$CPDPRG1= <>
##$CPDPRG2= <waltz16>
##$CPDPRG3= <>
##$CPDPRG4= <mlev>
##$CPDPRG5= <mlev>
$$ [...]
##$SUBNAM3= <"">
##$SUBNAM4= <"">
##$SUBNAM5= <"">
##$SUBNAM6= <"">
##$SUBNAM7= <"">
##$SUBNAM8= <"">
##$SUBNAM9= <"">
##$SW= 369.568048894756
##$SWIBOX= (0..15)
0 1 3 0 0 0 0 0 0 0 0 0 0 0 0 0 
##$SW_h= 29940.119760479
##$TD= 32768
##$TD0= 1
##$TE= 0
##$TE2= 300
##$TE3= 300
##$TEG= 300
##$TL= (0..7)
0 120 53 12 22 120 120 120 
##$TP= (0..7)
150 150 150 150 150 150 150 150 
##$TP07= 0
##$TPNAME0= <>
##$TPNAME1= <>
##$TPNAME2= <>
##$TPNAME3= <>
##$TPNAME4= <>
##$TPNAME5= <>
##$TPNAME6= <>
##$TPNAME7= <>
##$TPOAL= (0..7)
0.5 0.5 0.5 0.5 0.5 0.5 0.5 0.5 
##$TPOFFS= (0..7)
0 0 0 0 0 0 0 0 
##$TUNHIN= 0
##$TUNHOUT= 0
##$TUNXOUT= 0
##$USERA1= <user>
##$USERA2= <user>
##$USERA3= <user>
##$USERA4= <user>
##$USERA5= <user>
##$V9= 5
##$VALIST= <valist>
##$VCLIST= <CCCCCCCCCCCCCCC>
##$VD= 0
##$VDLIST= <DDDDDDDDDDDDDDD>
##$VPLIST= <PPPPPPPPPPPPPPP>
##$VTLIST= <TTTTTTTTTTTTTTT>
##$WBST= 1024
##$WBSW= 4
##$XGAIN= (0..3)
0 0 0 0 
##$XL= 0
##$YL= 0
##$YMAX_a= 39934
##$YMIN_a= -41669
##$ZGOPTNS= <>
##$ZL1= 120
##$ZL2= 120
##$ZL3= 120
##$ZL4= 120
##$ABSF1= 182.463
##$ABSF2= -187.1042
##$ABSG= 5
##$ABSL= 3
##$ALPHA= 0
##$AQORDER= 0
##$ASSFAC= 0
##$ASSFACI= 0
##$ASSFACX= 0
##$ASSWID= 0
##$AUNMP= <proc_1d>
##$AZFE= 0.1
##$AZFW= 0.5
##$BCFW= 0
##$BC_mod= 2
##$BYTORDP= 0
##$COROFFS= 0
##$CY= -3
##$DATMOD= 1
##$DC= 0
##$DFILT= <>
##$DTYPP= 0
##$F1P= 0
##$F2P= 0
##$FCOR= 1
##$FTSIZE= 65536
##$FT_mod= 6
##$GAMMA= 0
##$GB= 0
##$INTBC= 1
##$INTSCL= 5.30512e-09
##$ISEN= 30
##$LB= 1
##$LEV0= 0
##$LPBIN= 0
##$MAXI= 10000
##$MC2= 0
##$MEAN= 0
##$ME_mod= 0
##$MI= 50
##$NCOEF= 0
##$NC_proc= -2
##$NLEV= 6
##$NOISF1= 182.463
##$NOISF2= 159.3651
##$NSP= 0
##$NTH_PI= 0
##$NZP= 0
##$OFFSET= 182.463
##$PC= 4
##$PHC0= -1328.113
##$PHC1= 94.40169
##$PH_mod= 1
##$PKNL= yes
##$PPARMOD= 0
##$PSCAL= 0
##$PSIGN= 0
##$REVERSE= no
##$SF= 81.0140089999434
##$SI= 65536
##$SIGF1= 159.3651
##$SIGF2= -187.1042
##$SINO= 113.3802
##$SIOLD= 16384
##$SREGLST= <1H.CDCl3>
##$SSB= 0
##$STSI= 65536
##$STSR= 0
##$SW_p= 29940.119760479
##$SYMM= 0
##$S_DEV= 0
##$TDeff= 32768
##$TDoff= 0
##$TI= <>
##$TILT= no
##$TM1= 0
##$TM2= 0
##$TOPLEV= 0
##$USERP1= <user>
##$USERP2= <user>
##$USERP3= <user>
##$USERP4= <user>
##$USERP5= <user>
##$WDW= 1
##$XDIM= 65536
##$YMAX_p= 273856290
##$YMIN_p= -2483105
$$ End of Bruker specific parameters
$$ ---------------------------------
##NTUPLES= NMR SPECTRUM
##VAR_NAME=  FREQUENCY,     SPECTRUM/REAL,   SPECTRUM/IMAG
##SYMBOL=    X,             R,               I
##VAR_TYPE=  INDEPENDENT,   DEPENDENT,       DEPENDENT
##VAR_FORM=  AFFN,          ASDF,            ASDF
##VAR_DIM=   65536,         65536,           65536
##UNITS=     HZ,            ARBITRARY UNITS, ARBITRARY UNITS
##FACTOR=    0.456856943014862, 1,           1
##FIRST=     14782.0589164792, 0,            0
##LAST=      -15158.0608439998, 0,           0
##MIN=       -15158.0608439998, -2483105,    0
##MAX=       14782.0589164792, 273856290,    0
$$ Real data points
##PAGE= N=1
##DATA TABLE= (X++(R..R)), XYDATA
$$ [...]
##PAGE= N=2
##DATA TABLE= (X++(I..I)), XYDATA
37012D38104J17662L1019q7805j45330j07082j4148P3707J11411P5862r028p5065
$$ 438104 555766 586785 498980 353650 246568 232420 306127 417538 493400 484372 409307
37001D09307p9932n1458k9492n684L5331O2100M0196q387m1356n2223m5785j1021
$$ 409307 329375 277917 248425 242741 278072 340172 380368 371981 330625 278402 232617 221596
36989B21596L2586K6825k9752n4477j6559o100p1728r4783L1118J80155J38672
$$ 221596 254182 281007 251255 196778 180219 174119 102391 7608 38726 218881 357553
36978C57553o6962j82682p9921Q6430J24085M6303j3509n170J9618J5103j7345
$$ 357553 290591 107909 27988 114418 238503 284806 271297 266127 285745 300848 283503
36967B83503n2224n1172P805Q0231Q4329R262n7867m1892L1811Q2203O0795k0262
$$ 283503 231279 180107 187912 268143 352472 361734 303867 261975 293786 375989 436784 416522
36955D16522r9349r6212R932J22629J14878p316r6158m6965P1492J13150L2371
$$ 416522 317173 220961 230893 353522 468400 461084 364926 317961 389453 502603 534974
36944E34974q0506j14263n0947K5996K4151n3222j07904o7500K5125P6783O0085
$$ 534974 454468 340205 289258 315254 339405 286183 178279 110779 135904 212687 272772
36933B72772J3483l3305o3234l8456M8344J13698P2327k7040n8709p151J7881
$$ 272772 286255 252950 189716 151260 199604 313302 385629 358589 299880 292729 310610
36922C10610l6794r3893q7097n6251m4897j1242Q0480J62749J45169M0363o1833
$$ 310610 273816 179923 92826 36575 -8322 -19564 60916 223665 368834 409197 347364
36911C47364j06722j03229p5712m1281j2794J1306L9643N6700L6185n322j8096
$$ 347364 240642 137413 61701 20420 7626 18932 58575 115275 151460 146138 128042
36900A28042O340K7636L2419M7366O2071K3421o0226r5125l2566N2644P0990L7171
$$ 128042 134382 162018 194437 241803 303874 327295 267069 171944 139378 192022 263012 300183
36888C00183J8563K6813K8743J5835l142l8102q6236j02273n6637J1181M6910
$$ 300183 318746 345559 374302 390137 386995 348893 262657 160384 103747 114928 161838
36877A61838N0178M1140P035n6140r1123m2175N2753R9225O3917Q0l3882l1457
$$ 161838 212016 253156 260191 204051 112928 70753 123506 222731 286648 286728 252846 221389
36865B21389j8456j5903k2038j2834K5296N6909L1510k8854l4600M1180R8214
$$ 221389 202933 187030 164992 152158 177454 234363 265873 237019 202419 243599 341813
36854C41813L7272r1355j42075n6411P7553J43340J14099M4802p404l4042o2538
$$ 341813 379085 287730 145655 89244 166797 310137 424236 469038 461634 427592 365054
36843C65054j04319j25262q7115j1444L6271L0389Q060L2o803j9249j0094K7358
$$ 365054 260735 135473 48358 36914 73185 103574 111634 111666 104863 85614 75520 102878
36831A02878N1432L5379R401N106R106N968J1822K8718K5915N706J8371O3852
$$ 102878 154310 189689 199090 204196 213302 219270 231092 259810 285725 291431 309802 373654
36819C73654N8511l1734j03982n5534N4254Q3593P525o8354o7708j3517M9465
$$ 373654 432165 400431 296449 240915 295169 378762 386287 317933 250225 236708 286173
36808B86173J02033J15933O0273l9610j12479j19711p7078j1742M6873N5466M934
$$ 286173 388206 504139 564412 524802 412323 292612 215534 203792 250665 306131 311065
36797C11065l7342o142N7208N8787l820m2151j9102P522q04l033L0679N3139J9361
$$ 311065 273723 267581 324789 383576 379756 337605 318503 326025 325221 322188 352867 406006 425367
36784D25367l1034l0507J4792L4131j2855q8383j20680p7770K213N1815M5140
$$ 425367 394333 363826 378618 412749 399894 311511 190831 113061 115274 167089 212229
36773B12229J3397j2888l9245o2555m0876L9809J06679P6411k7592r9124q1187
$$ 212229 225626 212738 173493 110938 70062 109871 216550 292961 265369 166245 85058
36762H5058j5371L1513L2913J823k3441l397M8852O6028K7768J2717P3245J16978
$$ 85058 69687 101200 134113 135936 112495 109098 157950 223978 251746 264463 337708 454686
36750D54686K9607j23029j59698m5564O2089N4674O222J0653L0562r58m5357l3249
$$ 454686 484293 361264 201566 156002 218091 272765 278987 289640 320202 319244 273887 240638
36738B40638J0278J8008n849j6445j4604j6251N419N7716O7407j6987j10745r0833
$$ 240638 250916 268924 263075 246630 232026 215775 221194 278910 346317 329330 218585 127752
36726A27752K4097J01599Q2906L2568J0758R105K0470O1366R9940O3964l9741
$$ 127752 151849 253448 336354 368922 379680 388785 409255 470621 570561 634525 594784
36715E94784j02921o0289K0573M4639J4540q424o202K146K1082N7901P1357J5689
$$ 594784 491863 431574 452147 496786 511326 502902 496700 498846 519928 577829 649186 664875
36703F64875p7027j25805j06684o7782m1723j0503L3514O0047N7729N5286N4511
$$ 664875 587848 462043 355359 287577 245854 235351 268865 328912 386641 441927 496438
36692D96438Q590q3036j23667m1819Q0347R8793R576m9825j3144J6210o5052j88138
$$ 496438 505028 421992 298325 256506 336853 435646 445222 395397 382253 398463 333411 145273
36680A45273k00076o8892Q9038J58016J19978K4119n8565n9161L0875J21248J11984
$$ 145273 -54803 -123695 -34657 123359 243337 267456 208891 149730 180605 301853 413837
36669D13837K2570l9343l4731k6590m4265k6217M9425Q3447k537j18490j15222
$$ 413837 436407 397064 362333 335743 291478 265261 314686 398133 395596 277106 161884
36658A61884k282O5159J3527n5771l4597L6102M9732O86k3841J2933N4391N4198
$$ 161884 159602 224761 238288 182517 147920 184022 233754 234440 210599 223532 277923 332121
36646C32121M1881N3998O4161L3527j0276q231L1840L5247l5702j30080j73913
$$ 332121 374002 428000 492161 525688 515412 507181 539021 574268 538566 408486 234573
36635B34573j42088n2985N5704J23250R5941J963n2612j1210N4996N1170n935
$$ 234573 92485 39500 95204 218454 314395 316358 263746 252536 307532 358702 352767
36624C52767l0182m581J4142J0024K4360N3296L2763m4444q9566m2830L9849P7950
$$ 352767 322585 318004 332146 342170 366530 419826 452589 408145 318579 275749 315598 393548
36612C93548P4929P4290O7609K1344m2712o8001m6868k3844k6397m0297m2919
$$ 393548 468477 542767 610376 631720 589008 521007 474139 450295 423898 383601 340682
36601C40682k1595K4294O3719M4268l2697p8655k2107P4401P6099m3521j56877
$$ 340682 319087 343381 407100 451368 418671 340016 317909 392310 468409 424888 268011
36590B68011j39810j6537Q7124R2017K5259m2049o8886n4051q547N3771J01912
$$ 268011 128201 111664 198788 290805 316064 274015 205129 151078 142531 196302 298214
36579B98214R3350K0824n6001o2870k417M5602L3187Q219L3949Q6267Q6248R739
$$ 298214 391564 412388 356387 293517 291100 336702 369889 378108 412057 498324 584572 594311
36567E94311r2998j68562j89171j27170J8113J61841J86403Q4494k0993l7642
$$ 594311 501313 332751 143580 16410 34523 196364 382767 467261 446268 408626
36557D08626j2659k8618o3568m2311J9000K6723l6868p5181k0307O7116Q7898
$$ 408626 395967 367349 303781 261470 280470 307193 270325 195144 174837 241953 329851
36546C29851L4780k2915m5324n0868n5667m3322l508L9493N4761M1786K5637K2390
$$ 329851 364631 341716 296392 245524 189857 146535 143027 182520 237281 279067 304704 327094
36534C27094J8436r785n1436n1685K3512J15213J11265j6846j57481j78279p1359
$$ 327094 345530 335745 284309 232624 256136 371349 482614 465768 308287 130008 58649
36523E8649O2427J39117J42020P6897l6488j25658j06801J339P3998L5162l9525
$$ 58649 121076 260193 402213 479110 442622 316964 210163 211502 285500 320662 281137
36512B81137k7152P6258J53609J14492m280q8199p0415l289p69r4617j71818j09010
$$ 281137 253985 330243 483852 598344 594064 505865 435450 432161 431392 336775 164957 55947
36500E5947M5810J14471K8378p6188n6988M0345P8597L8115J0409K9873L9964
$$ 55947 101757 216228 244606 168418 111430 151775 230372 268487 278896 308769 348733
36489C48733J4548n889p107k4586n6344m9141K545L2968J2281n525K0519N0610
$$ 348733 363281 357392 350285 325699 269355 220214 222759 255727 268008 262483 283002 333612
36477C33612L8385N594p036p278k0085l5288l3521k5788k6190k1038k149M623
$$ 333612 371997 377591 370555 363277 343192 307904 274383 248595 222405 201367 199218 203841
36465B03841j9104m6936m6720k6308q293J0115L8347O1028N8393L7336J6556J112
$$ 203841 184737 137801 91081 64773 56480 66595 104942 165970 224363 261699 278255 279367
36453B79367r447j1792j2576k2832k6843N489N9211P1979J8589m3901n1436j9023
$$ 279367 269920 258128 245552 222720 195877 201366 260577 332556 351145 307244 255808 236785
36441B36785r464l7233m7400P942R7499J29508N1003p3483j15089l6601M7117
$$ 236785 227321 190088 142688 150630 248129 377637 428640 355157 240068 203467 250584
36430B50584J8203p5957r0187M120Q2801O0302K725J922L7378L7000J261j6224
$$ 250584 268787 192830 102643 106763 189564 249866 252591 254513 291891 328891 330152 313928
36418C13928o456o579k5966l0886L331N7651Q1946M0170l4867n2545J7685P0636
$$ 313928 307472 300893 274927 244041 247372 305023 386969 427139 392272 339727 357412 428048
36406D28048j688j25390j23073J9484J21976Q5678K8902O1716R9015L3677n5178
$$ 428048 426360 300970 177897 197381 319357 405035 433937 495653 594668 628345 573167
36395E73167m1488J4646l1532j49043j72007o3898M7070Q0132P3109M9074j2391
$$ 573167 531679 546325 514793 365750 193743 129845 176915 257047 330156 379230 366839
36384C66839o4377k4935O2025O4604j7605m5735J5889L7981l5580q1763k2866
$$ 366839 302462 277527 339552 404156 386551 340816 356705 394686 359106 277343 254477
36373B54477K8681k4187q0657k0997P3360N8806k0682j9672M8165M6252k3830
$$ 254477 283158 258971 178314 157317 230677 289483 268801 249129 297294 343546 319716
36362C19716j6201R1101J33451K8060q2397n7402K5097J4755o4261p1563J0191
$$ 319716 303515 394616 528067 556127 473730 416328 441425 456180 391919 320356 330547
36351C30547N9649K3153j9075j3110j4814n9551p3794k702P0907M1684m8843p2095
$$ 330547 390196 413349 394274 381164 366350 306799 233005 230303 301210 342894 294051 221956
36339B21956m031N8298N5891K8784J4408m243k8622k4850j385r998m2216k8599
$$ 221956 217925 276223 332114 360898 375306 371063 342441 317591 316206 306208 263992 235393
36327B35393K7598L6117j2981m178J00232J52122L5798j28604j55524p0943l8398
$$ 235393 262991 299108 286127 281949 382181 534303 570101 441497 285973 215030 176632
36316A76632p4825m6058P0541J28312N4323l2292j7621L9237K6941m1132o8416
$$ 176632 101807 55749 126290 254602 308925 276633 259012 298249 325190 284058 215642
36305B15642k2192M4257P2983M8779N01j4817K8816P0898K8597p3365j15048m5607
$$ 215642 193450 237707 310690 359469 359970 345153 373969 444867 473464 400099 285051 239444
36293B39444M9457Q1302P2302Q3270J02320P8781J8423k7879m5915o8121j07373
$$ 239444 288901 370203 442505 525775 628095 706876 725299 697420 651505 583384 476011
36282D76011j23892p0714L8005J16909R2273J794l3418L3639J04662P7699n950
$$ 476011 352119 281405 319410 436319 528592 530386 496968 530607 635269 712968 707018
36271G07018m3455l8150o7463j24218j26476o9610k9674j8224K3405P9911O5432
$$ 707018 663563 625413 557950 433732 307256 237646 207972 189748 213153 293064 358496
36260C58496p955k3186M4594Q3404M2774R692K6676J0776o3367q1218J367M4540
$$ 358496 350541 327355 371949 455353 498127 507819 534495 545271 481904 400686 402053 446593
36248D46593m0791j14624l2722R9106Q8815m0800j15274q1702j9376M5930J32221
$$ 446593 405802 291178 258456 357562 446377 405577 290303 208601 189225 235155 367376
36237C67376J64518N9468q8639j11376k8698q76m2487j6123Q4032R2575l0009
$$ 367376 531894 591362 502723 391347 362649 361773 319286 303163 387195 479770 449761
36226D49761j02438k1647O3176Q384q2792m2703Q1683J14320K3672o1608o1673
$$ 449761 347323 325676 388852 397236 314444 271741 353424 467744 491416 429808 368135
36215C68135k1302Q52k053k0245l7052j8384L5219N7504R935l7341l498O8060
$$ 368135 346833 347685 345632 325387 288335 269951 305170 362674 372609 335268 331770 399830
36203C99830P4852K1392J823L0394J8599o1105j15238q0664k5047k6661m8209
$$ 399830 474682 496074 497897 528291 546890 485785 370547 289883 264836 238175 189966
36192A89966j9255K9600K0961k8185l4074O536J5585j7256r700N5820P5272n205
$$ 189966 170711 200311 221272 193087 159013 165549 181134 163878 154178 209998 285270 280065
36180B80065p2487q952J12103J26849K7215m2564k4008j9452r1200j34598m2776
$$ 280065 207578 198626 310729 437578 464793 422229 398221 378769 287569 152971 110195
36169A10195J05966J41289L4544o5060k5238J09765J74763P3569j01780j59546
$$ 110195 216161 357450 391994 326934 301696 411461 586224 659793 558013 398467
36159C98467l4861J10977Q3852q2187j67453p1903N7861N7218l3922p1342k2352
$$ 398467 363606 474583 558435 476248 308795 236892 294753 351971 318049 246707 224355
36148B24355L7197O7461Q1641O4699n555p9920q4351k9867J1940K1228K9914L3970
$$ 224355 261552 329013 410654 475353 469798 389878 305527 275660 287600 308828 338742 372712
36136C72712J263m6238m9834q249K6304L6355M4191M2418L408n0641o8399n2575
$$ 372712 373975 327737 277903 269654 295958 332313 376504 418922 422330 371689 303290 250715
36124B50715m5588m6267k2834N942q816n3459o5620l1024J6164O9070J30612J47991
$$ 250715 205127 158860 136026 141968 133152 79693 14073 -16951 -787 68283 198895 346886
36112C46886P8481q27J8186Q5498M6157j01366j68788n7970Q3060Q0636k0608
$$ 346886 425367 424540 442726 528224 574381 473015 304227 246257 329317 409953 389345
36101C89345n5227J8302R9811J15473Q1711K9886k7406o1759m3799J478J1454
$$ 389345 334118 352420 452231 567704 649415 679301 651895 590136 546337 547815 559269
36090E59269l5811r5418j06265m7427M3490R4880O5374q063n3023n0690l9671
$$ 559269 523458 428040 321775 274348 317838 412718 478092 470029 417006 366316 326645
36079C26645l6950j9451R884J4986O151M2328J16876J29391L1612p9034r0712
$$ 326645 289695 270244 280128 295114 301265 343593 460469 589860 621472 542438 451726
36068D51726l6137k6183p0546p2077J1857J03714J20755P7585L8846K3432N53
$$ 451726 415589 389406 318860 246783 258640 362354 483109 560694 599540 622972 623525
36057F23525m3015p2474m7683J9983O7003L9740m7785j26617j37942p4804K7058
$$ 623525 580510 508036 460353 480336 547339 587079 539294 412677 274735 199931 226989
36046B26989J11397J20083L0998j01722j69605j03272M8956J46999Q4769r1213
$$ 226989 338386 458469 489467 387745 218140 114868 163824 310823 395592 304379
36036C04379k04298j29275N3437J45137P8087q579J7509R5739R2310J8558p413
$$ 304379 100081 -29194 24243 169380 247467 238888 256397 352136 444446 463004 455591
36025D55591K9143K3393n6234j09093p1093j1309l250r449L3949J00438J16284
$$ 455591 484734 508127 451893 342800 271707 260398 257148 247699 281648 382086 498370
36014D98370O8622J0982p389J4505K6654l3542j53674k12315j09946P5773J63372
$$ 498370 566992 577974 570585 585090 611744 578202 424528 212213 102267 178040 341412
36003C41412R9191O878o832K8150N0893O2417N7681n930r7594r4383L2499J27117
$$ 341412 440603 447481 440649 468799 519692 582109 639790 633860 536266 441883 474382 601499
35991F01499N7788q0262j00661P741Q8878N3868k6798n9369m2248k6701l8525
$$ 601499 659287 579025 478364 486105 574983 628851 602053 542684 500436 473735 435210
35980D35210o2222o5173l1697J2668K9725K4910L1060L6078j112n4293m6556J1261
$$ 435210 372988 307815 276118 288786 318511 343421 374481 410559 409447 355154 308598 319859
35968C19859J3856n7251p3510L6925J49298J20647L960m7703q156L1169L3616
$$ 319859 333715 276464 202954 239879 389177 509824 513784 466081 457925 489094 522710
35957E22710L5327L2887o061m4594j8555L9904M0028k2587p1609p9363p3520l7447
$$ 522710 558037 590924 584863 540269 521714 561618 601646 579059 507450 428087 354567 317120
35945C17120O4312J67996J54409K6874p6953p4550k6541q099m858J7754L5671
$$ 317120 381432 549428 703837 730711 653758 579208 552667 544568 539710 557464 593135
35934E93135J1463m5705j03653j37672j18210k9424P9611J21117O8457j6472o3272
$$ 593135 604598 558893 455240 317568 199358 169934 249545 370662 439119 422647 359375
35923C59375n1413Q707R0258J39266J10922L0636k9927m3594m7760p3195j00951
$$ 359375 307962 316669 406927 546193 657115 687751 657824 614230 566470 493275 392324
35912C92324r4355l7609N0931J14984R6253J0777m8659l1126J106k2887o6867
$$ 392324 297969 260360 311291 426275 522528 533305 484646 453520 454626 431739 364872
35901C64872n5544j920K8180K9305L0778O656o9603j22194o1058N2748P5523M911
$$ 364872 309328 307408 335588 364893 395671 402327 332724 210530 149472 202220 277743 282654
35889B82654j9916M6528Q2676O267r4318j05377m4458N052K0091K4965K7952L4099
$$ 282654 262738 309266 391942 398209 303891 198514 154056 159108 179199 204164 232116 266215
35877B66215N9908Q9549P6655K1426k0993l3250n9074j07182j16185n1559L9480
$$ 266215 326123 415672 492327 513753 492760 459510 400436 293254 177069 125510 164990
35866A64990J02733J31084J18998M9469m0868o8914j4389N4413Q6681R3078O7510
$$ 164990 267723 398807 517805 567274 526406 457492 443103 497516 584197 677275 744785
35855G44785k2906j34557j52491n3875M2476M7451J1763K687p874m7640n2833
$$ 744785 721879 587322 434831 380956 423432 470883 482646 485333 477459 429819 376986
35844C76986K0763R2014P2327R071m04L4167L9084J3218L080o045n2888r2320
$$ 376986 397749 489763 562090 571161 570757 604924 644008 657226 660306 654261 601373 509053
35832E09053m5086O4268J25462Q6618o673r2709j27463p0163O4989J66318J35359
$$ 509053 463967 528235 653697 740315 733642 640933 513470 443307 508296 674614 809973
35821H09973K3157m1166l4063l7816p5093p6851k8090j2147o5993j07386o6468
$$ 809973 833130 791964 757901 720085 644992 568141 540051 527904 461911 354525 288057
35810B88057Q110M3065N4024Q3278R4414K7648p7796j14192n0046L5915O8235
$$ 288057 296167 339232 393256 476534 570948 598596 520800 406608 356562 392477 460712
35799D60712N1053K0279j0274k7924r364K8351J8582n7842j12177n8438M6886
$$ 460712 511765 532044 521770 493846 484482 512833 531415 473573 361396 302958 349844
35788C49844P1733Q992n339Q9231J59541O8528j05502j62569n2304P4608Q1226
$$ 349844 421577 430569 425230 514461 674002 742530 637028 474459 422155 496763 577989
35777E77989l475o6594m9926K4472R3878R3445J5621n6916m0577K8000M0305j6549
$$ 577989 574514 507920 457994 482466 576344 669789 685410 628494 587917 615917 656222 639673
35765F39673m5003o714J1945m7283j08535q3290n752L7325L7143L5634L0593K21
$$ 639673 594670 587956 599901 552618 444083 360793 355041 392366 429509 465143 495736 495957
35753D95957k3386M557N5883O2718J3162n0368r8808j19654q7878n061O1880N4888
$$ 495957 472571 477128 533011 595729 608891 558523 459715 340061 252183 247122 309002 363890
35741C63890J4169J8730N8264M8483k9818r1635o6613J1300O3970O9569O4151
$$ 363890 378059 396789 455053 503536 473718 382083 315470 326770 390740 460309 524460
35730E24460O8086N1858j3742r0062q7778K0685J29630R9729o4820k01390j77377
$$ 524460 592546 644404 630662 540600 452822 473507 603137 702866 638046 436656 259279
35719B59279l5488Q6064J20321J03050Q2090O3644L5072q958n8642q2956n3164
$$ 259279 223791 309855 430176 533226 615316 678960 714032 705074 646432 563476 510312
35708E10312N959K5322j6666n2344j5761O3073J02367P3017P423o4643j27703
$$ 510312 516271 541593 524927 472583 456822 519895 622262 695279 702702 638059 510356
35697E10356j46267q5307K6928J02901Q1769n778o5371l0239O4953J06145K4098
$$ 510356 364089 278782 305710 408611 490380 484602 419231 388992 453945 560090 584188
35686E84188j06568j39091l3951R0349J10597M2062j6509k6337k8340m5752m1529
$$ 584188 477620 338529 304578 394927 505524 547586 531077 504740 476400 430648 389119
35675C89119J3622P7820P5094j0486j00251j01200j7254N5028N3974K4466K6230
$$ 389119 402741 480561 555655 545169 444918 343718 326464 381492 435466 459932 486162
35664D86162L3815j574m7640m6782l3179p5109j27847q3443L6557Q9216L3009
$$ 486162 519977 518403 470763 423981 390802 315693 187846 104403 140960 230176 263185
35653B63185j2201K6774O5445L2549J348M4975Q8092K9514p9846j09408l8588
$$ 263185 250984 277758 343203 375752 377100 422075 510167 539681 459835 350427 311839
35642C11839L8134N3145J9453k4064m6827l4082q032l507J055O1094J51012J62586
$$ 311839 349973 403118 422571 398507 351680 317598 309566 306059 307114 368208 519220 681806
35630F81806N7332p0972j25790j05895m4038L9562Q9104M5827l3909l1630L0456
$$ 681806 739138 668166 542376 436481 392443 432005 521109 566936 533027 501397 531853
35619E31853Q589j00584j24897j7407M0140m6293j02182J3591J52893J28251J4253
$$ 531853 540442 439858 314961 297554 337694 291401 189219 202810 355703 483954 498207
35608D98207k4508j7436n7653o5710N1025J60421J04924m832J6669Q5437J1918
$$ 498207 473699 456263 398610 332900 383925 544346 649270 644438 661107 746544 758462
35597G58462j22482j03708M013l3105j63824j11670J22437K26399Q5906o4486
$$ 758462 635980 532272 536285 503180 339356 227686 350123 576522 662428 597942
35587E97942p0456n6520r5393n4713Q5542J16658k7187j07888J7124J42264P2136
$$ 597942 527486 470966 375573 320860 406402 523060 495873 387985 405109 547373 619509
35576F19509n3101k8322P0023O0802k4247m8390k5051l3956l4540K0673L3202
$$ 619509 566408 538086 608109 668911 644664 596274 571223 537267 502727 523400 556602
35565E56602o8048j42088m3520J11268J08497l5778j29537j02177m1130K318M9489
$$ 556602 488554 346466 302946 414214 522711 486933 357396 255219 214089 216407 265896
35554B65896Q3033O7147L9465M7992N3167J1886k0718N118K3877k2509n8119j1191
$$ 265896 348929 416076 455541 503533 556700 568586 547868 552986 576863 554354 496235 485044
35542D85044L2439k5581j02001n7495P1864J43313J28279R3172L9602n6728j20467
$$ 485044 517483 491902 389901 332406 404270 547583 675862 769034 808636 751908 631441
35531F31441p4289J727r238m8373J2566J13327P5676r4328j96486j34877k1704
$$ 631441 557152 558879 549641 501268 513834 627161 702837 608509 412023 277146 255442
35520B55442L7759O9083R7794P5276j374m2967o988L4981K1297j3466k2577k2574
$$ 255442 293201 362284 460078 535354 533980 491013 484025 519006 540303 526837 504260 481686
35508D81686l9318n5050m5565j3088L1887O9849O2878N858l5284o511M1712K4646
$$ 481686 442368 387318 341753 328665 360552 430401 493279 499137 463853 457342 499054 523700
35496E23700m2953p0385k4299M5867R0009Q5248J9017o9636p7702L3475J43143
$$ 523700 480747 410362 386063 431930 521939 607187 626204 556568 478866 512341 655484
35485F55484J14030j2892q6384o7124m5951o4600o3941j4308L5718N8808Q3203
$$ 655484 769514 756622 670238 603114 557163 492563 428622 414314 450032 508840 592043
35474E92043J09123R1776K5442m1091p8733r0420o2433R406O4028M0668j9194
$$ 592043 701166 792942 818384 777293 698560 608140 545707 555113 619141 659809 640615
35463F40615l2429r247j8088m5248j8041M7611N8965M685l4080l7279p0227j34659
$$ 640615 608186 598939 580851 535603 517562 565173 624138 628823 594743 557464 487237 352578
35451C52578j38936n6974J7746L0254M8332J18998J58779Q2735m2324p8154k794
$$ 352578 213642 156668 174414 204668 253000 371998 530777 613512 571188 493034 490240
35440D90240P4731O9852J5442j0631L060k73m7172p8444k9765N7027P3297n44
$$ 490240 564971 634823 650265 639634 642694 642421 595249 516805 487040 544067 617364 616820
35428F16820o1548l7333J5316J7011j6267l0594k6810j8095K3168R1381J05580
$$ 616820 555272 517939 533255 550266 533999 503405 476595 458500 481668 573049 678629
35417F78629L4872k3468O102M9127K3655N0O2242J13254J4217j54531j84538n4998
$$ 678629 713501 690033 696135 745262 768917 768967 831209 944463 958680 804149 619611 564613
35405E64613N4572N3800L0919M2976K7930l3447n9691k7483j7508m7258k4318
$$ 564613 619185 672985 703904 746880 774810 741363 681672 654189 636681 589423 565105
35394E65105P0073J11505K6493q4045j00396m3590J749J7477K3708Q778l5308
$$ 565105 635178 746683 773176 689131 588735 545145 546894 564371 588079 596857 561549
35383E61549o9278n2844J0849R2999J45506J02425m0825j66945j58659o4254k3988
$$ 561549 492271 439427 450276 543275 688781 791206 750381 583436 424777 360523 336535
35372C36535n1274l1062O6247J29282R2275K8670J4123K5085J8853K916j0610
$$ 336535 285261 254199 320446 449728 542003 570673 584796 609881 628734 631650 621040
35361F21040k2783j1159K6613J7140p5339j26448j4892J34730R5379q7638j27636
$$ 621040 598257 587098 613711 630851 555512 429064 414172 548902 644281 556643 429007
35350D29007N4826J91928Q6392q9610q0742P5478J55912Q6895k1788q1554r4503
$$ 429007 483833 675761 762153 672543 591801 667279 823191 910086 888298 806744 712241
35339G12241p6714m0511j2439P133M4480P3923L5560l7039l7689K5039J9713p3437
$$ 712241 635527 595016 582577 589710 634190 708113 743673 706634 668945 693984 713697 640260
35327F40260j02543l954P0835R513o6570j7072P4220N0651n5358r7761n4590j3614
$$ 640260 537717 533763 604598 614111 547541 530469 604689 655340 599982 502221 447631 434017
35315D34017J165K4448L4276q371n4612l1357L6270P1695O1277L3963j854k1341
$$ 434017 435182 459630 493906 485535 430923 399566 435836 507531 568808 602771 600917 579576
35303E79576K6697J12983J17866J2406p3648n6577k8118o8447q8082l147Q2706
$$ 579576 606273 719256 837122 849528 775880 719303 691185 622738 534656 531509 614215
35292F14215M5912l9572l9073O320k0265p5871l4907O9949R3826K0992l2148k0539
$$ 614215 660127 620555 581482 587802 567537 491666 456759 526708 620534 641526 609378 588839
35280E88839j002O630K3922J5946n2519j04277m9895M5827N7114O540J2148P1880
$$ 588839 587837 594467 618389 634335 581816 477539 427644 473471 530585 537125 549273 621153
35268F21153P9149K0632j8281k2090m8082q0888n2326R847J7077j2875J2108P5272
$$ 621153 700302 720934 702653 680563 632481 551593 499267 509114 526191 513316 525424 600696
35256F00696O8136j5884o8758m7645j1703J6333O8287J12636P5933j3251n0540
$$ 600696 668832 652948 584190 536545 524842 541175 609462 722098 798031 784780 734240
35245G34240k6473k4180n2026l4596K7310M5221L872j5385J3808K8240M127j2857
$$ 734240 707767 683587 631561 596965 624275 669496 673368 657983 671791 700031 704158 691301
35233F91301j2124k4162k8385J3442M9782P656n6848l4493L7218K7804m9847n2924
$$ 691301 679177 655015 626630 640072 689854 697510 640662 606169 643387 671191 621344 568420
35221E68420L8190Q3084K4639k8596q640R828k7576n8830l5044J861K0217L8004
$$ 568420 606610 689694 714333 685737 677097 686925 659349 600519 565475 567336 587553 625557
35209F25557L3165l3397q7937j2930J28512J32485l4049j61389j05534K6800Q5193
$$ 625557 658722 625325 537388 524458 652970 785455 751406 590017 484483 511283 596476
35198E96476P6958O1091K0089m7512o3618r613J6634k2262k7179L9362N5774l5354
$$ 596476 673434 734525 754614 707102 643484 633871 650505 628243 601064 640426 696200 660846
35186F60846q6424J6888J40952J11979J396k340R1294J04706j1839j17393j09510
$$ 660846 574422 591310 732262 844241 845637 843297 934591 1039297 1027458 910065 800555
35175H00555m6521j8798k8590l1802r674K8766N9471M9954o934p0781r1636n3749
$$ 800555 754034 735236 706646 674844 665170 693936 753407 803361 796427 725646 634010 580261
35163E80261K7883J14500J41485P1315l6989p9164m1047q199l0579o5987p0325
$$ 580261 608144 722644 864129 935444 898455 819291 778244 770045 739466 673479 603154
35152F03154m5354J4198J08139J56674P5939n4024n8253N8624R1917l9777j51816
$$ 603154 557800 571998 680137 836811 912750 858726 800473 859097 951014 911237 759421
35141G59421q9154L2202L9601j6728K650N6436J5655o9779l9635Q7502J28687
$$ 759421 670267 702469 742070 725342 727992 784428 800083 730304 690669 778171 906858
35130I06858L6400l5501L186M8214K196o1865l5666M5725O6187k45p2393q4055
$$ 906858 943258 907757 910943 959157 961353 899488 863822 909547 975734 975489 903096 819041
35118H19041n4703m3261o8177q2823l2550O2630J10851O0711j9746k2901N8307
$$ 819041 764338 721077 652900 570077 537527 600157 711008 771719 751973 729072 787379
35107G87379J23625R5381N026n9983n5947r787K8233K9943q889q0104j48608j45860
$$ 787379 911004 1006385 1011411 951428 895481 885694 913927 943870 934981 854877 706269 560409
35095E60409l5891J01901J27748K0506p3311l6638N1859N0942j6794j4756P2929
$$ 560409 524518 626419 754167 774673 701362 664724 716583 767525 750731 735975 808904
35084H08904J20344O8521p067n3392j01067j35623p5366O2725J32514O8641j9871
$$ 808904 929248 997769 990702 937310 836243 700620 625254 687979 820493 889134 869263
35073H69263m3463o4772j36740j60932m5507J13506J56108Q0246N149j8183k9601
$$ 869263 825800 761028 624288 463356 417849 531355 687463 767709 772858 754675 725074
35062G25074m4215l6249j0071O542J4601K3553J9865Q674K7670P0077O8930J0606
$$ 725074 680859 644610 634539 641081 655682 679235 699100 707774 735444 805521 874451 885057
35050H85057k4654M681K7620j0197m8774k8403K914j0890k9175o763J1466j2337
$$ 885057 860403 865084 892704 882507 833733 805330 808244 797354 768179 761416 772882 760545
35038G60545k5584m354l3397j38649j67738m198K04494K24554P2018k5698L0915
$$ 760545 734961 730607 697210 558561 390823 386625 591119 815673 887691 861993 892908
35027H92908J04997N6694q1522j90080j98161j11162M563N8892L2172R525N2616
$$ 892908 997905 1054599 973077 782997 584836 473674 478237 537129 569301 578826 631442
35016F31442R2500M2067m9467p1588k6378K052P177M9997J16722J24686O2189
$$ 631442 723942 766009 716542 644954 618576 620628 627805 677802 794524 919210 981399
35005I81399J182k1181k3799k693N3839Q7581K7332q3170j26815p8603k3414j5018
$$ 981399 982581 961400 937601 934908 988747 1076328 1103660 1020490 893675 815072 791658 776640
34993G76640k3814k1887j5575P083O1283R5335L4449r3352j62243r9108L5289
$$ 776640 752826 730939 715364 722447 783730 879065 913514 820162 657919 558811 594100
34982E94100J25994J15883L9899j5698r13L5706J5613l5532j3913P8794J06282
$$ 594100 720094 835977 875876 860178 859265 894971 910584 875052 861139 939933 1046215
34971A046215J2954p4436n5489j6674n3943q6493j7947N3874n646j11004q6386
$$ 1046215 1059169 984733 929244 912570 858627 772134 754187 808061 802415 691411 605025
34960F05025K8382M6802l8709n5436L9442J02508P7898P8814J41875J34053p056
$$ 605025 633407 680209 641500 586064 625506 728014 805912 884726 1026601 1160654 1153598
34949A153598j42478j46805q4756o4511o1917q575O1819P5613M7941M4194O4152
$$ 1153598 1011120 864315 779559 715048 653131 644556 706375 781988 829929 874123 938275
34938I38275M9558j8829q7821q8022r197P2086O4586j3904m1083L2056Q8053J6723
$$ 938275 987833 969004 881183 793161 783964 856050 920636 906732 865649 897705 985758 1002481
34926A002481j00926j10044j7761L8324J5561P29L6658O8184O0440L3256j8875
$$ 1002481 901555 791511 773750 812074 827635 828364 865022 933206 993646 1026902 1008027
34915A008027j08323j64880j02320K9826R4457O0918K0039J8011J3192r313j5965
$$ 1008027 899704 734824 632504 662330 756787 817705 837744 855755 868947 859634 843669
34904H43669j1940k5823k7917J3316L5140k2113p7829k8650O0147N9346L191P865
$$ 843669 831729 805906 777989 791305 826445 804332 726503 697853 758000 817346 820537 828402
34892H28402L3184l5105j23778o6613P3354P5448n0173o8951N3381Q0488n5513
$$ 828402 861586 826481 702703 636090 709444 784892 734719 665768 719149 799637 744124
34881G44124j01028P8763K38185J44413m7656o4671O1029J01892J2896n8931m6540
$$ 744124 643096 721859 960044 1104457 1056801 992130 1053159 1155051 1167947 1109016 1062476
34870A062476k0141k5442l8258m3688l8721k896M8695N2356k58l6644l1430m1680
$$ 1062476 1042335 1016893 978635 934947 896226 893330 942025 994381 994123 957479 926049 884369
34858H84369o8995l3827N5124P1416j5963p2087k2027L1488P878k0543J626Q214
$$ 884369 815374 781547 836671 908087 892124 820037 798010 829498 837376 816833 818459 826673
34846H26673j4329L8514J51503J20104j09457k62759j18523J38395J94646O2815
$$ 826673 812344 850858 1002361 1122465 1013008 750249 631726 770121 964767 1027582
34836A027582j7646N192j6912j05262j11018P185J08717R8129L5503k432j6107
$$ 1027582 1009936 1015128 998216 892954 781936 789121 897838 995967 1031470 1029038 1012931
34825A012931k0490j1267p44K08J4273M3297L9647j158r121K2519j1384j36739
$$ 1012931 992441 981174 980430 980638 994911 1038208 1077855 1076697 1067576 1090095 1078711 941972
34813I41972j96210p3034J07853J57144Q4780K5249J1401l298J507N4353P4113
$$ 941972 745762 672728 780581 937725 1022505 1047754 1059155 1055857 1057364 1111717 1185830
34802A185830j0206j04227q7516j9526k3548n7922o542Q3461P4127j1705l1693
$$ 1185830 1175624 1071397 983881 964355 940807 882885 876343 959804 1033931 1022226 990533
34791I90533K3934L9471M053J5405O3663K8353r3574j55428q8164R535L8253P958
$$ 990533 1014467 1053938 1057991 1073396 1137059 1165412 1071838 916410 828246 837781 876034 883992
34779H83992l6154o2596k5399Q0564J46738P2586n6390o2729O2031J46998R3589
$$ 883992 847838 785242 759843 840407 987145 1059731 1003341 940612 1002643 1149641 1243230
34768A243230j4781o6873m8872j338K7935j4068j18404j66079o7397P8763R9581
$$ 1243230 1228449 1161576 1112704 1111366 1139301 1125233 1006829 840750 773353 852116 951697
34757I51697m812p5023l2972M3664P8407P5145L8567l9876j07471r1562j8411
$$ 951697 946885 871862 838890 882554 960961 1036106 1074673 1034797 927326 835764 817353
34746H17353K6835M1108P6738J03912N0409m0897n4911J962J4116l5293l8308
$$ 817353 844188 885296 962034 1065946 1116355 1075458 1020547 1022509 1036625 1001332 963024
34735I63024L5337P6968K3572m4246m3135j473K0179J9372J7124J7521K9799N5508
$$ 963024 998361 1075329 1098901 1054655 1011520 1010047 1030226 1049598 1066722 1084243 1114042 1169550
34723A169550M7546l6538j42845j68246r4442L768O5307P7189L5597l4439n5603
$$ 1169550 1217096 1180558 1037713 869467 775025 778793 844100 921289 956886 922447 866844
34712H66844Q133P0934L4627o4632j15133q0581L607J09339J80523J13465q4846
$$ 866844 874977 945911 980538 915906 800773 720192 723799 833138 1013661 1127126 1042280
34701A042280k10549j02058J12748J85033Q5584j5557l9673n0841o0239p813O8590
$$ 1042280 831731 729673 842421 1027454 1113038 1097481 1057808 1006967 946728 938915 1007505
34690A007505N7774k4289m8889Q372M6392K8969J5467J2371k2889m7319Q914P3721
$$ 1007505 1065279 1040990 992101 1000473 1046865 1075834 1091301 1103672 1080783 1033464 1042378 1116099
34678A116099K5994o9261m2125Q3603J15120J5919m5895K53L1066j5921l9205
$$ 1116099 1142093 1072832 1030707 1114310 1229430 1245349 1199454 1199707 1230773 1214852 1175647
34667A175647M799J0695n8746p9949J0734R5372O9393r215m7529m2741j8460J7988
$$ 1175647 1180446 1191141 1132395 1052446 1063180 1158552 1227945 1218730 1171201 1128460 1110000 1127988
34655A127988J7872n7475j16122m0972Q7379Q0257m6573q8103N801O5231K3406
$$ 1127988 1145860 1088385 972263 931291 1018670 1098927 1052354 964251 970052 1035283 1058689
34644A058689K5359J30596J81645Q5892k3448l6184l7295r5011j06759q004P4693
$$ 1058689 1084048 1214644 1396289 1482181 1458733 1422549 1385254 1290243 1183484 1175480 1250173
34633A250173L5451l4071k6674J201k5114m6906n776L3434K1672K6526P7370P8460
$$ 1250173 1285624 1251553 1224879 1226080 1200966 1154060 1148284 1181718 1203390 1229916 1307286 1385746
34621A385746q977p1405m0804p553k8797k0595M3922M0296o9240j16834r91J26989
$$ 1385746 1376769 1305364 1264560 1257007 1228210 1207615 1251537 1291833 1222593 1105759 1104768 1231757
34609A231757J08859J3440l5989o4490j04072n8050J01182J97377J15123O463
$$ 1231757 1340616 1354056 1318067 1253577 1149505 1091455 1192637 1390014 1505137 1511600
34599A511600K5380N7498m6952j64663j02757M4213M0711q9938j10011L9841J64775
$$ 1511600 1536980 1594478 1547526 1382863 1280106 1324319 1365030 1275092 1165081 1204922 1369697
34588A369697J23405j3198j15203j30510p0705K304J008o8563p7664K9914J16995
$$ 1369697 1493102 1479904 1364701 1234191 1163486 1165790 1166798 1098235 1020571 1050485 1167480
34577A167480N8540m8354m0147N4187Q6876L5915l729l278k035J5388Q1165J32201
$$ 1167480 1226020 1177666 1137519 1191706 1278582 1314497 1310768 1307490 1305455 1320843 1402008 1534209
34565A534209Q4102k4041q3669o8688k9027N515K2260J730k4301J3479Q4690O5955
$$ 1534209 1618311 1594270 1510601 1441913 1412886 1418401 1440661 1442391 1418090 1431569 1516259 1582214
34553A582214m6710r8602l6072q163r0887j28619j1897J06106P0579n036M0168
$$ 1582214 1535504 1436902 1400830 1392667 1301780 1173161 1161264 1267370 1337949 1332913 1373081
34542A373081J15602N7796n8418o1043N536j2365p4827l7827M9722K7469o6838
$$ 1373081 1488683 1546479 1488061 1427018 1432554 1420189 1345362 1307535 1357257 1384726 1317888
34531A317888n3888O5631J18693O3324K5027M0552J1907p3194r7154j6690O8224
$$ 1317888 1264000 1329631 1448324 1511648 1536675 1577227 1589134 1515940 1418786 1402096 1470320
34520A470320P1061N936p5719j22250r4599l6775n0422j11629n7857J26912K10620
$$ 1470320 1541381 1547317 1471598 1349348 1254749 1217974 1167552 1055923 998066 1124978 1335598
34509A335598O9187p4465j374J33346P8851o2777k6064J28815J15097p5623j70471
$$ 1335598 1404785 1330320 1328946 1462292 1541143 1478366 1452302 1581117 1696214 1620591 1450120
34498A450120q8297k3765m8304q882J22136J55674L3555n3885j471M8930j0158
$$ 1450120 1361823 1338058 1289754 1280872 1403008 1558682 1592237 1538352 1536881 1585811 1575653
34487A575653p3582m4627K32j5077l1564J277K7682J5897J8118L8241R908m5138
$$ 1575653 1502071 1457444 1457676 1442599 1411035 1412312 1439994 1455891 1474009 1512250 1522158 1477020
34475A477020j6432Q8553J19439K0210q2287q3235k9967N286K8028M6407L2353
$$ 1477020 1460588 1549141 1668580 1688790 1606503 1523268 1493301 1498587 1526615 1573022 1605375
34464A605375k114j0729q749m4055q5661p0391l0009l0351l0177M0686J19048
$$ 1605375 1603261 1592532 1583783 1539728 1454067 1383676 1353667 1323316 1293139 1333825 1452873
34453A452873J01527L9801N0081R2412N2223k3444n716N8181K0328p9873p2087
$$ 1452873 1554400 1594201 1644282 1736694 1788917 1765473 1759757 1817938 1838266 1758393 1686306
34442A686306K8181L7984o4241j06758l3813K2405J564r934J4604R092j53P2553
$$ 1686306 1714487 1752471 1688230 1581472 1547659 1570064 1571628 1561694 1576298 1585390 1585237 1657790
34430A657790J51139P3973j04073j59510n7327K1257J1611K4299O0348n799j24244
$$ 1657790 1808929 1882902 1778829 1619319 1561992 1583249 1594860 1619159 1679507 1673708 1549464
34419A549464q8206Q6693J42814J8130m6013N9868J26296K0467p3150K665R9116
$$ 1549464 1461258 1547951 1690765 1708895 1662882 1722750 1849046 1869513 1796363 1799028 1898144
34408A898144M2283o7725o0419J6095K1290l3903n3602k7530P945N0802P4870
$$ 1898144 1940427 1872702 1812283 1828378 1849668 1815765 1762163 1734633 1742578 1793380 1868250
34397A868250K5695o0163q2270n2840o4205p5764L1810J79619J48665m4789j35028
$$ 1868250 1893945 1833782 1751512 1698672 1634467 1558703 1590513 1770132 1918797 1874008 1738980
34386A738980l6750K8709o2208j30148l4843Q4439P9357K6577K1886J518o2928
$$ 1738980 1702230 1730939 1668731 1538583 1503740 1588179 1667536 1694113 1715999 1717517 1654589
34375A654589m5866Q5048J48131M4226o4449l9046J1276l7404r7773n7899J9036
$$ 1654589 1608723 1693771 1841902 1886128 1821679 1782633 1793909 1756505 1658732 1600833 1619869
34364A619869M7432O6274Q9801L1801q3944p7995P4396J40431j290j45939r5531
$$ 1619869 1667301 1733575 1823376 1855177 1771233 1693238 1767634 1908065 1906775 1760836 1665305
34353A665305M4131R2316P8650R6524R4215J7295m0133j1995O581l6235k4986
$$ 1665305 1709436 1801752 1880402 1976926 2071141 2088436 2048303 2036308 2042889 2006654 1981668
34342A981668Q3331J25952J2371r5246n8119J1236k1018p7378m9735M728K2066
$$ 1981668 2064999 2190951 2203322 2108076 2049957 2061193 2040175 1962797 1913062 1917790 1939856
34331A939856O6969J47058J23015l3956j33559p2395K305j3765k059R9366J29917
$$ 1939856 2006825 2153883 2276898 2242942 2109383 2036988 2039293 2025528 2023469 2122835 2252752
34320B252752Q989q6031l9496j820p6880j12432j2512N7134k223j4963J11285
$$ 2252752 2261741 2175710 2136214 2134394 2057514 1945082 1932570 1989704 1987481 1972518 2083803
34309B083803J59973j801j45621p6887L1826m949m7224L9373P1961q1013j74349
$$ 2083803 2243776 2241975 2096354 2019467 2051293 2046344 1999120 2038493 2110454 2029441 1855092
34298A855092j1755J48560L0960j45456m8086J74308J66342j4920n5619M2590
$$ 1855092 1843337 1991897 2022857 1877401 1829315 2003623 2169965 2155045 2099426 2142016
34288B142016M0252n0498l0213O3122M0583m2321K130J03006N9239n9025l5872
$$ 2142016 2182268 2131770 2101557 2164679 2205262 2162941 2165071 2268077 2327316 2268291 2232419
34277B232419Q1334Q7225J1269K3080P3575J2499p0783r287Q0641n032j46083
$$ 2232419 2313753 2400978 2412247 2435327 2508902 2521401 2450618 2441331 2521972 2516940 2370857
34266B370857r0645P8251Q9500k8583l5121O0035M9699m7182l8071M6307J5404
$$ 2370857 2280212 2358463 2447963 2419380 2384259 2444294 2493993 2446811 2408740 2455047 2470451
34255B470451r4749q9611O885J9121k6333K0139J04457Q1962K7663P2067R1324
$$ 2470451 2375702 2286091 2292976 2312097 2285764 2305903 2410360 2492322 2519985 2592052 2683376
34244B683376n4106j64709j4056J85928J06685j03481o9473J35083J27361q7978
$$ 2683376 2629270 2464561 2450505 2636433 2743118 2639637 2570164 2705247 2832608 2744630
34234B744630j44754K3411J17025M3704J5146P5824N0643l8181L280J11527M9423
$$ 2744630 2599876 2623287 2740312 2784016 2799162 2874986 2925629 2887448 2890728 3002255 3051678
34223C051678j10534q3958Q2049P8537q6532j11646K0431L5290p3299l7472J21402
$$ 3051678 2941144 2857186 2939235 3017772 2931240 2819594 2840025 2875315 2802016 2764544 2885946
34212B885946R4656j12392j50107M4530J44659L5925k3895O8133J05379K9181
$$ 2885946 2980602 2868210 2718103 2762633 2907292 2943217 2919322 2987455 3092834 3122015
34202C122015K2933P7164j8720j93334j44486P1439P3125j51177j83391Q1618
$$ 3122015 3144948 3222112 3203392 3010058 2865572 2937011 3010136 2858959 2675568 2757186
34192B757186K43864J01657n0981j4255J0918q3764p2360J19337K05269N2437
$$ 2757186 3001050 3102707 3051726 3037471 3048389 2964625 2892265 3011602 3216871 3269308
34182C269308p8194j7490N2252J4536K4837J16865P5655j15346j68139o30J12456
$$ 3269308 3191114 3173624 3225876 3240412 3265249 3382114 3457769 3342423 3174284 3173654 3286110
34171C286110M8346J4688Q2865N0796q6403n7269J42612J71340l4130j15065N0522
$$ 3286110 3334456 3349144 3432009 3482805 3396402 3339133 3481745 3653085 3618955 3503890 3554412
34160C554412J27454l4635j29407p66O4850q0339j44801L1047J52906K5441r5899
$$ 3554412 3681866 3647231 3517824 3517058 3581908 3501569 3356768 3387815 3540721 3566162 3470263
34149C470263o252R8611O0324M8446J38616J02021j13231j94918k5853Q0651l6827
$$ 3470263 3464011 3562622 3622946 3671392 3810008 3912029 3798798 3603880 3578027 3658678 3621851
34138C621851r7216O4069J80781P8786j7287K7628M691j37433j01562J63925K57378
$$ 3621851 3524635 3588704 3769485 3848271 3830984 3858612 3863303 3725870 3624308 3788233 4045611
34127D045611J4538j70545l0769J46219R9029J8232N8017J0741j83530j90816
$$ 4045611 4060149 3889604 3858835 4005054 4104083 4122315 4180332 4191073 4007543 3816727
34117C816727R4588K63645Q6733q9721M409J12601J8802m2167Q1199J17610n5250
$$ 3816727 3911315 4174960 4261693 4171972 4176381 4288982 4307784 4265617 4346816 4464426 4409176
34106D409176j10092Q9046J76588j2727r2795J34246K70189O5845j18045k2183
$$ 4409176 4299084 4388130 4564718 4551991 4459196 4593442 4863631 4929476 4811431 4789248
34096D789248M5561j04921j26438J35846K44395j1343j61644O4444K01154n6883
$$ 4789248 4834809 4729888 4603450 4739296 4983691 4972348 4810704 4875148 5076302 5019419
34086E019419k33040M0742L14897J62936n1256P0336K06459K2460j30812N9873
$$ 5019419 4786379 4827121 5142018 5304954 5253698 5324034 5530493 5552953 5422141 5482014
34076E482014K04451j2626j62216Q4956K45135o8393l37981p3165K62556J25072
$$ 5482014 5686465 5673839 5511623 5596579 5841714 5773321 5435340 5362175 5624731 5749803
34066E749803j19181J9153J84724m9027k42392P1244L91057J36018k34771o3663
$$ 5749803 5630622 5649775 5834499 5785472 5543080 5614324 6005381 6141399 5906628 5842965
34056E842965K88039J73775j11350J8807K60524N7839k47176p7454K22545P1544
$$ 5842965 6131004 6304779 6193429 6212236 6472760 6530599 6283423 6205969 6428514 6500058
34046F500058j79156L6365L07881L3660l10090j3420M45649K26101k87488j91059
$$ 6500058 6320902 6357267 6665148 6698808 6388718 6375298 6820947 7047048 6759560 6568501
34036F568501K53903J73194k24459q4550M11708L89932o0156j22688J73540J40260
$$ 6568501 6822404 6995598 6771139 6686589 7098297 7488229 7428073 7305385 7478925 7619185
34026G619185j26006J5852L71265K49622j30201l9905L02376J60072k20942o6403
$$ 7619185 7493179 7509031 7880296 8129918 7999717 7959812 8262188 8422260 8201318 8134915
34016H134915L68449K65714j36496q727M02805K47568k08810p0277L95715K47705
$$ 8134915 8503364 8769078 8632582 8623855 9026660 9274228 9065418 8995141 9390856 9638561
34006I638561k50118j05220M31567L11040k51473j60733M29971M30859l9074O5843
$$ 9638561 9388443 9283223 9714790 10025830 9774357 9613624 10043595 10474454 10435380 10501223
33996A0501223N65505L74016k67792j42026N60942N31484j46743j66165M50659
$$ 10501223 11066728 11440744 11172952 11030926 11591868 12123352 11976609 11810444 12261103
33987A2261103M37085j64173q4289N76470M70456k74316j77751O82359P05412
$$ 12261103 12698188 12534015 12449726 13026196 13496652 13222336 13044585 13726944 14432356
33978A4432356j50403k33834O29423Q17877P0552q0834N98712O32179q9353k079
$$ 14432356 14281953 14048119 14677542 15495419 15565971 15485137 16083849 16716028 16626675 16624596
33968A6624596R13767R06746q5270j69694Q10242R13711k8516J3874J200970J340568
$$ 16624596 17538363 18445109 18359839 18190145 19000387 19914098 19885582 19899456 21100426 22440994
33958B2440994K13557J47435J413188J534081J90787N5482J551445J833912L80781
$$ 22440994 22654551 22801986 24215174 25749255 25940042 25995524 27546969 29380881 29761662
33949B9761662K25200J998022K470451R11523P60828K793776L254618J345721
$$ 29761662 29986862 31984884 34455335 35366858 36127686 38921462 42176080 43521801
33941D3521801J348835M246648N145512K711409K445792O082731P449281M459101
$$ 43521801 44870636 49117284 54262796 56974205 59419997 65502728 72952009 77411110
33933G7411110M228447R135909J0592503O372962Q601362J8708968J0663252l5057888
$$ 77411110 81639557 90775466 101367969 107740931 116342293 135051261 145714513 110656625
33925A10656625q9584532r9004044n2032125M187017K4258876J3903905N349430
$$ 110656625 21072093 -77931951 -129964076 -125777059 -101518183 -87614278 -82264848
33918h2264848Q537811R955936M219773N03028K322346K598690r05159j822921
$$ -82264848 -73727037 -63771101 -59551328 -59048300 -56725954 -54127264 -55032423 -56855344
33910e6855344J705393L651751J679489O79688K742966L651784J592383M49852
$$ -56855344 -55149951 -51498200 -49818711 -49139023 -46396057 -42744273 -41151890 -40702038
33902d0702038K027735K877387J289942L52401J638152K301199Q56657k3767J140353
$$ -40702038 -38674303 -35796916 -34506974 -34154573 -32516421 -30215222 -29358565 -29382332 -28241979
33893b8241979J886716P37498q2781Q48065J507085N47186j69259O34602J238461
$$ -28241979 -26355263 -25617765 -25700546 -24852481 -23345396 -22798210 -22967469 -22332867 -21094406
33884b1094406M46721j28531O24592J150866L76040k01953M80180J002263L20493
$$ -21094406 -20647685 -20776216 -20151624 -19000758 -18624718 -18826671 -18346491 -17344228 -17023735
33875a7023735k18154M11944R33941L33894j96142L21394P61734J96692k75953
$$ -17023735 -17241889 -16829945 -15896004 -15562110 -15758252 -15436858 -14675124 -14478432 -14754385
33866a4754385K59268P39394K42355k32550K22354O69091K27397k16884J79765
$$ -14754385 -14495117 -13755723 -13513368 -13745918 -13523564 -12854473 -12627076 -12843960 -12664195
33857a2664195N69270J53132k25627K09346O03747J61368k77614J16417N50560
$$ -12664195 -12094925 -11941793 -12167420 -11958074 -11354327 -11192959 -11470573 -11354156 -10803596
33848a0803596J80286k53963R8456N53108K56357j82284N8892M27455J51874k36451
$$ -10803596 -10623310 -10877273 -10778817 -10225709 -9969352 -10151636 -10092744 -9665289 -9513415 -9749866
33838i749866R005L86186J74594j60292N4625L68799J59679j11903J36796M07072
$$ -9749866 -9740861 -9354675 -9180081 -9340373 -9285748 -8916949 -8757270 -8869173 -8732377 -8325305
33828h325305J15201k10606M9212L82075J52450j53999Q5641L79908R3777k75852
$$ -8325305 -8210104 -8420710 -8371498 -7989423 -7836973 -7990972 -7905331 -7525423 -7431646 -7707498
33818g707498n1677L04634R4123k61256m5413L70513K57042j01594k8702K35242
$$ -7707498 -7759175 -7454541 -7360418 -7621674 -7667087 -7296574 -7039532 -7141126 -7169828 -6934586
33808f934586Q5890k13157o3580K79847K15642n5821M487K04167Q0560j12145
$$ -6934586 -6848696 -7061853 -7125433 -6845586 -6629944 -6685765 -6681278 -6477111 -6396551 -6508696
33798f508696P6742L28812J37365j87751j02162J39211L1446j64425K7638K93767
$$ -6508696 -6431954 -6103142 -5965777 -6153528 -6255690 -6116479 -6085033 -6249458 -6221820 -5928053
33788e928053J11105k08382r3449J97106J06595j20683N5676L61972J99110k00658
$$ -5928053 -5816948 -6025330 -6118779 -5921673 -5815078 -5935761 -5880085 -5518113 -5319003 -5519661
33778e519661j92897J04332J21771n7129L5988K43447R8515j75487l3310L23915
$$ -5519661 -5712558 -5608226 -5486455 -5543584 -5507596 -5264149 -5165634 -5341121 -5374431 -5050516
33768e050516K83266n2658r4025J33064J18956j18537j37156K1056k8681j71155
$$ -5050516 -4767250 -4819908 -4913933 -4780869 -4661913 -4780450 -4917606 -4896550 -4925231 -5096386
33758e096386j5551K55141J76476q4008k5587K13561J25459j60451j09763J82454
$$ -5096386 -5111937 -4856796 -4680320 -4764328 -4789915 -4576354 -4450895 -4611346 -4721109 -4538655
33748d538655J72666q9185q4793J50152J16681j47700j43235J02326R3309j45889
$$ -4538655 -4365989 -4455174 -4539967 -4389815 -4273134 -4420834 -4564069 -4461743 -4368434 -4514323
33738d514323j15295J63626J69596j00004j04069K03660K68653l5379j93793n496
$$ -4514323 -4629618 -4465992 -4296396 -4396400 -4500469 -4296809 -4028156 -4063535 -4257328 -4262824
33728d262824J21332j1922r6711q38J7667p5169K662K07124J61656j03164j33356
$$ -4262824 -4141492 -4153414 -4250125 -4250963 -4233296 -4308465 -4305803 -4098679 -3937023 -4040187 -4173543
33717d173543J25291K24390L9956m1955J05680J38115m8010j11333M6754Q7182
$$ -4173543 -4048252 -3823862 -3783906 -3825861 -3720181 -3582066 -3630076 -3741409 -3694655 -3607473
33707c607473q6401j25719Q5670K00939N8391n6272P068J6386j12809j24117M8586
$$ -3607473 -3693874 -3819593 -3733923 -3532984 -3474593 -3530865 -3523797 -3507411 -3620220 -3744337 -3695751
33696c695751J15555j7078o9679O4649J28251J9764j7715J02560J29660l7358
$$ -3695751 -3580196 -3597274 -3666953 -3602304 -3474053 -3454289 -3472004 -3369444 -3239784 -3277142
33686c277142j59250j05142l7848l3205L7283J52502J18265l5661p5976m891k0048
$$ -3277142 -3436392 -3541534 -3579382 -3612587 -3575304 -3422802 -3304537 -3340198 -3416174 -3421065 -3441113
33675c441113o1397Q9245K94035K10844o6599j21717M8971N6532j22306j02011
$$ -3441113 -3502510 -3413265 -3119230 -2908386 -2974985 -3096702 -3047731 -2991199 -3113505 -3215516
33665c215516J43654J88759n6301j75245j7956O1304p6973j01027J03018J71049
$$ -3215516 -3071862 -2883103 -2939404 -3114649 -3132605 -3071301 -3148274 -3249301 -3146283 -2975234
33655b975234m2499j61537K5496J94547J03587q385N4282Q8872k8363o0105Q9266
$$ -2975234 -3017733 -3179270 -3153774 -2959227 -2855640 -2864025 -2809743 -2720871 -2749234 -2809339 -2720073
33644b720073J25129p7871j97930n4037N9220n7091j32080L3345J68376M8984
$$ -2720073 -2594944 -2672815 -2870745 -2924782 -2865562 -2922653 -3054733 -3021388 -2853012 -2804028
33634b804028p4011M4970J86774Q9461p3444l5123R6013Q4741j9675n0134k2940
$$ -2804028 -2878039 -2833069 -2646295 -2556834 -2630278 -2665401 -2569388 -2484647 -2504322 -2554456 -2577396
33623b577396l742N0511J05613J2199j75370j88312m30R5365Q681L784J65734
$$ -2577396 -2581138 -2530627 -2425014 -2412815 -2588185 -2776497 -2776927 -2681562 -2672881 -2669097 -2503363
33612b503363K01312j4016j78455r6799N896m2917n3946R1597J70093N3133l8677
$$ -2503363 -2302051 -2316067 -2494522 -2591321 -2585425 -2628342 -2682288 -2590691 -2420598 -2367465 -2406142
33601b406142J9052K1808j04361j10872N2988O7495j32329j40878J81346L64398
$$ -2406142 -2387090 -2365282 -2469643 -2580515 -2527527 -2460032 -2592361 -2733239 -2551893 -2187495
33591b187495J18115j45896m5578J14410m5995k69301j60394Q5529Q4482k7400
$$ -2187495 -2069380 -2215276 -2260854 -2146444 -2192439 -2461740 -2622134 -2536605 -2452123 -2479523
33581b479523P4347K30569J08024j29134j02512Q2472N1811j38211j35319M3512
$$ -2479523 -2405176 -2174607 -2066583 -2195717 -2298229 -2215757 -2163946 -2302157 -2437476 -2393964
33571b393964P7819m7147n8001O6204Q6986k3655p0126k7009k8449m4592M2289
$$ -2393964 -2316145 -2363292 -2421293 -2355089 -2268103 -2291758 -2361884 -2388893 -2417342 -2461934 -2419645
33560b419645J38767Q8595l315M1072J10680Q948j40196r0205P1498P3862n9821
$$ -2419645 -2280878 -2192283 -2195598 -2154526 -2043846 -2034898 -2175094 -2265299 -2193801 -2119939 -2179760
33549b179760r1555j2723n625n6318J303J27010J26972P130n3385j6562J6781
$$ -2179760 -2271315 -2284038 -2289663 -2345981 -2344678 -2217668 -2090696 -2083566 -2136951 -2153513 -2136732
33538b136732L1495N2848N097j23551j40547N2465K14425J14326q2072r2774K9167
$$ -2136732 -2105237 -2052389 -2047292 -2170843 -2311390 -2258925 -2044500 -1930174 -2012246 -2105020 -2075853
33527b075853O4997L4475P0058R4289p308r1830o184Q2635j8765j35500k9556
$$ -2075853 -2010856 -1976381 -1906323 -1812034 -1819342 -1911172 -1917356 -1834721 -1853486 -1988986 -2018542
33516b018542J34954P4639q6716m9425J02302O9032j03468j38387n7815q7027
$$ -2018542 -1883588 -1808949 -1895665 -1945090 -1842788 -1773756 -1877224 -2015611 -2073426 -2160453
33506b160453j56436k4487K01179J95898J197m8427P0558O7422q9879j26795O031
$$ -2160453 -2316889 -2341376 -2140197 -1944299 -1943102 -1991529 -1920971 -1853549 -1943428 -2070223 -2064192
33495b064192O3189o169Q834J20910R9987n7259q1566P4511J43251K1034q4482
$$ -2064192 -2001003 -2007172 -1998338 -1877428 -1777441 -1834700 -1916266 -1841755 -1698504 -1677470 -1761952
33484a761952o3417m9310q2037k5991J02251J13014J3204J2253J09189P2490j14075
$$ -1761952 -1825369 -1874679 -1956716 -1982707 -1880456 -1767442 -1754238 -1741985 -1632796 -1560306 -1674381
33473a674381j95219r9259l7059p2449j7033J49336J79209P881j02908j7509O3574
$$ -1674381 -1869600 -1968859 -2005918 -2078367 -2095400 -1946064 -1766855 -1758974 -1861882 -1879391 -1815817
33462a815817J254m8113L0561Q9672K0976l5176L1911R5902L6980n6559p7014
$$ -1815817 -1814563 -1862676 -1832115 -1742443 -1721467 -1756643 -1724732 -1628830 -1591850 -1648409 -1725423
33451a725423n7559l1102M1681J17354P9600l0930m4866L3326K3666q9372j14969
$$ -1725423 -1782982 -1814084 -1772403 -1655049 -1575449 -1606379 -1651245 -1617919 -1594253 -1683625 -1798594
33440a798594p073N3787j984k5494M3201P0240J2958J421N1126P011j35077j66992
$$ -1798594 -1805667 -1751880 -1753864 -1779358 -1736157 -1665917 -1652959 -1651538 -1600412 -1593401 -1728478 -1895470
33428a895470l0323P1546L2022L697Q3914J39204P4824J3l275j5277p0459p0223
$$ -1895470 -1925793 -1854247 -1822225 -1818528 -1734614 -1595410 -1520586 -1520573 -1523848 -1539125 -1609584 -1679807
33416a679807j818P653o0920o9922J0853N2873K9494N0213J00142M7299n9543
$$ -1679807 -1681625 -1673972 -1734892 -1804814 -1793961 -1741088 -1711594 -1661381 -1561239 -1513940 -1573483
33405a573483k9174J00489Q2286j00705j86683q7482l131j2263M2954J67899J38514
$$ -1573483 -1602657 -1502168 -1419882 -1520587 -1707270 -1794752 -1797883 -1810146 -1767192 -1599293 -1460779
33394a460779n9127j38051o551P2295k2423n6703Q2292J48397P030r5054Q283
$$ -1460779 -1519906 -1657957 -1664508 -1592213 -1614636 -1671339 -1589047 -1440650 -1433620 -1528674 -1520391
33383a520391R6352J210o4833O3406J52204m041j74253q5001J05257J07629j4896
$$ -1520391 -1424039 -1422829 -1487662 -1424256 -1272052 -1276093 -1450346 -1535347 -1430090 -1322461 -1337357
33372a337357m5061k4071r0635j46796n0876P1265N1888M647Q8460J69305O4162
$$ -1337357 -1382418 -1406489 -1497124 -1643920 -1694796 -1623531 -1571643 -1566996 -1478536 -1309231 -1245069
33361a245069q8270n9646N3038N615j58822k03061r1515K5871R8010J48787J08296
$$ -1245069 -1333339 -1392985 -1339947 -1334332 -1493154 -1696215 -1787730 -1761859 -1663849 -1515062 -1406766
33350a406766m9429j45436m4429R2367O5218l3488j8972N0783L0106k0606N204
$$ -1406766 -1456195 -1601631 -1646060 -1553693 -1488475 -1521963 -1540935 -1490152 -1460046 -1480652 -1475448
33339a475448J1252q1487q9037J19187K86791J38372j31472j57326Q72J8849r4783
$$ -1475448 -1464196 -1545683 -1634720 -1515533 -1228742 -1090370 -1221842 -1379168 -1378296 -1359447 -1454230
33328a454230o2171J01222J05064o1739r8613N5242J16862j4551p8684O9930K09386
$$ -1454230 -1516401 -1415179 -1310115 -1371854 -1470467 -1415225 -1298363 -1312914 -1391598 -1321668 -1112282
33317a112282J38624j8877o9845l0062O587L7761N5613p951j24191j47818m5711
$$ -1112282 -973658 -992535 -1062380 -1092442 -1085855 -1048094 -992481 -1000432 -1124623 -1272441 -1318152
33306a318152L9175K4142l385J9886K3478l2738o5534k4506J7696Q926O639N1796
$$ -1318152 -1278977 -1254835 -1258220 -1238334 -1214856 -1247594 -1313128 -1337634 -1319938 -1311012 -1304373 -1252577
33294a252577Q4628N3885N93j9878p288K0271M5654K9353m2551r6642n5039L8201
$$ -1252577 -1167949 -1114064 -1113471 -1133349 -1140637 -1120366 -1074712 -1045359 -1087910 -1184552 -1239591 -1201390
33282a201390P2990K9498k3923n5477q3520r6820o7841j9262J0851L0497M7725
$$ -1201390 -1128400 -1098902 -1122825 -1178302 -1261822 -1358642 -1426483 -1445745 -1434894 -1404397 -1356672
33271a356672L0596j3862j2249M5116O1728Q711l305O6523P9919l5355j14493
$$ -1356672 -1326076 -1339938 -1352187 -1307071 -1245343 -1236632 -1239937 -1173414 -1093495 -1128850 -1243343
33260a243343j9042J04035N3912q7428j04334o893L0159o961J4572R3292R6206
$$ -1243343 -1262385 -1158350 -1104438 -1191866 -1296200 -1303093 -1272934 -1279895 -1265323 -1172031 -1075825
33249a075825J2563l9752m0220p1550j19466q3547K2386P6409M4192k23j9354
$$ -1075825 -1063262 -1103014 -1143234 -1214784 -1334250 -1417797 -1395411 -1319002 -1274810 -1275033 -1294387
33238a294387k4232L775N4538L6232o5312r0471N2779J88051J23427l6338p4429
$$ -1294387 -1318619 -1314844 -1260306 -1224074 -1289386 -1379857 -1327078 -1139027 -1015600 -1051938 -1126367
33227a126367j9135l6494q9353j8217J22137J31175K0433j1695O2273P1350k7427
$$ -1126367 -1145502 -1181996 -1271349 -1289566 -1167429 -1036254 -1015821 -1027516 -965243 -893893 -921320
33216i21320q4396l5673J1406j0012n0062p4856q0975k0572R7986J23798j3118
$$ -921320 -1005716 -1041389 -1029983 -1039995 -1090057 -1164913 -1245888 -1266460 -1168474 -1044676 -1057794
33205a057794j20904l3609Q0903K124j26371l2820J78912J88820J8440l3307N0527
$$ -1057794 -1178698 -1212307 -1131404 -1129280 -1255651 -1288471 -1109559 -920739 -902299 -935606 -885079
33194h85079J848j83415j99038J2677J44289O1433j1152M0572L0295r6853j00931
$$ -885079 -883231 -1066646 -1265684 -1253007 -1108718 -1047285 -1058437 -1017865 -987570 -1084423 -1185354
33183a185354R1458J95026N5967p2453J2294J13299J6445j26712r5050J8590J6347
$$ -1185354 -1093896 -898870 -842903 -915356 -903062 -789763 -773318 -900030 -995080 -976490 -960143
33172i60143n8382o0668j9763k6205l1056K4988O0262J4657j8837J7879K7745
$$ -960143 -1018525 -1079193 -1098956 -1125161 -1156217 -1131229 -1070967 -1056310 -1075147 -1057268 -1029523
33161a029523l1824l8762N4297J03522L4505k5905r443k7605r7830n1497J23809
$$ -1029523 -1061347 -1100109 -1045812 -942290 -907785 -933690 -943133 -970738 -1068568 -1120065 -996256
33150i96256J74428Q225j01365K8990J67583P4194q9060p0772L5413J5331n9823
$$ -996256 -821828 -813603 -914968 -885978 -718395 -644201 -733261 -804033 -768620 -753289 -813112
33139h13112j5024N6874k2788j42234p8718Q5183R0958n4317j16524l9985J5692
$$ -813112 -828136 -771262 -794050 -936284 -1015002 -929819 -838861 -893178 -1009702 -1049687 -1033995
33128a033995o285j0181J5957j0591o5034m5043K3988L0387j6119j7834K2534
$$ -1033995 -1040280 -1050461 -1034504 -1045095 -1110129 -1155172 -1131184 -1100797 -1116916 -1134750 -1112216
33117a112216L5883M1780Q4950R7939J4836o5945k3696O9851O7014j8949p8824
$$ -1112216 -1076333 -1034553 -949603 -851664 -836828 -902773 -926469 -856618 -789604 -808553 -887377
33106h87377j03388j24891p9897O5336J67815R7973l2573m2071L7431N8412J6592
$$ -887377 -990765 -1115656 -1195553 -1130217 -962402 -864429 -897002 -939073 -901642 -843230 -826638
33095h26638r213m7092j30473j41614m020J08092K2036j12014n2529J11107J07721
$$ -826638 -835851 -882943 -1013416 -1155030 -1159050 -1050958 -1028922 -1140936 -1193465 -1082358 -974637
33084i74637m1086o5777P3643J30147Q360r0346k8662O5526N0486k8271p7150
$$ -974637 -1015723 -1081500 -1007857 -877710 -869350 -959696 -988358 -922832 -872346 -900617 -977767
33073i77767q7151n8874K4072J01708Q2842L240k0299J4607J4992k0024j6695
$$ -977767 -1064918 -1123792 -1099720 -998012 -915170 -911930 -932229 -917622 -902630 -922654 -939349
33062i39349P16m5719j02928n7133M0217L6066n7912q5833j5030M2824N9020J03344
$$ -939349 -938633 -984352 -1087280 -1144413 -1104196 -1068130 -1126042 -1211875 -1226905 -1184081 -1125061 -1021717
33050a021717J47442R1706j9726m9839k2694p7123j78889j49034J4887J21861
$$ -1021717 -874275 -782569 -802295 -852134 -874828 -951951 -1130840 -1279874 -1264987 -1143126
33040a143126J07781R0496Q5214k5239j85042j56100Q5854K54244J78859L8456
$$ -1143126 -1035345 -944849 -859635 -884874 -1069916 -1226016 -1140162 -885918 -707059 -668603
33030f68603J8699K5433p0206j58214q9735M7128P8161J8461r775n696l7667o8110
$$ -668603 -649904 -624471 -694677 -852891 -942626 -895498 -817337 -798876 -808651 -814347 -852014 -920124
33018i20124k0818N3412M8808j5370l6375l971m54n2322r3912o9120N939P3023
$$ -920124 -940942 -887530 -838722 -854092 -890467 -894438 -894892 -947214 -1041126 -1110246 -1104307 -1031284
33006a031284Q4528M7458K5894N9028Q8596L8463n2915p8313k5605K0404K9641
$$ -1031284 -946756 -899298 -873404 -814376 -725780 -687317 -740232 -818545 -844150 -823746 -794105
32995g94105M7281O6288K9204l2091j6972O0085O9810j3282o2908k0593J1362
$$ -794105 -746824 -680536 -651332 -683423 -700395 -640310 -570500 -583782 -646690 -667283 -655921
32984f55921l4764p4719l8729L471j3579k5176L4133J00064R1828M9294M5086
$$ -655921 -690685 -765404 -804133 -800662 -814241 -839417 -805284 -705220 -613392 -564098 -519012
32973e19012N1521N850o4324q3574m5478n025M920j0353l7405n9563o3556n4592
$$ -519012 -467491 -461641 -525965 -609539 -655017 -660042 -655122 -665475 -702880 -762443 -825999 -880591
32961h80591l1211L0286J07848J03229j9161j20076n2427J05191J50560O0789
$$ -880591 -911802 -881516 -773668 -670439 -689600 -809676 -862103 -756912 -606352 -545563
32951e45563l494J4682J583p9289j04918k9633J1967o2448j38483j00805l219
$$ -545563 -549057 -534375 -532792 -612081 -716999 -746632 -734665 -797113 -935596 -1036401 -1039620
32940a039620O1583J00577J26257Q4489j6212n8104m641J6655o8180j37398p3172
$$ -1039620 -978037 -877460 -751203 -666714 -682926 -741030 -745671 -729016 -797196 -934594 -1007766
32929a007766M6718Q8795N6956J5852m0868j10492j04432N350Q9264N2619j141
$$ -1007766 -961048 -872253 -815297 -799445 -840313 -950805 -1055237 -1049887 -960623 -908004 -909145
32918i09145N0266J33641J14512K9776O44P943m9777j40736j39378m5173J9872
$$ -909145 -858879 -725238 -610726 -580950 -580306 -572363 -622140 -762876 -902254 -947427 -927555
32907i27555J5428J7502N3020N7746J6432M890N4187Q3598K0454q6063j22552
$$ -927555 -912127 -894625 -841605 -783859 -767427 -762537 -708350 -624752 -604298 -690361 -812913
32896h12913n0783M6355O1295n521m1334K1635R2942M7177p7485j22920m2774
$$ -812913 -863696 -817341 -756046 -761567 -802901 -781266 -688324 -641147 -718632 -841552 -884326
32885h84326M5754N4448K3868J564k7941m7182L545Q2514N6912p1538j21792n787
$$ -884326 -838572 -784124 -760256 -758692 -786633 -833815 -830270 -747756 -690844 -762382 -884174 -889961
32873h89961J26931J28677O5743N4785N1414l1499j29138j25322m7284J063J1375
$$ -889961 -763030 -634353 -568610 -513825 -462411 -493910 -623048 -748370 -795654 -794591 -783216
32862g83216K9150L1175r976k9220J9894M9929j9170r9787p2263J2883L1536m042
$$ -783216 -754066 -722891 -732867 -762087 -742193 -692264 -711434 -811221 -883484 -870601 -839065 -843107
32850h43107m351J0819k9691p1612j2046R1734Q6991k0479o5948J5268J00196
$$ -843107 -847458 -836639 -866330 -937942 -949988 -858254 -771263 -791742 -857690 -842422 -742226
32839g42226P7141r761n4998k7723K1594K8990j7079m8382N201Q7807O0019q2688
$$ -742226 -665085 -674846 -729844 -757567 -735973 -706983 -724062 -772444 -767243 -679436 -619417 -702105
32827g02105j60903o7612O5133P9426L2406O3303J41951J38040M9760k6527p8862
$$ -702105 -863008 -930620 -865487 -786061 -753655 -690352 -548401 -410361 -360601 -387128 -465990
32816d65990j42612j52329l2080J19088J32949K4873n0416n1700n7885o2740J2442
$$ -465990 -608602 -760931 -793011 -673923 -540974 -516101 -566517 -618217 -676102 -738842 -726400
32805g26400J13166Q5514o6060j63711j27975o6001n2154j9232P0819J28001Q6724
$$ -726400 -613234 -527720 -593780 -757491 -885466 -951467 -1003621 -1022853 -952034 -824033 -737309
32794g37309J4424n891J3149K3563J2585k0222o1546n1990M0106J22364Q0833
$$ -737309 -722885 -728776 -715627 -692064 -679479 -699701 -761247 -813237 -773131 -650767 -569934
32783e69934l3303o2244J8773P5277L2372m1375q4601j12223j06953j2702J16532
$$ -569934 -603237 -665481 -646708 -571431 -539059 -580434 -665035 -777258 -884211 -896913 -780381
32772g80381J26913q351j19114p1566N5745J06503M8268l5609o8789l4559K6823
$$ -780381 -653468 -661819 -780933 -852499 -796754 -690251 -641983 -677592 -746381 -780940 -754117
32761g54117L9666k3655p8113k7579Q3946J30048R1667N6684M2820j9842j16051
$$ -754117 -714451 -738106 -816219 -843798 -759852 -629804 -538137 -481453 -438633 -458475 -574526
32750e74526j22788o382J04171R7316R256o9730j00744p4204k254M1228k992n2480
$$ -574526 -697314 -703696 -599525 -502209 -492953 -562683 -663427 -737631 -739885 -698657 -701649 -754129
32738g54129K0780J56416J46014n2218k25187k02695o8353J6132L2490M4260N8178
$$ -754129 -733349 -576933 -430919 -483137 -708324 -911019 -979372 -963240 -930750 -886490 -828312
32727h28312O2624Q6558J18555P9393l3489r3084k9161N2857M0219j9991l3252
$$ -828312 -765688 -679130 -560575 -481182 -514671 -607755 -636916 -584059 -543840 -563831 -597083
32716e97083k1028m5136o8783k9277K6388J1640m7539n1076K1276R4211J04848
$$ -597083 -618111 -663247 -732030 -761307 -734919 -723279 -770818 -821894 -800618 -706407 -601559
32705f01559M9412m0262j02176p3055K8489R9554Q5751N2480P0055J02539P8480
$$ -601559 -552147 -592409 -694585 -767640 -739151 -639597 -553846 -501366 -431311 -328772 -250292
32694b50292N159n7416p9646o0899l949N6443O0999Q728l2056l0752l3034n8990
$$ -250292 -245133 -302549 -382195 -443094 -447043 -390600 -329601 -320873 -352929 -383681 -416715 -475705
32682d75705o0625k4974j1770l2682r194P6968J10943J6394j07725j29766p3247
$$ -475705 -536330 -561304 -573074 -605756 -614950 -537982 -427039 -410645 -518370 -648136 -721383
32671g21383n0074q2769j05850q4563k9080N7800J54656J92132J32804L4400l1671
$$ -721383 -771457 -854226 -960076 -1044639 -1073719 -1015919 -861263 -669131 -536327 -501927 -533598
32660e33598o4609p8966m7667K6481O7837L8828R319L1931M2660j7079p7498n5948
$$ -533598 -598207 -677173 -724840 -698359 -630522 -591694 -582375 -550444 -507784 -524863 -602361 -658309
32648f58309n566j8107n5951k2847N7224P6483J7798m3829q0052j15305j22841
$$ -658309 -663875 -681982 -737933 -760780 -703556 -627073 -609275 -653104 -733156 -848461 -971302
32637i71302n2379N1611R0450O5382O5447J01290Q2559j5814q7409m4530N5958
$$ -971302 -1023681 -972070 -881620 -816238 -750791 -649501 -566942 -582756 -670165 -714695 -658737
32626f58737R4400L9120l5012n0607j4283J822m1070q6592n6525K7798P0318N1781
$$ -658737 -564337 -525217 -560229 -610836 -625119 -623297 -664367 -750959 -807484 -779686 -709368 -657587
32614f57587N4800J02845R6574j1544j00339n6824L1478R770r1412j06427j668
$$ -657587 -602787 -499942 -403368 -414912 -515251 -572075 -540597 -530827 -622239 -728666 -730334
32603g30334Q3069O3848J6988J7658K2531k0757o6467n6567k7420m1871p0638
$$ -730334 -647265 -583417 -566429 -548771 -526240 -546997 -613464 -670031 -697451 -739322 -809960
32592h09960l2482O9535J34805R8584J5057k5810j8836k3376m2876q551R1045
$$ -809960 -842442 -772907 -638102 -539518 -524461 -550271 -569107 -592483 -635359 -643910 -552865
32581e52865J50792Q8241k8115q1581p4834p7043o3752K9240J25030P4447q2703
$$ -552865 -402073 -313832 -341947 -423528 -498362 -575405 -639157 -609917 -484887 -410440 -493143
32570d93143j33151j6818P5526J8023n4263K028R3130P0102j4486k6910J1161
$$ -493143 -626294 -643112 -567586 -549563 -603826 -601798 -508668 -438566 -453052 -479962 -468801
32559d68801P027n880L6732N1820n0325j47767p2578Q4950R9314j7502m7347M9137
$$ -468801 -461774 -467654 -430922 -379102 -429427 -577194 -649772 -564822 -465508 -483010 -530357 -481220
32547d81220P6993l0030q6569J2594J05190M2799o5231n4693K4103K1648n1841
$$ -481220 -404227 -434257 -520826 -508232 -403042 -360243 -425474 -480167 -456064 -434416 -486257
32536d86257o5485N946N7486K7619l0576m8641k4249K856L108k0138l8859l6127
$$ -486257 -551742 -545796 -488310 -460691 -491267 -539908 -564157 -561301 -558193 -578331 -617190 -653317
32524f53317k8229k7961j0519L4678M9436j8476j07549j04658r630O3445N7503
$$ -653317 -681546 -709507 -720026 -685348 -635912 -654388 -761937 -866595 -876225 -812780 -755277
32513g55277M0134P3125J11770Q0904j5909j02161j01474K094J31449J61643O0040
$$ -755277 -715143 -642018 -530248 -449344 -465253 -567414 -668888 -666794 -535345 -373702 -313662
32502c13662m8211l5009M9266N6755k9918q6780n4556o998K036J2331M1822L6482
$$ -313662 -361873 -396882 -347616 -290861 -320779 -407559 -462115 -469113 -467077 -454746 -412924 -376442
32490c76442j2233k5158L0269P5251M7420j0339m3323o4837q7194p4437k3827
$$ -376442 -388675 -413833 -383564 -308313 -260893 -271232 -314555 -379392 -466586 -541023 -564850
32479e64850K20k7496m2218Q37N4909O9963O0760M0708j2203p4709p1591n614
$$ -564850 -564630 -592126 -634344 -633507 -578598 -508635 -447875 -407167 -419370 -494079 -565670 -571284
32467e71284J8374l7888p2585j4753N4239M4209K914Q794K6445m401l1894J4756
$$ -571284 -552910 -590798 -663383 -678136 -623897 -579688 -576774 -567980 -541535 -545936 -577830 -563074
32455e63074P1275K8402p4246r5288r218O3027L9103l1030o6787n0450l352M9181
$$ -563074 -491799 -463397 -537643 -632931 -642149 -579122 -540019 -571049 -637836 -688286 -691638 -642457
32443f42457P4005N2029P358k9517o4321r5272p2246K5235J11896R2140J890m4469
$$ -642457 -568452 -516423 -509065 -538582 -602903 -698175 -770421 -745186 -633290 -541150 -539260 -583729
32431e83729k4952j5009l1863l116Q5800J37005Q7147O231j8857j1940l4994n9597
$$ -583729 -608681 -623690 -655553 -658669 -572869 -435864 -348717 -342486 -361343 -373283 -408277 -467874
32419d67874j7077N9873O0199l6316j14807q4603J052L9773K6287K5048M0882
$$ -467874 -484951 -425078 -364879 -401195 -516002 -600605 -599553 -559780 -533493 -508445 -467563
32408d67563J7345m1812n2752J5449P6582M9652k6187o4062n5468m7259m2515
$$ -467563 -450218 -492030 -544782 -529333 -452751 -403099 -429286 -493348 -548816 -596075 -638590
32397f38590j2016K9786M9732O9295J18816J44031O9535n4618r4432l3480k684
$$ -638590 -650606 -620820 -571088 -501793 -382977 -238946 -169411 -224029 -318461 -351941 -354625
32386c54625o9016j25947p0561K5097K9130m2544n9500J6894Q4049O3570J1357
$$ -354625 -423641 -549588 -620149 -595052 -565922 -608466 -667966 -651072 -567023 -503453 -492096
32375d92096J5707N4809K9736p7147j52199r6205K9100P4170Q273m3497J515N5582
$$ -492096 -476389 -421580 -391844 -468991 -621190 -717395 -688295 -614125 -605852 -649349 -647834 -592252
32363e92252J1083p3598o2461L8704R1699L7242l8731n4179k0108L1471Q4666
$$ -592252 -581169 -654767 -717228 -678524 -586825 -549583 -588314 -642493 -662601 -631130 -546464
32352e46464Q8541j615j06228q1564O2033J43856P2473k4117j0111N9065O1633
$$ -546464 -457923 -459538 -565766 -647330 -585297 -441441 -368968 -393085 -403196 -344131 -282498
32341b82498Q586j7912k7732p5027j14103n6782N9645J06019N3412R02N429R357
$$ -282498 -273912 -291824 -319556 -394583 -508686 -565468 -505823 -399804 -346392 -345490 -340061 -330704
32329c30704l1903o3031k9977J4778j1321q0860p9101L0091J35894J21833K4495
$$ -330704 -362607 -425638 -455615 -440837 -452158 -533018 -612119 -582028 -446134 -324301 -299806
32318b99806k4977K707K872p2898j15424l2475Q0072P3950j6968l8064K8536M7945
$$ -299806 -324783 -322076 -319204 -392102 -507526 -540001 -459929 -385979 -402947 -441011 -412475 -364530
32306c64530k4069o7368j1974M5396J5809l8570k9870P985j953m6828o4370m4800
$$ -364530 -388599 -455967 -467941 -422545 -406736 -445306 -475176 -467191 -469144 -515972 -580342 -625142
32294f25142j5973J2394L3336L0035J1560l707m3048j22431j48153j9743J64702
$$ -625142 -641115 -628721 -595385 -565350 -553790 -557497 -600545 -722976 -871129 -890872 -726170
32283g26170J84236J2843j27959r2847J2892O3425R6176J44085J05560n1984j56264
$$ -726170 -541934 -529091 -657050 -749897 -737005 -673580 -577404 -433319 -327759 -379743 -536007
32272e36007q3950K7958J7388l5522Q110P2559K8543l2044L5561J20184K5823
$$ -536007 -619957 -591999 -574611 -610133 -602023 -529464 -500921 -532965 -497404 -377220 -351397
32261c51397j48660j37584M0339J09857P325m2046M0373M1831j30209k29800o0256
$$ -351397 -500057 -637641 -597302 -487445 -480120 -522166 -481793 -439962 -570171 -799971 -860227
32250h60227J88059K17545M8687o7686l3956K5726J4675k0934k0502m500j4479
$$ -860227 -672168 -454623 -405936 -473622 -507578 -481852 -467177 -488111 -508613 -513113 -527592
32239e27592m1865m3039N777P3136R2714M1912j5967j3582K0689J0970m4461q3013
$$ -527592 -569457 -612496 -606719 -533583 -440869 -398957 -414924 -428506 -407817 -396847 -441308 -524321
32227e24321q4638p2895l4592M7721J02269M0105p9642r5881K4683J39990J44249
$$ -524321 -608959 -681854 -716446 -668725 -566456 -526351 -605993 -701874 -677191 -537201 -392952
32216c92952R1627O3771M3457j3925q5373j21318j07154m5918M6421J10349R2501
$$ -392952 -301325 -237554 -194097 -208022 -293395 -414713 -521867 -567785 -521364 -411015 -318514
32205c18514L5738K5790M8694J4550p6051j21522q8170m8916l1672J9285R4506
$$ -318514 -282776 -256986 -208292 -193742 -269793 -391315 -479485 -528401 -560073 -540788 -446282
32194d46282R2486m57n9919k5187K228n1425r4396l0071P7333J15383Q7300M8600
$$ -446282 -353796 -354253 -414172 -439359 -437131 -488556 -582952 -613023 -535690 -420307 -333007 -284407
32182b84407r313q9904j10107k3250O2657K7541p2053r7007m6861l4792p6950
$$ -284407 -293720 -383624 -493731 -516981 -454324 -426783 -498836 -595843 -642704 -677496 -754446
32171g54446o4667M5419J48213J35615L2875n2466n8940j2420K8887M2261N2851
$$ -754446 -819113 -773694 -625481 -489866 -456991 -509457 -568397 -580817 -551930 -509669 -456818
32160d56818P9819R0327M5193k2988m2867j9347l4598j10105j54939r9351j407
$$ -456818 -376999 -286672 -241479 -264467 -307334 -326681 -361279 -471384 -626323 -725674 -727081
32149g27081M1670K3649L798M207M028K406K2000O3441R8441R9238N8687J280
$$ -727081 -685411 -661762 -657964 -653757 -649729 -647323 -625323 -561882 -463441 -364203 -305516 -304236
32137c04236k6749j4573k1523r5586j70774j30218K4680J58849J73402J02274
$$ -304236 -330985 -345558 -367081 -462667 -633441 -763659 -738979 -580130 -406728 -304454
32127c04454K2442l5714o1547m3092p252J580J422M0882Q4814M9413m0611p0568
$$ -304454 -282012 -317726 -379273 -422365 -429617 -428037 -426615 -385733 -300919 -251506 -292117 -362685
32115c62685l0652k9942p9657n1751P3753J23723J4210p9981m752J01305K7047
$$ -362685 -393337 -423279 -502936 -554687 -480934 -357211 -343001 -422982 -427734 -326429 -299382
32104b99382j53830j91181n1163M9188j0292r7471o0540O5828J53918J52631R7221
$$ -299382 -453212 -644393 -695556 -646368 -656660 -754131 -814671 -748843 -594925 -442294 -345073
32093c45073L6867M978P943J8234J4030J4928L4888L2751k6918r5412r3843k0382
$$ -345073 -308206 -303228 -295285 -277051 -263021 -248093 -213205 -180454 -207372 -302784 -396627 -417009
32081d17009O1073J06676J02588L4546p2497j25983o5753M0431Q6054P0415N7578
$$ -417009 -355936 -249260 -146672 -112126 -184623 -310606 -376359 -335928 -249874 -179459 -121881
32070a21881L5475n5096j63861j47278J8572J58275J06471p2474j61344o6114
$$ -121881 -86406 -141502 -305363 -452641 -434069 -275794 -169323 -241797 -403141 -469255
32060d69255O8497N5693p6640j18871J8779J55231Q8351r6698j39089J0751J23027
$$ -469255 -400758 -345065 -421705 -540576 -521797 -366566 -278215 -374913 -514002 -503251 -380224
32049c80224M5106q3291p3743L5499R3317P9819P0383O2943J1759m1349l0475
$$ -380224 -335118 -418409 -492152 -456653 -363336 -283517 -213134 -150191 -138432 -179781 -210256
32038b10256l664m8412j27777j33256o0386J523J5476Q117j8513o1265n3073M3439
$$ -210256 -213920 -262332 -390109 -523365 -583751 -582228 -566752 -558635 -577148 -638413 -691486 -648047
32026f48047J31397J03525J6161l845L0796J1768n7517p3015k2637N084q157J203
$$ -648047 -516650 -413125 -396964 -400809 -370013 -358245 -415762 -488777 -511414 -506330 -514487 -513284
32014e13284K7611L089m5679j8721O8051Q5529N021n7102l8478j0741k0363j0333
$$ -513284 -485673 -482584 -528263 -546984 -478933 -393404 -388383 -445485 -483963 -494704 -515067 -525400
32002e25400M3350O4794J3990l8017l3048j1553j9181l3859l4405m0139m1982
$$ -525400 -482050 -417256 -403266 -441283 -474331 -485884 -505065 -538924 -573329 -613468 -655450
31991f55450L718P8302J01951O0883K5720K0287q026o0587o0976N349N3772M5494
$$ -655450 -651732 -573430 -471479 -410596 -384876 -364589 -372615 -433202 -494178 -488829 -435057 -389563
31979c89563L8746N1124J4014p4200r6730n485P6278M0004l9898l7094L0023N5452
$$ -389563 -350817 -299693 -285679 -359879 -456609 -462094 -385816 -345812 -385710 -422804 -392781 -337329
31967c37329K1546n142k273l734j3157N36L5214N1152K4600l3495r0049j00273
$$ -337329 -315783 -320925 -323198 -326932 -340089 -339553 -304339 -253187 -228587 -262082 -352131 -452404
31955d52404m6657J7974K3699r498L333O3292O7184j9552p9086r507J14215J46566
$$ -452404 -499061 -481087 -457388 -466886 -463553 -400261 -333077 -352629 -431715 -441222 -327007 -180441
31943a80441P3705L229q774j1991m9903q8729q1473l8580j234J8016L1884L2811
$$ -180441 -106736 -103507 -112281 -124272 -174175 -262904 -344377 -382957 -384191 -366175 -334291 -301480
31931c01480o162p2724r7893m0855L5230L8638j3490k4847J0494o863q7313q9798
$$ -301480 -307642 -380366 -478259 -519114 -483884 -445246 -458736 -483583 -473089 -479952 -567265 -657063
31919f57063N3222J88097J52919J9712l7465j4610l1143q9500q8629l2231j5719
$$ -657063 -603841 -415744 -262825 -243113 -280578 -295188 -326331 -415831 -504460 -536691 -552410
31908e52410l0325J3188P9246L9780q1951j11450P575J39647J77765J47955P9142
$$ -552410 -582735 -569547 -490301 -450521 -532472 -643922 -636347 -496700 -318935 -170980 -91838
31897i1838l1559j09188o6036J1473l5511j46183j10842M9606Q0744o7498j30065
$$ -91838 -123397 -232585 -298621 -287148 -322659 -468842 -579684 -530078 -449334 -516832 -646897
31886f46897K6352J72553J04712m1790p3285n0066q2539p5805N7081J53679N5682
$$ -646897 -620545 -447992 -343280 -385070 -458355 -508421 -590960 -666765 -609684 -456005 -400323
31875d00323q8664n9964O4101O5177l8265o3517O903N3179O7944J02467P5536
$$ -400323 -488987 -548951 -484850 -419673 -457938 -521455 -514552 -461373 -393429 -290962 -215426
31864b15426p6180j69386j4035K08596J54945j40258k90326j27455J01607J58412
$$ -215426 -291606 -460992 -475027 -266431 -111486 -251744 -542070 -669525 -567918 -409506
31854d09506R8848M4942k6439j32035j64574p2954K4839K8662k561Q190K7763
$$ -409506 -310658 -265716 -292155 -424190 -588764 -661718 -636879 -608217 -610778 -602588 -574825
31843e74825J5864J4669M9373O2884K2935j5284q055J8113L8623N5474L8899l4483
$$ -574825 -558961 -544292 -494919 -432035 -409100 -424384 -432439 -414326 -375703 -320229 -281330 -315813
31831c15813q6541k2609R0906R6217m246m7896J5313M7727k7364r7817o5072L86
$$ -315813 -402354 -424963 -334057 -237840 -242086 -289982 -274669 -226942 -254306 -352123 -417195 -416809
31819d16809L348k4198j2003L2478P8132J23240J31313M0535j02906j55780q2205
$$ -416809 -413461 -437659 -449662 -417184 -339052 -215812 -84499 -43964 -146870 -302650 -384855
31808c84855m931N452K5729Q5694O5514q4335j90494r3230R2462J35184J8316
$$ -384855 -389786 -384334 -358605 -272911 -207397 -291732 -482226 -575456 -482994 -347810 -329494
31797c29494p2204m0754J9042J2658k6766l2071r771m760k5475m7465n5700n1137
$$ -329494 -401698 -442452 -423410 -410752 -437518 -469589 -479360 -484120 -509595 -557060 -612760 -663897
31785f63897k8103K9033J10676J53471R1833l9497j09651n0134M7606O7363L8481
$$ -663897 -692000 -662967 -552291 -398820 -306987 -346484 -456135 -506269 -458663 -391300 -352819
31774c52819O1943J18222R3372j8557r0014n2948J7372L5598L99o3478j33455
$$ -352819 -290876 -172654 -79282 -97839 -187853 -240801 -223429 -187831 -187432 -250910 -384365
31763c84365j45177n0687O7739Q1070J5218P141N5694K0665r3573q9588R1511
$$ -384365 -529542 -580229 -512490 -431420 -416202 -409061 -353367 -332702 -426275 -515863 -424352
31752d24352K20349J12380q6771j32565l6189J7783j3707k0298K7522M1394q613
$$ -424352 -204003 -91623 -178394 -310959 -347148 -329365 -343072 -363370 -335848 -294454 -303067
31741c03067n1889m9181l3241k3857j2536j5699m4708m9823R567P3122N8801k45
$$ -303067 -354956 -404137 -437378 -461235 -473771 -489470 -534178 -584001 -574434 -501312 -442511 -442756
31729d42756m851N0557P7683M1361L29m201p103m4367q7548q2695k0926M9121
$$ -442756 -447607 -397050 -319367 -278006 -277677 -281878 -288981 -333348 -420896 -503591 -524517 -475396
31717d75396P4306O1989P1133J09876Q6926n4274j93386j58539J1693R3630Q79
$$ -475396 -401090 -339101 -267968 -158092 -71166 -125440 -318826 -477365 -465672 -372042 -371163
31706c71163r1874k4593J16412J56980Q1886p532o2738q4287n3995O970J5949
$$ -371163 -463037 -487630 -371218 -214238 -132352 -139884 -202622 -286909 -340904 -333934 -317985
31695c17985k7029j125J13340J37175k4584j73923j05937N2243M6544q6191j05356
$$ -317985 -345014 -346139 -232799 -95624 -120208 -294131 -400068 -347825 -301281 -387472 -492828
31684d92828Q079M4247l5487l2587J03508J51999j286j51004r8966M5306P8170
$$ -492828 -484749 -440502 -475989 -508576 -405068 -253069 -254355 -405359 -504325 -459019 -380849
31673c80849K3271L2043R9706R2800j2322j01494j02240n0829J908M1925O0159
$$ -380849 -357578 -325535 -225829 -133029 -145351 -246845 -349085 -399914 -398006 -356081 -295922
31662b95922N0641L0418J2536j2243l4951k4093M072j6698q9497j20940o0596
$$ -295922 -245281 -214863 -202327 -214570 -249521 -273614 -269542 -286240 -375737 -496677 -557273
31651e57273J0510O033l1448j3005M8403P4004N2500L4571L2310K4590L0856P4165
$$ -557273 -546763 -540730 -572178 -585183 -536780 -462776 -410276 -375705 -343395 -318805 -287949 -213784
31639b13784R3238P110j32873j72220o1285O8734Q2664P087l9160r158M8172P8311
$$ -213784 -120546 -113436 -246309 -418529 -479814 -411080 -328416 -321329 -360489 -369647 -321475 -243164
31627b43164O0097j2758j10183j43598n2720P9819R1709m5739j61663r7459Q2744
$$ -243164 -183067 -195825 -306008 -449606 -502326 -422507 -330798 -376537 -538200 -635659 -552915
31616e52915J80717J17369r024r6710j45467j65301j08597L1741J48739J41949
$$ -552915 -372198 -254829 -263853 -360563 -506030 -671331 -779928 -748187 -599448 -457499
31606d57499N8889K5563O8565R4510L6109n8056q9305j8885R0521J21906J8227
$$ -457499 -398610 -373047 -304482 -209972 -173863 -231919 -321224 -340109 -249588 -127682 -109455
31595a09455j27736j48529q814J26053R5398m7003j23617q0727k1427j4156p824
$$ -109455 -237191 -385720 -394534 -268481 -173083 -220086 -343703 -424430 -445857 -460013 -467837
31584d67837M1139Q3277O9010K8669J506l3237r0358j13833n2731M5426R0227
$$ -467837 -426698 -343421 -274411 -245742 -244236 -277473 -367831 -481664 -534395 -488969 -398742
31573c98742O7033L2667J5200r374m3581m3798P757O1289O7107M5740M2686M0594
$$ -398742 -331709 -299042 -283842 -293216 -336797 -380595 -372838 -311549 -244442 -198702 -156016 -115422
31561a15422j6021j08997j36981n2235O1351J02156P8900N0257M541q4361j30892
$$ -115422 -131443 -240440 -377421 -429656 -368305 -266149 -187249 -136992 -132451 -216812 -347704
31550c47704k6329J48720J73311n144j74214j48048m777P1582M5643l667m8983
$$ -347704 -374033 -225313 -52002 -57146 -231360 -379408 -384185 -312603 -266960 -270627 -319610
31539c19610r3110p7137L0086J22363Q9501m550k7219R832Q563j5703J7188N9504
$$ -319610 -412720 -489857 -459771 -337408 -247907 -252457 -279676 -269844 -261281 -276984 -259796 -200292
31527b00292K687r4793p1569N1400Q3967j5060p4743j6801K3961k8737m5204N4819
$$ -200292 -197605 -292398 -363967 -312567 -228600 -243660 -318403 -335204 -311243 -339980 -385184 -330365
31515c30365J25136M2283o2535k1859P5363L6061j02168j31315j8110M7314l9427
$$ -330365 -205229 -162946 -225481 -247340 -171977 -135916 -238084 -369399 -387509 -340195 -379622
31504c79622j42203j00977M4794J35141J04991L6484K5950O1432N4640j9299o3974
$$ -379622 -521825 -622802 -578008 -442867 -337876 -301392 -275442 -214010 -159370 -178669 -242643
31493b42643N127J07494Q2603o9816j64074q9229L7095N9901O830l852K7966J8174
$$ -242643 -237516 -130022 -47419 -117235 -281309 -370538 -333443 -273542 -266712 -270564 -242598 -224424
31481b24424k4078j3952L9307L2864n2985j12377p5027J384L6138L0513K4189
$$ -224424 -248502 -262454 -223147 -190283 -243268 -355645 -430672 -429288 -393150 -362637 -338448
31470c38448J9410r95k4278j9132K1836P0114Q2818M0166k5237n3135k6230J0479
$$ -338448 -319038 -320033 -344311 -363443 -341607 -271493 -188675 -148509 -173746 -226881 -253111 -242632
31458b42632J8852J4622J7948J1122j0535m503M0417M9957k9468j19660j04425
$$ -242632 -223780 -209158 -191210 -180088 -190623 -195126 -154709 -104752 -134220 -253880 -358305
31447c58305k445O0521L6043l705p739j0787l0104j7241L1971K7065p3909j55156
$$ -358305 -360750 -300229 -264186 -267891 -275630 -286417 -316521 -333762 -301791 -274726 -348635 -503791
31435e03791q4637Q2686J58785P1534n0111o5671N12L4788J3461J1102N4206O9713
$$ -503791 -588428 -505742 -346957 -275423 -325534 -391205 -390693 -355905 -342444 -331342 -277136 -207423
31423b07423P380o6841n9465J4349N2059N524o2184o9159j4285L7683M2101J9408
$$ -207423 -200043 -266884 -326349 -312000 -259941 -254417 -316601 -385760 -400045 -362362 -320261 -300853
31411c00853J6395L6895L2294k3548p8914p3666m1695n8233q8675j5905J40874
$$ -300853 -284458 -247563 -215269 -238817 -317731 -391397 -433092 -491325 -580000 -595905 -455031
31400d55031J84855K3329j50306j15244N0195J01886R597l6057L3560P6564K4342
$$ -455031 -270176 -246847 -397153 -512397 -462202 -360316 -350719 -386776 -353216 -276652 -252310
31389b52310m323M6776M9959n5525j11807p21J32811R8487m5978j08610n4822
$$ -252310 -256633 -209857 -159898 -215423 -327230 -327951 -195140 -96653 -142631 -251241 -306063
31378c06063K262J2932J0201j2738p2290r6257j5140R6817J18258O4043K7245
$$ -306063 -303801 -290869 -280668 -293406 -365696 -461953 -477093 -380276 -262018 -197975 -170730
31367a70730K274p1392j43797j10164j594M9809J8221k998K2632M4684N5057Q5433
$$ -170730 -168456 -239848 -383645 -493809 -495403 -445594 -427373 -430371 -407739 -363055 -307998 -222565
31355b22565Q9609l133j23410j25910k3210K4518k9168n4343J6131P2690K5033
$$ -222565 -132956 -136089 -259499 -385409 -408619 -384101 -413269 -467612 -451481 -378791 -353758
31344c53758n6098p9394o8331o3833k4170P4760J47772J13289J6111n0293o9377
$$ -353758 -409856 -489250 -557581 -621414 -645584 -570824 -423052 -309763 -293652 -343945 -413322
31333d13322p0197m4127K0988P5771N6858k7260j04635j08317k0333J07018J68008
$$ -413322 -483519 -527646 -506658 -430887 -374029 -401289 -505924 -614241 -634574 -527556 -359548
31322c59548J04822k666k2996M7964Q5338K4023n4713n7214N0M5646M7321R378
$$ -359548 -254726 -257392 -280388 -232424 -147086 -123063 -177776 -234990 -234940 -189294 -141973 -132595
31310a32595n0882r0474p0732j8915O780J1092L5754N3731K496q2565r8169m1494
$$ -132595 -183477 -273951 -344683 -363598 -356818 -345726 -309972 -256241 -253745 -336310 -434479 -475973
31298d75973r122k0822k863L8092R759n9565j7209J37482J90694M4952r9997n5377
$$ -475973 -485095 -505917 -508780 -470688 -460929 -520494 -537703 -400221 -209527 -164575 -264572 -319949
31286c19949O2858M5234p1864j05821m3676j6614l7707m932P4636R0497M4276
$$ -319949 -257091 -211857 -283721 -389542 -433218 -449832 -487539 -492471 -417835 -327338 -283062
31275b83062M7357R9551P3830n1228j32489q3456R078M3747L4541K3522m782n4745
$$ -283062 -235705 -136154 -62324 -113552 -246041 -329497 -320419 -276672 -242131 -218609 -223391 -278136
31263b78136p4734m5443k2302l6402l9308J993L6636J2063m1830o2239l6060M937
$$ -278136 -352870 -398313 -420615 -457017 -496325 -494332 -457696 -445633 -487463 -549702 -585762 -580825
31251e80825K6972R467l6137n0951J3997J16395J56776J01616J3631m1238m9757
$$ -580825 -553853 -544386 -580523 -631474 -617477 -501082 -344306 -242690 -229059 -270297 -320054
31240c20054j5914M9626R4766O2899j6913n2586j6944K6560L8379M8042N9145
$$ -320054 -335968 -286342 -191576 -128677 -145590 -198176 -215120 -188560 -150181 -102139 -42994
31229d2994J3874r4669j67887j29017l2351K4368L1984M0160N2800L9142J3574
$$ -42994 -29120 -123789 -291676 -420693 -453044 -428676 -396692 -356532 -303732 -264590 -251016
31218b51016J9233M6927M4735M171k8935l4254m7152q9113j14837o4558M9065
$$ -251016 -231783 -184856 -140121 -135950 -164885 -199139 -246291 -335404 -450241 -514799 -465734
31207d65734J39255J35710N8596j2500l0963j6489m75J3836J6728k6143j07171
$$ -465734 -326479 -190769 -132173 -144673 -175636 -192125 -192600 -178764 -162036 -188179 -295350
31196b95350j40414o5972M0964N3790k6959p7126l5150K2545K2702N212L0890
$$ -295350 -435764 -501736 -460772 -406982 -433941 -511067 -546217 -523672 -500970 -495758 -464868
31185d64868O6781M4348k4898p0515o4092l3099k321K1379L0871L3270N4853R0187
$$ -464868 -398087 -353739 -378637 -449152 -513244 -546343 -548664 -527285 -496414 -463144 -408291 -318104
31173c18104Q4359J1817o9408r3019o7803l0731K4571R6637J13550K6666p4024
$$ -318104 -233745 -221928 -291336 -384355 -452158 -482889 -458318 -361681 -248131 -221465 -295489
31162b95489o0093L8028O5119k3108r7488o2671J0884K7560J3024K7077L7226
$$ -295489 -355582 -317554 -252435 -275543 -373031 -435702 -424818 -397258 -384234 -357157 -319931
31151c19931m546m0094Q578Q3875O1834m6349r9961m0325L4651L6217M504J0399
$$ -319931 -324477 -364571 -355993 -272118 -210284 -256633 -356594 -396919 -362268 -326051 -321547 -311148
31139c11148L8665L6502M001k8967n6496o9684l4446M3821Q9017N2424q104j2765
$$ -311148 -272483 -235981 -231980 -260947 -317443 -387127 -421573 -377752 -288735 -236311 -244415 -257180
31127b57180K6749N0269N2815N7214L0848n9893j38599q8312O0298J31660L4105
$$ -257180 -230431 -180162 -127347 -70133 -39285 -99178 -237777 -326089 -265791 -134131 -100026
31116a00026j16894j57964p5324K1089N3607L3719N487K036L9232R8628J25625
$$ -100026 -216920 -374884 -450208 -429119 -375512 -341793 -336306 -334270 -295038 -196410 -70785
31105g0785Q1672q990q5749j08595p5309j0537M2079M5814J1744j1001j593P985
$$ -70785 10887 1897 -83852 -192447 -267756 -278293 -236214 -190400 -178656 -189657 -191250 -183265
31093a83265q875l0845l0413j8865j5551o137K8810O7916P1139L4276r842l4331
$$ -183265 -192140 -222985 -253398 -272263 -287814 -293951 -265141 -197225 -126086 -91810 -101652 -135983
31081a35983l8027l1185k0536m977J9084M1742L9689J2219j967J9812L4504n406
$$ -135983 -174010 -205195 -225731 -230708 -211624 -169882 -130193 -117974 -119941 -100129 -65625 -71031
31069g1031o0037m7634K1735M5919k0159j02046j19569p9286k2738K9903M9108
$$ -71031 -131068 -178702 -156967 -111048 -131207 -233253 -352822 -432108 -454846 -424943 -375835
31058c75835M066n4829k5553P7493J00960k1640j40714r8158M3203J11738P6895
$$ -375835 -371769 -426598 -452151 -374658 -273698 -295338 -436052 -534210 -491007 -379269 -302374
31047c02374L2361K155n9098j10097n2294Q2513J43505Q3089J3536Q950M372n1093
$$ -302374 -270013 -267858 -326956 -437053 -489347 -406834 -263329 -180240 -166704 -157754 -153382 -204475
31035b04475q4052k6049N6590N7162j9537q1496p4120j6679M3247O1274J9571
$$ -204475 -288527 -314576 -257986 -200824 -220361 -301857 -375977 -392656 -349409 -288135 -268564
31024b68564m3777o2560k0506L7509P7634J04222J11161P7481K3622l111j1985
$$ -268564 -312341 -374901 -395407 -357898 -280264 -176042 -64881 12600 36222 33111 21126
31013B1126n2876j01280o3071O6691J55312J05737j3157q0537q3087p7579p0584
$$ 21126 -31750 -133030 -196101 -129410 25902 131639 118482 37945 -45142 -122721 -193305
31002a93305l5856p95j5249o1026p7395n6005l5795k4932j216K7313L2706K3400
$$ -193305 -229161 -229956 -245205 -306231 -383626 -439631 -475426 -500358 -501574 -474261 -441555 -418155
30990d18155K4485K0410j1588l1059J7512R4634J00289K9196j1650K3136L4304
$$ -418155 -393670 -373260 -384848 -415907 -398395 -303761 -203472 -174276 -185926 -162790 -128486
30979a28486n2972j30615m7102J36473J85496J5786j66640j40754K6848R4750
$$ -128486 -181458 -312073 -359175 -222702 -37206 -21420 -188060 -328814 -301966 -207216
30969b07216p77q2122k5760N9707L1336n9361o5706J8079O4999J8411m4389m2574
$$ -207216 -207993 -290115 -315875 -256168 -224832 -284193 -349899 -331820 -266821 -248410 -292799 -335373
30957c35373J8553Q4639R7304K1132r4336j17146M844J28095Q3031p6983j44757
$$ -335373 -316820 -232181 -134877 -113745 -208081 -325227 -320383 -192288 -109257 -186240 -330997
30946c30997n9591L1740K8392R020N4778J03823P3122k025m1321l2580j058L6773
$$ -330997 -390588 -358848 -330456 -321436 -266658 -162835 -89713 -91738 -133059 -165639 -166697 -129924
30934a29924L5755m8308j42354j05366M6596J22498M4693k3525M2107J08551K2055
$$ -129924 -94169 -142477 -284831 -390197 -343601 -221103 -176410 -199935 -157828 -49277 -27222
30923b7222j08014q8054K4728K3843q5547j00115K3419Q9450j4619j47603j42648
$$ -27222 -135236 -223290 -198562 -174719 -260266 -360381 -336962 -247512 -262131 -409734 -552382
30912e52382k3065R0203J34613R7000j2220j05368o7369P2606J44037P4301r035
$$ -552382 -575447 -485244 -350631 -253631 -265851 -371219 -438588 -365982 -221945 -147644 -156679
30901a56679O480M4098m038o9392j4735J21158J51382N997j64863j85859o7247
$$ -156679 -150199 -106101 -110139 -179531 -194266 -73108 78274 84271 -80592 -266451 -333698
30890c33698K8766n222r6529q9804M5295J57695J09628k5130n6138N0277J23758
$$ -333698 -304932 -310154 -406683 -496487 -451192 -293497 -183869 -208999 -265137 -214860 -91102
30879i1102M6608p7424r1303r989L5942O405k6114k4146l0169o3946p9445m6271
$$ -91102 -44494 -121918 -213221 -223210 -187268 -180863 -206977 -231123 -261292 -325238 -404683 -450954
30867d50954K371K8193L7347M8705N6165M3237P843l5155n5730k4106M4358P7516
$$ -450954 -448583 -420390 -383043 -334338 -278173 -234936 -227093 -262248 -317978 -342084 -297726 -220210
30855b20210K6323n6196p2946j6336K3409l691l5773o497M3509L3990j6955j3166
$$ -220210 -193887 -250083 -323029 -339365 -315956 -319647 -355420 -361917 -318408 -284418 -301373 -314539
30843c14539O2507J02051K3363r9929j25739k6563Q5812J10110N9596L181l0417
$$ -314539 -252032 -149981 -126618 -226547 -352286 -378849 -293037 -182927 -123331 -120150 -150567
$$ [...]
##END NTUPLES=NMR SPECTRUM
##END=
