##TITLE=31Pdec_LY-TMF-15.5.R.t
 D2O, 24 sc
 5.3.2020
##JCAMPDX= 6.0         $$ Bruker NMR JCAMP-DX V2.0
##DATA TYPE= NMR SPECTRUM
##DATA CLASS= NTUPLES
##ORIGIN= UXNMR, Bruker Analytische Messtechnik GmbH
##OWNER= root
$$ XWIN-NMR		Version 3.5
$$ Thu Mar  5 14:29:00 2020 Russian Standard Time (UT+4h)  she@DPX200
##.OBSERVE FREQUENCY= 81.013821
##.OBSERVE NUCLEUS= ^31P
##.ACQUISITION MODE= SIMULTANEOUS
##.ACQUISITION SCHEME= undefined
##.AVERAGES= 24
##.DIGITISER RES= 17
##SPECTROMETER/DATA SYSTEM= spect
##.PULSE SEQUENCE= zgpg30
##.SOLVENT NAME= DMSO
##.SHIFT REFERENCE= (INTERNAL, DMSO, 0, 182.463)
##AUDIT TRAIL= $$ (NUMBER, WHEN, WHO, WHERE, WHAT)
$$ ##TITLE= Audit trail, XWIN-NMR		Version 3.5
$$ ##JCAMPDX= 5.01
$$ ##ORIGIN= Bruker BioSpin GmbH
$$ ##OWNER= she
$$ F:/spectra/data/she/nmr/P31/1/pdata/1/auditp.txt
$$ ##AUDIT TRAIL=  $$ (NUMBER, WHEN, WHO, WHERE, WHAT)
(   1,<2020-03-05 14:27:58.95 +0400>,<she>,<DPX200>,
      <created by zg, POWCHK disabled, PULCHK disabled
       configuration hash MD5:
       00 E9 B6 7A A2 85 ED C7 34 08 36 98 17 FE 4E 26
       data hash MD5: 32K
       1F 0A 8A 43 62 4A 21 D8 86 F0 D6 48 46 D7 F4 72>)
(   2,<2020-03-05 14:28:01.23 +0400>,<she>,<DPX200>,
      <Start of raw data processing
       efp BC_mod = 2 LB = 1 FT_mod = 6 PKNL = 1 PHC0 = -1358.207 PHC1 = 150.6017 SI = 64K 
       data hash MD5: 64K
       72 E5 FA 46 8D 0F EF 9F 7B A8 B8 AB 28 5E 10 68>)
(   3,<2020-03-05 14:28:15.65 +0400>,<she>,<DPX200>,
      <pk PHC0 = 0.4365777 PHC1 = 0 
       data hash MD5: 64K
       12 BC DC FD 98 F7 F9 A3 27 64 8A A4 EF 9E 5F 6E>)
(   4,<2020-03-05 14:28:18.39 +0400>,<she>,<DPX200>,
      <abs ABSG = 5 
       data hash MD5: 64K
       AB F8 71 FC B8 B6 A7 2D 79 D3 F5 19 E3 9F AC 95>)
(   5,<2020-03-05 14:28:33.00 +0400>,<she>,<DPX200>,
      <pk PHC0 = -4.398807 PHC1 = 0 
       data hash MD5: 64K
       58 4B ED 78 17 43 8D 3D 8E C3 F4 DD 74 97 ED 00>)
$$ ##END=
$$ 
$$ hash MD5
$$ D0 D3 55 16 A2 6A F0 BC 65 6D C0 B3 CE 65 2E 7F
##$RELAX= 
##$RELAX= 
##$RELAX= 
##$RELAX= 
##$RELAX= 
##$RELAX= 
##$RELAX= 
##$RELAX= 
$$ Bruker specific parameters
$$ --------------------------
##$DU= <F:/spectra>
##$EXPNO= 1
##$NAME= <P31>
##$PROCNO= 1
##$TYPE= <nmr>
##$USER= <she>
##$AMP= (0..31)
100 100 100 100 100 100 100 100 100 100 100 100 100 100 100 100 100 100 
100 100 100 100 100 100 100 100 100 100 100 100 100 100 
##$AQSEQ= 0
##$AQ_mod= 1
##$AUNM= <au_zg>
##$AUTOPOS= <>
##$BF1= 81.014009
##$BF2= 200.13
##$BF3= 200.13
##$BF4= 200.13
##$BF5= 200.13
##$BF6= 200.13
##$BF7= 200.13
##$BF8= 200.13
##$BYTORDA= 1
##$CFDGTYP= 0
##$CFRGTYP= 5
##$CHEMSTR= <none>
##$CNST= (0..31)
1 1 145 1 1 1 1 1 1 1 1 1 1 1 1 1 1 1 1 1 1 1 1 1 1 1 1 1 1 1 1 1 
##$CPDPRG= <waltz16>
##$CPDPRG1= <>
##$CPDPRG2= <waltz16>
##$CPDPRG3= <>
##$CPDPRG4= <mlev>
##$CPDPRG5= <mlev>
##$CPDPRG6= <mlev>
##$CPDPRG7= <mlev>
##$CPDPRG8= <mlev>
##$CPDPRGB= <>
##$CPDPRGT= <>
##$D= (0..31)
0 1 0 0 0 0 0 0 0 0 0 0.03 2e-05 3e-06 0 0 0 0 0 0 0 0 0 0 0 0 0 0 0 0 
0 0 
$$ [...]
##$SUBNAM3= <"">
##$SUBNAM4= <"">
##$SUBNAM5= <"">
##$SUBNAM6= <"">
##$SUBNAM7= <"">
##$SUBNAM8= <"">
##$SUBNAM9= <"">
##$SW= 369.568048894756
##$SWIBOX= (0..15)
0 1 3 0 0 0 0 0 0 0 0 0 0 0 0 0 
##$SW_h= 29940.119760479
##$TD= 32768
##$TD0= 1
##$TE= 0
##$TE2= 300
##$TE3= 300
##$TEG= 300
##$TL= (0..7)
0 120 53 12 22 120 120 120 
##$TP= (0..7)
150 150 150 150 150 150 150 150 
##$TP07= 0
##$TPNAME0= <>
##$TPNAME1= <>
##$TPNAME2= <>
##$TPNAME3= <>
##$TPNAME4= <>
##$TPNAME5= <>
##$TPNAME6= <>
##$TPNAME7= <>
##$TPOAL= (0..7)
0.5 0.5 0.5 0.5 0.5 0.5 0.5 0.5 
##$TPOFFS= (0..7)
0 0 0 0 0 0 0 0 
##$TUNHIN= 0
##$TUNHOUT= 0
##$TUNXOUT= 0
##$USERA1= <user>
##$USERA2= <user>
##$USERA3= <user>
##$USERA4= <user>
##$USERA5= <user>
##$V9= 5
##$VALIST= <valist>
##$VCLIST= <CCCCCCCCCCCCCCC>
##$VD= 0
##$VDLIST= <DDDDDDDDDDDDDDD>
##$VPLIST= <PPPPPPPPPPPPPPP>
##$VTLIST= <TTTTTTTTTTTTTTT>
##$WBST= 1024
##$WBSW= 4
##$XGAIN= (0..3)
0 0 0 0 
##$XL= 0
##$YL= 0
##$YMAX_a= 10943
##$YMIN_a= -9890
##$ZGOPTNS= <>
##$ZL1= 120
##$ZL2= 120
##$ZL3= 120
##$ZL4= 120
##$ABSF1= 182.463
##$ABSF2= -187.1042
##$ABSG= 5
##$ABSL= 3
##$ALPHA= 0
##$AQORDER= 0
##$ASSFAC= 0
##$ASSFACI= 0
##$ASSFACX= 0
##$ASSWID= 0
##$AUNMP= <proc_1d>
##$AZFE= 0.1
##$AZFW= 0.5
##$BCFW= 0
##$BC_mod= 2
##$BYTORDP= 0
##$COROFFS= 0
##$CY= -3
##$DATMOD= 1
##$DC= 0
##$DFILT= <>
##$DTYPP= 0
##$F1P= 0
##$F2P= 0
##$FCOR= 1
##$FTSIZE= 65536
##$FT_mod= 6
##$GAMMA= 0
##$GB= 0
##$INTBC= 1
##$INTSCL= 5.30512e-09
##$ISEN= 30
##$LB= 1
##$LEV0= 0
##$LPBIN= 0
##$MAXI= 10000
##$MC2= 0
##$MEAN= 0
##$ME_mod= 0
##$MI= 50
##$NCOEF= 0
##$NC_proc= -4
##$NLEV= 6
##$NOISF1= 182.463
##$NOISF2= 159.3651
##$NSP= 0
##$NTH_PI= 0
##$NZP= 0
##$OFFSET= 182.463
##$PC= 4
##$PHC0= -1362.17
##$PHC1= 150.6017
##$PH_mod= 1
##$PKNL= yes
##$PPARMOD= 0
##$PSCAL= 0
##$PSIGN= 0
##$REVERSE= no
##$SF= 81.0140089999434
##$SI= 65536
##$SIGF1= 159.3651
##$SIGF2= -187.1042
##$SINO= 113.3802
##$SIOLD= 16384
##$SREGLST= <1H.CDCl3>
##$SSB= 0
##$STSI= 65536
##$STSR= 0
##$SW_p= 29940.119760479
##$SYMM= 0
##$S_DEV= 0
##$TDeff= 32768
##$TDoff= 0
##$TI= <>
##$TILT= no
##$TM1= 0
##$TM2= 0
##$TOPLEV= 0
##$USERP1= <user>
##$USERP2= <user>
##$USERP3= <user>
##$USERP4= <user>
##$USERP5= <user>
##$WDW= 1
##$XDIM= 65536
##$YMAX_p= 291332534
##$YMIN_p= -5706518
$$ End of Bruker specific parameters
$$ ---------------------------------
##NTUPLES= NMR SPECTRUM
##VAR_NAME=  FREQUENCY,     SPECTRUM/REAL,   SPECTRUM/IMAG
##SYMBOL=    X,             R,               I
##VAR_TYPE=  INDEPENDENT,   DEPENDENT,       DEPENDENT
##VAR_FORM=  AFFN,          ASDF,            ASDF
##VAR_DIM=   65536,         65536,           65536
##UNITS=     HZ,            ARBITRARY UNITS, ARBITRARY UNITS
##FACTOR=    0.456856943014862, 1,           1
##FIRST=     14782.0589164792, 0,            0
##LAST=      -15158.0608439998, 0,           0
##MIN=       -15158.0608439998, -5706518,    0
##MAX=       14782.0589164792, 291332534,    0
$$ Real data points
##PAGE= N=1
##DATA TABLE= (X++(R..R)), XYDATA
$$ [...]
39303 -840642 -869706 -822649 -500016 -61864 181245 112276 -118684 -225863 19165 562829
39293 562829 1028389 1060331 700496 259034 -116571 -485668 -779583 -780852 -508096 -281040
39283 -281040 -260812 -232900 -23998 163851 76189 -176671 -284705 -139885 151937 466271
39273 466271 633613 440002 -47969 -351132 -108891 411410 686369 656896 653806 730496
39263 730496 599540 248211 79193 295074 615848 794918 957382 1184143 1221409 943086
39253 943086 682559 682035 584801 5810 -662815 -641378 122234 809189 744585 62457 -701103
39242 -701103 -1177329 -1196424 -748572 -169908 16052 -283901 -576350 -473252 -212663 -210936
39232 -210936 -418441 -481925 -298200 -11884 353511 843339 1257407 1300430 1017183 725114
39222 725114 552136 398552 309649 459712 741541 818177 676157 670579 858901 779811
39212 779811 193976 -402016 -428804 -53434 122047 -46944 -214226 -254030 -390302 -601750
39202 -601750 -511730 -49533 316871 282372 165058 315608 499386 337380 28776 59818
39192 59818 375027 454411 184321 28393 213701 348846 130807 -94835 95849 462015
39182 462015 433985 -21648 -374353 -281330 86823 451302 715653 788808 524962 137
39172 137 -444683 -583587 -494438 -282250 89602 548131 798575 705843 564088 720580
39162 720580 1079833 1232230 973845 474007 10399 -241893 -212361 54590 376154 548008
39152 548008 488411 225462 -153023 -469142 -547682 -475211 -581194 -971006 -1267508 -1076062
39142 -1076062 -549032 -180474 -153684 -232748 -227074 -176986 -75424 193564 542515 666997
39132 666997 496287 349034 464630 661144 670608 568603 612474 817045 945632 839013
39122 839013 563749 305310 252004 475396 772736 743809 212193 -497009 -862752 -698703
39112 -698703 -248777 155815 352269 309676 50484 -329632 -671398 -843224 -808649 -625819
39102 -625819 -408549 -248242 -153501 -117750 -222414 -532416 -868469 -876406 -437482 137806
39092 137806 452245 427771 245802 41324 -152906 -271336 -249194 -158104 -133240 -181963
39082 -181963 -196775 -121451 14946 170193 273953 225233 49033 -40936 85552 235695
39072 235695 153597 -40700 54500 557768 1074984 1135247 710448 222341 121202 472635
39062 472635 866331 758810 36904 -784625 -1069391 -728291 -227663 -524 -84018 -301858
39052 -301858 -490453 -471449 -110066 418034 640873 283018 -380608 -817391 -764806 -350555
39042 -350555 136629 411379 284646 -154005 -510110 -469283 -185124 -76905 -261491 -429515
39032 -429515 -328252 -105084 -12814 23264 280209 735222 960619 619597 -103122 -707808
39022 -707808 -914996 -837204 -686945 -532928 -383085 -307593 -351591 -434182 -435625 -299011 5059
39011 5059 451413 799580 682398 81397 -455965 -377585 174992 536545 340787 -165270
39001 -165270 -620540 -945718 -1110134 -917396 -330466 245390 343937 -2487 -336321 -324867
38991 -324867 -25925 304685 445364 306556 13880 -130998 40334 315047 337423 75507
38981 75507 -133811 -12064 359191 688245 768544 578777 222301 -154091 -439600 -599669
38971 -599669 -627678 -507877 -289719 -128529 -136100 -230380 -249689 -176679 -118347 -99522 -34499
38960 -34499 96944 198149 198380 107118 -89889 -428688 -809721 -995129 -858584 -543246
38950 -543246 -301724 -265855 -419455 -667279 -832124 -703715 -253161 237933 411646 220861
38940 220861 -17968 5645 252366 411339 266889 -88427 -390514 -466171 -327234 -84547
38930 -84547 139994 245424 204150 107797 88930 178559 301653 397451 441435 371891 165177
38919 165177 -1521 109604 409350 499366 261390 154306 602607 1288252 1473364 957153
38909 957153 270448 -102056 -224662 -306019 -277814 -87887 -35817 -388965 -864471 -909546
38899 -909546 -420358 166162 451361 415642 194502 -146664 -535358 -846754 -1024801 -1069483
38889 -1069483 -900691 -479085 -69465 -52520 -364632 -466684 -86380 322844 195367 -305318
38879 -305318 -489714 -105053 366911 456033 315069 338499 496483 425693 47344 -290177
38869 -290177 -306369 -106420 94173 280217 484236 541066 263467 -237338 -669062 -947959
38859 -947959 -1188869 -1306923 -989602 -241250 348804 209022 -470079 -910860 -645931 28893
38849 28893 509023 513983 192259 -142936 -219551 68854 548754 857105 784446 474511
38839 474511 210092 109784 126302 199089 253067 158804 -124422 -435090 -600095 -659843
38829 -659843 -728566 -729605 -516072 -208283 -126885 -354560 -621278 -691066 -613186 -499266 -322016
38818 -322016 -99508 -32142 -216280 -391423 -233702 194342 523982 539886 327551 16415
38808 16415 -359860 -727066 -932077 -916825 -764582 -521413 -139675 333493 674830 697739
38798 697739 440412 67081 -305500 -604939 -752378 -738903 -675254 -648303 -587573 -395672
38788 -395672 -166533 -123696 -320858 -531006 -502898 -247461 16259 143068 163506 110575
38778 110575 -78551 -369965 -486133 -189619 309159 496113 193130 -196220 -242196 -46761
38768 -46761 16756 -72398 11812 375460 726625 815965 722049 601749 470796 370119 441900
38757 441900 638630 632323 269396 -110531 -100066 214587 443758 512508 707334 1126952
38747 1126952 1462243 1423737 1103991 779762 570379 437248 349729 282211 144338 -134822
38737 -134822 -485550 -747768 -817681 -704344 -488920 -259242 -33613 254516 609987 818154
38727 818154 593361 -29845 -595697 -672359 -328499 -10750 9330 -123831 -174431 -152828
38717 -152828 -181400 -183108 48408 482279 791582 754699 533758 400900 325103 53163
38707 53163 -441892 -835788 -849357 -598457 -430420 -509343 -684612 -735329 -639379 -561760 -605275
38696 -605275 -641752 -476987 -169745 -20248 -150328 -279205 -111507 211161 324329 187996
38686 187996 66813 23836 -137534 -395783 -456442 -318196 -390862 -778820 -944082 -502354
38676 -502354 72830 84164 -362957 -590270 -425841 -380556 -743159 -1127164 -1073752 -612753
38666 -612753 -50190 384345 518168 272726 -81323 -67566 389654 818664 840917 624629
38656 624629 500366 478814 418419 350478 315086 137398 -278323 -627084 -545775 -172083
38646 -172083 -22041 -338530 -826094 -1026477 -758988 -210542 241376 316140 72138 -159867
38636 -159867 -144782 46961 232682 331781 294366 48682 -307952 -480603 -353774 -207748
38626 -207748 -326719 -575985 -638549 -509693 -447214 -541040 -650506 -708119 -775902 -810415 -645155
38615 -645155 -235488 266195 659554 773770 515893 58158 -161307 91897 491394 572387
38605 572387 392491 393355 690291 956937 1018537 1059472 1122089 899301 287070 -264308 -291655
38594 -291655 64168 302713 209292 -51895 -303736 -477139 -472270 -230044 67712 122946
38584 122946 -130042 -465472 -640075 -587125 -386188 -185541 -97514 -31819 271321 859908
38574 859908 1332704 1249820 735849 366920 418325 543492 339883 -64380 -250803 -144000
38564 -144000 -73602 -242396 -436965 -350174 21830 424445 645631 655426 547924 461908
38554 461908 494376 596745 607957 452469 221882 5419 -211223 -366207 -236888 234352
38544 234352 683161 710419 453676 411932 699219 868827 579898 50414 -329956 -468840
38534 -468840 -415899 -102241 428925 819223 802351 608331 605497 748212 770368 720076 829011
38523 829011 988281 873489 541178 378713 445644 388096 84582 -145486 -117909 -55572
38513 -55572 -80474 63167 480456 759928 500924 -124994 -678545 -1014140 -1197080 -1163612
38503 -1163612 -874257 -596247 -627719 -866534 -985878 -896900 -712337 -415043 50394 455370
38493 455370 456516 81133 -280424 -368765 -261559 -103056 83360 289373 470337 630299
38483 630299 785902 875589 865065 846883 841320 646342 160306 -287147 -276807 108564 400169
38472 400169 397864 311204 262001 101858 -172004 -243331 77433 539215 764983 638337
38462 638337 258766 -214821 -553474 -579367 -436614 -457412 -635027 -569344 -106013 354807
38452 354807 452849 397796 545139 766359 695528 383795 212289 257299 230727 44216
38442 44216 -30708 149937 352400 342028 193231 76942 9491 -34353 7421 139572 229795
38431 229795 223659 268734 476899 711469 754651 565293 254711 -58853 -254064 -215705
38421 -215705 3816 146576 27138 -237278 -397416 -366506 -219764 -38217 71861 -66025
38411 -66025 -484612 -870121 -813682 -281991 333903 636922 538737 200043 -137209 -262358
38401 -262358 -154122 -57391 -214496 -505774 -573407 -326686 -59199 21681 94958 374523
38391 374523 700637 747060 508143 321591 435483 738436 928735 850817 666018 699337
38381 699337 1032017 1279469 990417 290484 -173348 -43348 337521 522700 576024 742828
38371 742828 881977 726670 441613 340818 235692 -273430 -934378 -1016127 -438979 6727
38361 6727 -188109 -579939 -604832 -413168 -380473 -374339 -129443 103574 -26316 -229214 32309
38350 32309 606447 837613 612752 501064 790994 1061524 901489 492764 221822 149490
38340 149490 127027 103201 91395 90673 179977 428942 637972 489295 42244 -278414 -289061
38329 -289061 -248704 -326902 -324885 -152521 -121511 -418183 -677648 -501858 -97062 56777
38319 56777 -51931 -26906 265617 548784 615747 546114 432390 256927 88674 80798 196177
38308 196177 202646 19131 -165720 -195333 -152729 -177238 -252806 -280541 -235403 -163243 -100861
38297 -100861 -49062 24001 152482 300947 368075 314914 201779 31422 -294041 -729363
38287 -729363 -976402 -833007 -503881 -304727 -192949 79987 444562 547550 324496 129081
38277 129081 181076 261923 142017 -23227 24004 214518 276863 130361 -85433 -257444
38267 -257444 -369007 -409279 -375526 -294497 -149431 87893 284494 212775 -100164 -337607
38257 -337607 -358111 -398078 -587086 -609478 -222626 185653 52951 -527174 -961812 -1035569
38247 -1035569 -1048662 -1105405 -915993 -439352 -92542 -62999 11398 345460 547048 293009
38237 293009 -31559 95401 525375 779597 841922 957636 931308 392528 -378164 -696147
38227 -696147 -551102 -632374 -1144147 -1403621 -919756 -140946 284166 354549 359109 256971
38217 256971 -31758 -207245 -59187 51635 -212981 -475708 -217754 282826 346288 -5068
38207 -5068 -160234 -16006 -67964 -361519 -275454 384731 921919 804728 471577 539851
38197 539851 808390 698459 272464 108799 357535 566436 419033 116115 -44409 -56198
38187 -56198 -51323 -44586 25905 141145 172464 -10185 -361041 -590033 -425483 9909 293249
38176 293249 248416 137304 183057 229016 99542 -30157 40735 120103 -71236 -385801
38166 -385801 -474671 -367205 -355182 -398985 -169567 312159 600634 504619 363327 450639
38156 450639 534679 314392 -46942 -171816 -41894 19240 -156022 -383658 -418399 -237708
38146 -237708 -13278 82897 28741 -39111 12930 130428 121250 -89453 -363173 -548696 -649696
38135 -649696 -714261 -692416 -539385 -368149 -330263 -375089 -302876 -91189 7345 -173983 -377242
38124 -377242 -175160 416558 832959 625260 32762 -363007 -402250 -405808 -539957 -593084
38114 -593084 -487420 -521892 -829310 -1019648 -753162 -315511 -154525 -139726 148856 591579
38104 591579 651767 297435 126336 428782 730447 530019 -5402 -388713 -447388 -296263
38094 -296263 -35429 191236 139589 -190393 -397574 -183196 213954 386906 325814 275681
38084 275681 245246 41772 -342250 -731632 -1043754 -1237965 -1135833 -666497 -175467 -75914
38074 -75914 -255240 -255136 -16532 25395 -343442 -774652 -900807 -804555 -707073 -553418 -228191
38063 -228191 77374 67096 -228695 -521081 -662732 -705332 -639216 -380497 -21798 175774
38053 175774 107971 -59604 -169744 -273758 -458229 -636683 -641862 -416458 -9704 493778
38043 493778 918672 1012943 721194 366568 326916 551002 644577 454838 271898 335316
38033 335316 451612 347543 154278 191720 405991 412129 88851 -230624 -233020 23168
38023 23168 332650 617895 818779 775963 446328 57554 -153001 -218541 -300162 -411954
38013 -411954 -455648 -383912 -161162 276486 824381 1138992 1014774 703168 583222 619697
38003 619697 467183 62326 -255159 -280610 -264408 -510828 -892631 -1006107 -711321 -305369
37993 -305369 -154024 -294225 -463510 -454427 -336922 -294049 -328317 -272278 -81695 65222
37983 65222 44869 378 133796 404256 588295 552214 323734 -1168 -258096 -232892
37973 -232892 111645 504127 665276 663711 751811 941920 1037475 1034260 1138007 1335695 1300378
37962 1300378 868102 320312 1528 -110281 -234938 -381173 -373509 -207373 -124875 -298285
37952 -298285 -587431 -693993 -528386 -365152 -552109 -1029620 -1276053 -902838 -208112 128115
37942 128115 -110065 -442577 -389925 -79660 44254 -143168 -384172 -454694 -357847 -171991
37932 -171991 35864 158119 122156 32660 68850 221128 273868 76646 -279067 -570608
37922 -570608 -639256 -470462 -166749 141797 400825 625533 776968 748050 555490 431156
37912 431156 569102 844698 951957 795852 581971 504021 495911 350906 -8523 -427902
37902 -427902 -641399 -506479 -184679 -54451 -340568 -839588 -1109898 -928669 -478568 -115629
37892 -115629 -61177 -286907 -557698 -583301 -264478 180968 427284 359976 90229 -266614
37882 -266614 -628629 -814086 -651250 -273664 -39763 -60880 -75286 75634 145014 -120189
37872 -120189 -553971 -852277 -1043137 -1289274 -1403081 -1054089 -424302 -135427 -408110 -763930
37862 -763930 -760283 -569775 -529215 -535717 -340852 -145810 -350550 -819161 -943541 -496694
37852 -496694 48158 204332 83905 94017 323285 520031 514433 389014 281467 217600
37842 217600 155325 103626 182175 537689 1117680 1573803 1570141 1188495 810855 579130
37832 579130 266136 -206979 -463675 -149670 521538 1016565 1117942 991786 752605 358833
37822 358833 -64227 -199467 18314 223150 87301 -203520 -162134 359906 910010 873846
37812 873846 147558 -684525 -910778 -422231 232246 532900 517579 488631 435068 76426
37802 76426 -592677 -1154895 -1250248 -960692 -606350 -336949 -57131 329854 713069 838439
37792 838439 625023 392130 571284 1093226 1332306 916363 326966 280953 706025 882453
37782 882453 549699 221941 251634 242381 -207112 -696763 -526161 274510 958808 1003402
37772 1003402 584395 162362 -5096 81899 259923 285688 60405 -202229 -225110 -54078
37762 -54078 27774 -61345 -108407 34495 243616 331929 263262 113317 6434 127519 582560
37751 582560 1157876 1401953 1077641 428754 -92604 -268524 -210008 -116799 -64487 5506
37741 5506 188054 528413 982952 1422290 1674792 1616166 1269655 804451 389236 77583
37731 77583 -113021 -111709 62387 163974 -9111 -241119 -127605 271233 408059 51766
37721 51766 -315139 -229309 10793 -188412 -773180 -1126943 -978741 -660698 -460629 -268256
37711 -268256 25629 269913 371689 466407 594728 588263 446795 430986 567432 467770
37701 467770 -72393 -661288 -833271 -665118 -508353 -399497 -161985 124974 219589 155367
37691 155367 156464 199944 83859 -120406 -121924 69625 97666 -194568 -545428 -691108 -647055
37680 -647055 -482501 -190142 76926 15226 -368130 -631950 -476249 -137825 47791 166280
37670 166280 461261 805736 846680 534683 132852 -186853 -386496 -331614 36306 362810
37660 362810 207827 -276364 -510096 -402391 -509226 -1052069 -1403634 -1008586 -307166 -122585
37650 -122585 -463798 -643663 -431585 -320939 -568475 -696050 -275769 332302 476053 123206
37640 123206 -169237 -51854 239059 296595 61053 -169002 -138681 40862 43209 -179957
37630 -179957 -242364 128394 565648 484756 -33318 -284142 46837 456964 454453 279044
37620 279044 390823 687489 751268 562534 421887 380287 290676 256748 455728 616576
37610 616576 277769 -440164 -900891 -844387 -645930 -583818 -439997 -51746 273641 218439
37600 218439 -65177 -229013 -161044 86981 463536 779218 756056 458373 319018 489134
37590 489134 564676 267770 -42669 23347 174223 -100755 -627295 -738687 -273159 217241
37580 217241 275689 36803 -171913 -265388 -290777 -251241 -207357 -288711 -490131 -677753 -830568
37569 -830568 -1005865 -1050361 -695612 -33281 452660 481548 291877 196067 148529 -5095
37559 -5095 -159097 -158819 -151154 -340871 -530897 -322614 234955 593145 403479 -63404 -367599
37548 -367599 -473253 -598721 -697473 -470168 103005 581458 574280 222512 -25525 706
37538 706 53460 -120207 -433369 -586749 -413919 -30324 298854 409043 394405 493422 764841
37527 764841 964266 871152 634018 555150 578897 311648 -372467 -1051141 -1243005 -929465
37517 -929465 -412546 84441 423527 402724 -42360 -597750 -862880 -833506 -807720 -881290
37507 -881290 -876237 -753768 -717311 -814179 -783100 -476186 -160578 -178853 -491030 -762648 -778270
37496 -778270 -579359 -303705 -93489 -101465 -380792 -752997 -928698 -787448 -444491 -51411
37486 -51411 331881 628712 660984 320233 -220700 -619824 -726709 -712633 -779092 -871210
37476 -871210 -818900 -653545 -567807 -594232 -566740 -430709 -335827 -336187 -265773 -61834 54479
37465 54479 -59701 -174169 -46548 127367 -9634 -371034 -495837 -191404 279200 676197
37455 676197 1054155 1440583 1606007 1369222 895802 497634 302091 260679 307855 352360
37445 352360 252220 -44085 -409605 -674053 -757881 -647655 -385976 -114216 47368 180413
37435 180413 419562 623352 500877 130902 -20764 218817 414936 186572 -165862 -115561
37425 -115561 255753 385906 96228 -196712 -184229 -98458 -256797 -551548 -660149 -520169
37415 -520169 -324726 -186837 -52355 119587 290021 434164 549419 568510 386822 9986
37405 9986 -385715 -563082 -390769 50528 485706 623525 400174 41086 -166631 -141575
37395 -141575 1120 174838 412186 704603 878935 752687 377276 21958 -89192 50144
37385 50144 302023 510457 527782 259979 -196695 -539786 -513277 -169630 193780 332710
37375 332710 232005 51310 -6972 161245 427755 490243 209985 -148727 -189404 121991
37365 121991 428031 460505 326249 233138 158817 -27294 -257434 -308704 -134835 20490
37355 20490 -95848 -431841 -672093 -598576 -346954 -217749 -260193 -227887 -25493 44298
37345 44298 -275307 -698265 -718932 -350681 -101028 -183909 -248582 -57124 72234 -169372
37335 -169372 -497581 -464496 -161566 12985 72401 355008 797062 880544 396494 -239252
37325 -239252 -590350 -686113 -712827 -634101 -398258 -192807 -171755 -171712 -10974 137628 11869
37314 11869 -260606 -321965 -147980 -75427 -259531 -464355 -479848 -423627 -472166 -557967 -535132
37303 -535132 -444990 -402849 -380530 -326468 -358079 -563156 -713270 -505165 -70896 105382
37293 105382 -141605 -412117 -328359 -50868 34666 -127909 -336998 -535322 -753705 -799826
37283 -799826 -452703 59208 223930 -39677 -253942 -99732 151167 134755 -57094 -131798
37273 -131798 -91097 -105589 -102872 134837 560318 884566 968699 918796 829541 687920 509784
37262 509784 349611 196602 48807 31078 237843 527958 686512 709364 705036 629756
37252 629756 405613 193824 189574 200100 -149214 -743664 -955629 -466450 254773 531010
37242 531010 255293 -149174 -296230 -88337 399522 960778 1260423 1087099 618756 254066
37232 254066 177565 235528 220359 111540 4550 -67176 -160497 -311001 -439966 -397404 -126574
37221 -126574 228592 445561 459437 397687 355483 232768 -130407 -703065 -1219038 -1389714
37211 -1389714 -1150421 -701081 -292686 18380 341298 678306 830903 675529 383695
37202 383695 197089 106753 -26840 -144119 -68409 125511 154932 -13917 -69520 172866
37192 172866 481706 542594 352388 125972 3800 -7503 17947 -78253 -403467 -776660
37182 -776660 -856945 -616479 -408109 -421008 -403679 -158092 44722 -106279 -413083 -478570
37172 -478570 -349284 -368146 -514144 -402754 69894 564259 824814 919643 879233 569098
37162 569098 87737 -154324 -7296 132629 -105539 -519506 -658191 -436953 -126780 39740
37152 39740 -51375 -463625 -991635 -1098959 -534647 119588 34528 -744307 -1283053 -974010
37142 -974010 -252976 129978 91225 86891 334678 614547 694255 546414 199988 -268577
37132 -268577 -604090 -547009 -167480 229415 522243 808562 1020767 866331 281592 -346974
37122 -346974 -592994 -421307 -87949 169013 212215 19923 -221548 -265245 -189359 -361972
37112 -361972 -835476 -1108872 -797625 -235014 -11970 -174610 -348620 -452052 -700919 -980943
37102 -980943 -856927 -323301 29510 -175490 -607176 -800833 -779228 -771166 -714483 -475582
37092 -475582 -294954 -540733 -1116802 -1507313 -1399851 -984753 -652146 -627094 -888087 -1225866
37082 -1225866 -1351550 -1094525 -543212 34876 368341 297346 -116495 -547240 -662203 -500769
37072 -500769 -404014 -514457 -619327 -586668 -604370 -770043 -786515 -387782 191880 514115
37062 514115 497855 372754 288466 295203 476018 729017 662775 134914 -350263 -281758 53713
37051 53713 7329 -380208 -495018 -257261 -272851 -721345 -930798 -451970 157720 158261 -317998
37040 -317998 -627411 -602872 -532894 -439428 -66605 492183 771495 602123 330372 275388
37030 275388 354692 361160 278308 168867 1891 -243725 -457866 -508584 -386864 -184994
37020 -184994 -6792 86519 124552 218941 425643 636915 691971 563779 363902 216701
37010 216701 196820 296013 355586 151639 -310267 -698040 -723776 -511215 -392620 -431764
37000 -431764 -405635 -226931 -98327 -181814 -352361 -400251 -314174 -238920 -261641 -354767 -464605
36989 -464605 -553334 -566517 -428535 -119709 212874 268032 -142046 -780087 -1104171 -852511
36979 -852511 -383117 -234839 -451500 -595157 -386874 -40870 93768 -35498 -231376 -334404
36969 -334404 -327767 -269072 -215029 -148834 22019 290168 433948 293735 116543 301848
36959 301848 761812 923004 536559 92659 118636 407889 391443 53084 -62553 283084
36949 283084 664820 628140 277194 39137 138141 494238 909817 1167143 1119213 850214
36939 850214 613108 511848 419066 286189 284443 483269 638302 525088 284376 185334
36929 185334 206139 118548 -124799 -351847 -444863 -423897 -338067 -289145 -452434 -826174 -1074678
36918 -1074678 -908740 -524487 -344546 -407139 -385324 -178182 -64306 -204754 -382997 -369124
36908 -369124 -228101 -148038 -233068 -521942 -902744 -990914 -498660 213331 431151 63757
36898 63757 -213086 -7053 206847 -53232 -433877 -370661 -89824 -241342 -792181 -1060570
36888 -1060570 -784318 -427541 -352792 -345568 -156202 28307 -70843 -382713 -635294 -690076
36878 -690076 -566266 -344160 -144945 -26981 118141 385027 640310 726932 756317 879432
36868 879432 918421 639269 253149 145038 204132 6649 -383929 -471070 -221096 -160386
36858 -160386 -404557 -379260 138220 455372 -19070 -805314 -1022097 -571747 -33663 268112
36848 268112 454500 582905 545860 372540 195621 52878 43893 396516 986810 1148647
36838 1148647 482382 -443762 -760922 -405389 28247 264095 471903 602438 387138
36829 387138 -5143 -51797 287036 473470 251790 -26303 -84865 -110607 -249487 -306320
36819 -306320 -216744 -294192 -702140 -1119466 -1206074 -1001332 -639939 -124376 363721 402726
36809 402726 -74575 -530462 -512528 -224745 -81045 -95881 -121063 -295997 -747961 -1118767
36799 -1118767 -939021 -346013 50283 -46679 -375988 -606016 -674315 -650105 -601968 -627472
36789 -627472 -743212 -748159 -449801 -10685 189848 48688 -146625 -132206 6103 -16608
36779 -16608 -334302 -769813 -966951 -713851 -175743 277980 496060 624607 736382 673052
36769 673052 405686 229990 329075 425676 221616 -62872 -25879 214342 163028 -259154
36759 -259154 -586802 -531679 -344743 -307437 -305884 -146705 67618 159076 188603 261167 237233
36748 237233 -59457 -496377 -782018 -860586 -889007 -898383 -770616 -547581 -477400 -656685
36738 -656685 -829718 -680573 -216658 253734 465088 420970 309564 282338 336910 380628
36728 380628 371395 363084 401089 429589 383203 344568 474669 738002 845895 610922 245108
36717 245108 98784 159453 78883 -271389 -577136 -554525 -352162 -239113 -153206 93429
36707 93429 346275 276313 -53563 -234633 -146817 -110193 -312913 -517237 -487542 -298057
36697 -298057 -28794 405972 864421 869241 278414 -333704 -430372 -305170 -576845 -1167556
36687 -1167556 -1429844 -1155472 -780122 -587619 -388005 -105625 -19499 -155845 -50185 486426
36677 486426 862240 467626 -397532 -897054 -774902 -576186 -797457 -1289739 -1594064 -1498121
36667 -1498121 -1091328 -525520 58279 477136 584901 435688 278175 320590 511454 616093
36657 616093 531475 427683 481707 568061 398912 -54364 -480684 -592247 -381178 7606
36647 7606 440009 774045 914633 982016 1187652 1431059 1304207 690908 74346 -53656
36637 -53656 133976 92957 -257927 -430609 -117456 354825 487270 254856 80012 292407
36627 292407 787803 1183763 1212391 952000 684561 535346 341808 -52723 -498402 -699301
36617 -699301 -602289 -426862 -342802 -337491 -396333 -554333 -696289 -553148 -45928 537235
36607 537235 848460 828159 637615 422492 304905 429129 761051 936251 589109 -155306
36597 -155306 -744529 -795880 -441068 -40755 212307 285360 118186 -311036 -791561 -970602
36587 -970602 -694333 -163675 267750 381591 205557 -47837 -140301 -15845 117298 12061
36577 12061 -282579 -441576 -283425 -21986 31461 -113678 -209292 -193402 -271355 -539382
36567 -539382 -782556 -787191 -670146 -705034 -917877 -1050249 -904979 -574962 -307739 -241033
36557 -241033 -294367 -271536 -75987 153884 182162 -22127 -229220 -264728 -232753 -283891 -325471
36546 -325471 -209999 -101812 -316628 -777276 -970233 -579962 103615 581981 716920 692571
36536 692571 613875 426458 147875 -81985 -181630 -194924 -193989 -227594 -297685 -275450 35788
36525 35788 591589 998796 937710 571018 271928 64809 -316393 -860858 -1176971 -1037600
36515 -1037600 -679178 -423571 -302037 -198311 -79596 77406 323200 538557 483770 219154
36505 219154 154774 440174 632253 290609 -393053 -928622 -1198771 -1337257 -1191686 -506708
36495 -506708 439100 984112 927889 687319 521197 172132 -500472 -1072824 -1112104 -790079
36485 -790079 -551900 -464381 -293298 -21005 123988 62679 -53089 -117784 -154904 -147124 -24535
36474 -24535 172868 301050 281693 145988 -45484 -212480 -257331 -184683 -154252 -300661
36464 -300661 -563049 -774191 -828567 -704203 -461660 -296413 -413753 -746935 -981383 -951398
36454 -951398 -782866 -547836 -114803 449818 703489 409254 -41 29502 378227 478907
36444 478907 185584 -100926 -128009 -97314 -219420 -410375 -532376 -557601 -406960 5652
36434 5652 475722 617004 379628 124968 89468 128303 101073 128207 286169 385973 250269
36423 250269 -68464 -478883 -939118 -1233835 -1057733 -515554 -139727 -166499 -201674 95771
36413 95771 431125 391051 157044 169571 342944 204879 -290224 -653221 -581106 -299681
36403 -299681 -110610 -26416 8601 -98914 -380717 -615301 -550979 -224378 48296 -39728
36393 -39728 -489998 -928219 -918464 -462216 -61499 -127985 -480603 -645301 -490895 -276693
36383 -276693 -200524 -246903 -405833 -664090 -797954 -560018 -106951 129884 59793 43099
36373 43099 298033 590163 657697 554940 373075 11202 -495663 -782418 -648880 -457567
36363 -457567 -627848 -962368 -945689 -572291 -350148 -479201 -555203 -250976 168539 302813
36353 302813 243425 362751 662450 749585 456648 126548 145996 435056 600146 480594
36343 480594 332275 453018 774832 929785 690984 258081 44278 202496 460828 485773
36333 485773 311589 257493 453292 661785 642977 479620 373451 296296 94794 -161229
36323 -161229 -232764 -103633 -30672 -151993 -310944 -348410 -299923 -183714 123125 598566
36313 598566 908650 783248 396095 122817 48775 -35773 -251859 -496007 -633923 -611516
36303 -611516 -411430 -80674 243666 477220 662750 773050 620707 175160 -221746 -237306
36293 -237306 20001 250861 453042 768843 1020987 900640 541394 373139 417638 306946
36283 306946 52864 130008 579935 716104 132179 -583704 -683945 -344129 -275897 -583136
36273 -583136 -709743 -395798 -5159 129583 95042 10036 -230929 -621831 -860031 -735528
36263 -735528 -412700 -125724 140228 453155 650965 509893 80752 -347316 -568037 -613358
36253 -613358 -630847 -694768 -719206 -544428 -158209 206900 307503 182582 71564 89205
36243 89205 172017 295356 472068 530700 224513 -330797 -645327 -466538 -126949 -53839
36233 -53839 -188911 -190427 -7443 101352 8437 -177375 -400099 -708181 -1005793 -1069295
36223 -1069295 -866446 -591306 -346842 -79177 136625 92772 -158373 -266830 -129335 -118073
36213 -118073 -489382 -889865 -832062 -419162 -149939 -151582 -101878 119359 219890 49282
36203 49282 -95557 60186 351451 481746 466657 489573 528063 420686 186041 22956
36193 22956 60315 284618 626283 959269 1119961 1078436 981362 903821 727970 413837
36183 413837 165561 108359 34677 -230341 -428254 -215579 239264 441738 282275 111622
36173 111622 112241 63801 -181838 -441097 -568845 -685616 -850215 -891633 -794724 -875295 -1266929
36162 -1266929 -1560747 -1326138 -749019 -358792 -289143 -230007 -40877 21605 -236179 -595567
36152 -595567 -702005 -500035 -242067 -160287 -246722 -327858 -272507 -86686 172858 480452
36142 480452 759982 831595 634346 453008 651763 1132141 1339709 947733 287971 -66893
36132 -66893 85982 580793 1230778 1858918 2146016 1819300 1005955 170051 -306835 -340541
36122 -340541 -40372 385577 670254 659180 462118 306984 287197 371627 556786 823504
36112 823504 1018752 978266 736692 475584 320675 299933 382327 425990 243152 -126800
36102 -126800 -393216 -429485 -454099 -563288 -426015 145711 637620 436139 -172074 -276206
36092 -276206 374283 1033233 1053667 675052 435216 381778 281800 161416 165364 187493 70716
36081 70716 -72407 -120804 -249440 -536163 -539735 154625 1100228 1331639 605294 -270438
36071 -270438 -522119 -304445 -199687 -288562 -224859 14688 56223 -165683 -168797 349317
36061 349317 927923 884556 241196 -333472 -454931 -421950 -585869 -803702 -805558 -703599
36051 -703599 -711606 -640654 -174834 508229 911905 939944 905612 850367 478478 -108318 -259892
36040 -259892 327648 1101395 1408562 1294776 1135286 936092 547507 211235 253827 431072
36030 431072 214539 -331746 -550970 -105316 617062 1074193 1105315 831818 458545 263062
36020 263062 377063 488137 156731 -494451 -850663 -670914 -385680 -338209 -264160 129171
36010 129171 546182 545690 259089 140097 211670 100762 -265240 -509888 -381650 -45020
36000 -45020 278399 588068 907521 1114070 1101014 893391 537669 117594 -77266 277298
35990 277298 1048877 1610711 1505432 937120 416786 159872 90383 199246 498528 720387
35980 720387 507098 -30710 -331624 -121969 198860 163642 -59760 40733 466824 619588
35970 619588 161268 -433641 -464322 95619 617162 641586 336227 80500 -65253 -259824
35960 -259824 -460031 -419262 -106500 133597 -24313 -456632 -713558 -548754 -188272 -14317
35950 -14317 -82003 -92033 158649 473501 528382 317985 104544 -37845 -325466 -813590
35940 -813590 -1152718 -1046106 -718874 -592515 -646223 -515978 -164964 36920 -16808 66051
35930 66051 494194 833534 612384 42052 -300108 -247557 -53999 139269 322208 278353
35920 278353 -162154 -594896 -413780 245579 603107 404405 262272 541622 676177 143946
35910 143946 -534552 -530935 -9190 152287 -259865 -533879 -173419 451509 773349 736868
35900 736868 582869 394870 153971 -71541 -228939 -359491 -453253 -442320 -385395 -400726
35890 -400726 -403368 -220597 24874 15848 -239811 -388012 -284799 -147242 -75871 84234
35880 84234 274927 165801 -199488 -258866 207519 596867 334046 -243170 -399561 -59490
35870 -59490 245553 250067 165619 140834 89035 24027 54094 40013 -260070 -675512 -722568
35859 -722568 -308316 84379 45501 -281311 -502187 -452144 -224332 35762 218805 282497
35849 282497 265347 182024 -23851 -278873 -301100 10895 283408 125089 -269368 -412753
35839 -412753 -293974 -298999 -412374 -169955 464911 878220 770776 690582 1111503 1536926
35829 1536926 1187793 237373 -373160 -232164 124220 143930 -28361 -8943 149050 110786
35819 110786 -177281 -442299 -508976 -489356 -548531 -670739 -705514 -550331 -259758 -22799
35809 -22799 -10727 -168561 -184735 191722 768762 1019105 705638 235784 140846 315258
35799 315258 171166 -405589 -738766 -292786 486006 734534 324197 -127398 -293355 -523031
35789 -523031 -1048168 -1417881 -1113689 -351194 152914 29330 -463735 -884992 -1030947 -954198
35779 -954198 -799864 -663770 -532829 -377400 -269623 -259757 -169299 213996 686970 727219
35769 727219 213369 -288293 -239814 136963 196567 -234113 -666191 -601457 -70736 488176
35759 488176 687087 525331 386848 621277 1053005 1110355 586830 3526 -41011 379055
35749 379055 751627 867926 890952 846237 559705 93206 -224833 -268184 -221263 -175772
35739 -175772 -28562 148951 83658 -205102 -306613 -36217 223612 74379 -317734 -492660
35729 -492660 -302310 49226 361138 527418 440402 115341 -189771 -247444 -168340 -204469
35719 -204469 -360276 -457470 -472038 -497674 -437930 -74528 529187 984922 1008191 667822
35709 667822 187774 -234285 -371670 -63424 473774 710649 416589 -2735 -34111 259976
35699 259976 412900 293553 256781 500525 687976 457438 17816 -118896 131231 337447
35689 337447 207433 -30906 -30356 201243 454800 703416 1008767 1182184 927071 334459
35679 334459 -119443 -173125 -50410 28577 249960 791588 1276463 1126589 415809 -109007
35669 -109007 11473 363266 269968 -316368 -852615 -943993 -698348 -413710 -244690 -207603
35659 -207603 -244248 -206340 12103 263223 274742 63336 -14453 241876 548784 506814
35649 506814 135646 -187816 -219762 -38377 194008 399215 508495 463745 361246 394466
35639 394466 555345 557133 185679 -381912 -748015 -732069 -521738 -410425 -496620 -671497
35629 -671497 -812449 -885871 -859505 -638861 -211727 200650 316830 149371 7341 75603
35619 75603 195923 200356 236646 514494 886768 988731 729438 364144 121516 38928
35609 38928 125974 368108 560994 478004 258374 300732 686046 1034861 1055522 908172
35599 908172 867329 926445 916649 748856 381995 -166706 -639981 -704850 -466374 -436385 -778336
35588 -778336 -1021719 -826687 -547179 -589353 -676265 -354765 129539 175448 -186750 -416281
35578 -416281 -460461 -809818 -1496150 -1861344 -1575498 -1148714 -1060086 -1033412 -669105 -254861
35568 -254861 -339358 -832089 -1123358 -936195 -552139 -279085 -138704 -49218 62708 330458
35558 330458 805311 1244990 1332848 1105877 887518 803234 674401 433559 302980 400109
35548 400109 444651 113366 -463400 -825034 -760058 -527755 -467373 -593266 -686395 -625977
35538 -625977 -462156 -263192 -92274 -71226 -219898 -257222 114545 659052 717177 79280
35528 79280 -613607 -669747 -233848 49843 -14638 -124584 -214044 -567154 -1148790 -1456787
35518 -1456787 -1229664 -769694 -371600 22466 362528 293900 -186936 -437442 -47205 453970
35508 453970 359978 -128074 -272422 15332 134055 -140253 -326301 -101916 175433 71139
35498 71139 -319625 -654905 -835800 -932658 -935213 -832528 -701905 -535454 -229294 108991
35488 108991 154665 -136327 -347621 -179345 103884 128042 31676 203380 570331 642462
35478 642462 266689 -107680 -39730 370554 725856 833662 769174 651166 578219 639223
35468 639223 759152 642473 123068 -477798 -614571 -177863 344231 450258 161444 -140898
35458 -140898 -208202 -80875 80579 113041 -67621 -279327 -105863 587778 1264023 1205006
35448 1205006 410496 -360083 -517523 -240861 -10729 39086 15421 -136406 -503612 -855620
35438 -855620 -851930 -561853 -422839 -658293 -1022496 -1165803 -1010185 -705015 -420027 -271312
35428 -271312 -311036 -494205 -691874 -753321 -573193 -206977 59277 -55393 -437597 -659373
35418 -659373 -576107 -534700 -750413 -847914 -454190 59457 31932 -430918 -530297 45383
35408 45383 671058 716730 336881 19868 -131968 -261923 -304291 -137122 67979 73850
35398 73850 -26983 -15130 34037 -91821 -306903 -336476 -168739 -28587 35068 167133
35388 167133 339851 338669 146005 2634 16321 7383 -160970 -356804 -394291 -266135 -68248
35377 -68248 120308 202680 92117 -141295 -308238 -339678 -325973 -293176 -164251 -4535
35367 -4535 -43679 -310819 -483877 -300668 63777 246000 169682 37138 -38340 -127431 -264114
35356 -264114 -385544 -489655 -624132 -704936 -573709 -275098 -47060 31844 137906 322532
35346 322532 300795 -136330 -675992 -762613 -283470 293860 483171 236515 -197154 -598332
35336 -598332 -819350 -723107 -323010 86812 149379 -176708 -553076 -585951 -173299 427922
35326 427922 826008 840776 679658 694714 918014 979151 604602 42001 -239788 -184158
35316 -184158 -190889 -514406 -921919 -1082456 -1033126 -1014646 -1001576 -716103 -128705 330296
35306 330296 228062 -326952 -783613 -762899 -392036 15409 389926 805722 1086906 872113
35296 872113 163821 -490304 -586150 -236061 82961 170252 174099 149857 -38651 -335702
35286 -335702 -392988 -17988 534717 873827 865550 606123 246642 -2543 58312 339380
35276 339380 464892 263795 26168 12975 -32964 -489632 -1130346 -1288183 -765505 -118347
35266 -118347 113109 56057 142657 427296 620952 625352 644103 778260 846537 709551 533382
35255 533382 566139 780340 900091 740664 401943 138338 122418 319789 513861 476976
35245 476976 224820 87835 375928 932492 1207381 908772 425574 383260 865640 1345517
35235 1345517 1389889 1142704 993970 1032455 1054454 956026 835020 729378 509540 117027
35225 117027 -259809 -390519 -318447 -327724 -559934 -769389 -583513 5226 558036 681989
35215 681989 470579 302629 316933 332785 262096 297286 581974 945476 1144384 1190069
35205 1190069 1236245 1267484 1120200 771473 432258 343203 549665 829954 805869 260908
35195 260908 -547665 -1035008 -888442 -398003 -51445 35823 84785 207778 288884 246259
35185 246259 139126 21924 -77563 -54900 155206 369656 322539 68174 -31493 218581
35175 218581 605847 802589 693512 373971 55377 18868 387824 844498 854312 335942
35165 335942 -149020 -84432 349472 570626 360159 20865 -143108 -175007 -246840 -349463
35155 -349463 -348600 -246326 -249356 -537188 -983884 -1192739 -908271 -352179 13996 56576 75008
35144 75008 282252 468160 376293 163018 169317 376910 438375 219669 -7415 35367 298115
35133 298115 542239 607401 469521 219545 54390 116890 283661 289351 116731 46262
35123 46262 218028 382971 275062 31523 -13694 161061 244183 55076 -234828 -396230
35113 -396230 -426653 -421598 -336273 -61886 324509 571439 561372 497901 685674 1135062 1467184
35102 1467184 1276568 587800 -97546 -251532 177651 726695 884225 585654 225004
35093 225004 181462 402467 536699 434520 335251 479105 722870 754532 577048 480841
35083 480841 538986 469865 133227 -157816 -77543 204215 297283 225016 372606 814990
35073 814990 1122481 991695 732484 861769 1402254 1856502 1806900 1316561 736966 301126
35063 301126 -11244 -281610 -442517 -350086 -64036 103222 -39399 -265108 -240348 -42139
35053 -42139 -32847 -235083 -262159 -2313 94197 -272808 -652692 -418468 311051 834445
35043 834445 820673 580861 434418 348174 287877 412445 712871 870209 712348 479695
35033 479695 411509 388123 238094 103909 200967 441220 590101 603594 528619 270144
35023 270144 -213690 -641486 -694308 -491307 -437949 -631041 -737960 -485914 11270 454798
35013 454798 646385 534487 209868 -77237 -87204 149021 377281 450262 459040 520126 599885
35002 599885 600602 497542 357546 307533 456807 744812 929248 861370 685383 597292 535671
34991 535671 362944 222247 350654 596555 565053 296112 315458 810961 1210686 921943
34981 921943 150390 -413348 -476010 -287592 -89958 90621 145742 -129413 -635537 -927989
34971 -927989 -745088 -309929 39434 270190 529610 804386 909652 710962 231223 -343588
34961 -343588 -680209 -509884 30687 454995 497442 435503 625094 933296 969888 733547
34951 733547 607010 743999 903515 960115 1128642 1497199 1740662 1566843 1117250 646278
34941 646278 143804 -370501 -524048 -69401 531143 565186 35629 -383272 -342443 -188825
34931 -188825 -242287 -292301 -74341 236598 338718 247909 125221 -22683 -185381 -203555
34921 -203555 -71965 -66176 -249628 -198614 376267 1037931 1127657 637612 82295 -319120
34911 -319120 -768159 -1269022 -1480219 -1280565 -995168 -895462 -857863 -683733 -436697 -293859
34901 -293859 -313878 -482467 -758196 -965440 -866591 -462752 -57422 54503 -168194 -553953
34891 -553953 -807428 -612190 66731 772593 941764 547830 101840 -4857 147562 336215
34881 336215 496107 559575 349426 -139159 -587863 -694652 -501636 -254470 -119616 -154775
34871 -154775 -352812 -575090 -615162 -447671 -257330 -152721 -52550 75429 104565 -13327
34861 -13327 -133966 -165889 -202518 -278558 -223953 77049 467596 701518 682104 430664 33593
34850 33593 -273001 -211495 182008 508284 456917 125925 -220626 -488729 -697515 -792138
34840 -792138 -688873 -381722 76371 549770 786176 670751 514182 725079 1145968 1166851
34830 1166851 647227 212811 333449 600660 387896 -153416 -338223 3669 302104
34821 302104 66043 -531998 -973363 -963669 -592923 -173048 -26531 -291904 -829056 -1315093
34811 -1315093 -1436295 -1068341 -425740 2972 -103518 -516675 -753934 -713058 -660707 -623080
34801 -623080 -303575 271886 585488 377779 64497 60561 156744 -25926 -390638 -627516
34791 -627516 -746402 -878593 -885629 -640271 -382846 -330672 -257899 53711 298376 122311
34781 122311 -224907 -305451 -236156 -375547 -571605 -434244 -119619 -91835 -272424 -186585
34771 -186585 167114 362138 364653 513974 736322 608878 220748 121549 333674 275804
34761 275804 -182848 -461250 -286188 -118586 -257284 -346456 -152511 -29473 -152896 -48262
34751 -48262 566261 1127420 1016488 463418 90230 26548 32792 72139 207939 294931 270010
34740 270010 403594 815171 1122323 1026336 841545 952214 1144535 1007466 621423 296838
34730 296838 -12440 -451337 -760066 -663383 -486491 -728476 -1230792 -1413381 -1166118 -863113
34720 -863113 -640894 -343331 -102037 -262693 -692144 -802844 -382040 143469 361877 285804
34710 285804 34620 -359363 -701159 -692380 -397910 -200936 -167498 43474 464544 569225
34700 569225 64417 -539226 -582976 -156547 113224 -46473 -335627 -461318 -494018 -585683
34690 -585683 -666192 -569138 -282955 40866 233003 200171 -25202 -265692 -323659 -204952
34680 -204952 -129325 -211256 -230358 81260 561569 709638 346413 -97240 -153075 84235
34670 84235 227033 236008 371148 624294 688270 508882 404323 535576 674156 621707
34660 621707 469832 318568 134743 12674 140741 368320 288300 -73968 -192496 112635
34650 112635 372976 343382 491546 1105381 1579211 1302208 716226 653800 1017854 1023592
34640 1023592 505124 43566 -100784 -241550 -420172 -233963 297354 529598 159761
34631 159761 -311938 -396233 -243427 -131390 48658 399969 661922 657685 616409 651632
34621 651632 419001 -233138 -740540 -535108 52575 214966 -204983 -594539 -491687 -84287
34611 -84287 223388 284346 170573 6815 -83415 -114630 -306257 -741347 -1031365 -714793
34601 -714793 -7444 298400 -140820 -700291 -589236 140309 771628 900541 764388 646377
34591 646377 463582 115106 -177390 -179484 -17573 80513 198854 510409 799870 671029
34581 671029 211278 -12404 275463 691066 750237 443287 67897 -186581 -267263 -147865
34571 -147865 78064 207212 197228 205009 257026 199153 78666 151312 334976 172400 -363104
34560 -363104 -591601 -128510 369285 103424 -630729 -866229 -383459 73815 -70153 -591952
34550 -591952 -990623 -1001305 -532325 313541 1054223 1188113 834230 559570 562615 545459
34540 545459 394546 373574 533004 532881 250731 31205 104541 226520 120536 -136517
34530 -136517 -355467 -466348 -368490 30616 490179 577301 260940 -62535 -213906 -395980
34520 -395980 -631522 -640234 -447005 -466844 -714640 -593805 129801 758599 578915 -149124
34510 -149124 -652901 -688387 -568380 -479069 -341483 -165863 -56745 15154 81962 -15218
34500 -15218 -354203 -650786 -580632 -217838 124227 289281 260006 5271 -347309 -438786
34490 -438786 -119053 250158 255636 -1969 -116410 38024 236940 267946 100677 -155460
34480 -155460 -270124 -68969 254392 281166 -27962 -239075 -145738 -106769 -392051 -677786
34470 -677786 -596115 -322933 -139266 138711 704428 1126545 856904 125263 -348944 -370030
34460 -370030 -331382 -398361 -332049 -125274 -140079 -484840 -797396 -788039 -552189 -250641 82959
34449 82959 321846 270579 49673 71068 461831 819782 703190 138062 -465034 -712951
34439 -712951 -508006 -107207 83113 -88309 -385433 -579470 -763425 -1028677 -1090731 -652111
34429 -652111 21797 350397 197654 -41336 -62874 68957 236541 403658 419096 135443
34419 135443 -218486 -215007 142750 388059 283293 115017 154973 257952 221670 171620
34409 171620 296914 474404 451661 230927 15019 -112825 -227157 -332493 -292004 -23087
34399 -23087 328159 494736 410969 352052 581196 868386 652576 -181614 -1007258 -1206556
34389 -1206556 -941703 -815449 -996808 -1134959 -993409 -666364 -215899 382693 880848
34380 880848 854296 336911 -58888 119121 620663 903712 811584 595739 463397 376464
34370 376464 250708 162727 290934 657088 964885 829508 245080 -334996 -527212 -451724
34360 -451724 -438176 -503936 -441443 -286606 -318848 -612558 -918974 -1020849 -936761 -760630
34350 -760630 -545719 -359832 -242417 -118303 65196 192237 177334 194906 445750 787994
34340 787994 878165 608659 158953 -276671 -555797 -542075 -307168 -222959 -506457 -829092
34330 -829092 -754489 -392325 -178387 -167679 -65015 146733 186719 68729 123514 355202
34320 355202 355298 29030 -127484 254087 836789 1022321 688354 223184 18064 124350
34310 124350 301984 305627 184680 253834 655477 1095156 1204775 985408 645564 246986
34300 246986 -145827 -236535 117348 509791 493541 284237 381910 672320 591244 106999
34290 106999 -189054 -14833 273700 387541 470720 611673 627781 533970 637555 957208
34280 957208 1097066 905939 741752 886639 1193700 1464925 1662771 1625111 1150955 527856
34270 527856 372930 757212 1084721 1023759 901584 943551 840443 438941 190651 444551
34260 444551 838720 860987 557807 274301 120036 65978 149612 245527 67128 -295125
34250 -295125 -319123 142567 523067 387811 103392 215438 620133 833730 714871 477583
34240 477583 298181 267989 420213 522941 225695 -337066 -553225 -221684 95574 -41535
34230 -41535 -270128 -78652 359265 518806 299005 -17214 -252660 -372727 -333840 -227214
34220 -227214 -262527 -380038 -287248 -58710 -137558 -505930 -535043 -28360 301455 -90670
34210 -90670 -686980 -691579 -152787 319696 487328 535176 590175 702439 930523 1056772
34200 1056772 697685 33241 -212072 97714 169030 -424847 -974086 -841697 -551405 -770977
34190 -770977 -1019827 -483244 489994 854829 437534 -39369 -195808 -236769 -194821 91188
34180 91188 390370 329477 70832 442 12337 -152503 -231994 57857 264333 -115905
34170 -115905 -580261 -293919 496500 831692 585710 481220 695333 660592 284407 196117
34160 196117 601768 935069 872641 759448 799044 699489 371723 179306 246126 230102
34150 230102 -8186 -167091 -79954 89961 293295 589594 694735 256701 -377171 -418685
34140 -418685 237783 858532 935639 715326 554306 433677 277062 165042 92949 -7838
34130 -7838 -860 230141 406802 249391 52041 232891 536442 425347 65624 94424
34120 94424 536665 801942 680558 496519 330294 -43877 -463250 -476997 -163977 -46337
34110 -46337 -191382 -200168 -62917 -190868 -591707 -829886 -820145 -876375 -986965 -822901 -441003
34099 -441003 -227430 -207398 -126178 -49602 -141567 -108888 320757 712442 613617 497117 965074
34088 965074 1481911 1153867 370517 263327 814882 1008963 691753 706121 1199322 1382903
34078 1382903 1071231 916905 983278 638329 56906 243963 1261424 1952334 1764282
34069 1764282 1380591 1233518 897117 313835 132261 433858 543515 401838 648977
34060 648977 1117979 875718 46383 -132842 571643 1010759 790720 880549 1547210 1665995
34050 1665995 823839 183791 418790 660426 382635 432424 1197024 1612885 1082817 588246
34040 588246 800817 883851 314564 82185 818661 1488401 1244477 903887 1266295 1630337
34030 1630337 1311153 989723 1217426 1212271 468440 -87387 149975 271180 -282812 -488811
34020 -488811 242376 726128 182276 -190601 569179 1360925 1125971 792800 1299954 1688405
34010 1688405 1121753 791864 1704119 2542605 1968112 1098280 1362912 1818205 1085274
34001 1085274 106243 349635 1011658 682643 136535 732121 1637827 1422646 869977
33992 869977 1416595 2302919 2080938 1445930 1759311 2320044 1941044 1558587 2329892 2936838
33982 2936838 1920271 829246 1677238 3130140 2815565 1594707 1739125 2632493 2283962
33973 2283962 1435841 2021605 3133474 2743391 1829204 2480919 3621534 3110314 2243558
33964 2243558 3363848 4957295 4296452 2925863 3936140 5867452 5387211 3925577
33956 3925577 5035825 7230409 6648177 4835653 6044692 8773251 8567277 7251804
33948 7251804 9848756 14264287 14772306 13901188 18603671 26347417 29432102 31714834
33940 31714834 43407329 59871994 69076461 84149620 137967322 227587482 291332534
33933 291332534 271269874 184246500 101063645 63766030 54741933 43961599 30275617
33926 30275617 25111825 24899355 19599961 11842417 9760178 11113537 8888499 4815427
33918 4815427 4811845 7121003 6095564 2914661 2596037 4302471 3611206 1163437 854193
33909 854193 2120032 1523642 -274086 -13892 1671481 1599218 120044 22446 1005543
33900 1005543 742546 -123599 645883 1987951 1190269 -838572 -986360 453156 495096
33891 495096 -1057538 -1626666 -793640 -649075 -1484936 -1427602 -333170 -107989 -1051193
33882 -1051193 -1446780 -880188 -674766 -1028018 -838407 -327538 -811126 -1911664 -1899670
33873 -1899670 -749698 -88961 -242567 -72862 405482 31719 -946985 -1031688 -198255
33864 -198255 91537 -402860 -477625 50876 123458 -308106 -204677 369464 322003 -222890
33854 -222890 -99248 524050 345293 -484052 -445157 534001 815845 -94998 -815184 -608825
33844 -608825 -382098 -665389 -752911 -403653 -392749 -820260 -759708 -100264 77049 -565382
33834 -565382 -1061630 -927222 -776397 -809002 -453445 124622 -37593 -851858 -1061989 -386308
33824 -386308 26063 -293044 -426493 2453 90899 -491887 -742680 -193298 187348 -194729
33814 -194729 -483624 -21408 456607 234288 -160672 -93431 72517 -97946 -245594 -99169
33804 -99169 -102366 -411653 -397652 132909 363461 -153803 -680446 -590893 -365936 -537713
33794 -537713 -759309 -712840 -846221 -1359079 -1495332 -748340 151777 330650 10945 -153761
33784 -153761 -169787 -318269 -434812 -351941 -372594 -610259 -561795 -5044 392299 39269
33774 39269 -669228 -1043373 -1043347 -938077 -692773 -314748 -192877 -503876 -826605 -814222 -670394
33763 -670394 -584954 -380651 -90159 -125211 -471782 -507313 -30084 353599 278510 163009
33753 163009 257973 127385 -364904 -535233 -22650 469675 305332 -78462 -57072 115760
33743 115760 -55035 -345612 -317615 -137885 -128391 -113706 72251 63893 -354976 -695950 -580702
33732 -580702 -441014 -705738 -983908 -799007 -448254 -362126 -294624 48771 260185 -53359
33722 -53359 -464443 -494868 -515940 -962781 -1325671 -956566 -294426 -194091 -514826 -487026
33712 -487026 -94851 29008 -194245 -285989 -218235 -386573 -701753 -688375 -409748 -372927
33702 -372927 -571568 -511247 -163161 -43589 -322930 -630211 -769052 -910245 -1052113 -964171
33692 -964171 -697417 -559540 -605885 -690491 -886044 -1254350 -1373201 -787790 161545 646099
33682 646099 428692 1971 -261547 -418450 -468654 -273397 -14703 -108650 -559760 -903137
33672 -903137 -828441 -426736 115011 594253 677080 215577 -406630 -713776 -761366 -838096
33662 -838096 -817589 -444865 -31706 -110323 -510880 -546831 -77583 357576 448974 392311
33652 392311 223741 -308882 -1046434 -1347294 -979546 -451475 -203888 -73048 171134 329810
33642 329810 172311 -118032 -235604 -160375 -17523 172274 385011 488150 408036 200797
33632 200797 -104009 -498205 -825910 -886331 -701531 -439039 -158770 74084 -5311 -527085
33622 -527085 -1090393 -1170650 -829088 -536812 -408056 -176169 133031 144042 -200719 -513873
33612 -513873 -594192 -624651 -670049 -581469 -507209 -843647 -1474122 -1700404 -1224892 -615485
33602 -615485 -462051 -622920 -683430 -634611 -647793 -627889 -476525 -426288 -625590 -724315 -396290
33591 -396290 5061 -99144 -565687 -655215 -109807 469648 485447 121684 -14437 272941
33581 272941 617143 643421 381324 113751 22770 65714 83097 -61483 -378480 -707650
33571 -707650 -837163 -747504 -656387 -720438 -814995 -783821 -762052 -955973 -1197118 -1113623 -752722
33560 -752722 -589085 -806956 -1032556 -971169 -836608 -851939 -779134 -355330 166901 358608
33550 358608 209218 -28773 -296375 -593565 -688917 -464577 -292479 -525011 -826881 -601421
33540 -601421 63216 481840 347037 35473 -63165 18712 115630 173378 132280 -28813
33530 -28813 -97164 147360 514002 591337 336470 86624 8161 -69135 -274069 -517294
33520 -517294 -686740 -722791 -582928 -399950 -458759 -686171 -508503 287741 935220 623604
33510 623604 -237504 -536329 -83242 212162 -196865 -803706 -1014051 -915968 -754943 -422833
33500 -422833 103179 444828 375462 183826 134543 47770 -262922 -609287 -804254 -970108
33490 -970108 -1167637 -1157607 -842210 -534489 -481805 -486828 -272723 115606 494084 786134
33480 786134 928358 887585 865526 1068084 1230587 905436 271044 -3486 176787 160619
33470 160619 -305974 -574525 -164725 410614 456317 99466 -122834 -132492 -133155 -44241 212482
33459 212482 241977 -316615 -1062575 -1245773 -746402 -114879 215991 283775 291303 365488
33449 365488 529394 634742 485627 214155 217689 517427 615627 274190 -77534 -96552
33439 -96552 -126684 -517391 -874459 -653924 -79073 249123 315424 517202 797919 749284
33429 749284 435793 342109 537107 602267 398075 223918 164977 -68170 -532925 -868583
33419 -868583 -853979 -643578 -345900 115623 599615 729376 457915 169101 21277 -318819
33409 -318819 -1011031 -1569414 -1456222 -847764 -395055 -392033 -572131 -658601 -720174 -883827
33399 -883827 -1003529 -860784 -564795 -465314 -636448 -723590 -465717 -124316 -107578 -346524
33389 -346524 -422674 -225343 -52021 -63958 -97237 -74174 -137800 -271737 -262361 -171177 -329186
33378 -329186 -687213 -743810 -372941 -109247 -249690 -305601 148453 669657 622995 183088
33368 183088 -38456 -690 -134886 -481288 -647740 -514918 -344550 -248341 -106307 41705
33358 41705 19508 -133757 -263562 -429611 -725922 -958777 -944305 -906802 -1104879 -1306842
33348 -1306842 -1165172 -861069 -794252 -875857 -773641 -642726 -894802 -1375019 -1505765 -1199514
33338 -1199514 -924083 -875558 -775108 -505505 -281617 -143736 85818 301402 185108 -191576
33328 -191576 -438615 -517237 -720704 -1020769 -1104499 -1024186 -1080629 -1095498 -621580 110431
33318 110431 367623 138247 193985 699440 801707 43601 -797205 -886347 -498363 -315820
33308 -315820 -307653 -90202 176997 85191 -213464 -235524 51124 297488 387198 420554 325799
33297 325799 31073 -189106 -66032 145738 8358 -386231 -523289 -191435 318326 666635
33287 666635 758311 648235 454843 302606 152402 -156754 -535515 -593219 -193564 259795
33277 259795 394736 386316 521021 590875 233065 -357787 -612537 -385048 -62175 78330
33267 78330 128277 146317 -18715 -358055 -552958 -421518 -246901 -397295 -753444 -787783
33257 -787783 -245801 461315 725230 516463 407822 747756 1156161 1122132 780672 617008
33247 617008 615144 334784 -208444 -448309 -199028 10171 -181056 -403432 -296033 -191126
33237 -191126 -491044 -847351 -641020 14538 430758 365259 252777 424584 659182 635444
33227 635444 422593 332893 500896 734371 712041 336998 -82639 -138194 159054 388680
33217 388680 316675 157899 104561 -11505 -310824 -497148 -286111 79709 165367 -14762
33207 -14762 -112925 -51017 -71540 -254123 -388006 -354852 -330716 -529479 -904514 -1138264 -906918
33196 -906918 -273079 190986 -56055 -794989 -1202611 -868869 -254490 69634 168690 377592
33186 377592 624775 606132 340804 80617 -120262 -324203 -412389 -286202 -173516 -331133
33176 -331133 -617393 -725975 -642087 -512286 -307913 -3109 173387 75212 -37366 76904
33166 76904 198047 84674 5661 278865 612415 547974 279177 319308 568007 472810
33156 472810 2613 -310436 -262558 -159188 -92023 212163 728250 1020895 926973 713693
33146 713693 464089 -25298 -617011 -804949 -505474 -218973 -208786 -189078 -40872 -108850
33136 -108850 -464372 -585646 -198597 201026 135505 -136662 -211845 -294184 -729921 -1224580
33126 -1224580 -1216955 -775917 -472415 -494373 -488250 -249454 -29287 -57398 -159700 -19479
33116 -19479 393680 782223 836277 564052 306789 347757 532919 460131 42519 -370176
33106 -370176 -478436 -350845 -164209 48997 217977 103229 -380861 -889756 -936236 -384618
33096 -384618 445545 1059505 1128216 717472 227072 -35578 -169988 -371835 -468747 -176373
33086 -176373 262482 241219 -319559 -786297 -714403 -425759 -412544 -639171 -784709 -770652
33076 -770652 -656812 -350688 163250 556750 524791 256594 199948 470175 752072 684078
33066 684078 169612 -544345 -984403 -856440 -417505 -173228 -168325 18624 500585 842526
33056 842526 809189 776040 1038532 1253344 1027835 594023 386220 363246 280573 235864
33046 235864 356319 307776 -224870 -840677 -878157 -374885 67432 194373 214555 164877
33036 164877 -117789 -449140 -426946 -120783 21224 -36367 105358 470872 597773 356889
33026 356889 167671 197003 65906 -342021 -485001 -22529 523204 501551 85010 -65207
33016 -65207 228974 560403 611132 444523 217432 -1795 -156353 -218583 -246073 -245436 -101094
33005 -101094 192768 404569 371325 254916 275524 366438 331601 184986 84436 64626
32995 64626 68951 104784 134854 -22017 -412839 -728918 -666709 -380192 -248378 -314018 -333551
32984 -333551 -298761 -449091 -741553 -793888 -511572 -320657 -507248 -716614 -491464 -23349
32974 -23349 101122 -225980 -494955 -330645 52045 266383 245131 107451 -142286 -492164
32964 -492164 -725384 -673924 -540497 -645403 -924732 -1006372 -761176 -436407 -203100 69388
32954 69388 452409 703048 604968 333549 225107 327291 407085 295297 15978 -326576
32944 -326576 -585338 -589297 -346339 -161926 -324242 -693064 -822040 -512894 -67853 55573
32934 55573 -279503 -778783 -988848 -694009 -136900 181140 2406 -432797 -702313 -660166
32924 -660166 -456523 -233699 -5636 228022 444371 632856 710157 496128 -10418 -431952
32914 -431952 -382755 -11535 137193 -162658 -553176 -629941 -439920 -275296 -227198 -180924
32904 -180924 -100195 -73897 -128286 -166761 -94694 82713 260674 288578 93678 -197778 -345056
32893 -345056 -253299 -60635 89606 250576 549519 953641 1277669 1382866 1267919 985171
32883 985171 563048 36687 -482867 -802223 -752190 -353727 147627 501553 706303 935211
32873 935211 1193767 1202909 735800 -25614 -617411 -752394 -528946 -194898 132680 429650
32863 429650 586205 466924 161371 -4513 178359 542103 768749 795384 812984 904678
32853 904678 925332 794808 671676 686615 687171 450625 41250 -259302 -339853 -387217 -609295
32842 -609295 -965984 -1211519 -1134333 -750033 -300690 -42831 -13407 -51589 -36816 18799
32832 18799 112034 274603 386274 203834 -260138 -605423 -511180 -157598 55238 35694
32822 35694 -31914 -89357 -225932 -376164 -347806 -143425 47564 161588 268343 305095
32812 305095 158280 10747 208153 694666 967709 742161 307815 49334 -39665 -120708
32802 -120708 -109226 152593 510178 613061 348198 -67942 -363117 -407278 -236736 -49096
32792 -49096 -77752 -317754 -481038 -363910 -121315 -15807 -59756 -123279 -236282 -489537
32782 -489537 -728967 -681145 -385192 -184277 -212762 -178515 193146 718765 961963 761075
32772 761075 367493 113929 102461 206807 251349 161478 11448 -63802 -46866 -89859 -302980
32761 -302980 -533340 -505456 -199978 82879 126788 91160 227819 443292 396893 -6665
32751 -6665 -484227 -753015 -782217 -610307 -212938 279914 503264 264881 -115596 -142860
32741 -142860 252775 679126 791197 610041 354906 180509 126276 170354 265862 383000
32731 383000 521559 656433 731039 739336 721318 651950 481470 316678 345619 510445 526667
32720 526667 352299 306143 499391 513608 4575 -679360 -933455 -732521 -539791 -521881
32710 -521881 -378916 70829 613894 980290 1067929 837135 368805 1215 11723 200755
32700 200755 191515 44907 92767 271419 232528 81882 303958 854763 1056213 621670
32690 621670 95807 -42752 -55587 -309049 -567484 -445159 -120978 -85806 -472990 -1022071
32680 -1022071 -1407414 -1318855 -616356 293326 688015 460573 303054 607561 823120 434811
32670 434811 -80106 -13473 410466 497506 276598 266593 347803 -60899 -766087 -817157
32660 -817157 62256 992785 1177884 816318 445970 138238 -203445 -377957 -248726 -122206
32650 -122206 -284485 -511188 -463638 -258418 -226090 -368051 -463266 -501280 -602316 -660633
32640 -660633 -468015 -117191 78555 54141 68267 268652 433028 244987 -304181 -862828
32630 -862828 -1017812 -651511 -61389 297180 245678 31170 -6568 154154 251984 155669
32620 155669 69563 230378 525528 619002 444360 310213 388449 375613 -30861 -519322
32610 -519322 -484090 70167 439049 156899 -434422 -758452 -698069 -432782 -22671 442675
32600 442675 632639 367567 -26784 -161548 -119304 -141456 -110254 131160 243275 -170420
32590 -170420 -773990 -859697 -432148 -198093 -416420 -502039 -6637 660249 857961 588249
32580 588249 355038 455744 736927 879624 726354 435886 345952 531783 621483 344296
32570 344296 78058 364253 991445 1173702 660063 33723 -189196 -107372 67519 350246
32560 350246 553595 244053 -470327 -780684 -303650 261687 194927 -121980 107096 738826
32550 738826 906086 372683 -194741 -304519 -216947 -298430 -444394 -404612 -220552 -71402
32540 -71402 5183 35181 -15681 -149201 -312257 -532118 -848514 -1060454 -826194 -157890
32530 -157890 424601 443115 21504 -311509 -296188 -178071 -245725 -386226 -310293 -80469
32520 -80469 -74405 -371468 -547010 -314188 -33923 -175259 -506832 -381154 239537 641269
32510 641269 350712 -279789 -684198 -777665 -766629 -721752 -676409 -765158 -914991 -744797
32500 -744797 -131570 442968 484282 135112 -130140 -164298 -105187 33742 272766 383839
32490 383839 153022 -234792 -468041 -569588 -681998 -635440 -233364 218268 232180 -99780
32480 -99780 -229300 -21082 48737 -358718 -974291 -1319275 -1188832 -646683 93271 670102
32470 670102 780534 499673 178829 9695 -85788 -207949 -422703 -852618 -1445162 -1729785
32460 -1729785 -1259783 -292158 430755 605590 592599 658533 558639 102794 -359714 -383055
32450 -383055 -32594 283620 369764 342192 335239 350790 311927 129598 -179645 -387200 -246859
32439 -246859 138901 362080 204358 -126805 -338416 -382738 -333491 -184063 51852 218929
32429 218929 175008 -33165 -239118 -300082 -156941 92406 191829 11459 -184393 -27773
32419 -27773 389084 569881 293075 -123451 -353842 -479188 -659671 -744767 -526609 -152918
32409 -152918 28817 -85020 -306723 -442506 -419998 -236598 21192 171764 103396 -92648
32399 -92648 -220400 -137988 179933 582312 757441 547030 259070 364364 819174 1047358
32389 1047358 731767 234321 3488 -37421 -164797 -262830 -18598 483246 816419 789371
32379 789371 591365 425246 344533 398278 573297 610682 246091 -334300 -621240 -436427
32369 -436427 -145497 -125368 -323179 -482789 -529102 -528824 -482919 -385773 -358584 -508053 -722694
32358 -722694 -795191 -708528 -629578 -629019 -583701 -409338 -237016 -231484 -312701 -220985 127133
32347 127133 492958 596212 419684 126625 -196833 -519546 -659916 -382050 236126 766956
32337 766956 903721 798928 790553 946093 1054504 947405 623901 136876 -419731 -827498
32327 -827498 -860971 -542132 -146279 73180 60844 -111571 -315860 -345697 -28826 525903
32317 525903 936325 934115 645256 364542 169770 -57762 -317045 -446793 -413792 -390958
32307 -390958 -464900 -502288 -436962 -438397 -580468 -588719 -243600 152639 133524 -205123 -325418
32296 -325418 -92821 60192 -44294 44653 607541 1123419 972000 393036 153353 492222
32286 492222 991641 1336028 1564568 1613611 1261388 636676 216654 144947 39414 -334562
32276 -334562 -667438 -627645 -375082 -263458 -334762 -381695 -291749 -120237 5075 -53040
32266 -53040 -268113 -321625 42296 523436 543190 81706 -250782 -123534 74263 -48033
32256 -48033 -287213 -355544 -459442 -846111 -1184273 -997669 -451703 -117562 -118709 -81972
32246 -81972 148858 305923 220340 74788 50481 90560 98837 93796 118531 216290 469240
32235 469240 842452 1070146 954167 685887 592382 661864 633440 457815 297114 118901
32225 118901 -292143 -866314 -1180375 -1002580 -619673 -456035 -568461 -677881 -579690 -377621
32215 -377621 -321339 -465424 -553173 -336759 29299 135404 -111692 -365178 -403528 -459465
32205 -459465 -747098 -1027667 -1002961 -823415 -778245 -756587 -504946 -184207 -110772 -115118 217237
32194 217237 743438 866162 476326 133655 162283 202918 -78753 -418110 -444032 -271588
32184 -271588 -196442 -170326 -16500 104282 -95859 -486179 -601780 -278993 101336 82650
32174 82650 -332075 -701123 -637071 -214634 147024 184944 46947 -11257 16970 23585 83738
32163 83738 314857 559686 563778 415058 439586 665476 762935 560756 270957 130258
32153 130258 134675 187521 210984 90676 -170108 -259111 99898 636158 823079 671782
32143 671782 680577 939167 946610 528045 229346 399145 519842 18404 -756028 -1015373
32133 -1015373 -658106 -263573 -181539 -263137 -375763 -555613 -649007 -373982 165518 500042
32123 500042 450580 352118 478269 625851 490114 157014 -48782 -42128 -47484 -232331 -460705
32112 -460705 -463897 -176333 170123 292408 141082 -108334 -286731 -348129 -303408 -198206
32102 -198206 -151042 -234929 -297946 -85596 415580 929209 1209665 1227201 1041734 748658
32092 748658 570955 697016 944337 890241 443985 -22137 -224294 -294649 -395007 -383337
32082 -383337 -116923 238218 468189 586373 598693 324760 -241171 -702534 -736099 -523176
32072 -523176 -375340 -226550 114953 482569 565544 420614 349579 406260 393438 208264
32062 208264 -131516 -614777 -1077018 -1171873 -855638 -591695 -661681 -649870 -162404 321879
32052 321879 59569 -738962 -1127962 -790003 -352925 -296082 -366884 -275699 -195647 -252780
32042 -252780 -179634 152634 408968 365125 320025 565636 880379 922560 749592 590766
32032 590766 447631 262702 170899 254431 332049 283891 289468 458218 541784 330929 36730
32021 36730 -59234 -55305 -184965 -377626 -415380 -302776 -146068 103844 436098 536590
32011 536590 157637 -431531 -741337 -677145 -507387 -355892 -107867 255746 583702 779970
32001 779970 826874 661659 307562 33850 92677 373130 584984 682986 825314 1024147
31991 1024147 1149647 1193006 1229614 1224261 1165500 1239242 1513028 1615146 1177444 483436
31981 483436 165622 300646 354610 62781 -223989 -218026 -135429 -182554 -123619 257344 673987
31970 673987 743029 569542 507704 576202 541053 413061 430889 623186 758498 689077 436294
31959 436294 16658 -483549 -751073 -561485 -214649 -213368 -474067 -350544 387655 1087991
31949 1087991 1058629 499683 154245 272712 422956 250620 -74134 -259064 -315839 -371717
31939 -371717 -354080 -134904 165999 274737 114060 -113203 -176380 -40576 142080 190721
31929 190721 80743 14646 228642 672592 992556 925330 606567 379306 401898 565475
31919 565475 682702 613452 331968 48343 116340 569751 882152 530690 -250173 -663715
31909 -663715 -347286 210031 372110 102567 -205132 -303189 -196554 63442 349693 391290
31899 391290 63666 -364374 -561552 -584608 -687493 -821183 -725835 -458986 -376517 -529879
31889 -529879 -525590 -150893 247479 248839 -85471 -402593 -539945 -526117 -334546 3974
31879 3974 181409 -116405 -747706 -1243055 -1388240 -1367836 -1314696 -1078492 -584308 -117512
31869 -117512 -8480 -191096 -286965 -53622 392062 726715 695816 328340 -30361 -7285
31859 -7285 382305 730355 743188 590965 611086 841926 1053575 1083776 903043 494099
31849 494099 -39233 -360903 -243094 52468 96480 -68005 -49626 141999 32462 -475877
31839 -475877 -777395 -422783 183063 393648 230870 145449 175932 -18001 -424590 -628391
31829 -628391 -503132 -375000 -403191 -344768 -107609 -20338 -270089 -495379 -292916 163563
31819 163563 365827 148167 -189404 -317111 -168329 130385 396428 482508 386048 258936
31809 258936 236549 306023 375845 380153 290009 143694 77135 171331 271777 159282 -96153
31798 -96153 -199086 -70677 63231 82309 129878 239626 172351 -158280 -432047 -369548
31788 -369548 -150790 -99643 -218879 -353137 -548592 -871848 -1087085 -934078 -584061 -405148
31778 -405148 -386870 -232084 44008 66377 -319341 -821248 -1114124 -1124980 -873054 -411766
31768 -411766 -10095 -2550 -315792 -488478 -312708 -110103 -179586 -319405 -180798 173225
31758 173225 386363 316462 125631 -25595 -107070 -122331 -123771 -253477 -532440 -674472
31748 -674472 -378879 204115 573912 492215 240331 174928 283956 357788 380325 477940
31738 477940 593526 518027 244103 4542 -97478 -211086 -377647 -363687 -85864 91620
31728 91620 -152146 -520709 -481538 -115536 -41579 -457032 -836461 -783755 -612855 -722860
31718 -722860 -908186 -795767 -562783 -597373 -707001 -366281 320985 606886 151608 -520863
31708 -520863 -824798 -833303 -903681 -1035983 -997002 -797294 -662907 -675536 -725527 -721181 -636740
31697 -636740 -458357 -247723 -141112 -155932 -156305 -130071 -268028 -573196 -645914 -176566 515894
31686 515894 816207 627855 469337 699442 1014425 910057 376160 -143249 -339510 -289760
31676 -289760 -152225 64444 304788 315147 -41682 -465096 -539311 -347299 -395690 -837549
31666 -837549 -1159156 -886030 -262911 139735 244851 423365 760940 913179 742387 587420
31656 587420 703593 849213 700300 359929 151723 135115 139548 135591 261612 524390
31646 524390 719913 674146 420323 134289 -14223 35205 209349 390237 533058 642874
31636 642874 668753 541130 295470 21662 -271350 -564359 -666222 -409390 10942 198655
31626 198655 74701 -98557 -223107 -456265 -703497 -561852 -45371 168345 -324478 -904899
31616 -904899 -702215 184603 883761 998224 948717 1066956 1070627 686075 215046 97160
31606 97160 272865 351144 179198 -75188 -249137 -308532 -246340 -93571 30102 58170
31596 58170 101249 263007 409127 316423 23557 -162958 -45121 238824 420831 407511
31586 407511 286175 130187 -48951 -177477 -121382 108405 287209 252313 154257 243155
31576 243155 451730 436428 69473 -370520 -611328 -727065 -865650 -883298 -573939 -125575
31566 -125575 34670 -143256 -228675 60078 420754 377916 -55820 -386610 -262402 125171
31556 125171 311669 93658 -306733 -548939 -523052 -369518 -262198 -275176 -407753 -597136
31546 -597136 -695991 -575199 -304055 -125175 -197188 -449663 -720532 -919836 -1017277 -998871
31536 -998871 -897367 -757396 -551477 -280253 -148837 -395475 -886501 -1170741 -1062304 -860698
31526 -860698 -810521 -699426 -303865 97223 97999 -166887 -230501 -52248 -38224 -310582 -494882
31515 -494882 -360073 -183052 -246539 -373418 -258164 29852 194288 177052 171200 267222
31505 267222 358275 376180 395348 445900 368953 -22164 -637731 -1056716 -899155 -287866
31495 -287866 190354 93365 -402269 -749413 -637284 -209256 182235 233174 -165069 -770092
31485 -770092 -1067674 -788035 -284308 -117618 -333579 -466001 -199439 332331 874100 1269520
31475 1269520 1340235 983476 479346 285341 414690 438750 219930 143896 403194 562731
31465 562731 202855 -417436 -754150 -716257 -598876 -544153 -483912 -415595 -352808 -188242
31455 -188242 42044 -15311 -538722 -1081159 -1070580 -598500 -229027 -149548 -45022 225444
31445 225444 390248 293947 170240 216745 290318 210882 58416 2966 85370 271938 489331
31434 489331 556046 357474 120388 179767 428564 404128 34440 -159222 152922 546459
31424 546459 426689 -140161 -583690 -601073 -362880 -87296 171492 344708 335362 229399
31414 229399 233126 351714 376618 236794 117420 148932 195496 74389 -166782 -313048
31404 -313048 -231102 23653 273678 343950 199509 -1511 -65093 9846 43752 -79997
31394 -79997 -297648 -502006 -656729 -740321 -735272 -734915 -877910 -1061551 -917453 -280610 458636
31383 458636 733390 469203 113363 27067 147632 282976 390956 414542 177865 -269053
31373 -269053 -460622 -57920 542124 562065 -166006 -944135 -1063914 -597011 -141472 -47575
31363 -47575 -172201 -254208 -234446 -205590 -252577 -387483 -525313 -508046 -251129 118635 352867
31352 352867 334078 193063 165244 354505 622962 688704 367456 -231351 -756074 -897283
31342 -897283 -636913 -229951 34995 65593 -1328 20996 164659 315015 397184 421664
31332 421664 307660 -120321 -774675 -1148308 -851043 -216587 12361 -374438 -822055 -812925
31322 -812925 -485309 -248927 -188965 -183367 -296241 -642703 -1042411 -1195638 -1102059 -974837
31312 -974837 -847990 -610549 -337763 -220893 -209976 -82422 151107 263065 228692 257095
31302 257095 362875 288647 -41944 -350849 -430658 -415495 -448321 -383976 -63891 342912
31292 342912 526237 417232 183140 -32245 -179470 -222662 -161856 -77035 -46577 -96504
31282 -96504 -273333 -609692 -941392 -954424 -556726 -46498 231253 246242 166543 63480
31272 63480 -71610 -163394 -135390 -76476 -127268 -268357 -399684 -546689 -780537 -995062
31262 -995062 -995350 -802976 -660166 -699522 -791060 -760233 -590716 -350398 -76824 158802 195576
31251 195576 -60521 -456725 -697767 -663992 -547109 -602490 -804587 -853224 -556911 -110859
31241 -110859 104661 -53534 -381347 -590455 -541703 -253019 133503 366335 257488 -83588
31231 -83588 -340147 -366788 -302928 -253187 -99740 217089 467660 420764 192350 36239
31221 36239 -87860 -418158 -905493 -1164679 -988768 -637090 -472289 -513922 -517002 -346691
31211 -346691 -81898 180602 420563 571994 484001 124783 -260713 -359483 -169108 -15417
31201 -15417 -124486 -343599 -432578 -448181 -555578 -580895 -177618 515580 853152 552583
31191 552583 173076 356007 916503 1171419 955886 744667 814964 876481 654905 323341
31181 323341 122429 -14102 -164893 -128983 208911 509253 386690 9971 -119331 114340
31171 114340 358777 398428 401918 478708 400716 -11161 -514575 -722334 -563966 -231312
31161 -231312 167680 614075 949182 979555 807018 725847 723557 426160 -282036 -909771
31151 -909771 -948585 -590853 -459201 -725211 -952464 -839531 -625758 -564612 -460332 -102991
31141 -102991 187954 -38251 -598341 -852162 -627485 -427717 -590839 -761805 -502721 -13967
31131 -13967 182982 36247 -31319 180694 398836 368254 204185 106521 43003 -67472
31121 -67472 -98115 87038 326196 348899 211805 235985 482206 613961 436649 277478
31111 277478 525542 967985 983093 401373 -215891 -314191 -32119 119090 11293 -48000
31101 -48000 82126 145208 -59765 -342020 -418925 -305230 -185078 -76209 119331 317920
31091 317920 274918 -74094 -486602 -686571 -632458 -460421 -282166 -124778 3512 83186
31081 83186 102018 46968 -108573 -355105 -581453 -617806 -399676 -84856 53931 -92480
31071 -92480 -315391 -279523 108197 576520 782886 687874 567007 660223 897064 1015467
31061 1015467 887289 629280 397719 191607 -62916 -319146 -446014 -444077 -457164 -508398
31051 -508398 -397195 -12425 375253 358776 -94099 -599918 -863118 -982940 -1134865 -1167951
31041 -1167951 -779513 -27869 584103 612870 126313 -414048 -620068 -453607 -131222 111652
31031 111652 154606 -2196 -277997 -555622 -731136 -750993 -611675 -347145 -45660 148358
31021 148358 133575 -17068 -107816 -67905 -61324 -235694 -441622 -394772 -112038 41638 -165625
31010 -165625 -512478 -657411 -624126 -696622 -908086 -952925 -681197 -395770 -449307 -715508
31000 -715508 -727447 -300256 241397 511412 505434 452023 409515 257864 13755 -138677
30990 -138677 -179413 -334751 -676754 -890968 -708332 -395494 -451715 -850934 -978960 -453386
30980 -453386 323092 659752 397373 -45082 -299935 -416244 -607727 -887611 -1036528 -831450
30970 -831450 -294411 233416 355768 67313 -186112 -47419 308606 504309 544937 683932
30960 683932 803923 470549 -283137 -771321 -573524 -191056 -329945 -854402 -1022738 -607710
30950 -607710 -157459 -99674 -186070 -59973 124207 31693 -233823 -286083 -77970 55826
30940 55826 -39696 -107779 95703 430912 595230 538177 464863 507475 580082 565232 486049
30929 486049 417435 346531 257328 269301 463510 561710 95861 -896993 -1628714 -1393091
30919 -1393091 -504633 62098 -50355 -222774 72169 466277 398880 111428 263544 811284
30909 811284 1016784 569109 -10909 -248740 -350265 -637674 -905557 -807519 -504925 -417027
30899 -417027 -549687 -571116 -433680 -427178 -620876 -709448 -517390 -283246 -272897 -389208
30889 -389208 -359740 -117010 197715 469940 657203 677993 456856 100289 -119548 -46397
30879 -46397 154622 180521 -11254 -113460 118724 474864 522450 211524 -35343 56962
30869 56962 196043 -24859 -459249 -551233 -105794 423484 506820 158891 -152019 -84698
30859 -84698 215667 317456 21041 -351572 -287662 248935 656436 374967 -412068 -994483
30849 -994483 -952545 -477159 47235 400791 423123 -43670 -868439 -1534053 -1597316 -1155038
30839 -1155038 -681793 -482772 -444760 -264946 196372 771668 1136695 1121171 855461 561911
30829 561911 290487 1764 -197859 -166214 -36436 -108964 -385680 -518554 -319961 -25311
30819 -25311 81337 -1860 -204594 -601308 -1159587 -1532701 -1405848 -892829 -362809 -47819
30809 -47819 -9419 -234567 -504304 -441637 -19592 245826 4736 -292446 11676 734671
30799 734671 1014844 494467 -266973 -650600 -650153 -483677 -114639 462108 884062 817556
30789 817556 449447 212037 204389 224071 209165 288653 473473 621033 686757 750602 803649
30778 803649 735865 540436 339510 201819 95568 13623 -11192 -10746 -54450 -116328 -104901
30767 -104901 -34985 -43955 -198431 -354909 -242608 306484 1139227 1782689 1812504 1307145
30757 1307145 791298 623328 625069 480207 263009 262543 445577 500024 377009 368986 576221
30746 576221 701332 545445 346548 371905 471762 356158 108530 77165 358397 700401
30736 700401 869462 828984 584007 137967 -356407 -640731 -616494 -416759 -208946 -84627
30726 -84627 -107051 -260827 -388347 -410204 -550402 -1016108 -1477322 -1311599 -496007 203630
30716 203630 207334 -125830 -103410 291536 506003 310755 7611 -196318 -435507 -715319
30706 -715319 -736575 -422972 -191463 -387518 -755173 -784123 -375813 124060 406113 449602
30696 449602 400244 415126 548495 633975 405839 -102682 -453259 -319768 35475 75038
30686 75038 -315916 -728644 -787825 -533199 -240024 -119555 -243878 -531116 -720083 -559727
30676 -559727 -140140 111971 -104653 -593378 -856042 -621247 -102417 252858 214447 -47643
30666 -47643 -209011 -151730 -11793 78075 135072 195979 222145 219408 283449 417557 485875
30655 485875 478347 595007 853870 859252 310181 -415322 -615910 -195714 179564 -47574
30645 -47574 -667729 -1088449 -1071294 -844802 -686715 -660257 -688340 -678456 -568912 -367905 -169942
30634 -169942 -99543 -229450 -513274 -751662 -697274 -302700 188016 503179 614599 613349
30624 613349 461131 115030 -205121 -204355 47880 196886 143776 152564 343703 465932 341860
30613 341860 182961 215071 293644 193483 53380 198391 640713 1047200 1141804 922047
30603 922047 547674 214365 73977 104893 121281 41151 30496 224877 443164 388177
30593 388177 43452 -331972 -535526 -559186 -465365 -327223 -257156 -308071 -350320 -186138
30583 -186138 222316 727317 1133363 1272184 1062965 652729 394153 492866 727370 690124
30573 690124 276352 -213136 -430237 -317096 -111110 -106845 -382431 -719696 -873483 -916726
30563 -916726 -1120684 -1442941 -1433501 -857276 -153743 31899 -371217 -846904 -958016 -728713
30553 -728713 -417377 -200393 -102698 -36111 118482 356908 534081 574184 537688 382779
30543 382779 -60202 -663765 -880136 -410849 262510 457040 187614 -9703 25040 -36134
30533 -36134 -272396 -318105 -21313 284829 369626 453775 734337 1019560 1100497 1076745 1051738
30522 1051738 910785 689787 747731 1199676 1537959 1255680 589125 196253 270577 407614
30512 407614 261692 -62632 -266898 -198115 81830 345762 338116 40491 -252716 -285489
30502 -285489 -178146 -236646 -516859 -775278 -794451 -585734 -311227 -136123 -118610 -174802
30492 -174802 -220140 -332159 -587391 -765278 -559029 -154268 -152561 -680323 -1026604 -574854
30482 -574854 274579 625312 269103 -212573 -368922 -291025 -129952 185165 609236 848693
30472 848693 753359 476970 129001 -347885 -822881 -923885 -572078 -214784 -251759 -513319
30462 -513319 -584823 -393991 -156005 72597 413932 795557 883169 462509 -286594 -959036
30452 -959036 -1268446 -1197847 -900773 -527924 -159981 135655 286724 317310 373471 532054
30442 532054 661323 612149 459857 364926 275312 23901 -315537 -474486 -426609 -467043
30432 -467043 -749988 -1034400 -1047759 -858378 -704751 -661134 -662043 -681295 -690294 -584160 -341653
30421 -341653 -143884 -162509 -324894 -420805 -327195 -23216 439096 829285 809017 337728
30411 337728 -144249 -183904 145818 412174 412738 324867 337098 423814 485594 464764 306052
30400 306052 16444 -233231 -273807 -191335 -192023 -241006 -118599 145873 226918 3764 -205494
30389 -205494 -114208 86710 29875 -244749 -321189 10083 466933 627267 387676 -5091
30379 -5091 -268305 -342824 -369485 -450504 -469612 -225060 233571 533074 380601 -37932 -258340
30368 -258340 -128530 27321 -83514 -283363 -211804 84802 159773 -206547 -661897 -721443
30358 -721443 -370452 -21493 31184 -116206 -235568 -268459 -286578 -311913 -304702 -264665 -248204
30347 -248204 -298493 -389839 -424571 -311576 -114832 -78658 -373656 -834082 -1116139 -1134189
30337 -1134189 -1140731 -1309065 -1457462 -1327998 -955249 -585812 -377504 -343729 -442624 -535937
30327 -535937 -421277 -122613 23619 -163144 -342950 -123496 259973 214342 -296035 -646169
30317 -646169 -478094 -187992 -222076 -387550 -282617 -20397 7351 -143720 -52323 329643
30307 329643 564506 415845 163089 82191 51579 -77319 -84237 289064 823194 1007657
30297 1007657 685775 218969 3532 65653 180941 185923 68226 -109852 -249383 -245298
30287 -245298 -89810 83784 152552 180539 334383 601439 717097 471946 10845 -313774
30277 -313774 -356625 -292648 -313840 -402609 -475279 -552561 -638149 -591281 -326226 -29483 51955
30266 51955 -25184 12264 240414 478064 637535 827023 1022630 954711 509187 -5142
30256 -5142 -223181 -177771 -151889 -235458 -306308 -342121 -427736 -470121 -235379 239956 549260
30245 549260 397043 -159 -185492 -33820 145403 64855 -152948 -127644 309779 893541
30235 893541 1184157 1005664 588360 306979 333763 544311 698848 687361 618728 650921
30225 650921 705722 457003 -239777 -984573 -1182482 -806035 -490828 -692961 -1054846 -918067
30215 -918067 -239046 410669 647136 638849 664613 740650 807607 913562 1026253 972078 764233
30204 764233 710469 962029 1213199 1126021 834538 706416 771459 755555 599293 550696
30194 550696 711933 850738 784847 663507 679679 710109 475196 -31506 -483159 -591979
30184 -591979 -398483 -154245 -23610 20412 58251 94136 92672 57665 5651 -68651 -105434
30173 -105434 57897 464702 823834 763611 353708 110784 332117 660442 554094 21692
30163 21692 -415014 -425928 -232780 -225161 -465689 -684964 -623389 -288484 52307 110757 -120318
30152 -120318 -333811 -277423 -91386 -107116 -347690 -457476 -177164 316663 647723 663102
30142 663102 510008 405585 444082 559607 583733 382931 5323 -337535 -465368 -372466
30132 -372466 -182578 -33688 -13462 -120448 -249509 -262555 -91614 240401 638250 910140
30122 910140 828814 376331 -120253 -278137 -75333 192449 351915 520698 790497 983409
30112 983409 867847 464200 -3931 -358241 -552411 -606683 -575472 -530350 -496201 -435740
30102 -435740 -317004 -136918 102070 327426 343289 30114 -386429 -486270 -158463 241277
30092 241277 341055 174041 26914 57693 233381 488942 739005 815699 588909 140454
30082 140454 -282389 -467314 -367011 -123150 17192 -57451 -151422 -13136 240689 233047
30072 233047 -76496 -255132 -32241 289865 336684 228705 270784 371502 253923 55100
30062 55100 178944 607323 869216 730567 457390 327470 317959 368997 514484 608225
30052 608225 355985 -178416 -509447 -417211 -300824 -531700 -826858 -688330 -200063 96555
30042 96555 2699 -129090 3403 240514 267667 62746 -107575 -3571 351844 675307
30032 675307 664872 323539 -9604 -50545 105082 193180 181314 208484 215392 -19201 -424047
30021 -424047 -554154 -142103 510174 907539 952753 910391 898805 737259 331395 -72343
30011 -72343 -176590 -9157 178820 295458 467132 719823 836837 653488 328642 144300
30001 144300 130119 97623 11576 73905 366705 648657 681807 596940 699684 988636 1125713
29990 1125713 909373 537517 298326 205580 112769 27961 60502 119386 -31178 -348030
29980 -348030 -431618 -66672 382043 399680 15242 -275702 -237535 -138648 -178428 -102824 323279
29969 323279 796007 841123 529148 382584 616909 902210 931869 815658 743653 611349
29959 611349 246204 -210329 -425596 -293261 -30300 99818 38529 -47359 63786 374324
29949 374324 548299 239117 -409189 -816604 -657971 -270784 -165825 -342165 -394553 -180832
29939 -180832 -11587 -133063 -338584 -270052 66386 294794 159901 -133199 -171084 115493
29929 115493 307340 16739 -561704 -838207 -545023 -13233 319273 398466 415908 451829
29919 451829 486155 561109 669397 624166 304471 -73540 -184970 -21248 137115 89248
29909 89248 -158998 -525665 -866951 -965705 -755170 -441134 -161421 275429 965012 1451242
29899 1451242 1221117 546183 224055 458710 640692 387645 120181 263235 500728
29890 500728 348515 5614 26939 431378 731458 695761 531407 391724 230602 136828
29880 136828 314560 660184 784135 548828 211285 -57311 -406667 -908742 -1270194 -1168895
29870 -1168895 -660900 -83056 277100 313538 112955 -52990 57180 346529 478444 351269
29860 351269 231304 323056 491099 553018 552038 537455 375854 62605 -48340 307615 804694
29849 804694 861754 388703 -161713 -418758 -389485 -162259 250226 681866 824353 645212
29839 645212 481393 535671 585213 418338 264668 464889 912595 1184688 1123373 935149
29829 935149 752219 467437 75118 -153548 -3008 396275 770691 1022046 1174338 1155904
29819 1155904 865614 414940 107006 137477 421769 730225 895866 867225 653929 297429
29809 297429 -117863 -469378 -646823 -624934 -485339 -339152 -233589 -170436 -180835 -277813
29799 -277813 -335018 -165072 205058 482118 466067 340930 415091 651120 707973 465304
29789 465304 237587 337195 632589 742688 550657 297148 198579 206695 210670 276825 514678
29778 514678 789938 778691 361323 -179490 -465837 -444141 -356254 -346183 -302211 -124014
29768 -124014 83127 217375 380870 655067 834129 670391 299031 90744 102881 42544
29758 42544 -169033 -203806 116550 450252 420983 172832 74898 102872 -51062 -376023
29748 -376023 -513892 -332818 -101659 -12481 78902 283364 393580 201251 -131358 -249897
29738 -249897 -26475 365514 680669 774279 652382 462520 360319 345509 338060 392037
29728 392037 616125 872760 852460 540776 302516 349864 447899 363067 263039 344185
29718 344185 361269 -30049 -633309 -880659 -599100 -196538 -68061 -178327 -280121 -229863
29708 -229863 -24254 215534 271632 82794 -76899 27762 130960 -187697 -718779 -736739
29698 -736739 -45447 639830 656863 261122 117635 333536 520613 554612 671103 871532
29688 871532 806896 374140 -16967 6995 266323 311320 47169 -190489 -154017 -40658
29678 -40658 -196178 -572620 -728368 -453554 -141164 -256493 -609416 -585721 -75910 339829
29668 339829 266541 12305 -63249 -181008 -635099 -1092121 -1037668 -658226 -590457 -909834
29658 -909834 -1062027 -800336 -501743 -436455 -389900 -231257 -224356 -439579 -426619 80971
29648 80971 589588 486125 -59522 -352825 -146034 145601 123957 -137440 -346842 -362575
29638 -362575 -221722 -11339 203594 398757 539647 518090 264552 -71943 -265581 -359044
29628 -359044 -574447 -819473 -686585 -135595 255769 54009 -397565 -513975 -295478 -138598
29618 -138598 -111702 14540 201996 203350 84681 103155 121294 -231347 -788394 -888342 -327606
29607 -327606 330017 594200 611562 623702 452744 -60990 -580934 -706694 -550018 -446361
29597 -446361 -389826 -203472 -19651 -98117 -307261 -251945 132060 499955 586886 440943
29587 440943 196977 -63723 -230384 -218265 -119667 -88488 -113343 -104602 -112424 -219506 -323907
29576 -323907 -298707 -252308 -322691 -342679 -96929 182610 45656 -455563 -771690 -671745
29566 -671745 -546989 -711611 -900345 -780256 -534080 -516364 -642143 -575728 -322688 -170426
29556 -170426 -157664 -66810 86013 5756 -369534 -706097 -751110 -637099 -551082 -398323
29546 -398323 -10562 528409 979936 1211301 1177623 827289 265050 -138655 -107265 118005
29536 118005 18297 -495757 -903332 -742707 -237748 -20787 -324406 -704795 -620361 -95454
29526 -95454 338676 281476 -137813 -518830 -664600 -651736 -542241 -273654 125853 437996
29516 437996 507820 444055 411565 359804 153388 -140497 -344136 -481715 -707044 -921125
29506 -921125 -791984 -259812 275470 437396 287194 68893 -184498 -506037 -682389 -468292
29496 -468292 -24530 223238 153216 40630 55408 13680 -247329 -541509 -577673 -345637
29486 -345637 -74627 78640 151111 252985 425519 570505 495214 122134 -336371 -546371
29476 -546371 -415165 -146539 56365 143144 71427 -209267 -544480 -636254 -470378 -402502
29466 -402502 -616076 -780063 -536322 -82805 102210 -35221 -100841 121220 408659 491911
29456 491911 356389 91781 -239198 -483989 -443428 -158434 91532 182234 275993 443921
29446 443921 466612 221295 -21206 10458 112779 -110822 -606358 -896015 -751357 -480670
29436 -480670 -448907 -612354 -686098 -535324 -211432 212429 620583 802293 665954 440804
29426 440804 420319 525460 389552 -70009 -440051 -334254 79777 303371 138021 -145311
29416 -145311 -211054 11742 400728 785705 956421 765969 368297 169745 370431 684315
29406 684315 694090 374911 55564 -69525 -133707 -277913 -374368 -202237 221683 613022
29396 613022 683705 386688 -46848 -280064 -155182 145780 297044 231339 241331 575546
29386 575546 1025760 1103701 642531 45697 -163967 74459 363815 357260 86089 -211970
29376 -211970 -390488 -426947 -314847 -86195 127033 210903 232206 353073 586413 763454
29366 763454 769067 701645 750990 977699 1242601 1327180 1141830 843434 684659 704558 687941
29355 687941 520578 403339 512720 630709 443706 102457 55697 310999 337084 -131170
29345 -131170 -638649 -651753 -280732 7779 94581 175518 231569 49271 -269954 -309574
29335 -309574 55076 438908 492111 355623 379887 620387 837245 862431 744741 565188
29325 565188 298156 -81310 -463909 -708755 -867387 -1133286 -1448920 -1338278 -434427 855150
29315 855150 1578741 1273398 464604 -43205 -63479 41974 24803 -48276 -95944 -137386
29305 -137386 -148013 -82845 -268 46884 133425 273961 296365 148413 98630 313098 483396
29294 483396 281176 -54234 -71467 144718 139279 -129650 -277081 -196970 -146545 -124242 167912
29283 167912 646608 791392 443010 56864 -23149 45829 111382 280303 461497 344777
29273 344777 100687 356353 1122555 1550366 1240584 942553 1269384 1570579 1041381 254425
29263 254425 381924 1284533 1663844 1044773 353224 313541 426578 34077 -525432 -508480
29253 -508480 71774 549034 560108 354747 308152 535482 921211 1245019 1303144 1072279
29243 1072279 739080 516841 485898 581858 619381 393051 -66658 -410971 -364278 -127789
29233 -127789 -148926 -551015 -1037804 -1278565 -1121262 -550172 219538 696609 549595 51423
29223 51423 -255726 -245520 -162330 -33787 323189 748015 802536 489865 325970 527454
29213 527454 689108 497514 220581 182478 243336 161022 52452 114946 229305 195609
29203 195609 68312 -51294 -247861 -522869 -627943 -479026 -381297 -494919 -460881 9967
29193 9967 542398 621023 420413 515019 941407 1184837 1057353 964702 1184274 1402042
29183 1402042 1189700 577119 -69585 -483031 -613862 -495410 -171633 292804 791053
29174 791053 1136369 1113726 688516 114947 -284743 -406267 -354315 -264961 -238734 -293551
29164 -293551 -252599 123778 711845 958797 520576 -212367 -538613 -267608 185184 397867
29154 397867 299292 18607 -265131 -350251 -192749 -21145 -9070 35532 303123 457013
29144 457013 -25582 -1008830 -1720977 -1721330 -1362710 -1137224 -1042407 -850490 -582278 -369202
29134 -369202 -145198 180963 456357 492513 383694 351934 412150 426373 357777 246149
29124 246149 57591 -215975 -411840 -359732 -104024 201371 491212 706749 688090 402948
29114 402948 151429 247420 562354 677109 459950 199907 147060 208488 178840 23639
29104 23639 -178862 -374095 -490403 -438822 -277058 -207026 -263365 -163353 328016 974889
29094 974889 1242179 899707 281949 -100173 -79299 95849 113665 -58085 -166373 20536
29084 20536 410308 645751 519298 246318 189606 369809 468642 337181 219960 318429
29074 318429 398091 132613 -318120 -455609 -153312 164963 165459 69606 248144 609505
29064 609505 703198 325142 -252678 -633691 -671849 -495933 -327985 -310426 -416243 -511341
29054 -511341 -530057 -521502 -489817 -334183 -57189 116731 7652 -236432 -309642 -132782
29044 -132782 106164 224755 175357 -28337 -305327 -465463 -372541 -128484 69477 191936
29034 191936 315808 407678 423343 524402 865059 1210658 1152862 734158 454645 554833
29024 554833 702117 570387 323816 247641 262428 166427 66540 143154 194512 -110144 -615394
29013 -615394 -789664 -461014 -8408 250126 421835 619731 592916 103986 -580922 -949552
29003 -949552 -893417 -781940 -904683 -1122347 -1132363 -853825 -434362 -35448 246976 343880
28993 343880 248569 71009 -56570 -135471 -281832 -545677 -818701 -930120 -770980 -334844
28983 -334844 256079 733163 811577 444864 -94917 -465257 -543499 -423186 -211262 53209
28973 53209 321648 508623 554792 444718 190661 -109658 -249783 -106009 141150 144559
28963 144559 -183224 -520359 -516189 -219637 -2084 -113276 -453162 -773320 -958068 -1043611
28953 -1043611 -1069559 -1037680 -987074 -975498 -955662 -801405 -539035 -418411 -591742 -815905
28943 -815905 -703591 -252591 123674 136206 -60172 -169632 -107101 93493 438218 810282
28933 810282 891359 532983 32171 -233064 -259365 -228040 -102776 180396 332840 50058
28923 50058 -370100 -331341 121538 285528 -127552 -518544 -303830 261979 592697 646664
28913 646664 766528 947577 850098 438143 94207 68213 192128 200268 48388 -137697
28903 -137697 -215312 -100249 141107 283270 170423 -86126 -264161 -293146 -220754 -48867
28893 -48867 208210 421989 506005 554296 631793 595348 370378 212859 355733 548315
28883 548315 361644 -127293 -408841 -295811 -131667 -161837 -190601 -75304 -107764 -555858
28873 -555858 -1147526 -1401670 -1269872 -1064080 -875667 -482684 156913 692450 795928 550384
28863 550384 278571 156835 156858 242097 412016 570898 552030 356105 229718 367841 613284
28852 613284 633174 389954 224970 378151 617906 541885 129370 -245893 -327539 -259011
28842 -259011 -294065 -430665 -469575 -321172 -106879 12672 7959 -23945 22087 153814 272775
28831 272775 273003 155531 31702 7502 81940 174729 248167 370240 610401 870585 907122
28820 907122 600634 142821 -159276 -219785 -174500 -98368 54290 213725 169883 -94240
28810 -94240 -279339 -159713 90929 163291 40729 -60235 -50419 -30610 -77616 -187426 -361084
28799 -361084 -545302 -574901 -392543 -234336 -351413 -627126 -739251 -631415 -514967 -441896
28789 -441896 -232377 128385 370754 345401 262240 368848 617335 807531 868330 830538
28779 830538 666965 327573 -134793 -566311 -784450 -645627 -178499 322778 494011 249819
28769 249819 -168058 -482170 -567321 -384907 26356 452917 637445 595025 607756 844196
28759 844196 1185276 1464027 1614221 1506068 952120 64581 -654812 -821360 -591676 -387103
28749 -387103 -375061 -438301 -480959 -494485 -418640 -194249 80959 247205 301004 353500 414494
28738 414494 385480 246562 106040 68712 152791 307085 426714 403399 243070 71898
28728 71898 -46399 -204369 -464446 -680991 -645512 -350868 8940 255458 339274 290300
28718 290300 169452 53264 -11634 -33156 -32132 -23464 -45570 -129300 -233827 -311107 -414129
28707 -414129 -592014 -699768 -537316 -213633 -112215 -381806 -704084 -721277 -468225 -195576
28697 -195576 14488 217426 371294 406447 419923 540290 666180 578219 274128 -16489
28687 -16489 -125659 -72260 76982 290794 519491 700687 817504 850676 711872 338066
28677 338066 -169886 -584324 -705372 -466081 13668 449994 616525 594968 651162 831386
28667 831386 898088 716215 429525 167393 -92419 -232304 26654 596001 887810 602888
28657 602888 284550 591092 1306824 1656148 1410924 1043707 844269 565036 65970 -298426
28647 -298426 -210575 119349 269266 119728 -148813 -326593 -295489 -102066 5761 -152410
28637 -152410 -363960 -266401 78698 238689 78860 -78622 -84194 -232261 -645945 -897571
28627 -897571 -654797 -293423 -342917 -594255 -357399 466015 1136828 1022478 358058 -134960
28617 -134960 -84602 318621 741631 1037200 1171018 1080209 752101 339723 28047 -203853
28607 -203853 -518472 -883628 -1008052 -741683 -347690 -176421 -231384 -297841 -335642 -421496
28597 -421496 -428950 -173793 155956 151679 -178475 -356100 -149939 68191 -99162 -499677
28587 -499677 -700520 -550311 -196524 227037 637504 877784 825182 576395 376848 414360
28577 414360 704681 1029508 999272 437466 -269799 -516278 -218926 130444 204507 171715
28567 171715 161574 -43905 -483820 -716029 -471712 -152817 -179305 -262960 72064 591628
28557 591628 665795 270292 -37076 -42706 -64359 -209030 -171990 72407 61568 -373782 -680572
28546 -680572 -337507 355362 669327 408316 89288 219113 664127 806399 257021 -644137
$$ [...]
##END NTUPLES=NMR SPECTRUM
##END=
