##TITLE=31Pdec_LY-TMF-15.40.3
 D2O, 24 sc
 6.3.2020
##JCAMPDX= 6.0         $$ Bruker NMR JCAMP-DX V2.0
##DATA TYPE= NMR SPECTRUM
##DATA CLASS= NTUPLES
##ORIGIN= UXNMR, Bruker Analytische Messtechnik GmbH
##OWNER= root
$$ XWIN-NMR		Version 3.5
$$ Fri Mar  6 17:31:49 2020 Russian Standard Time (UT+4h)  she@DPX200
##.OBSERVE FREQUENCY= 81.013821
##.OBSERVE NUCLEUS= ^31P
##.ACQUISITION MODE= SIMULTANEOUS
##.ACQUISITION SCHEME= undefined
##.AVERAGES= 24
##.DIGITISER RES= 17
##SPECTROMETER/DATA SYSTEM= spect
##.PULSE SEQUENCE= zgpg30
##.SOLVENT NAME= CDCl3
##.SHIFT REFERENCE= (INTERNAL, CDCl3, 0, 182.463)
##AUDIT TRAIL= $$ (NUMBER, WHEN, WHO, WHERE, WHAT)
$$ ##TITLE= Audit trail, XWIN-NMR		Version 3.5
$$ ##JCAMPDX= 5.01
$$ ##ORIGIN= Bruker BioSpin GmbH
$$ ##OWNER= she
$$ F:/spectra/data/she/nmr/P31/1/pdata/1/auditp.txt
$$ ##AUDIT TRAIL=  $$ (NUMBER, WHEN, WHO, WHERE, WHAT)
(   1,<2020-03-06 17:30:17.90 +0400>,<she>,<DPX200>,
      <created by zg, POWCHK disabled, PULCHK disabled
       configuration hash MD5:
       00 E9 B6 7A A2 85 ED C7 34 08 36 98 17 FE 4E 26
       data hash MD5: 32K
       E0 60 B5 B6 5A 17 27 C3 66 03 74 E1 A0 46 CF 7C>)
(   2,<2020-03-06 17:30:23.00 +0400>,<she>,<DPX200>,
      <Start of raw data processing
       efp BC_mod = 2 LB = 1 FT_mod = 6 PKNL = 1 PHC0 = -1353.629 PHC1 = 150.6017 SI = 64K 
       data hash MD5: 64K
       E6 90 D8 32 5F 9C DB 32 4E 48 A5 0B EE BA 54 8E>)
(   3,<2020-03-06 17:30:38.14 +0400>,<she>,<DPX200>,
      <pk PHC0 = -1.594247 PHC1 = 0 
       data hash MD5: 64K
       9B 18 38 6A 92 02 CA 10 27 16 C8 E6 D9 FD A4 C6>)
(   4,<2020-03-06 17:30:50.87 +0400>,<she>,<DPX200>,
      <pk PHC0 = -4.200001 PHC1 = 0 
       data hash MD5: 64K
       33 AC D2 19 DC AD 20 7C 5F AD E0 E0 B5 23 E5 92>)
(   5,<2020-03-06 17:31:07.56 +0400>,<she>,<DPX200>,
      <pk PHC0 = 6 PHC1 = 0 
       data hash MD5: 64K
       31 51 56 10 F1 A8 0A F7 9A E4 B5 88 C8 6C DA AB>)
$$ ##END=
$$ 
$$ hash MD5
$$ 9B D3 2D 31 97 DA F3 BF 63 E1 78 83 26 13 06 DF
##$RELAX= 
##$RELAX= 
##$RELAX= 
##$RELAX= 
##$RELAX= 
##$RELAX= 
##$RELAX= 
##$RELAX= 
$$ Bruker specific parameters
$$ --------------------------
##$DU= <F:/spectra>
##$EXPNO= 1
##$NAME= <P31>
##$PROCNO= 1
##$TYPE= <nmr>
##$USER= <she>
##$AMP= (0..31)
100 100 100 100 100 100 100 100 100 100 100 100 100 100 100 100 100 100 
100 100 100 100 100 100 100 100 100 100 100 100 100 100 
##$AQSEQ= 0
##$AQ_mod= 1
##$AUNM= <au_zg>
##$AUTOPOS= <>
##$BF1= 81.014009
##$BF2= 200.13
##$BF3= 200.13
##$BF4= 200.13
##$BF5= 200.13
##$BF6= 200.13
##$BF7= 200.13
##$BF8= 200.13
##$BYTORDA= 1
##$CFDGTYP= 0
##$CFRGTYP= 5
##$CHEMSTR= <none>
##$CNST= (0..31)
1 1 145 1 1 1 1 1 1 1 1 1 1 1 1 1 1 1 1 1 1 1 1 1 1 1 1 1 1 1 1 1 
##$CPDPRG= <waltz16>
##$CPDPRG1= <>
##$CPDPRG2= <waltz16>
##$CPDPRG3= <>
##$CPDPRG4= <mlev>
##$CPDPRG5= <mlev>
##$CPDPRG6= <mlev>
##$CPDPRG7= <mlev>
##$CPDPRG8= <mlev>
##$CPDPRGB= <>
##$CPDPRGT= <>
##$D= (0..31)
$$ [...]
##$SUBNAM2= <"">
##$SUBNAM3= <"">
##$SUBNAM4= <"">
##$SUBNAM5= <"">
##$SUBNAM6= <"">
##$SUBNAM7= <"">
##$SUBNAM8= <"">
##$SUBNAM9= <"">
##$SW= 369.568048894756
##$SWIBOX= (0..15)
0 1 3 0 0 0 0 0 0 0 0 0 0 0 0 0 
##$SW_h= 29940.119760479
##$TD= 32768
##$TD0= 1
##$TE= 0
##$TE2= 300
##$TE3= 300
##$TEG= 300
##$TL= (0..7)
0 120 53 12 22 120 120 120 
##$TP= (0..7)
150 150 150 150 150 150 150 150 
##$TP07= 0
##$TPNAME0= <>
##$TPNAME1= <>
##$TPNAME2= <>
##$TPNAME3= <>
##$TPNAME4= <>
##$TPNAME5= <>
##$TPNAME6= <>
##$TPNAME7= <>
##$TPOAL= (0..7)
0.5 0.5 0.5 0.5 0.5 0.5 0.5 0.5 
##$TPOFFS= (0..7)
0 0 0 0 0 0 0 0 
##$TUNHIN= 0
##$TUNHOUT= 0
##$TUNXOUT= 0
##$USERA1= <user>
##$USERA2= <user>
##$USERA3= <user>
##$USERA4= <user>
##$USERA5= <user>
##$V9= 5
##$VALIST= <valist>
##$VCLIST= <CCCCCCCCCCCCCCC>
##$VD= 0
##$VDLIST= <DDDDDDDDDDDDDDD>
##$VPLIST= <PPPPPPPPPPPPPPP>
##$VTLIST= <TTTTTTTTTTTTTTT>
##$WBST= 1024
##$WBSW= 4
##$XGAIN= (0..3)
0 0 0 0 
##$XL= 0
##$YL= 0
##$YMAX_a= 24835
##$YMIN_a= -26614
##$ZGOPTNS= <>
##$ZL1= 120
##$ZL2= 120
##$ZL3= 120
##$ZL4= 120
##$ABSF1= 0
##$ABSF2= 0
##$ABSG= 0
##$ABSL= 0
##$ALPHA= 0
##$AQORDER= 0
##$ASSFAC= 0
##$ASSFACI= 0
##$ASSFACX= 0
##$ASSWID= 0
##$AUNMP= <proc_1d>
##$AZFE= 0.1
##$AZFW= 0.5
##$BCFW= 0
##$BC_mod= 2
##$BYTORDP= 0
##$COROFFS= 0
##$CY= -3
##$DATMOD= 1
##$DC= 0
##$DFILT= <>
##$DTYPP= 0
##$F1P= 0
##$F2P= 0
##$FCOR= 1
##$FTSIZE= 65536
##$FT_mod= 6
##$GAMMA= 0
##$GB= 0
##$INTBC= 1
##$INTSCL= 5.30512e-09
##$ISEN= 30
##$LB= 1
##$LEV0= 0
##$LPBIN= 0
##$MAXI= 10000
##$MC2= 0
##$MEAN= 0
##$ME_mod= 0
##$MI= 50
##$NCOEF= 0
##$NC_proc= -3
##$NLEV= 6
##$NOISF1= 182.463
##$NOISF2= 159.3651
##$NSP= 0
##$NTH_PI= 0
##$NZP= 0
##$OFFSET= 182.463
##$PC= 4
##$PHC0= -1353.423
##$PHC1= 150.6017
##$PH_mod= 1
##$PKNL= yes
##$PPARMOD= 0
##$PSCAL= 0
##$PSIGN= 0
##$REVERSE= no
##$SF= 81.0140089999434
##$SI= 65536
##$SIGF1= 159.3651
##$SIGF2= -187.1042
##$SINO= 113.3802
##$SIOLD= 16384
##$SREGLST= <1H.CDCl3>
##$SSB= 0
##$STSI= 65536
##$STSR= 0
##$SW_p= 29940.119760479
##$SYMM= 0
##$S_DEV= 0
##$TDeff= 32768
##$TDoff= 0
##$TI= <>
##$TILT= no
##$TM1= 0
##$TM2= 0
##$TOPLEV= 0
##$USERP1= <user>
##$USERP2= <user>
##$USERP3= <user>
##$USERP4= <user>
##$USERP5= <user>
##$WDW= 1
##$XDIM= 65536
##$YMAX_p= 312125444
##$YMIN_p= -1928848
$$ End of Bruker specific parameters
$$ ---------------------------------
##NTUPLES= NMR SPECTRUM
##VAR_NAME=  FREQUENCY,     SPECTRUM/REAL,   SPECTRUM/IMAG
##SYMBOL=    X,             R,               I
##VAR_TYPE=  INDEPENDENT,   DEPENDENT,       DEPENDENT
##VAR_FORM=  AFFN,          ASDF,            ASDF
##VAR_DIM=   65536,         65536,           65536
##UNITS=     HZ,            ARBITRARY UNITS, ARBITRARY UNITS
##FACTOR=    0.456856943014862, 1,           1
##FIRST=     14782.0589164792, 0,            0
##LAST=      -15158.0608439998, 0,           0
##MIN=       -15158.0608439998, -1928848,    0
##MAX=       14782.0589164792, 312125444,    0
$$ Real data points
##PAGE= N=1
##DATA TABLE= (X++(R..R)), XYDATA
$$ [...]
39473 457115 650690 771906 663622 416848 243945 169773 60789 -98444 -175279 -121038
39463 -121038 -38023 54 23587 32572 -50575 -225745 -341203 -269948 -84863 30107 3083
39452 3083 -68177 -65324 16066 97259 125647 105003 43695 -53346 -126193 -78985 77079 174465
39440 174465 93116 -38253 545 170669 173768 -125068 -453607 -455989 -133784 210256 384684
39429 384684 456603 503772 447241 227333 -6768 -35796 142172 281462 166564 -141879
39419 -141879 -372608 -330254 -80643 150763 221976 172455 102410 37011 -52307 -153903 -215649
39408 -215649 -224666 -229395 -270792 -320640 -301592 -167133 32337 171125 162055 45808 -64751
39397 -64751 -115139 -126057 -89366 54597 291894 469931 434505 195000 -97595 -293990
39387 -293990 -322758 -189170 18244 155062 142043 52969 17680 49181 38675 -72768 -191088
39376 -191088 -181247 -49667 41568 -34024 -195707 -245177 -142734 -93624 -266507 -509289 -507549
39365 -507549 -202183 136819 279655 282993 293354 307542 269329 235477 264395 261900 127720
39354 127720 -38237 -73730 -28170 -89139 -269112 -374197 -291859 -128770 -40846 -81401 -235756
39343 -235756 -457035 -638020 -672281 -567072 -404402 -218897 -30101 63030 -11402 -137581
39333 -137581 -147041 -85821 -137035 -295729 -364213 -285458 -219679 -238959 -216171 -101004 -26176
39322 -26176 -16624 115248 403449 542226 318951 -3496 -37491 173427 275833 163683
39312 163683 65016 115072 185613 173589 159418 200240 221114 207150 271765 414418 425774
39301 425774 199000 -34682 18765 310743 529234 539240 524907 649854 772235 645737
39291 645737 308530 83448 168752 388003 446720 320983 228104 264469 281477 167109
39281 167109 56766 130072 317232 368215 177332 -84336 -161201 28589 314947 423355
39271 423355 242657 -35453 -120932 13746 103720 -26139 -213523 -214433 -55878 45279
39261 45279 11409 -48050 -60586 -68109 -105234 -173256 -314585 -542756 -715641 -656712 -403748
39250 -403748 -170145 -63742 -21522 -14456 -98959 -229048 -242122 -114446 -25726 -62010 -53484
39239 -53484 141095 360753 349714 128516 -49238 -60238 -30041 -79065 -129459 -44600 146458
39228 146458 268461 215286 60982 -65524 -149396 -257333 -364410 -343512 -182211 -77252
39218 -77252 -177820 -328565 -256757 22748 206870 134661 -3905 13773 112490 69911 -130118
39207 -130118 -281971 -248800 -110140 -16245 -9327 -18233 30903 125048 171542 100078 -49909
39196 -49909 -180997 -262947 -336540 -399682 -391886 -315284 -261461 -268306 -253071 -152969 -36792
39185 -36792 2374 -15534 -8891 46674 125308 204906 238574 151862 -40119 -187713 -183586 -118184
39173 -118184 -138347 -205766 -147287 58277 192649 57550 -267161 -499237 -458738 -245378
39163 -245378 -110018 -182808 -362459 -471371 -456883 -387457 -312048 -231036 -179414 -201779 -228060
39152 -228060 -113521 146025 361787 376193 227428 36021 -139840 -260115 -255723 -133317
39142 -133317 -5707 85176 237458 460834 543281 330005 -2316 -173201 -195957 -293487
39132 -293487 -481187 -525535 -335824 -119900 -63414 -83402 -22266 94244 132439 56589 -69868
39121 -69868 -196307 -284567 -272387 -149408 -26240 -34511 -175785 -326888 -374107 -302562 -176053
39110 -176053 -58455 54374 215169 408263 492317 341306 21825 -271965 -453753 -594971
39100 -594971 -728150 -750046 -593184 -371295 -249248 -248119 -280945 -317921 -399024 -506821 -536330
39089 -536330 -411518 -170721 75408 225732 225332 75432 -156077 -350116 -402222 -302635
39079 -302635 -151338 -68126 -75891 -96914 -73555 -47261 -86890 -187811 -293128 -369644 -398102
39068 -398102 -333467 -165140 5675 44868 -54512 -164983 -174123 -74026 76454 189559
39058 189559 166425 -14482 -222981 -296388 -243343 -221826 -302740 -381905 -366426 -319528 -341667
39047 -341667 -405728 -406629 -322630 -247892 -282983 -429214 -571804 -568769 -401396 -218479 -159825
39036 -159825 -167943 -91709 43165 34555 -187503 -421304 -450416 -300725 -135688 -18752 89724
39025 89724 188311 226870 201328 150846 91142 23712 -33284 -83459 -161501 -250309 -268137 -196144
39013 -196144 -121346 -85773 -13042 123982 199526 130244 43380 84893 176575 160015 82467
39002 82467 105930 196704 173486 58035 96013 358157 572484 484276 195951 7714 60387
38991 60387 268310 486168 600607 539321 325880 91396 -50252 -97061 -87926 -28442 52221
38980 52221 80930 64508 121541 280220 362084 220404 -1577 -43397 89564 124529 -86835
38969 -86835 -371087 -487502 -418950 -320842 -298718 -331174 -338906 -262844 -135661 -103657 -275859
38958 -275859 -518595 -548554 -315962 -134522 -277795 -584842 -680698 -497486 -310118 -270773
38948 -270773 -209401 5578 181012 75590 -211480 -359046 -245998 -45427 59840 54881
38938 54881 -11786 -119799 -214285 -195351 -38970 159217 298926 355249 328395 211600 41323
38927 41323 -107561 -210335 -302863 -386464 -405895 -341899 -246302 -177484 -183687 -326378 -586073
38916 -586073 -758213 -630293 -304441 -144447 -312590 -557074 -590786 -480773 -465376 -554075
38906 -554075 -567718 -478388 -429020 -438245 -354331 -141720 18717 -11051 -155850 -288883 -384460
38895 -384460 -425803 -344469 -177206 -122859 -280595 -450989 -384252 -154488 -82300 -290553
38885 -290553 -533385 -532804 -333478 -206025 -281454 -415193 -401153 -206247 41442 210112
38875 210112 243631 140992 -51658 -237044 -332799 -352263 -361659 -363851 -303480 -181332 -53547
38864 -53547 93666 321495 537510 493102 114679 -309641 -455846 -366149 -315293 -364513
38854 -364513 -320332 -127374 -12752 -151616 -422370 -614064 -685299 -689599 -618328 -466292
38844 -466292 -313520 -206434 -97366 -26376 -173223 -536276 -754110 -537696 -158035 -157111
38834 -157111 -597612 -955309 -825540 -401547 -104588 -44023 -74640 -146232 -289607 -385751
38824 -385751 -264301 -4670 128993 66178 475 41757 41663 -131899 -354043 -422602 -325825
38813 -325825 -180562 -32602 113200 168089 60876 -89300 -93150 37310 119772 93106
38803 93106 76777 118116 101867 -7916 -50517 64253 151365 4722 -270788 -400487 -342490
38792 -342490 -314760 -425139 -504455 -379899 -135924 9545 -22622 -129638 -182035 -128628
38782 -128628 5152 142928 210482 222824 284875 445073 581194 511244 218635 -101757
38772 -101757 -246988 -207464 -128732 -109117 -103373 -36730 57891 81013 6802 -104820 -225908
38761 -225908 -381002 -521795 -506373 -294985 -73884 -60221 -233383 -382132 -383726 -302139
38751 -302139 -222639 -139734 -43328 15955 14678 19329 96300 217970 298487 269417 108927
38740 108927 -121526 -257581 -166111 52678 119474 -81471 -322316 -314575 -91344 43625
38730 43625 -81104 -307985 -384039 -262788 -103108 -47731 -89181 -127928 -91059 14817 124460
38719 124460 168071 126251 49080 11346 37681 80626 78478 13982 -96262 -231106 -344464
38708 -344464 -362075 -277801 -222374 -319585 -469800 -416645 -80286 312833 512716 518563 461896
38697 461896 375359 253173 209919 345119 518835 505445 340668 268634 352974 412561 373133
38686 373133 382191 476043 434079 145984 -130030 -109870 103712 198065 100463 -4276 -11018
38675 -11018 10752 17600 46250 66771 -10978 -166139 -278620 -326075 -396280 -481196 -440870
38664 -440870 -236962 -46825 -46722 -180617 -238119 -108504 110583 228220 143979 -64263
38654 -64263 -218157 -211755 -95835 12216 47950 213 -127804 -282466 -348387 -268550 -136409
38643 -136409 -84970 -129825 -204954 -287194 -371542 -386258 -279004 -153357 -164263 -284326 -324024
38632 -324024 -193701 -704 133194 203749 235987 207256 123365 58347 54523 74998 99696
38621 99696 165496 263440 309784 284596 284578 348405 337278 119840 -185009 -295455 -104449
38610 -104449 176493 253518 73033 -140858 -153405 29539 210908 267309 268986 300355 275867
38599 275867 68291 -231694 -361392 -227052 -44666 -49470 -178480 -169383 77781 367547
38589 367547 444507 266833 7781 -154851 -191844 -181825 -182221 -181625 -155414 -112382 -77040 -67442
38577 -67442 -94393 -130573 -83454 113060 358595 447521 324505 160496 93551 35634 -123487
38566 -123487 -259708 -176877 57559 188583 159472 156373 240072 218340 -1389 -191177 -123151
38555 -123151 81181 142358 29381 -64990 -76906 -137549 -281747 -339932 -215536 -79769
38545 -79769 -136065 -301232 -301554 -61544 176773 176093 6220 -88363 -33546 16883 -57672 -193277
38533 -193277 -281156 -301822 -258408 -133408 -4794 -41802 -245925 -351503 -172871 78066
38523 78066 48503 -271098 -567637 -652337 -616501 -557989 -442167 -282830 -197077 -196337 -146388
38512 -146388 -10340 84969 88002 90898 88870 -58731 -317069 -410802 -234280 -54190 -96698
38501 -96698 -190166 -74920 151854 196837 18529 -177314 -273214 -293499 -222655 -49450 81417
38490 81417 30256 -87357 -71219 12227 -65205 -287104 -401872 -332874 -266703 -295200 -272847
38479 -272847 -112348 50038 89271 54292 -5013 -139392 -308487 -313543 -77796 187551
38469 187551 250602 133733 -19383 -180026 -357803 -434592 -298773 -75055 -11490 -149647
38459 -149647 -274211 -201928 14308 195494 239890 170626 57028 -43665 -82938 -17363
38449 -17363 143757 286263 252364 15986 -242935 -323404 -240156 -177901 -221674 -258649 -176964
38438 -176964 -39070 13196 -58457 -176049 -264484 -321926 -393491 -500339 -577907 -506230 -256421
38427 -256421 23105 148603 98933 -25032 -182656 -371762 -456198 -247121 180294 466056
38417 466056 381144 91397 -119837 -214325 -314787 -419341 -423555 -331145 -220320 -63966
38407 -63966 191978 414411 395775 185856 61005 112954 118139 -82127 -314646 -355616 -273745
38396 -273745 -266142 -297687 -174816 84125 231050 156041 18409 -51949 -135916 -286511 -343624
38385 -343624 -189759 -17775 -90135 -326752 -401967 -223665 -44368 -61505 -169115 -199928
38375 -199928 -174686 -165649 -117983 3856 50579 -113939 -350480 -398001 -234375 -84301 -104141
38364 -104141 -255299 -466303 -700417 -835007 -692104 -290623 79942 153243 -24553 -177117
38354 -177117 -111475 107042 247459 139358 -165652 -442243 -513702 -401512 -239511 -122252
38344 -122252 -102274 -227578 -442632 -527321 -308616 90041 364602 375801 235458 94698
38334 94698 28675 91518 259475 325142 99808 -245338 -310409 -24788 198798 16239
38324 16239 -388336 -594777 -498622 -335485 -292474 -342007 -396078 -405930 -323196 -133185 64948
38313 64948 126819 13354 -190965 -369354 -428456 -339682 -194435 -138108 -186759 -205812 -123517
38302 -123517 -29864 6949 52118 125727 104704 -39158 -94974 83690 303269 310175 197464
38291 197464 231397 378443 355681 128263 -4137 117200 272628 229594 74648 15182
38281 15182 62495 95248 84141 73223 42459 -46679 -133649 -124283 -35190 31082 22734 -30016
38269 -30016 -87535 -136637 -181294 -247800 -370022 -531224 -651472 -661249 -560272 -397496 -234293
38258 -234293 -120777 -50607 45171 181233 222486 32574 -276885 -399937 -201069 109212
38248 109212 252050 210118 161079 185762 204840 162799 107725 69022 -5019 -126116 -183001
38237 -183001 -74071 118025 180082 13166 -241792 -368310 -324147 -255026 -264354 -268462 -150161
38226 -150161 11010 -11743 -291694 -597203 -618981 -317340 25713 106904 -97416 -359710
38216 -359710 -487117 -499970 -509593 -513731 -417874 -227942 -89462 -93508 -143527 -85154 92585
38205 92585 249128 246310 71540 -150514 -252089 -192776 -141684 -287656 -555370 -658255
38195 -658255 -482681 -239449 -132287 -75612 83773 252944 256062 182326 269631 493631
38185 493631 582100 448648 307907 295500 271002 125754 15623 93700 216933 147233
38175 147233 -80901 -214599 -141208 853 50318 180 -69078 -112633 -136133 -148469 -133606
38164 -133606 -62375 59483 161948 171266 99870 23433 -26296 -76198 -126207 -138598 -116799
38153 -116799 -101391 -86961 -48935 -43825 -140759 -250738 -206722 -54396 -50725 -270825 -433289
38142 -433289 -294375 -32551 5505 -170155 -208398 54426 358231 398733 225848 108565
38132 108565 137599 155134 47058 -80717 -83368 -1631 26769 15156 110471 310537 394261
38121 394261 244561 65102 86820 198919 136272 -42957 2067 345342 624095 556829
38111 556829 330390 252647 267791 110791 -206320 -382088 -262721 -21867 117877 127849
38101 127849 90724 49385 13434 6410 37405 74714 74271 14156 -73913 -86843 62989 293477
38089 293477 382142 235049 28646 -26742 34188 31475 -68116 -137735 -129837 -148800 -272888
38078 -272888 -439765 -527227 -456676 -237351 -90 65056 -75252 -201541 -105146 108414
38068 108414 155026 -24853 -197082 -168033 11464 201493 328476 324979 112604 -244784
38058 -244784 -519340 -565280 -475790 -403207 -346049 -233042 -112928 -106121 -206180 -262536 -169347
38047 -169347 11330 127117 85624 -75846 -232909 -282187 -231806 -191347 -262494 -431779
38037 -431779 -566939 -531111 -325529 -108282 -27026 -48173 -32619 27195 -17880 -214818 -377237
38026 -377237 -320761 -99643 116926 268509 345453 258171 -5145 -203754 -108354 117830
38016 117830 106569 -156994 -297164 -131407 47544 -72986 -378072 -544540 -489680 -376151
38006 -376151 -330149 -371753 -502956 -659274 -667716 -440725 -136205 34709 65160 56046 -16549
37995 -16549 -217084 -417177 -404707 -220617 -152549 -346927 -616943 -700490 -552884 -307756
37985 -307756 -75942 118817 275390 373284 385913 314630 216297 166799 163241 115110 -7403
37974 -7403 -84927 -6991 141068 177562 74265 -35025 -77226 -110797 -159762 -147471 -61408
37963 -61408 -36669 -169167 -343262 -358584 -178612 38874 131154 76182 -37579 -124772 -169975
37952 -169975 -197830 -194686 -103906 63246 167373 88106 -94754 -195174 -199698 -289971 -522354
37941 -522354 -656904 -458949 -62351 156840 34219 -229601 -370825 -349527 -293182 -303793
37931 -303793 -399476 -533971 -587290 -429525 -88613 215411 290801 163895 -26810 -224856
37921 -224856 -416907 -496367 -360927 -116432 20747 38249 131803 342126 425583 226225
37911 226225 -33871 -49976 125855 193502 73137 -13736 63949 143083 41446 -177742
37901 -177742 -342494 -410545 -428746 -378216 -224514 -55711 -10136 -76641 -91247 52856 282494
37890 282494 449156 482673 417963 337014 327888 447690 648175 745784 562443 162402 -117279
37879 -117279 6940 415441 693783 616859 366671 194597 67410 -161834 -392032 -373681
37869 -373681 -124159 53221 -121 -125213 -181374 -269405 -458856 -543806 -314776 78122
37859 78122 283938 199076 41877 22105 133509 262392 321325 253581 52167 -181444
37849 -181444 -295762 -244825 -131588 -89797 -158893 -251626 -215931 11405 273173 308271 73098
37838 73098 -160964 -139667 54262 162897 137539 157801 301850 414032 343762 149909
37828 149909 -3799 -45467 -23668 -14068 -45114 -79092 -62730 -26099 -82538 -264529 -426153
37817 -426153 -415063 -286983 -222183 -268685 -305213 -232121 -62680 145265 301515 266466 6938
37806 6938 -243135 -182754 167448 467552 480978 291340 60134 -175942 -350874 -269686
37796 -269686 120813 527882 610695 389450 158411 77454 70227 79216 175192 372688 533900
37785 533900 540344 428275 277778 81497 -179344 -405749 -444811 -276505 -58180 41525
37775 41525 15356 -2795 87296 237124 325659 317636 296547 341599 425057 458102 404467 316687
37763 316687 273554 300429 344500 327412 233648 132367 86905 67479 -676 -127341 -261377
37752 -261377 -386883 -527055 -646426 -643580 -474112 -207132 63300 280457 382254 316703
37742 316703 159404 94289 176512 217922 41096 -233402 -323855 -180903 -55851 -137317
37732 -137317 -290119 -257495 -5897 260040 361988 297814 156314 17264 -51140 -24957
37722 -24957 -5156 -146625 -421397 -563641 -384881 -60549 80209 10435 16943 216316
37712 216316 325334 84411 -300629 -404443 -166222 62086 46360 -34086 83835 345767
37702 345767 470765 320441 25545 -198777 -248334 -169334 -89691 -104854 -187248 -219945 -133228
37691 -133228 26123 165489 232600 222233 159041 94733 73956 93065 133130 211041 328202
37680 328202 397037 320325 137658 -7009 -37670 14778 120800 264386 362043 332345 254341
37669 254341 279768 362686 277449 -30885 -318754 -366567 -239303 -108449 -6455 88441
37659 88441 100780 -16035 -133134 -115848 -37031 -43559 -109351 -105214 -28652 21820 29148 34700
37647 34700 6089 -85099 -124066 2865 172921 149239 -77950 -269978 -258317 -108709 27139
37636 27139 53423 -67801 -285387 -431913 -386632 -253351 -222102 -291814 -311121 -251148 -222167
37625 -222167 -243759 -230746 -197206 -224331 -223962 -17663 309722 438035 277935 103715 97728
37614 97728 83773 -91773 -224651 -81484 177305 232393 102186 62725 164343 181596
37604 181596 40849 -31361 130821 378107 469172 366902 198358 59044 -23426 -23448 65988
37593 65988 181863 231283 177590 60433 -48149 -88750 -37793 89736 250080 373521
37583 373521 377452 231884 22701 -111557 -129157 -108515 -106040 -87110 -43007 -60398 -180197
37572 -180197 -281278 -222214 -34015 140374 234903 269025 236741 138244 74157 132828 197431
37561 197431 53133 -284676 -533386 -505380 -342712 -284810 -344704 -362683 -282877 -196263 -134522
37550 -134522 2957 265913 521605 595797 484758 340128 266971 224003 136628 24877
37540 24877 -41641 -67850 -129233 -247551 -344066 -338922 -245062 -142335 -105039 -171004 -324890
37529 -324890 -483184 -548965 -513340 -453979 -414498 -358451 -272694 -217022 -203085 -124913 77474
37518 77474 258494 212132 -47920 -284122 -313282 -177075 -30677 18777 -66107 -273890
37508 -273890 -512607 -625638 -517717 -255524 -16632 51659 -66983 -256517 -367112 -351587
37498 -351587 -298749 -306598 -362128 -397585 -408445 -420170 -380417 -216768 -2229 72636 -66858
37487 -66858 -282291 -400936 -390033 -307746 -192813 -80918 -43160 -116265 -243625 -350361
37477 -350361 -425809 -477434 -466832 -361231 -202351 -67858 -10133 -67767 -253577 -468556
37467 -468556 -522079 -339314 -80857 49374 54808 89043 203378 294542 286669 225562 179080
37456 179080 160438 164688 172728 110400 -75458 -281098 -319862 -175403 -42685 -42415 -33534 163271
37444 163271 455633 557559 353749 45526 -90255 6923 161033 164882 -26369 -266117
37434 -266117 -352877 -210860 56589 288343 408230 435502 412246 376649 370512 404076 427306
37423 427306 392461 328109 295660 297916 299207 310282 366709 439444 467884 475878 532669 582026
37411 582026 459216 150175 -106284 -100686 64381 129575 55177 53818 235714 404434 303480
37400 303480 -43294 -355403 -418245 -283976 -154642 -145986 -204734 -223952 -186459 -168804 -221728
37389 -221728 -294881 -304748 -241867 -167137 -124203 -112112 -140141 -245055 -426455 -606192 -690419
37378 -690419 -665508 -614920 -632714 -708200 -702829 -489061 -137387 94802 27066 -230791 -406393
37367 -406393 -372129 -229841 -115591 -49290 6353 67457 158503 307003 448354 443882 267329
37356 267329 70650 -19555 -63490 -160140 -249868 -217160 -110348 -77883 -121660 -103211 1050
37345 1050 43991 -42152 -117310 -48579 89711 145544 102709 32073 -76996 -268779 -442876
37334 -442876 -404836 -134604 136119 195337 104801 85046 208512 331450 321551 216345 98588
37323 98588 -59752 -295075 -463922 -348009 21656 320333 307017 107681 -9072 -11061
37313 -11061 -62620 -183020 -193167 -26176 139947 153280 104365 143817 235693 252636 210837
37302 210837 231823 318800 337576 218729 50661 -40120 -8683 103844 200229 180148 56040
37291 56040 -8721 113095 307671 332854 134751 -94769 -202020 -247808 -321757 -338026 -166524
37280 -166524 117316 279969 220269 89178 96679 282603 506674 607178 538673 384677
37270 384677 259158 194260 134504 41619 -41020 -62283 -52805 -73603 -100935 -46465 97506
37259 97506 208252 167773 3206 -150396 -204156 -192412 -199606 -242311 -244169 -127649 83168
37248 83168 266570 304863 163970 -110713 -419230 -614411 -565697 -290712 16682 170855
37238 170855 185816 201820 248668 206672 24223 -158814 -184613 -78061 23807 68205 91284
37227 91284 73191 -59826 -267422 -362382 -223772 28928 154184 52704 -142648 -225399
37217 -225399 -120140 63844 151258 73885 -61791 -93207 5328 83200 -5795 -218952 -370394
37206 -370394 -343177 -197868 -69631 -20288 -19132 -18319 1203 31563 35682 -45661 -235599 -464993
37194 -464993 -610877 -595599 -419591 -114896 262382 581365 671408 483132 166138 -92738
37184 -92738 -274562 -481236 -708020 -792757 -636219 -370038 -221268 -260931 -361583 -371902
37174 -371902 -259056 -90206 51938 109974 53365 -110937 -313221 -429247 -370583 -198300
37164 -198300 -90181 -126064 -164139 -49681 100980 18933 -293817 -495513 -380264 -194589
37154 -194589 -262769 -481151 -491485 -261010 -127820 -245196 -342318 -181348 51621 39108
37144 39108 -198998 -386237 -403144 -357238 -309217 -190522 -2111 122606 107934 32234 -18152
37133 -18152 -62060 -136503 -205530 -215481 -160036 -43993 141851 362868 525149 569078 530116
37122 530116 469249 393841 288984 182148 126751 142546 201145 244978 200155 15604 -260168
37111 -260168 -464180 -443668 -215586 29033 103281 -3030 -139087 -160481 -53582 89057
37101 89057 161561 103250 -64368 -210391 -172192 51659 232877 152274 -114106 -280936
37091 -280936 -228619 -135414 -189213 -333759 -402433 -360178 -277210 -181509 -98340 -141468 -373515
37080 -373515 -623925 -643817 -440045 -274463 -308486 -418939 -414444 -276525 -109321 18930
37070 18930 88680 78753 517 -76866 -113656 -165936 -294872 -440692 -454370 -260566 35995
37059 35995 217983 151527 -66122 -191839 -107196 49287 82001 -2948 -51761 -17246 -1372
37048 -1372 -56665 -111021 -113978 -101352 -76128 16539 140344 156983 42430 -48288 -30674 -31998
37036 -31998 -141584 -190985 3143 288627 323744 49907 -218375 -214726 -28214 90908
37026 90908 58188 -42316 -161655 -321284 -472261 -474288 -271760 -5466 128251 95366
37016 95366 26293 13444 4924 -64523 -141029 -146687 -131260 -189929 -266764 -211263 -45059 15951
37004 15951 -114188 -219115 -73642 217251 348763 216306 4757 -100896 -116174 -133053
36994 -133053 -142822 -70982 79046 191997 144083 -70577 -301946 -354983 -182854 50851
36984 50851 156480 140693 168510 311258 429713 351629 99295 -126774 -170617 -68147
36974 -68147 40771 99708 176486 314152 416408 355028 158587 -4027 -36810 -15202 -36854
36963 -36854 -72213 -33751 79139 186421 231279 204406 104120 -56088 -228068 -374454
36953 -374454 -501818 -602679 -619226 -528980 -410328 -343757 -300589 -223090 -166895 -243156 -430754
36942 -430754 -564414 -534927 -416678 -366251 -449331 -582165 -602719 -409951 -85178 143575
36932 143575 124685 -45810 -149435 -119406 -85107 -140069 -196716 -142485 -40727 -54059 -192467
36921 -192467 -258543 -91115 212604 402064 372741 257210 196800 144908 -4155 -188388
36911 -188388 -248739 -197292 -221780 -381437 -482697 -354354 -88835 121384 253984 397106
36901 397106 515366 474149 276223 100118 75254 140674 155674 56986 -117479 -279841
36891 -279841 -335410 -233938 -22784 156559 147144 -97386 -413328 -509314 -274258 18330
36881 18330 -12326 -352430 -582625 -445149 -178669 -130275 -271504 -341893 -283871 -235845 -211950
36870 -211950 -104652 48106 98773 72771 131228 258883 279019 194971 214958 378612 452962
36859 452962 301831 94652 23396 45813 43028 17787 -9018 -107177 -285244 -384499 -272595
36848 -272595 -24254 199235 325066 337958 226719 64054 -5519 39362 50868 -51811
36838 -51811 -153283 -143062 -86962 -93783 -162969 -260346 -383571 -461842 -376674 -185949 -120856
36827 -120856 -234280 -277185 -86016 140734 160757 59538 50229 98320 45001 -40968 37195
36816 37195 227935 271572 100848 -78425 -117241 -79912 -36594 71081 284435 513108
36806 513108 634408 606370 465377 299438 204426 180916 122875 -9854 -104778 -91527 -92152
36795 -92152 -218236 -354913 -350786 -292524 -341596 -411426 -308419 -127205 -166258 -443879 -633768
36784 -633768 -551312 -394019 -383013 -443557 -400221 -264452 -151862 -81107 -20272 -4634 -59398
36773 -59398 -103577 -57502 29516 56067 5786 -60420 -78329 -2663 157453 290279 267488
36762 267488 107152 -57345 -181495 -330931 -467280 -405001 -88231 248690 345265 240495
36752 240495 192853 332712 523119 551875 370339 127436 1426 8233 -3829 -148924
36742 -148924 -351354 -465847 -477100 -459988 -409210 -281381 -170149 -228841 -400666 -433710
36732 -433710 -219115 72051 243687 272066 187684 -16510 -248835 -309090 -172052 -94244
36722 -94244 -257745 -469306 -423711 -149160 33740 -59530 -289792 -420285 -371954 -243403
36712 -243403 -177984 -213271 -222585 -64842 180023 257191 92193 -67579 -9022 110516 -4458
36701 -4458 -326833 -526908 -423798 -188413 -73477 -129453 -235410 -264328 -163647 24299
36691 24299 183993 236870 222202 200578 134689 -16858 -149078 -121434 6004 28475 -107555
36680 -107555 -251787 -320222 -411996 -578635 -676611 -588182 -434993 -404896 -474634 -484970 -421190
36669 -421190 -418952 -503441 -522303 -391939 -242393 -216037 -250165 -197133 -78060 -47679 -126247
36658 -126247 -147640 -27675 79547 12804 -128856 -119063 50174 143499 18703 -183801
36648 -183801 -255066 -178945 -77870 -5819 74150 162145 203203 191739 191861 234276 264860 224190
36636 224190 132180 61934 49594 58156 35874 -6317 -5050 62647 140159 173190 175282 154212
36624 154212 40257 -201032 -424651 -423366 -202106 6108 36008 -35871 -67370 -54560 -65133
36613 -65133 -95614 -119374 -184681 -331953 -470417 -460424 -288793 -67416 109980 225173 286314
36602 286314 304847 294727 234921 80092 -132497 -258599 -215890 -114458 -122253 -254300 -394618
36591 -394618 -473524 -508031 -501764 -423132 -273571 -86307 122135 314052 384773 268499 70743
36580 70743 -22657 27881 85738 45353 -34424 -37218 55009 163543 224390 253631 309750 405810
36568 405810 470323 419361 262703 93035 -28300 -107213 -138138 -90965 -4109 25909 2412
36557 2412 53561 219420 336796 246266 11811 -178583 -235379 -181532 -56662 61947 56119
36546 56119 -63385 -92162 94892 316482 326846 180965 125159 199815 213002 77767 -88707
36535 -88707 -202136 -286969 -297566 -132686 122496 239223 209686 296537 596511 819467
36525 819467 681332 298644 -10391 -137808 -183817 -195371 -151275 -117149 -175440 -239968 -156029
36514 -156029 25043 74657 -85299 -265942 -282109 -188180 -154048 -215708 -261762 -216345 -129680
36503 -129680 -90058 -125984 -217048 -338248 -447471 -473404 -386088 -265163 -221639 -248651 -236489
36492 -236489 -153281 -101776 -145570 -198470 -179709 -166153 -257093 -378121 -381529 -283188 -224123
36481 -224123 -225787 -166040 -2824 152300 213425 218985 212292 160944 40853 -110592 -249896
36470 -249896 -330290 -258323 6588 301011 368782 164809 -89411 -182697 -109449 23010
36460 23010 114217 67533 -154408 -417508 -522863 -471025 -447636 -509717 -498932 -337305 -178604
36449 -178604 -147647 -148819 -86449 -70195 -208943 -368612 -351680 -202568 -126169 -180321 -241413
36438 -241413 -228914 -195663 -212991 -289376 -387929 -447552 -424287 -356629 -318482 -285068 -168788
36427 -168788 -14859 15139 -85689 -124744 -37592 -29843 -234513 -454186 -454418 -315392 -250451
36416 -250451 -247174 -160002 -29171 -27392 -174241 -354172 -530454 -692884 -693312 -416505 -48465
36405 -48465 104439 12821 -121622 -227505 -369636 -462500 -342431 -118848 -79122 -202758
36395 -202758 -151915 163413 400288 325038 173876 234579 377521 297609 594 -259471
36385 -259471 -386690 -496089 -633896 -701756 -644274 -518181 -372458 -197090 11415 222801
36375 222801 383051 399364 199634 -125532 -354576 -400285 -412271 -497862 -500887 -251734 89409
36364 89409 193622 19736 -147517 -126709 -50573 -71156 -96200 17445 180546 195708 83624
36353 83624 64979 214092 328507 215285 -44531 -225061 -236333 -146623 -15099 125534
36343 125534 162209 -17012 -301433 -406744 -227272 18918 89696 3712 -91659 -165033
36333 -165033 -237480 -221562 -51219 119472 88375 -72142 -106537 26339 92553 -55920
36323 -55920 -288156 -410360 -369965 -199454 32587 160312 36062 -208299 -236534 47268
36313 47268 343954 375213 232605 147580 134067 84841 42219 99563 148841 17104 -194146
36302 -194146 -196667 36976 183873 19941 -263046 -336408 -178582 -59220 -143379 -295983
36292 -295983 -317537 -236616 -247437 -397307 -480487 -306795 26509 250906 265019 214118 234010
36281 234010 268202 192974 -169 -223143 -399769 -482761 -439335 -289423 -102703 78484
36271 78484 239160 301849 170914 -72587 -167893 12651 255430 249427 -31441 -325275
36261 -325275 -415960 -337876 -262535 -295234 -398376 -448403 -361685 -193881 -88581 -109160 -181187
36250 -181187 -223045 -236013 -213048 -79307 166880 347800 285829 51168 -101873 -45023
36240 -45023 80206 47093 -194465 -465796 -549528 -425401 -291324 -308690 -377394 -278813 -13918
36229 -13918 176688 160432 86322 124923 222125 240620 178041 90394 -46013 -217409 -259109
36218 -259109 -68896 172129 207536 56985 -45969 5956 127904 247206 342516 331539
36208 331539 168195 26605 131329 400482 516947 386259 259941 329959 452045 395353
36198 395353 166409 -50637 -128121 -60354 73572 127315 -48 -197387 -230350 -63267
36188 -63267 72137 16846 -80463 5949 259711 473889 510786 385021 186372 33777
36178 33777 12561 56677 -7990 -214921 -376070 -352034 -259519 -272178 -355361 -372289 -333959
36167 -333959 -340832 -361505 -287457 -165363 -162587 -308364 -457023 -509650 -494924 -430630 -298650
36156 -298650 -181200 -219844 -375717 -417177 -238496 -26861 -3118 -145293 -298132 -415951
36146 -415951 -522142 -525272 -290214 111195 396781 372701 133277 -69210 -71210 104010
36136 104010 307683 391358 332835 253649 259777 288000 208136 56352 10300 100510 129700
36125 129700 -17152 -156086 -69115 147751 223941 125184 73093 166231 242395 174323 59986
36114 59986 10295 -42620 -184760 -341613 -410454 -421786 -420921 -342601 -175128 -97159 -240000
36103 -240000 -438140 -450279 -330190 -323012 -463115 -552476 -509530 -453217 -430017 -345981 -220052
36092 -220052 -218366 -341411 -345181 -107784 159888 219130 110136 -403 -76161 -138685 -123030
36081 -123030 -9073 50479 -62969 -221412 -239265 -155566 -124658 -141802 -105684 -58359 -110478
36070 -110478 -187185 -112465 71952 134559 20154 -67425 -8001 48958 -57942 -262422 -413209
36059 -413209 -486635 -518529 -468067 -313520 -186202 -233040 -382485 -403895 -209431 28849
36049 28849 105760 35773 4369 104262 212054 166300 6211 -62953 57702 232071 285218
36038 285218 225459 175139 166458 140809 97608 87156 74410 -22349 -141858 -104085 114941
36027 114941 291993 238791 47601 -61222 -35210 -219 -44613 -138155 -241287 -355234
36017 -355234 -436896 -370088 -91326 282998 501746 383279 4863 -320252 -314592 -9046
36007 -9046 306577 417648 381550 349278 313214 163223 -74952 -230468 -231504 -208816 -287243
35996 -287243 -383412 -313859 -53861 211125 288404 159262 -54945 -243502 -378555 -469412
35986 -469412 -509153 -488655 -429748 -370084 -325951 -293348 -265616 -215918 -92708 100027 233016
35975 233016 158588 -90526 -310473 -385582 -433137 -600017 -813753 -874349 -737277 -549836
35965 -549836 -426726 -351830 -313591 -366113 -496086 -575413 -526202 -412238 -296975 -150658
35955 -150658 7253 29999 -141661 -318603 -306043 -205860 -254643 -427080 -468653 -330456
35945 -330456 -286516 -511415 -780764 -768133 -478484 -192188 -75646 -42908 31955 142098
35935 142098 209897 200521 133233 45972 -23328 -48543 -10772 117024 327302 497777 439087
35924 439087 100223 -321869 -552744 -492898 -256599 -19839 102946 90039 9544 -42429
35914 -42429 -60331 -141591 -327072 -498320 -508305 -347273 -105962 134983 284885 227556 -23499
35903 -23499 -243638 -246632 -149908 -198240 -375177 -420091 -229298 -903 70771 26048 -16391
35892 -16391 -46833 -85543 -87880 -54890 -96353 -248715 -345428 -210670 93175 333638 370374
35881 370374 255199 122438 62961 69691 53811 -50526 -189759 -268092 -299884 -357780 -390958
35870 -390958 -293940 -176191 -302746 -658924 -847122 -619768 -275910 -248705 -478827 -536730
35860 -536730 -273429 16406 84545 30565 19467 5054 -92650 -161725 -65085 97959 103958
35849 103958 -76523 -250254 -285805 -275229 -359119 -492661 -489305 -283561 -49224 8187 -88151
35838 -88151 -148068 -110832 -113224 -214518 -243930 -67364 145276 130316 -77792 -201262 -140202
35827 -140202 -91144 -201918 -340941 -319699 -164875 -31907 22901 42377 34890 -12682 -43000
35816 -43000 8368 71446 -9594 -258628 -487265 -482577 -235020 59861 207072 182690 104446
35805 104446 82950 140819 243285 330660 318057 155823 -69419 -183215 -136781 -84252 -159135
35794 -159135 -264944 -219100 -38066 85294 67237 27101 77613 179475 254744 304345 336486
35783 336486 292231 139574 -28556 -81859 -9921 64726 15949 -163496 -342865 -355978 -162125
35772 -162125 104229 287542 380014 465034 544096 548815 506394 533227 628750 625059 413198
35761 413198 99907 -137238 -243444 -256852 -196084 -85051 -7620 -21619 -66763 -54886 -7476
35750 -7476 -9542 -65066 -95836 -61964 7007 87730 181441 257407 261621 197817 128611 70113
35738 70113 -48855 -271711 -498597 -557117 -398472 -168652 -42358 -16159 70712 311888
35728 311888 604767 777641 778523 682339 566241 452822 346477 253991 178576 132593 121422
35717 121422 83984 -70892 -301198 -399908 -240328 27247 164750 163053 197130 309331
35707 309331 341554 194424 -34418 -208254 -282399 -245736 -104154 33390 29009 -64182 -31379
35696 -31379 185629 381809 387887 288090 225200 175509 68265 -38961 -83395 -156199 -339325
35685 -339325 -484262 -363208 5092 356877 483156 386566 182000 -9169 -89294 -46472
35675 -46472 16905 10936 -19128 18248 111126 182093 201541 152560 -21756 -288230 -433909
35664 -433909 -298666 -43377 15324 -189602 -439141 -577438 -658332 -712651 -630207 -395476
35654 -395476 -225952 -292319 -436138 -360751 -35642 270055 336892 214415 74633 -546
35644 -546 -15528 36200 146085 219190 155673 7331 -57969 20318 113568 99621 25217 -21921
35632 -21921 -85904 -233980 -363493 -316370 -143516 -36680 -12913 77031 196846 82212
35622 82212 -325914 -690482 -721072 -565982 -516647 -533922 -385076 -117398 -37538 -235347
35612 -235347 -440586 -406281 -195617 -25427 -13977 -135153 -262188 -226408 13494 246803
35602 246803 218684 -24243 -170232 -46450 194765 332307 332736 279859 214801 144262 91588
35591 91588 58249 16981 -20112 -18778 -18190 -94070 -221862 -309699 -367880 -487057 -638162 -675052
35579 -675052 -566474 -436334 -334709 -183538 -12990 -3175 -163968 -220073 -9327 219627
35569 219627 160967 -58098 -46155 261711 496965 376198 54596 -149361 -173862 -190175
35559 -190175 -278666 -325999 -247376 -157372 -224470 -410312 -468399 -238499 137028 369606 352706
35548 352706 234589 181253 190740 175734 117295 59876 16335 -54785 -204315 -443577 -691144
35537 -691144 -772794 -573721 -216486 26341 50370 31717 142255 283477 244837 32427
35527 32427 -145805 -193308 -224947 -309087 -294538 -33947 319824 420925 147982 -227430
35517 -227430 -366391 -256876 -158167 -204951 -250007 -152095 -41182 -132583 -368209 -451364 -253592
35506 -253592 -4194 15165 -158028 -228700 -32479 259555 353161 174130 -70112 -159376
35496 -159376 -106435 -76766 -131277 -173684 -141089 -93173 -69867 -20375 42798 -11488 -198793
35485 -198793 -292699 -125994 112227 115745 -86925 -176192 -2231 251962 370202 325208
35475 325208 182428 18414 -29519 135991 374293 433701 318241 280605 393899 415099
35465 415099 191283 -77846 -157120 -114794 -141681 -230996 -256294 -216225 -193170 -184088 -150300
35454 -150300 -125665 -122419 -55610 89785 163106 85152 27023 162169 387494 499977 507630
35443 507630 527457 502209 294914 -9920 -175546 -153132 -104705 -107588 -81244 -7424 18180
35432 18180 -19747 -28758 -7704 -62312 -177622 -181454 -3161 215254 338030 386510 388874
35421 388874 270394 33748 -106461 36888 319735 397166 168071 -76892 -33980 202618
35411 202618 256529 -29937 -386303 -483866 -357455 -282011 -328152 -295147 -94157 65268
35401 65268 -22321 -276254 -482439 -555466 -511880 -352667 -140247 -50304 -166571 -332116
35391 -332116 -363976 -302023 -285615 -308803 -281292 -223549 -215019 -243611 -276057 -362996 -497640
35380 -497640 -509369 -309520 -103814 -117392 -240542 -224428 -112918 -160135 -383142 -523310
35370 -523310 -439499 -245708 -68588 46952 12666 -210146 -392604 -241043 144567 333720
35360 333720 145245 -146484 -255110 -213377 -159244 -101553 -36320 -23061 -12317 139772 362359
35349 362359 363042 82340 -141297 -59740 114925 78382 -78700 -60282 129002 200308 40826
35338 40826 -133094 -102713 82636 217802 203090 135639 174647 340507 487651 517576 532426
35327 532426 646852 737537 602711 329043 221711 344822 422424 271339 41759 -84932
35317 -84932 -147346 -201352 -146460 48770 184304 93001 -132269 -342373 -540054 -718008
35307 -718008 -744334 -612690 -545846 -617414 -545282 -150598 240962 210524 -148852 -416063
35297 -416063 -468062 -521468 -658219 -728060 -693563 -685174 -695406 -567551 -333885 -247895 -403706
35286 -403706 -583017 -550500 -291318 69573 368394 418189 162451 -163243 -247837 -101090
35276 -101090 -13779 -121864 -258923 -262621 -167438 -42030 113854 238958 210566 56137
35266 56137 -46480 -51846 -116850 -311654 -476079 -462701 -333699 -223315 -179185 -213151 -322925
35255 -322925 -393281 -278475 -60669 -4328 -152710 -209830 24443 326687 356973 118319
35245 118319 -106543 -151139 -85602 -26569 -26254 -105287 -227775 -270443 -154026 15691 50103
35234 50103 -100115 -312234 -446980 -458276 -387111 -318767 -311100 -318542 -246181 -115922 -77168
35223 -77168 -177518 -227887 -15482 404355 734221 725966 386674 -51669 -309325 -275642
35213 -275642 -119268 -118487 -329763 -522005 -507170 -399891 -412612 -507810 -450710 -168482 137953
35202 137953 264526 232179 195243 238303 324908 372623 330516 229565 171145 207729 236176
35191 236176 100103 -178137 -370975 -315539 -123243 -22905 -56576 -65024 35214 117576
35181 117576 58356 -44340 460 193042 343250 344517 293197 306261 374312 458543 577797
35170 577797 695382 667496 450270 230671 174899 161680 -12164 -250460 -264840 -44939
35160 -44939 89126 -26969 -165915 -109220 -9908 -117661 -337248 -350729 -92095 177921
35150 177921 261567 243869 275456 338819 326558 214635 53871 -122764 -286289 -359024 -272696
35139 -272696 -74377 86560 90518 -53443 -231416 -322752 -286656 -189816 -156040 -250592 -386449
35128 -386449 -378066 -142808 162012 273124 109659 -141825 -262059 -235679 -189733 -182972 -171628
35117 -171628 -138357 -122818 -126958 -108448 -84171 -133446 -271811 -416224 -501832 -538655 -523460
35106 -523460 -402282 -180678 14684 60888 -20489 -98736 -71821 61679 218786 286714
35096 286714 205949 29577 -130982 -223601 -276232 -315674 -338350 -353049 -361296 -294679 -82602
35085 -82602 194720 339411 273530 139048 100391 149781 186579 191281 207676 211188 120601
35074 120601 -59612 -200274 -181788 -26210 133018 203128 222945 266058 268823 54787 -400944
35063 -400944 -820524 -870833 -538894 -139703 40349 -8594 -115854 -139472 -64604 -6241
35053 -6241 -117935 -392486 -585728 -483985 -209303 -66422 -109783 -108406 34702 114420 -16905
35042 -16905 -189490 -191339 -90041 -80931 -179025 -259650 -274694 -247932 -179242 -125902 -246311
35031 -246311 -571884 -856878 -857878 -656937 -503655 -446425 -355089 -222507 -177403 -224034 -217800
35020 -217800 -113482 -25639 -18750 -25387 -441 13299 4105 25491 82400 112242 97661 86290
35008 86290 101003 137691 225497 370776 480461 470036 396356 342827 247315 25639 -204492
34997 -204492 -246744 -132784 -63664 -61818 50037 295280 447542 375103 233020 197152 226593
34986 226593 217839 188866 160597 41282 -196957 -376140 -331247 -163184 -97478 -167796 -205862
34975 -205862 -100366 79859 202344 202120 110390 27181 42038 132497 184778 150066 107109
34964 107109 126501 164996 157671 121841 91981 38650 -61881 -155003 -189825 -200482 -225481
34953 -225481 -227527 -181913 -158785 -213840 -278335 -272207 -245109 -266123 -244659 -41151 258867
34942 258867 363503 119549 -287106 -537792 -501656 -302979 -150151 -159616 -294409 -412088
34932 -412088 -393731 -264126 -167305 -200615 -302292 -335445 -254233 -135167 -51943 16452 123399
34921 123399 251110 326599 316576 242085 113746 -60577 -195157 -164194 19801 158590
34911 158590 85823 -138295 -339988 -464492 -576587 -688069 -733582 -702983 -657845 -606737
34901 -606737 -484847 -273226 -36917 157715 267874 243243 95195 -32087 -16624 30979
34891 30979 -103315 -387842 -533145 -382915 -114347 36843 58850 60368 64027 43324 25472
34880 25472 23825 -12942 -74439 -47745 81462 135867 -8143 -222257 -314862 -275117 -183784
34869 -183784 -45419 109923 123724 -69571 -259421 -237426 -128800 -181025 -342233 -361720
34859 -361720 -232410 -191418 -299688 -365669 -318753 -325977 -465799 -597179 -642996 -697040 -739978
34848 -739978 -568785 -169799 139771 141950 14008 -22671 -69570 -289497 -527739 -534637 -389605
34837 -389605 -345993 -376498 -249689 1954 80325 -91054 -237963 -173006 -43100 -25914
34827 -25914 -68623 -80316 -130724 -269746 -352205 -250149 -94504 -100890 -249533 -321737 -194811
34816 -194811 49493 255959 301893 130634 -180140 -416675 -417804 -245892 -83498 -11137
34806 -11137 15373 33271 46730 87306 169605 216598 153947 48828 24882 68942 69583 30061
34794 30061 73056 214411 300954 232150 102648 50455 77725 97721 64476 -17292 -132925
34783 -132925 -245920 -311972 -344827 -391107 -415439 -320462 -122990 17418 15481 -24426 -5150
34772 -5150 -15865 -174487 -395105 -482895 -404879 -295902 -218307 -90491 118974 279406 255406
34761 255406 85695 -68826 -111108 -89170 -109654 -202758 -280932 -239044 -87991 55082 124118
34750 124118 186969 319019 449752 421976 199736 -45594 -82169 150349 444167 481198
34740 481198 148168 -313429 -553250 -498986 -376929 -343883 -288181 -86344 135649 178722
34730 178722 82000 50765 141960 226152 231384 220657 215885 135228 -36234 -156004 -81866
34719 -81866 153813 367403 379312 161641 -109762 -189211 -21601 184276 224881 157277
34709 157277 160347 237870 246437 162246 106728 115450 93355 30364 66591 278890 551963 717032
34697 717032 700242 517412 259341 91952 115554 204725 143715 -65641 -202010 -146261
34687 -146261 -13748 69169 114251 130524 37685 -175437 -370016 -434449 -403103 -326500 -182053
34676 -182053 3243 100876 47817 -71132 -179373 -293732 -387509 -350259 -182251 -56921
34666 -56921 -79968 -144864 -128325 -59370 11513 123241 249683 219756 -37921 -315758 -358799
34655 -358799 -161906 94644 274445 319371 198351 -26186 -192354 -221039 -190694 -151728
34645 -151728 -39938 126811 177393 55803 -45807 21898 155295 238952 344450 481909
34635 481909 427337 78958 -260290 -280735 -127065 -103395 -126014 93063 448707 511114
34625 511114 180551 -162027 -212070 -74948 25927 35081 -25399 -133543 -176797 -52568
34615 -52568 91443 -3203 -285869 -420573 -283531 -110111 -59945 14653 216844 359252
34605 359252 289792 189103 291733 513593 601898 504774 363637 251201 129136 -4396
34595 -4396 -101079 -153358 -178289 -165145 -125594 -112357 -105487 12118 262491 462142 430416
34584 430416 232938 95762 128701 242355 305204 284383 234099 208250 203393 186350 176436
34573 176436 246363 388221 446793 291947 9386 -200954 -269662 -265264 -218795 -123268 -64515
34562 -64515 -134782 -230486 -178090 -73092 -211017 -599697 -825322 -567686 -23235 371887
34552 371887 455423 375814 273712 164890 62673 -1519 -64439 -178595 -285755 -276346 -165951
34541 -165951 -86825 -92138 -80145 42652 199560 219947 66197 -88878 -66712 77723 127111
34530 127111 9885 -113825 -129504 -145228 -250929 -283720 -64931 255854 373022 277339
34520 277339 243013 377647 485120 413728 255176 125534 13526 -63338 -4322 165419
34510 165419 266262 257374 326918 560999 750217 687101 463091 299120 238562 175403 68001
34499 68001 -21710 -24232 84800 245588 309528 203337 82438 129861 230452 118013 -147917
34488 -147917 -197929 67436 278839 150491 -111719 -187568 -122772 -150413 -275131 -330544
34478 -330544 -276833 -185346 -83791 -34606 -185497 -519686 -749494 -692663 -552383 -572030
34468 -572030 -629406 -474249 -172777 22939 95181 200784 313782 293343 230189 348283
34458 348283 573547 555361 169240 -292208 -497539 -410817 -189808 40083 228547 357239
34448 357239 419937 390368 238170 31792 -72859 -35992 316 -43898 -41337 98473 223112
34437 223112 167136 16853 -65499 -112299 -213840 -279787 -194764 -61866 -28837 -17641 107816
34426 107816 260080 293038 282356 342008 340510 136660 -83173 -82080 -10870 -143089 -335193
34415 -335193 -243745 35304 94309 -64073 -19813 301449 453423 211865 -60895 -27853
34405 -27853 137073 160327 139348 275157 471927 528263 468725 402522 283840 69304 -103448
34394 -103448 -135334 -156675 -271709 -324576 -163122 57795 94872 -15852 -56956 28749 125114
34383 125114 169769 178687 116489 -68364 -320498 -521296 -606666 -564281 -411019 -245571 -197119
34372 -197119 -245658 -236313 -140988 -121717 -237091 -294465 -142083 83444 176585 159577 167490
34361 167490 186941 124828 27480 10633 36677 -31603 -182730 -243605 -123404 64142 144807
34350 144807 68106 -63747 -109281 -38084 28436 -26479 -133689 -113237 65003 221585 201745
34339 201745 46817 -111552 -205692 -225158 -167488 -57836 60965 181741 294197 311722
34329 311722 163260 -59149 -192444 -220363 -230813 -197407 -35210 137898 78423 -187191
34319 -187191 -321528 -133689 176796 351478 391374 392209 314166 126754 -11103 57305 242293
34308 242293 346097 337106 316519 311176 265302 171271 77157 17287 16258 83162 142902 80318
34296 80318 -92204 -232351 -271634 -266387 -209170 877 312624 470541 353410 177796
34286 177796 196096 347554 388613 248779 72573 -20522 -56561 -112765 -205774 -266682 -200521
34275 -200521 -10534 155709 167162 73826 -5188 -79390 -192811 -221679 -27943 232516
34265 232516 261841 83068 29893 234051 451582 474594 393913 357416 376284 458987 621287
34254 621287 694568 485093 194242 252614 623849 765344 473861 232841 403664 602460
34244 602460 339964 -156455 -307464 -65280 124786 59459 -52671 -63194 -61683 -109905
34234 -109905 -163132 -222578 -276940 -182894 114946 372140 349411 189837 179622 282938 263190
34223 263190 135497 115715 197111 158366 -28567 -142198 -76111 28676 38561 -15958 -47398
34212 -47398 349 141501 292992 319711 252523 299074 499199 593440 423691 210050 185083
34201 185083 216964 93743 -72636 -69073 19969 455 -50300 33152 134565 65063 -34884
34190 -34884 81954 295069 291152 97255 17352 123871 216160 213598 207189 186883 77435
34179 77435 -28348 -4914 45464 -9314 -33872 115715 230219 63642 -175099 -114173 156137
34168 156137 243710 105129 21516 36062 -44567 -160517 -59464 183018 232644 72005
34158 72005 -2826 61142 37551 -82682 -91741 -43833 -178540 -371850 -253738 93442 164710
34147 164710 -153565 -401934 -306769 -131196 -103920 -72316 63173 100148 -41991 -119245
34137 -119245 -4563 102701 97492 162836 360840 463180 371161 281639 265639 115069 -211514
34126 -211514 -417942 -334447 -153452 -36031 117639 351758 510118 551134 614904 669038
34116 669038 509169 203328 75751 151905 110163 -108547 -167346 60970 295136 398604
34106 398604 570546 818041 829508 586437 501211 691206 717636 348519 -7647 23601
34096 23601 227852 284941 279823 351457 333197 142165 70123 297117 538585 534884 470246
34085 470246 563594 672542 644333 634987 749540 787997 654096 574188 628414 558688 335573
34074 335573 363033 764150 1025929 768811 333032 166978 169394 108053 156177 473506
34064 473506 722259 557964 214715 94246 147350 145608 187657 440915 719659 784740
34054 784740 752245 803952 828901 722407 675135 810802 918380 862172 829253 871631 698659
34043 698659 244417 -88895 -78486 -4298 -18110 146439 474826 429945 -119289 -473109
34033 -473109 -150739 356430 456794 348116 403282 403069 93022 -168414 -39401 161151
34023 161151 121796 180354 598267 896539 662172 320606 351522 465882 344484 405397
34013 405397 961000 1394270 1120853 625693 584749 722465 543541 400271 739005 1064437
34003 1064437 809605 482262 749759 1140959 920509 502018 642719 944969 585371
33994 585371 -98206 -187767 233258 495612 732560 1399281 2012650 1866936 1428093 1540910
33984 1540910 1889414 1754191 1560627 2037621 2607359 2367737 1887622 2151027 2537242
33975 2537242 1897038 844709 783596 1398173 1425235 1166665 1738448 2524659 2071958 937167
33965 937167 851105 1571316 1471434 761861 1074512 2318462 3125401 3892442 6008243 8690354
33955 8690354 10269200 11857880 15675941 20696955 24678713 29370817 38086892 49409124
33947 49409124 60240593 73669572 94585155 118385233 136988065 158226619 202069707
33940 202069707 266586428 312125444 297812440 228657284 150151925 98715380 73853404
33933 73853404 58486525 46292808 39901694 36903096 31517632 24320163 20027197 18734576
33925 18734576 16901150 14311000 13388912 13608624 12439370 10357726 9788077 10293427 9449361
33916 9449361 7444131 6493484 6520191 5490688 3483361 2612704 3187015 3395707 2699004
33907 2699004 2387824 2785105 2753920 2059290 1649644 1550509 866679 -114131 -117523 771052
33897 771052 1117919 569602 232379 557134 811079 768642 1047022 1595626 1616125 1158216
33887 1158216 1133930 1598815 1634500 1087725 834439 1122196 1190439 785129 592303 882042
33877 882042 1073490 921574 871473 1003286 852352 482837 530683 985543 1125086 842128
33867 842128 824610 1207843 1279082 807257 469107 597975 640083 257789 -79148 -31160
33857 -31160 49791 -77103 -69302 248710 478009 383891 299675 449794 574778 527780 557099
33846 557099 729718 746336 567190 561976 825414 985933 866166 695377 549880 260842
33836 260842 -29569 49704 357800 339063 -30950 -188290 7971 55298 -214419 -310344
33826 -310344 -13135 213691 83712 -34230 128664 259246 137187 82855 304161 452349
33816 452349 267728 65520 144450 271937 183711 71596 157771 270964 242148 257165
33806 257165 434898 500799 253758 -59966 -191069 -303282 -605557 -943837 -1081268 -1048262
33796 -1048262 -947156 -747174 -495656 -375240 -359040 -189970 132536 268514 102690 -59197
33786 -59197 -24068 42291 70678 251680 523764 461085 -29292 -419753 -298077 85723
33776 85723 319218 389416 411283 276708 -38977 -233682 -115734 77683 115122 141349
33766 141349 306807 425394 328345 185591 166284 149824 56703 66149 217399 218869 -38678
33755 -38678 -213082 -77261 89408 17912 -97248 -30218 56519 32392 167439 610832
33745 610832 942241 768687 389281 325344 525241 593267 514429 563042 700725 641577
33735 641577 397971 259183 306016 362365 335047 245976 64483 -158483 -172657 111861
33725 111861 358586 261177 37859 75035 305937 381135 260126 173776 154711 67123 -14658
33714 -14658 88817 259469 210079 -38585 -192559 -140997 -27396 57840 111981 41374 -194817
33703 -194817 -350399 -163925 204402 353507 193366 -10331 -61939 20980 197418 396773
33693 396773 414008 157706 -83349 28969 375159 564519 530456 531080 616328 537623 211969
33682 211969 -128854 -318591 -435529 -534792 -527168 -406113 -309413 -277266 -201009 -69832 -25658
33671 -25658 -118388 -230971 -290326 -337084 -351985 -232314 5513 190355 220593 175260 165220
33660 165220 195685 195135 96485 -87196 -211989 -120430 121851 251759 166279 68626 127790
33649 127790 214901 164646 70028 78292 102119 -201 -141246 -167846 -129630 -126058 -87366
33638 -87366 18381 -6087 -247763 -389968 -138134 268856 379865 178713 -14500 -109220
33628 -109220 -241514 -350083 -259491 -100939 -152684 -318443 -259294 749 116212 46551
33618 46551 100389 324269 397257 227176 120844 220344 270490 119435 -20911 -9018 -22985
33607 -22985 -160318 -205739 -38046 105593 15585 -171154 -259370 -284595 -306791 -233433 -59972
33596 -59972 20418 -48840 -53394 95507 167827 44582 -15125 173594 336857 165975 -142113
33585 -142113 -161590 122684 337057 281419 116197 18194 -42881 -144525 -245179 -247560 -126574
33574 -126574 34022 105467 54678 21247 154877 379249 462994 333131 145343 32089
33564 32089 -14652 9346 147566 303557 284130 94897 -56152 -117680 -270513 -546984
33554 -546984 -692160 -563973 -368957 -303408 -249041 -58186 128750 126406 40086 63127 114580
33543 114580 -17883 -291731 -451961 -393034 -239420 -113943 -26519 47695 141853 302003
33533 302003 492772 571241 465094 283776 156314 82360 41096 87333 209478 255066
33523 255066 150246 42934 74807 164081 171982 121601 76907 -26184 -221586 -338358 -214936
33512 -214936 24780 131216 72164 7350 9570 25683 46467 104136 142416 76240 -46197
33501 -46197 -89869 705 200039 475600 718188 707838 346029 -138584 -400983 -358093
33491 -358093 -199588 -76510 39911 208722 397600 531150 553443 442939 247216 84614
33481 84614 44848 114359 233461 360482 446836 441228 356148 235210 55851 -182975 -289275
33470 -289275 -41078 421195 646755 453719 185930 210714 427996 516273 420106 298074
33460 298074 180694 6556 -130809 -93334 23566 15225 -90777 -93520 26792 81411 -17962
33449 -17962 -158925 -225688 -196161 -72645 97689 181525 114213 18564 -5280 -79328 -310069
33438 -310069 -495722 -371430 -48466 119938 55638 -907 59490 80999 -5480 -45835 29856
33427 29856 71518 -149 -35696 78402 227438 270662 233386 176422 65344 -101363 -200292
33416 -200292 -147970 -25625 61538 120872 180324 192937 130144 60759 52716 88392 134455
33405 134455 196280 255973 259152 203939 145279 94248 30397 18408 155740 369227 428875
33394 428875 237699 -27140 -138275 -68141 50339 99841 45722 -69450 -126287 -12757
33384 -12757 221521 366792 270289 -531 -246935 -334104 -273828 -174814 -139605 -171041 -175513
33373 -175513 -88047 39378 119890 141657 122015 24979 -163564 -334628 -357807 -251173 -135106
33362 -135106 -53471 45454 188907 349529 489331 538706 412438 157552 -21545 -21427 4978
33351 4978 -82148 -141640 12560 251873 307469 205255 195479 301264 291879 108718 -33143
33340 -33143 -11883 68725 171871 406319 718729 853494 755615 685708 773551 783610 531920
33329 531920 233096 175590 296128 345060 278622 219958 183763 98960 1085 -17011 37499
33318 37499 116551 238123 380713 406921 260223 101595 81273 123952 122544 174191 388424
33307 388424 605089 576158 340213 150712 91146 27741 -82529 -107969 3382 117430
33297 117430 125079 78008 49191 7506 -99676 -250697 -392175 -491286 -509103 -402399 -193906
33286 -193906 9381 97168 40334 -89939 -171526 -145430 -101580 -173171 -306465 -250702 121372
33275 121372 577071 748768 552797 251542 118734 179438 299212 398160 487250 546043
33265 546043 473489 215485 -97751 -241100 -161776 -63990 -137874 -293198 -303072 -140368 18861
33254 18861 89482 145331 182073 67826 -184147 -324791 -182963 110483 331010 413473
33244 413473 374861 180639 -139831 -399602 -454558 -384045 -329075 -277815 -154774 9465
33234 9465 147403 267517 361443 341857 213429 140269 182096 144879 -112299 -407492 -502532
33223 -502532 -459117 -460437 -446600 -253733 2302 47103 -85540 -66622 214316 468328 425615
33212 425615 174366 -24108 -57695 -1032 20202 -70394 -224164 -266796 -83034 207289
33202 207289 379008 376611 323307 301879 289152 272179 261982 221630 137061 111056 225694
33191 225694 380650 443474 464423 531595 530035 322048 75629 88716 330286 492507 477839
33180 477839 468909 502063 379269 95523 -49516 68367 169878 30828 -159885 -147482
33170 -147482 -31025 -51172 -173263 -174181 -9897 154412 192757 108493 -38095 -152129 -151911
33159 -151911 -86336 -66267 -28556 196212 495101 471562 25762 -384439 -343479 -48369
33149 -48369 67151 14281 114266 360235 422198 250435 177561 338740 429148 206602 -117427
33138 -117427 -201558 -32595 145799 173437 60383 -117804 -248632 -218146 -47932 97082
33128 97082 125956 132027 206581 283040 271762 212638 168764 96659 -32294 -95091 24480
33117 24480 214392 250050 98082 -59101 -89322 -42998 -8976 8641 24586 10655 -37272
33106 -37272 -71316 -96156 -208481 -444946 -659359 -656040 -420952 -134362 33170 56534 -5819
33095 -5819 -114334 -250951 -380781 -458160 -446864 -321541 -92126 157182 309138 328133
33085 328133 287421 252345 201096 114645 72410 157674 300844 330475 193362 33061 18324
33074 18324 160251 330902 405738 350135 208649 54496 -60599 -127504 -154192 -136876 -78387
33063 -78387 -14221 12966 -13774 -103393 -260667 -423868 -460881 -317874 -126581 -52181 -67508
33052 -67508 -15736 114963 150529 6035 -170900 -231520 -257280 -412739 -654079 -750190 -578966
33041 -578966 -266996 -13676 117369 184662 223940 200924 105641 25447 61958 181803 224069
33030 224069 98914 -83975 -154085 -87737 22659 152494 346074 538209 546488 306248
33020 306248 -17011 -224785 -285469 -268463 -204434 -120142 -108645 -221496 -337207 -267747 4768
33009 4768 281844 341611 135627 -178112 -355552 -261768 2615 202189 221754 161977 152498
32998 152498 166941 101935 -39508 -148780 -156547 -86696 12550 119984 237668 379279 535539
32987 535539 629788 570227 381480 210066 154644 170265 181280 181464 160758 59953 -102961
32976 -102961 -181897 -100080 11582 6445 -63217 -83920 -114720 -269363 -446489 -431114 -249486
32965 -249486 -168377 -297383 -424913 -341818 -132428 -15205 -34032 -47398 51045 211038
32955 211038 287803 168025 -121935 -399790 -473656 -330264 -127076 -884 39201 38543 24027
32944 24027 16019 11043 -55459 -221199 -376353 -369177 -238029 -171962 -213729 -198875 -57528
32933 -57528 41960 -18576 -83795 16983 159516 114070 -71770 -149406 -69913 -23023 -71494
32922 -71494 -41283 134085 226342 42410 -247384 -319776 -131425 62062 73492 -21217 -65553
32911 -65553 -36492 -15296 -47444 -100892 -115705 -56900 47520 108686 62366 -41284 -93085
32900 -93085 -82555 -126360 -302692 -528548 -661858 -670795 -630110 -590599 -537315 -460128 -379107
32889 -379107 -294212 -187949 -97564 -110328 -243596 -379859 -373670 -204668 10942 150284
32879 150284 195447 211844 234213 204816 57034 -150818 -253124 -165402 3394 82980 28509
32868 28509 -96955 -256092 -431961 -533301 -461086 -276778 -158604 -163696 -176089 -126320 -102713
32857 -102713 -175210 -265464 -290997 -295221 -319789 -291428 -181817 -147969 -326461 -575863 -620662
32846 -620662 -404914 -122276 66645 157751 167462 82864 -21462 -366 166366 333891
32836 333891 396027 401880 431470 491637 583040 726812 851101 785083 468637 73295 -179855
32825 -179855 -245479 -217743 -159640 -79070 -13547 -12335 -43834 -20753 67303 119727 54319 -75137
32813 -75137 -135286 -76832 6190 10642 -24270 18819 125941 128918 -46335 -227178 -206478
32802 -206478 -17539 145929 210539 247090 259467 159182 -40247 -205532 -297011 -403214
32792 -403214 -512150 -466143 -244155 -79340 -150605 -337013 -441135 -481943 -559924 -580115
32782 -580115 -370483 -4506 253124 310353 324126 397797 429850 327352 173590 87295
32772 87295 66539 69909 122446 233349 313599 288542 214245 176420 145368 49605 -59003
32761 -59003 -50059 83770 193774 168207 59020 -20390 -32640 6641 106526 253626 322544
32750 322544 159141 -203168 -497098 -477811 -199232 46510 67911 -32301 -42319 62821
32740 62821 115325 22879 -86448 -50602 84723 122410 -16218 -195564 -258871 -207452 -131874
32729 -131874 -64154 5562 36674 -11338 -63089 9332 196798 337563 314156 170474 19349
32718 19349 -55762 10264 231311 467970 500267 297537 94646 91808 197278 200708 88300
32707 88300 11350 19661 27897 24660 114978 317051 475674 449327 287639 165036 191410
32696 191410 316196 390779 331724 229256 228996 291406 204651 -89167 -349904 -366721 -260795
32685 -260795 -254966 -304343 -237958 -140974 -238037 -441429 -406450 -82443 171694 131014 -2726
32674 -2726 -17047 -42634 -246402 -470756 -484072 -379713 -412359 -570777 -602710 -387530 -42819
32663 -42819 278621 492723 548903 475489 397721 360631 237580 -23081 -198466 -56111
32653 -56111 289556 518340 517545 420490 312151 160764 8810 -28754 31000 52610 5941
32642 5941 -24192 -43466 -146660 -299796 -337639 -216055 -83112 -65342 -146123 -266610 -373771
32631 -373771 -362396 -158644 116108 244953 199528 147819 170571 171867 99931 46922 71330
32620 71330 107191 103948 80798 6300 -180617 -391220 -443129 -345050 -291042 -306555 -173864
32609 -173864 164762 408346 302282 12676 -139895 -135785 -181155 -308280 -338324 -201506
32599 -201506 -47322 -24262 -131549 -296469 -441869 -467587 -306547 -28711 204304 296410
32589 296410 265132 170739 81297 59867 86334 42375 -110886 -193870 1918 402280 686653
32578 686653 660187 449241 281800 212590 159786 111188 150653 289542 390467 320248 131946
32567 131946 24919 121313 338338 501174 514802 371514 72373 -325328 -608641 -531584
32557 -531584 -110026 326489 472202 349729 189558 101703 9461 -134186 -230840 -181998
32547 -181998 -44347 28675 -45657 -215563 -364315 -400095 -298198 -108587 64387 127954
32537 127954 79231 -3578 -82987 -240066 -549869 -890799 -1005883 -811660 -526706 -390547
32527 -390547 -362621 -247987 -36250 86767 46796 -6673 62404 203424 307557 353352
32517 353352 344292 242742 66567 -61052 -60219 -5025 -454 -38893 -67487 -105941 -186589 -244387
32505 -244387 -187157 -51700 9132 -91326 -249979 -251546 10057 363398 467636 176623
32495 176623 -251154 -431441 -300033 -109587 -17472 69324 190294 160254 -128214 -450816
32485 -450816 -517687 -349708 -182346 -112933 -62160 -3237 -323 -43593 -39744 30284 90109
32474 90109 95110 61098 3491 -26811 94371 406271 705941 726778 472941 215690 148477
32463 148477 204491 240572 233539 218024 165238 44998 -52107 24409 281459 510505 487163
32452 487163 237310 22249 10699 61751 -46161 -256501 -307040 -136171 26951 21442
32442 21442 -48730 -69653 -107021 -191127 -166939 34285 193933 109352 -93198 -184329 -175734
32431 -175734 -183522 -156421 -44425 -33311 -245835 -389820 -135060 287475 348015 23578
32421 23578 -179439 -39682 82091 -96650 -336289 -342754 -244790 -286568 -379602 -300517 -100314
32410 -100314 -7078 -87710 -253061 -438103 -562427 -485713 -217727 -7010 -19439 -105427
32400 -105427 -86669 -68841 -224285 -455212 -554598 -546715 -572695 -565832 -359280 -42404 101793
32389 101793 -8714 -192152 -311751 -384457 -393155 -262928 -58327 39089 6667 23146 172594
32378 172594 298666 238099 45941 -96213 -80439 84729 329093 550844 657611 624032
32368 624032 481208 266003 33351 -122742 -148239 -108012 -109532 -170881 -224289 -205659 -84899
32357 -84899 120073 295566 296564 139365 11587 -2312 -46497 -209311 -306762 -169967 26847
32346 26847 18630 -100894 -33347 186602 209184 -38301 -182314 24150 307990 283821 -5260
32335 -5260 -215573 -198088 -104143 -85150 -114430 -87346 56173 297121 523597 581659 420755
32324 420755 152615 -87986 -278373 -452991 -599030 -682062 -707994 -690820 -617651 -498372
32314 -498372 -388498 -325811 -313805 -378731 -530905 -649096 -554606 -262930 -12462 38294
32304 38294 -13194 -38627 -100685 -288712 -485965 -509444 -384236 -267627 -174693 -15367 128519
32293 128519 30802 -314987 -589356 -532799 -280759 -165411 -282997 -420766 -381768 -224144
32283 -224144 -132576 -165375 -228979 -255569 -278989 -308750 -256291 -90018 26495 -88413 -344366
32272 -344366 -438162 -228295 112507 360423 470425 460032 274604 -54282 -275111 -170771
32262 -170771 129928 306809 265334 187203 191197 178268 53429 -107270 -198827 -243853 -316953
32251 -316953 -422502 -518108 -567485 -522743 -354811 -147666 -58039 -129801 -245457 -302235 -322289
32240 -322289 -340917 -322677 -272988 -301059 -449790 -564960 -474676 -234960 -58661 -37622 -67933
32229 -67933 -35132 55718 149540 231341 306528 362174 388874 403074 422615 440866 432106 368933
32217 368933 244915 97823 -6185 -31899 -6409 12675 -23071 -129768 -249644 -245316 -32839
32206 -32839 263173 403421 328380 231584 266753 332253 277007 173069 180285 237680 139034
32195 139034 -108393 -256001 -185165 -68532 -68902 -91200 21109 204475 261492 135968 -45327
32184 -45327 -145795 -117439 15101 159925 196754 106807 17016 34320 99458 92213 9888
32173 9888 -60712 -81759 -67145 -12513 63667 74483 -18117 -107529 -96650 -73238 -170733 -323165
32161 -323165 -355379 -276150 -259939 -340135 -353915 -233002 -122283 -133435 -191709 -222354 -280026
32150 -280026 -367928 -330819 -93397 166430 264430 276833 358215 435995 339140 138804 71570
32139 71570 134246 42102 -329784 -696805 -697162 -332935 56561 182629 54478 -121889 -195609
32128 -195609 -204758 -287007 -479118 -647167 -646555 -499241 -345631 -265231 -231559 -207631 -182365
32117 -182365 -135932 -77534 -93790 -233351 -363023 -298439 -92691 -19091 -206018 -457654
32107 -457654 -536634 -466478 -407040 -359158 -196128 60102 204141 125712 -38832 -114444 -130461
32096 -130461 -239521 -449719 -574389 -477382 -265563 -154719 -197089 -251433 -217742 -172258
32086 -172258 -211313 -276012 -243835 -123805 -34027 -21660 -26566 1106 66546 182460 317266
32075 317266 323991 102488 -166098 -155668 181433 531087 638072 595374 589467 582968 455343
32064 455343 277912 192841 138855 -25063 -195241 -131064 107995 145979 -186060 -566785
32054 -566785 -586894 -253841 82912 187494 128724 70271 50042 -950 -126304 -288256
32044 -288256 -417776 -488833 -521647 -506536 -376627 -118625 132583 211594 117479 -18670
32034 -18670 -139143 -278752 -377237 -281275 -17688 136937 11209 -200267 -218449 -86747
32024 -86747 -65938 -211673 -320968 -275565 -168938 -63844 98550 255825 168620 -208185
32014 -208185 -520769 -432070 -104841 1256 -246525 -507424 -458221 -174482 64339 136696
32004 136696 102903 16967 -106485 -192597 -126383 111178 398314 567385 519499 291282
31994 291282 54070 -9107 105387 196062 91852 -129958 -245828 -168783 -24223 44117
31984 44117 28429 -6342 -36380 -75913 -129460 -199036 -287518 -352274 -311030 -150285 16572
31973 16572 67338 23728 17866 114111 239419 313534 375963 511380 675050 687554 446800
31962 446800 80954 -188927 -308412 -411621 -579967 -701324 -634271 -410040 -169281 26225
31952 26225 194162 297911 265706 137955 48047 30982 -15057 -138616 -241358 -237418 -186746
31941 -186746 -193791 -275705 -399774 -537461 -599550 -448167 -96576 217396 305933 281032 356918
31930 356918 488851 434708 155467 -86110 -83548 59606 131219 102179 94325 175348 310710
31919 310710 436961 470541 317770 -2956 -300041 -389037 -303262 -214803 -178825 -95421 65187
31908 65187 148102 9405 -255407 -380570 -218308 102825 317671 291177 129535 33187
31898 33187 60159 68117 -93951 -375700 -560750 -502714 -267919 -36083 75603 60399 -33622
31887 -33622 -133156 -148955 -42758 107377 171732 111718 5703 -71483 -123527 -168345 -184389
31876 -184389 -169539 -168653 -168231 -53509 206480 400592 283729 -54464 -223712 -16210 307749
31865 307749 347399 51055 -286509 -435000 -437168 -418120 -391423 -328970 -272075 -261047 -248423
31854 -248423 -194826 -183771 -312239 -494672 -515738 -308640 -64324 3354 -91957 -191915 -253039
31843 -253039 -368892 -538586 -594130 -448033 -266014 -241369 -298789 -219594 -9369 101698
31833 101698 50432 71124 314412 570471 572303 395954 309044 342188 300839 152428 88792
31822 88792 168665 197407 68992 -37532 39669 174691 183970 139336 216156 367784 412291
31811 412291 354837 340919 323496 87050 -341753 -603364 -470220 -169636 -52494 -118952
31801 -118952 -105110 73049 226305 219127 142125 106466 71506 -24160 -117468 -130555 -114500
31790 -114500 -152392 -195323 -131019 25475 138948 136274 67393 -6421 -68547 -87921 -26628
31779 -26628 66723 87559 39969 53238 171492 244988 132101 -80947 -185322 -122318 -27790
31768 -27790 -25274 -89743 -125519 -88591 -8750 51835 52269 25342 57798 165462 221092 91226
31756 91226 -165567 -327102 -248499 -4294 219001 296475 212468 18651 -194751 -319457
31746 -319457 -275756 -60395 236781 461598 487784 326111 115061 -33076 -131178 -217984
31736 -217984 -239962 -137610 3732 28103 -71415 -136272 -62971 76047 158794 152626 94886
31725 94886 38601 53446 175873 310769 282831 48162 -222109 -321370 -204920 17662
31715 17662 195157 204337 15970 -241785 -371075 -318102 -224990 -225586 -288261 -318198 -303119
31704 -303119 -267867 -179012 -1968 203560 328694 313174 161161 -54260 -165203 -20557
31694 -20557 294690 485261 397072 208921 149151 176367 124947 27940 45164 141164 103220
31683 103220 -116160 -311939 -318645 -185623 -21051 135339 225843 167107 24014 7308
31673 7308 178971 318974 218381 -35026 -211997 -257794 -275753 -284755 -200284 -38565 52830
31662 52830 10116 -44205 23464 183349 311800 359768 373264 384590 358704 250159 72573
31651 72573 -96559 -167509 -109333 8483 64109 11000 -51916 11570 190463 315630 271600
31640 271600 154538 142307 249878 320595 256214 138913 87399 98401 102172 93231 114918
31629 114918 163164 195752 212980 248993 289845 267342 146190 -18646 -121212 -97430 6210
31618 6210 65657 14304 -81460 -143780 -228920 -418447 -594733 -530752 -252313 -86394 -222920
31607 -222920 -433857 -405831 -168055 32678 120306 176402 155761 -61154 -363924 -475787
31597 -475787 -349971 -218218 -192647 -101833 176273 471464 552201 409562 183999 -29715
31587 -29715 -192076 -276542 -313550 -354363 -344523 -189036 27335 88855 -33015 -136435 -123162
31576 -123162 -112476 -137770 -43862 159952 181216 -77099 -232359 55495 525209 649224
31566 649224 349376 -2749 -164048 -193502 -130384 71340 279344 249523 21204 -94798
31556 -94798 6275 80639 -45200 -226463 -276652 -198879 -32101 234397 460621 376092
31546 376092 -16975 -332877 -294536 -86067 -7893 -43095 -28236 -13725 -125086 -233696
31536 -233696 -118625 132709 224371 117034 73637 230393 420941 480194 452296 408612
31526 408612 298804 105619 -44207 -60617 -37639 -89401 -153360 -92574 77723 189801
31516 189801 123433 -72959 -241857 -249336 -84809 133789 267719 273645 191714 60096 -81141
31505 -81141 -137420 -36857 132274 188861 93988 -7312 -18093 -17319 -80297 -119711 -30734
31494 -30734 120614 201041 217954 266230 324954 280281 136632 39734 64716 115062 64727
31483 64727 -109910 -355759 -573380 -597230 -303390 176303 476575 363244 10184 -196963
31473 -196963 -87388 164854 295452 212622 2176 -217699 -386721 -493107 -533582 -504521
31463 -504521 -432450 -384016 -396278 -402032 -296847 -100688 33904 24505 -22777 18452 95759
31452 95759 73312 -30630 -58177 42971 144574 144839 111933 151368 239817 277358 227927
31441 227927 125247 4989 -79122 -24981 220669 541200 720158 658776 470093 337985
31431 337985 327424 358605 332508 239204 142948 93680 79448 59560 16796 -30150 -40139 30555
31419 30555 178163 297374 234301 -43173 -358553 -482206 -370345 -197619 -161908 -303522
31409 -303522 -495909 -559656 -409822 -148895 17645 15618 -7765 88047 203899 141761 -86042
31398 -86042 -280334 -360374 -423887 -489473 -433140 -263601 -208515 -374458 -536457 -459959 -254685
31387 -254685 -180861 -237183 -199148 -3820 152545 100937 -115900 -361497 -541740 -599806
31377 -599806 -516929 -355587 -212307 -122208 -75569 -83168 -136967 -169761 -159933 -199178 -329855
31366 -329855 -406512 -284370 -67829 17797 -55690 -126027 -111166 -56583 45269 236094 398899
31355 398899 338306 84265 -120928 -173109 -199874 -263111 -243445 -113810 -55473 -155866 -229062
31344 -229062 -110997 66921 86372 -33925 -102602 -22668 154791 330201 386503 245983
31334 245983 7007 -110944 -50931 20316 19820 83959 257598 315093 118856 -84879 -17782
31323 -17782 178416 168212 -45689 -171356 -119799 -81331 -134125 -131648 -15945 71599 52941
31312 52941 8546 -46042 -199128 -382064 -351136 -52604 238021 280759 166425 109913 142608
31301 142608 161959 121838 21584 -154727 -348846 -413292 -324760 -278570 -414128 -567912
31291 -567912 -486372 -210792 -57319 -221088 -548994 -733032 -637169 -400446 -257275 -278972
31281 -278972 -312149 -198506 -3612 72216 -20161 -129033 -146682 -136503 -165527 -179247 -130488
31270 -130488 -81593 -76912 -54150 9952 9221 -111582 -224282 -205752 -125605 -90405 -36054 133192
31258 133192 311286 315199 173764 77090 83243 85675 42189 22955 40827 43284 76003 243268
31246 243268 485808 607920 560384 488612 459349 367306 184781 64926 75567 51466 -131333
31235 -131333 -329952 -363938 -294404 -268703 -244959 -116934 8408 -55768 -224163 -223477 -40852
31224 -40852 12739 -220572 -473072 -420011 -120583 110282 140415 113797 163395 241715 255618
31213 255618 201624 102370 -76757 -359653 -662040 -838770 -820481 -663917 -474236 -311135
31203 -311135 -174430 -50620 54584 125793 150087 105348 -33180 -235695 -382495 -343343
31193 -343343 -113871 158025 299206 249288 86485 -34854 21288 261963 517278 571929
31183 571929 392747 170089 90476 139492 190392 198819 198247 167516 53115 -89012 -122948
31172 -122948 -32089 40948 1086 -69607 -54299 26247 59306 -21582 -210800 -455804 -629711
31161 -629711 -576718 -304987 -64736 -91955 -307434 -419797 -325734 -241633 -373258 -598986
31151 -598986 -620759 -373328 -128369 -147956 -340890 -374695 -108709 211139 257052 24380
31141 24380 -197312 -216377 -129385 -86233 -50770 74294 213284 190468 -6784 -201663 -266175
31130 -266175 -254430 -284744 -400709 -566071 -697888 -692167 -516933 -295790 -200297 -244334 -288714
31119 -288714 -261166 -241072 -284780 -306044 -216004 -71280 18782 44506 45895 -16548 -211008
31108 -211008 -487744 -706505 -804945 -831697 -807916 -673856 -420243 -177451 -90063 -144870
31098 -144870 -199175 -160874 -65808 21479 94771 157150 172703 149049 197997 385946 557213
31087 557213 473619 155668 -95910 -103123 -54284 -197193 -452213 -550823 -453739 -366955 -372244
31076 -372244 -315790 -110147 99076 164104 132844 107916 79196 11289 -52404 -88119 -158022
31065 -158022 -268781 -302571 -207360 -118858 -162783 -268601 -321164 -363943 -485402 -620291 -645746
31054 -645746 -579316 -497897 -351800 -65724 244289 377046 335760 295555 296015 190298 -72425
31043 -72425 -321908 -389060 -293577 -151818 -36353 19734 2428 -47800 -74933 -96157 -147293
31032 -147293 -155025 -13806 203496 281090 144420 -51771 -169329 -257943 -408372 -586728
31022 -586728 -711063 -772838 -791647 -750070 -650445 -545028 -454747 -356857 -284834 -303694 -345012
31011 -345012 -238601 13499 176407 107981 -37461 -77468 -88857 -224574 -396349 -389295
31001 -389295 -202341 -22952 82131 190315 259562 127596 -172023 -358220 -283133 -148509
30991 -148509 -196466 -363567 -418292 -307510 -166463 -66091 37526 123143 81295 -82509
30981 -82509 -191379 -134009 -34880 -74674 -222915 -281146 -159582 20281 108491 93902 50518
30970 50518 24585 43834 146675 302122 363566 220233 -34705 -205038 -248411 -304277 -450435
30959 -450435 -568400 -511962 -299014 -55732 141658 278752 329604 284881 226667 274770
30949 274770 443898 601881 572368 270178 -211531 -609755 -658474 -334470 94044 337608
30939 337608 370246 364107 386472 302548 9886 -355237 -542235 -469446 -295578 -213790 -249470
30928 -249470 -293665 -279773 -249804 -247038 -229739 -149381 -56411 -39409 -82898 -83871 -12496 42573
30916 42573 10413 -78921 -182304 -311659 -453957 -516688 -437214 -284249 -176395 -152055 -180377
30905 -180377 -238066 -307677 -358188 -388154 -422467 -414934 -255152 43684 271627 256629 86368
30894 86368 -29714 -33007 -7091 15070 55229 61057 -29161 -120783 -59141 116211 209303 160051
30882 160051 92514 60757 -19836 -141240 -153231 -44066 -28805 -209921 -367987 -279738 -64211
30871 -64211 1867 -128047 -290326 -402643 -493555 -521130 -418174 -284318 -281485 -340210 -225815
30860 -225815 64400 227790 75835 -205283 -355192 -397233 -500381 -630249 -579699 -302329
30850 -302329 2727 161455 207152 237394 233647 125141 -48028 -147422 -100464 18747 80674
30839 80674 31109 -76866 -152493 -157777 -141298 -180754 -279464 -336301 -255103 -78896 38394
30828 38394 12490 -75993 -103878 -55715 22907 157121 393613 632471 668742 458976 209691
30817 209691 115942 143916 187060 287719 501533 643960 450638 -906 -306466 -267263
30807 -267263 -157326 -295273 -568129 -629764 -433870 -269193 -294424 -334525 -210841 -25037
30797 -25037 28549 -40103 -77716 -42128 -23682 -53339 -45899 44637 118782 33079 -223755 -482649
30785 -482649 -532014 -323800 -30294 148902 213520 308900 463134 526902 419027 266439
30775 266439 195770 141278 10024 -104892 -77832 -7330 -76375 -220391 -205758 -26959 63956
30764 63956 -29588 -98954 -1611 94526 6495 -159755 -203300 -131486 -50853 75417 315600
30753 315600 543958 584495 494031 456123 464975 369766 182771 75930 85929 79831 11880
30742 11880 -44195 -121422 -331522 -576713 -600229 -412684 -352010 -569425 -761855 -632828
30732 -632828 -346663 -241877 -307801 -283919 -151454 -157233 -357561 -474706 -303421 -15967
30722 -15967 77220 -74086 -230277 -163453 99884 322019 312337 141429 56754 161567 271529
30711 271529 176557 -57169 -198262 -192566 -196234 -279137 -315140 -234186 -187411 -325225 -539476
30700 -539476 -587218 -414197 -206618 -126471 -124244 -59313 82025 170532 112996 -27659 -116075
30689 -116075 -98888 -30283 18832 5299 -110695 -325518 -502983 -447233 -150482 122679
30679 122679 114307 -117829 -292380 -271550 -194225 -233122 -363233 -442185 -421722 -377123 -359510
30668 -359510 -310989 -152004 92466 302055 398960 430916 478560 522220 481375 370097 303177
30657 303177 324808 343700 282323 171796 40074 -149892 -348622 -358291 -82419 279070
30647 279070 462434 466394 451420 423301 279201 106883 129189 332768 456500 419521 456408
30636 456408 695522 894781 801928 542373 407468 435032 452699 399981 339200 238699
30626 238699 21362 -211870 -272608 -198208 -224297 -412703 -543862 -448822 -236349 -94274
30616 -94274 -50009 -41862 -64534 -107217 -79017 54449 159189 108170 -9213 -13169 83505
30605 83505 92857 -58243 -228404 -283825 -261228 -239691 -189884 -61639 77690 125064 107457
30594 107457 132053 192880 163081 -6343 -206118 -325907 -375189 -386333 -312606 -127756 54052
30583 54052 88342 223 -44891 29211 111392 55378 -147073 -371027 -482359 -440237 -316945
30572 -316945 -222168 -181787 -116035 26351 164028 183274 92897 -14818 -114380 -240689 -361854
30561 -361854 -398107 -366513 -364762 -394804 -350373 -216373 -130127 -180240 -278510 -303729 -248137
30550 -248137 -150245 -18171 87746 32274 -208210 -439082 -457506 -298750 -169110 -207133
30540 -207133 -399562 -635315 -737475 -551642 -140196 197933 235813 62933 -103457 -226604
30530 -226604 -385782 -518381 -481332 -334136 -299864 -409828 -418724 -156325 219067 420000
30520 420000 352860 155701 17907 36302 166941 261787 218924 120031 138539 305300 474363
30509 474363 535794 529908 506955 413910 213983 18947 -9924 145805 344960 442909 418351
30498 418351 357709 339484 337969 261948 97301 -50604 -98431 -84622 -53516 51466 249550
30487 249550 389227 347943 283236 436328 716164 767662 499756 252372 311118 510966
30477 510966 506367 243168 -40882 -155529 -111233 -23008 -14036 -137158 -271109 -191118 136960
30466 136960 440889 452192 227955 27808 -21122 16209 58247 74256 48737 27834 124582
30455 124582 333824 436647 259183 -56533 -219911 -155689 -15760 95806 194277 256789
30445 256789 217716 119099 78236 112114 158476 226450 332130 342293 128034 -153390 -204427
30434 -204427 -26584 72881 -37970 -130495 -16528 159775 196815 144748 134894 113698 -19640
30423 -19640 -169028 -175865 -94813 -113174 -257967 -373835 -348391 -205007 -27168 67558 -45887
30412 -45887 -337827 -554035 -478785 -219841 -68757 -127390 -244979 -278344 -219233 -85615
30402 -85615 106397 249083 218684 80418 34353 112378 119903 -47531 -222705 -223574 -129517
30391 -129517 -141474 -277673 -383789 -391447 -398480 -491369 -620218 -679151 -618234 -443823 -184254
30380 -184254 95487 292364 340582 283947 223267 171233 12062 -320116 -643866 -644884 -262686
30369 -262686 152249 213029 -38958 -227090 -172516 -98093 -227281 -412288 -344627 9011
30359 9011 391673 602254 650920 597868 447115 241112 96673 72100 94558 62541 -56629
30348 -56629 -237786 -407887 -448305 -311599 -139319 -113707 -176315 -83443 198389 370620
30338 370620 215085 -67675 -137211 15466 121611 74593 43573 151626 292945 329290
30328 329290 266960 165139 38422 -74106 -98655 -67343 -128734 -336682 -560662 -679769
30318 -679769 -719941 -715843 -607496 -402977 -280937 -355573 -461776 -364704 -95929 108825
30308 108825 138307 78363 10900 -52995 -69020 -4064 17422 -169238 -478677 -624147 -516003
30297 -516003 -389897 -434561 -501666 -342196 33391 409602 653146 752325 668044 379173
30287 379173 56549 -34685 135776 301186 243328 61788 -2734 103722 239349 314769
30277 314769 374229 423291 352860 126411 -85601 -98497 28948 85052 25084 24668 186624
30266 186624 371568 407794 323843 253751 225404 176827 96502 12037 -93102 -223582 -300035
30255 -300035 -270088 -217676 -229162 -243155 -192642 -186866 -337652 -498506 -442247 -243662 -183863
30244 -183863 -282122 -254419 6549 247805 269882 200563 185764 113492 -126568 -371385 -432815
30233 -432815 -399044 -418802 -388735 -165995 70737 22542 -253778 -410965 -321735 -205523
30223 -205523 -236861 -328196 -356377 -340674 -311271 -219550 -75183 -302 -56376 -143354 -131215
30212 -131215 8795 218031 382033 358612 111996 -185953 -322856 -294486 -246815 -219015
30202 -219015 -131845 -746 53999 11373 -39751 -88772 -181672 -219435 -44246 237934 302686
30191 302686 61018 -195619 -211837 -71389 45648 144173 269966 313044 169353 -65655
30181 -65655 -245265 -353546 -383581 -232973 81884 300686 240926 77878 61337 120273
30171 120273 33725 -146234 -173232 -30946 56581 14001 -14649 -496 -105263 -343426 -468240
30160 -468240 -324442 -69882 94150 193816 320995 392958 280167 59662 -58545 -14972
30150 -14972 38686 -53689 -286691 -518866 -598888 -497421 -358714 -364291 -499159 -538512 -344379
30139 -344379 -85066 -33375 -198370 -309146 -172861 90929 231952 178263 66869 20801
30129 20801 8967 -62627 -205995 -336386 -348342 -174051 166765 510231 604690 341528
30119 341528 -72843 -285231 -166633 71659 160988 72083 -31673 -44663 -22676 -71788
30109 -71788 -209271 -328518 -283047 -49730 183230 178195 -68647 -309054 -362323 -331109 -402391
30098 -402391 -553497 -605297 -497020 -351678 -293487 -328644 -392065 -407430 -325426 -196928 -164783
30087 -164783 -280442 -386536 -306786 -98391 27429 -7847 -97344 -148479 -168392 -163960 -121562
30076 -121562 -84099 -92394 -62909 105666 319618 382679 302189 279742 366674 373079 198078
30065 198078 11583 -12260 74861 168443 296830 458323 476466 246844 -22639 -66301
30055 -66301 47230 32288 -164433 -298439 -218788 -80351 -93166 -242348 -354406 -327300
30045 -327300 -212177 -135227 -186197 -330650 -414701 -316227 -98902 47004 20914 -91381
30035 -91381 -132902 -27651 165210 279402 150970 -204750 -538595 -597631 -414297 -254921
30025 -254921 -267389 -315806 -222527 -38833 45152 -20956 -100495 -81414 -8356 23049 8001
30014 8001 14689 77003 153499 168701 72329 -105751 -237194 -187858 19186 180665 122678
30003 122678 -102174 -303039 -389409 -405963 -365048 -218206 -23577 45337 -48366 -110278 36
29992 36 143706 129095 23079 21328 108220 92030 -68846 -222177 -290635 -341594 -380093 -317279
29980 -317279 -180155 -115971 -141196 -118023 -20974 29735 46980 186122 388194 354517 38357
29969 38357 -183965 -67239 110525 19561 -161149 -52834 275301 417135 268193 98003
29959 98003 21803 -143363 -429491 -540408 -290307 83063 229106 106355 -56548 -75396
29949 -75396 28826 86503 -53516 -331351 -480932 -353359 -159076 -190587 -381716 -411386
29939 -411386 -208790 -41715 -78376 -185669 -242775 -335951 -503028 -568736 -413684 -185348
29929 -185348 -75345 -76949 -101098 -136379 -162502 -111470 -47389 -160789 -433466 -547758 -316651
29918 -316651 25606 173602 164077 188600 202786 31009 -269688 -450270 -406162 -233087
29908 -233087 -28216 137171 144816 -23535 -152250 -57562 94841 8476 -278463 -447870
29898 -447870 -392276 -334686 -429734 -543043 -505927 -337028 -121119 104487 242850 135085
29888 135085 -193806 -451166 -393426 -130572 13435 -109555 -322963 -359659 -190973 -77545
29878 -77545 -242892 -528938 -535310 -155379 237554 295304 166139 197921 357213 318867 53363
29867 53363 -94650 45980 234693 238503 143637 99783 69866 20571 80368 289553 423729
29856 423729 287139 -7313 -243859 -391103 -484711 -437925 -219199 -39203 -85788 -209684
29846 -209684 -150217 43818 117300 51787 80749 268276 384320 273756 96953 77890
29836 77890 179812 167214 -77895 -387772 -456467 -164820 237831 357725 102702 -214578
29826 -214578 -289774 -178710 -104092 -96898 -52944 -2460 -47864 -114949 -46493 104749 156943
29815 156943 130135 182210 231540 14116 -415096 -618355 -378137 -31964 15705 -171523
29805 -171523 -282841 -275520 -340548 -493464 -536008 -395840 -233498 -196386 -272189 -399723 -546591
29794 -546591 -655268 -660997 -587212 -513561 -459201 -406775 -400250 -470156 -490235 -288698 81164
29783 81164 353330 375206 260400 156273 35792 -153220 -276790 -152030 143782 294180
29773 294180 125306 -171895 -297528 -223605 -171082 -236003 -231318 8619 326464 429948
29763 429948 300406 184888 187644 130831 -88773 -263027 -187809 -21595 -73121 -346065
29753 -346065 -570452 -630760 -664833 -720406 -619651 -282094 68507 193635 157821 171759
29743 171759 251288 237997 84991 -84015 -185547 -261649 -325395 -281827 -83476 141668
29733 141668 223364 169424 154532 276448 402221 324369 42248 -206310 -229047 -108916
29723 -108916 -66856 -161818 -254699 -240699 -156812 -37145 160148 392805 465202 275369 24753
29712 24753 -740 194995 352855 352087 353828 484331 573087 372257 -60411 -381556 -363494
29701 -363494 -134733 19890 -13196 -126440 -193441 -207219 -221975 -255016 -286991 -303277 -296182
29690 -296182 -266857 -252904 -301060 -376113 -363889 -226480 -88100 -81036 -165208 -205027 -169005
29679 -169005 -121191 -63704 39376 100164 -23444 -261442 -348314 -187475 10188 71809
29669 71809 129353 350453 588705 566352 308185 119137 146232 205546 77762 -222970
29659 -222970 -528988 -711260 -735259 -641573 -512511 -380529 -184298 92324 297350 275610
29649 275610 106619 -5177 -40947 -151306 -342588 -434000 -370467 -319441 -365575 -357957 -192612
29638 -192612 -17224 8473 -50064 -86086 -175698 -397031 -587488 -534640 -308014 -161149
29628 -161149 -175830 -230448 -255803 -278633 -247403 -70412 160679 224818 97879 14190 129721
29617 129721 306749 326371 169678 -9693 -84849 -43093 44906 82459 39232 13679 122524
29606 122524 315518 407427 321963 190129 161707 227189 281924 267155 182726 43887 -108991
29595 -108991 -220764 -283463 -319168 -280840 -81497 222814 399237 292800 39103 -89034
29585 -89034 -5961 118473 98240 -54304 -169139 -116578 59093 182585 114144 -120237
29575 -120237 -358140 -442661 -330237 -104496 71421 60938 -110969 -253081 -217497 -86030
29565 -86030 -49171 -126930 -144465 9773 247952 439900 557529 594744 486477 220537
29555 220537 -63768 -199369 -158241 -23273 131953 259168 308809 273538 197185 78840
29545 78840 -139595 -411769 -529430 -359306 -54129 120039 110227 79896 129615 185830 168798
29534 168798 108649 55598 7961 -18112 38108 168462 241995 148207 -49031 -172231 -134874
29523 -134874 -38303 -53056 -220138 -391910 -388798 -198231 29661 176373 258108 305482 252445
29512 252445 46946 -196662 -283608 -163970 25268 131666 108068 -24049 -216657 -371641
29502 -371641 -369798 -188942 34497 98734 -97216 -457129 -749955 -814099 -716210 -641648 -615138
29491 -615138 -459216 -105103 207270 204679 -44037 -224724 -193668 -86229 -35910 -19767
29481 -19767 -13412 -69672 -162944 -157743 -37746 12886 -121762 -301560 -348849 -307172 -318450
29470 -318450 -361109 -298830 -127409 -572 -29465 -180052 -342484 -405169 -315086 -167915
29460 -167915 -162861 -340104 -446374 -230673 186843 438995 378520 205631 115292 54082
29450 54082 -81513 -216531 -227303 -162685 -163225 -236089 -269692 -230068 -190645 -178707 -140350 -83479
29438 -83479 -118812 -287332 -447206 -433819 -280049 -168317 -177941 -200304 -143538 -103124 -215113
29427 -215113 -401000 -413841 -161489 149699 261927 151221 -20648 -136880 -175452 -99274
29417 -99274 125232 392773 502121 391614 217892 143002 146477 117302 37835 -15327 6765
29406 6765 87563 189754 271411 294012 267096 241371 215928 121994 -43993 -158954 -133518
29395 -133518 -49313 -23582 -22480 38222 78219 -53766 -282634 -329824 -93251 201571 331544
29384 331544 362578 450867 524312 387770 69995 -165991 -166286 -51796 -446 -25381 -46476
29373 -46476 -58679 -122106 -245448 -374876 -482705 -597354 -733243 -831931 -809007 -665069
29363 -665069 -516270 -467724 -472297 -395824 -234580 -153762 -241976 -343448 -260773 -40348 105224
29352 105224 113540 128482 237485 335403 304256 178085 54505 -37288 -101078 -104486 -29508
29341 -29508 67302 100088 19132 -170395 -385647 -486908 -431258 -372553 -456339 -551703 -404160
29330 -404160 -53687 169050 119804 15019 12778 -54176 -322819 -596458 -683092 -742647 -930822
29319 -930822 -961786 -505732 141360 340476 41631 -126788 192977 588955 566105 260940
29309 260940 118955 207524 256950 173041 107039 109569 65298 -39986 -60495 75847 262574
29298 262574 353987 276811 39027 -235345 -327739 -129049 206330 429377 470732 431675
29288 431675 376749 285849 161937 36002 -102060 -245638 -290315 -151503 77852 230389
29278 230389 285318 335230 369267 266229 10252 -244910 -359918 -341792 -274415 -222212 -215979
29267 -215979 -246038 -266693 -270565 -315091 -394884 -365823 -124765 201812 397868 428292 407090
29256 407090 358137 210239 865 -131288 -160988 -180525 -187076 -87341 67872 97454 -8396
29245 -8396 -46562 58093 123636 42899 -8129 133375 333521 380784 307454 271173 263924
29234 263924 171722 15198 -92583 -140139 -161730 -85190 138139 342572 341051 238338 271489
29223 271489 384595 288705 -34272 -232153 -91843 170155 291802 344192 485416 579764
29213 579764 384263 -11350 -258164 -234907 -168940 -232245 -280745 -117615 166281 275343
29203 275343 60467 -325353 -597498 -605028 -443948 -337431 -396281 -514234 -530235 -441070
29193 -441070 -365268 -338462 -278547 -153563 -39340 24107 94619 196024 264931 291903 358359
29182 358359 439858 348048 21750 -280175 -279878 -62155 64873 2615 -90349 -121161 -146728
29171 -146728 -138079 36960 327311 471680 365552 206639 158295 127360 29792 7371 159084
29160 159084 295855 233806 132850 230969 394312 288545 -77055 -340940 -323091 -224597
29150 -224597 -240791 -293880 -258366 -180628 -136673 -88937 -16673 842 -45805 -25102 110290
29139 110290 203891 139687 37820 48102 101118 48552 -69232 -95877 -24468 4017 -62985
29128 -62985 -124861 -99877 -26979 21050 30560 37408 81050 161897 213206 159854 40562 -3136
29116 -3136 79412 147689 52825 -143619 -234118 -112647 122047 278387 228763 4166 -211383
29105 -211383 -240913 -120343 -62944 -164435 -263810 -195237 -46853 -11786 -81080 -79248 42375
29094 42375 148837 158508 152402 208692 277680 269748 149231 -88216 -401192 -626988 -567611
29083 -567611 -237102 92965 199871 174099 257690 477495 589474 404970 45906 -203197
29073 -203197 -227368 -160120 -146267 -151998 -76720 45516 85796 22041 -47893 -100977 -232209
29062 -232209 -441405 -538748 -389895 -140877 -48328 -155091 -282197 -296119 -229452 -151296
29052 -151296 -68165 22393 92836 128444 129343 67542 -73998 -224852 -283074 -251142 -229665
29041 -229665 -275139 -347139 -387474 -358874 -219868 22917 234302 248792 83688 -51412
29031 -51412 4251 201614 381374 424491 275334 -47257 -383044 -494423 -316658 -73422
29021 -73422 -24940 -147372 -190890 -44360 101874 20462 -227428 -351080 -199169 48495
29011 48495 114168 -41234 -224449 -307376 -358910 -444116 -457537 -286709 -40382 53946 -45368
29000 -45368 -142513 -73880 95487 188434 135184 20119 -34221 19958 130690 199435 164860
28989 164860 46076 -84112 -148105 -106550 -14239 -20306 -207234 -413037 -354352 6477 363670
28978 363670 442207 319034 223938 176723 41231 -171728 -317749 -385655 -487380 -592842
28968 -592842 -544970 -368542 -292153 -386666 -441002 -314486 -170220 -194235 -288636 -248678 -99546
28957 -99546 -36570 -104704 -140991 -27689 148787 218901 126201 -21303 -66922 27221 136510
28946 136510 130495 40701 -2955 32803 65890 53107 31920 18134 -1705 6697 57524 36687
28934 36687 -138870 -287828 -151205 182651 343044 219617 101010 158606 169284 -30862
28924 -30862 -186186 -45569 149936 7505 -386053 -596736 -495036 -353213 -332031 -286839
28914 -286839 -129038 -5999 -9720 -5730 118610 268541 315941 262411 146053 -18050 -129866
28903 -129866 -47116 166946 241479 64301 -135928 -116412 36193 61733 -95861 -259307
28893 -259307 -307178 -304932 -333555 -333856 -199341 36507 196201 166552 51339 30959 86616
28882 86616 1861 -301488 -575454 -532129 -214419 86280 207431 217835 190365 100597 -21348
28871 -21348 -40723 103588 305389 429442 435322 347285 227352 189782 303300 463026 497851
28860 497851 406093 323088 260787 91855 -171643 -319695 -259719 -171778 -215120 -281569 -218596
28849 -218596 -128855 -220589 -450738 -547002 -379530 -132579 -65508 -211995 -364923 -313932
28839 -313932 -69193 155230 191705 114313 112257 207692 240789 146267 70760 131237 209073
28828 209073 122045 -92516 -213643 -125208 42351 63787 -140163 -415474 -530102 -446492
28818 -446492 -391768 -558451 -790764 -752245 -403029 -77932 -15996 -55454 51246 243096
28808 243096 302787 244678 270824 401942 422859 217191 -59563 -199184 -172078 -75604 22669
28797 22669 112441 184246 208309 147941 -10267 -208407 -322470 -269170 -92781 95130 228080
28786 228080 291526 274247 190086 109049 86967 93695 82272 85531 151528 219029 175641 43288
28774 43288 -7591 127682 340980 442846 397168 346754 399743 470767 411268 259543 227928
28763 227928 403042 605485 653307 613680 611137 529389 191123 -236689 -376880 -217725
28753 -217725 -176776 -454543 -701590 -573794 -281472 -239314 -420712 -468052 -300401 -187715
28743 -187715 -261065 -345569 -320040 -299791 -375359 -450282 -436310 -380287 -318600 -221715 -149840
28732 -149840 -234385 -414432 -416135 -120845 231704 339769 187615 -21360 -137554 -145983
28722 -145983 -91977 -50771 -91535 -182749 -207654 -127986 -35119 4803 30272 54807 7418
28711 7418 -109546 -150685 -37690 83957 37412 -132661 -246019 -253398 -259782 -316336 -348039
28700 -348039 -307904 -275289 -337850 -443230 -439281 -256461 -8057 116713 47670 -112071 -223751
28689 -223751 -246637 -215522 -165596 -137554 -180845 -271532 -298560 -223241 -172603 -259900 -394764
28678 -394764 -412176 -312263 -209721 -121557 2063 100806 79320 13643 42112 84473 -56623
28667 -56623 -321040 -423081 -295340 -185513 -237431 -304584 -293831 -346089 -496932 -501826 -249474
28656 -249474 -40813 -150832 -369637 -322864 -49943 100922 17925 -97195 -116164 -103326
28646 -103326 -85546 -19419 23217 -78847 -253244 -321501 -309008 -392045 -550072 -567632 -402100
28635 -402100 -256211 -240729 -253035 -252702 -359715 -573940 -682504 -594085 -512699 -606556 -729987
28624 -729987 -677809 -530023 -509941 -617225 -630799 -426334 -102887 189678 399171 541373
28614 541373 633099 678390 665902 574227 405492 203867 38080 -16048 82449 248149 276747
28603 276747 72476 -164249 -141915 128409 332636 283322 141635 119733 166603 104683
28593 104683 -76938 -243283 -319469 -307546 -189032 8344 107883 -59226 -399311 -618228
28583 -618228 -559601 -362170 -262146 -340679 -488383 -537089 -404751 -167868 3720 27573
28573 27573 1753 62860 193534 263267 237821 231471 322450 410602 324743 37305 -277108
28562 -277108 -398692 -264498 -9248 197007 327033 464681 607866 604339 349243 -21591
28552 -21591 -232304 -147319 112959 318844 335154 204486 99222 177031 412310 579898
28542 579898 482281 190229 -28853 -33797 39283 -6596 -164989 -279982 -302884 -353408 -510809
28531 -510809 -675581 -714865 -650419 -592070 -549836 -460460 -377281 -444360 -627237 -661810 -407375
28520 -407375 -92689 -15350 -111929 -80648 116342 172788 -78767 -382886 -413389 -197645
28510 -197645 2124 72552 95155 112369 85522 53936 112822 209310 154879 -92963 -317507
28499 -317507 -308595 -136092 -50880 -172176 -379237 -498578 -499321 -463948 -432090 -362054 -252397
28488 -252397 -210376 -326008 -527078 -653384 -652084 -594598 -514562 -368689 -182679 -82843 -113394
28477 -113394 -160711 -144430 -139645 -196415 -192731 -37086 111569 43697 -159045 -222003 -95579
28466 -95579 -27352 -171252 -349372 -312547 -80950 98406 42070 -213764 -478051 -557202
28456 -557202 -402655 -161954 -41757 -101117 -232098 -329082 -375583 -362642 -255540 -90395
28446 -90395 11003 -11684 -84433 -123747 -138497 -153129 -137142 -90430 -102601 -227707 -367256
28435 -367256 -374455 -230955 -44412 81816 106838 38954 -47170 -22182 173344 427418 554230
28424 554230 491869 351130 274464 292158 320649 277773 189123 158248 207783 204387 31297
28413 31297 -205208 -288857 -215247 -215809 -395541 -545121 -454332 -239042 -153629 -202497 -183410
28402 -183410 -57395 -10951 -134456 -285461 -343808 -386077 -492813 -564158 -475627 -284867
$$ [...]
##END NTUPLES=NMR SPECTRUM
##END=
