##TITLE=31Pdec_LY-TMF-15.24.R.T
 D2O, 24 sc
 6.3.2020
##JCAMPDX= 6.0         $$ Bruker NMR JCAMP-DX V2.0
##DATA TYPE= NMR SPECTRUM
##DATA CLASS= NTUPLES
##ORIGIN= UXNMR, Bruker Analytische Messtechnik GmbH
##OWNER= root
$$ XWIN-NMR		Version 3.5
$$ Fri Mar  6 16:47:36 2020 Russian Standard Time (UT+4h)  she@DPX200
##.OBSERVE FREQUENCY= 81.013821
##.OBSERVE NUCLEUS= ^31P
##.ACQUISITION MODE= SIMULTANEOUS
##.ACQUISITION SCHEME= undefined
##.AVERAGES= 24
##.DIGITISER RES= 17
##SPECTROMETER/DATA SYSTEM= spect
##.PULSE SEQUENCE= zgpg30
##.SOLVENT NAME= CDCl3
##.SHIFT REFERENCE= (INTERNAL, CDCl3, 0, 182.463)
##AUDIT TRAIL= $$ (NUMBER, WHEN, WHO, WHERE, WHAT)
$$ ##TITLE= Audit trail, XWIN-NMR		Version 3.5
$$ ##JCAMPDX= 5.01
$$ ##ORIGIN= Bruker BioSpin GmbH
$$ ##OWNER= she
$$ F:/spectra/data/she/nmr/P31/1/pdata/1/auditp.txt
$$ ##AUDIT TRAIL=  $$ (NUMBER, WHEN, WHO, WHERE, WHAT)
(   1,<2020-03-06 16:46:02.14 +0400>,<she>,<DPX200>,
      <created by zg, POWCHK disabled, PULCHK disabled
       configuration hash MD5:
       00 E9 B6 7A A2 85 ED C7 34 08 36 98 17 FE 4E 26
       data hash MD5: 32K
       41 F5 05 6C 1E 91 EA 4D 06 F3 83 50 64 89 4A 31>)
(   2,<2020-03-06 16:46:10.17 +0400>,<she>,<DPX200>,
      <Start of raw data processing
       efp BC_mod = 2 LB = 1 FT_mod = 6 PKNL = 1 PHC0 = -1357.237 PHC1 = 150.6017 SI = 64K 
       data hash MD5: 64K
       31 A9 1F F2 51 D1 00 42 EB 4A A8 CE 3D 40 E1 33>)
(   3,<2020-03-06 16:46:31.35 +0400>,<she>,<DPX200>,
      <pk PHC0 = -1.35329 PHC1 = 0 
       data hash MD5: 64K
       73 10 64 A3 53 D0 46 A1 43 51 00 19 2F 86 DA 06>)
$$ ##END=
$$ 
$$ hash MD5
$$ 62 02 B3 1E CC 82 C5 38 34 97 5E 7B 5D 8F 9D E5
##$RELAX= 
##$RELAX= 
##$RELAX= 
##$RELAX= 
##$RELAX= 
##$RELAX= 
##$RELAX= 
##$RELAX= 
$$ Bruker specific parameters
$$ --------------------------
##$DU= <F:/spectra>
##$EXPNO= 1
##$NAME= <P31>
##$PROCNO= 1
##$TYPE= <nmr>
##$USER= <she>
##$AMP= (0..31)
100 100 100 100 100 100 100 100 100 100 100 100 100 100 100 100 100 100 
100 100 100 100 100 100 100 100 100 100 100 100 100 100 
##$AQSEQ= 0
##$AQ_mod= 1
##$AUNM= <au_zg>
##$AUTOPOS= <>
##$BF1= 81.014009
##$BF2= 200.13
##$BF3= 200.13
##$BF4= 200.13
##$BF5= 200.13
##$BF6= 200.13
##$BF7= 200.13
##$BF8= 200.13
##$BYTORDA= 1
##$CFDGTYP= 0
##$CFRGTYP= 5
##$CHEMSTR= <none>
##$CNST= (0..31)
1 1 145 1 1 1 1 1 1 1 1 1 1 1 1 1 1 1 1 1 1 1 1 1 1 1 1 1 1 1 1 1 
##$CPDPRG= <waltz16>
##$CPDPRG1= <>
##$CPDPRG2= <waltz16>
##$CPDPRG3= <>
##$CPDPRG4= <mlev>
##$CPDPRG5= <mlev>
##$CPDPRG6= <mlev>
##$CPDPRG7= <mlev>
##$CPDPRG8= <mlev>
##$CPDPRGB= <>
##$CPDPRGT= <>
##$D= (0..31)
0 1 0 0 0 0 0 0 0 0 0 0.03 2e-05 3e-06 0 0 0 0 0 0 0 0 0 0 0 0 0 0 0 0 
0 0 
##$DATE= 1583498761
##$DBL= (0..7)
120 120 120 11 120 120 24 19 
##$DBP= (0..7)
150 150 150 150 150 150 150 150 
##$DBP07= 0
##$DBPNAM0= <>
##$DBPNAM1= <>
##$DBPNAM2= <>
##$DBPNAM3= <>
##$DBPNAM4= <>
##$DBPNAM5= <>
##$DBPNAM6= <>
##$DBPNAM7= <>
##$DBPOAL= (0..7)
0.5 0.5 0.5 0.5 0.5 0.5 0.5 0.5 
##$DBPOFFS= (0..7)
$$ [...]
##$SUBNAM2= <"">
##$SUBNAM3= <"">
##$SUBNAM4= <"">
##$SUBNAM5= <"">
##$SUBNAM6= <"">
##$SUBNAM7= <"">
##$SUBNAM8= <"">
##$SUBNAM9= <"">
##$SW= 369.568048894756
##$SWIBOX= (0..15)
0 1 3 0 0 0 0 0 0 0 0 0 0 0 0 0 
##$SW_h= 29940.119760479
##$TD= 32768
##$TD0= 1
##$TE= 0
##$TE2= 300
##$TE3= 300
##$TEG= 300
##$TL= (0..7)
0 120 53 12 22 120 120 120 
##$TP= (0..7)
150 150 150 150 150 150 150 150 
##$TP07= 0
##$TPNAME0= <>
##$TPNAME1= <>
##$TPNAME2= <>
##$TPNAME3= <>
##$TPNAME4= <>
##$TPNAME5= <>
##$TPNAME6= <>
##$TPNAME7= <>
##$TPOAL= (0..7)
0.5 0.5 0.5 0.5 0.5 0.5 0.5 0.5 
##$TPOFFS= (0..7)
0 0 0 0 0 0 0 0 
##$TUNHIN= 0
##$TUNHOUT= 0
##$TUNXOUT= 0
##$USERA1= <user>
##$USERA2= <user>
##$USERA3= <user>
##$USERA4= <user>
##$USERA5= <user>
##$V9= 5
##$VALIST= <valist>
##$VCLIST= <CCCCCCCCCCCCCCC>
##$VD= 0
##$VDLIST= <DDDDDDDDDDDDDDD>
##$VPLIST= <PPPPPPPPPPPPPPP>
##$VTLIST= <TTTTTTTTTTTTTTT>
##$WBST= 1024
##$WBSW= 4
##$XGAIN= (0..3)
0 0 0 0 
##$XL= 0
##$YL= 0
##$YMAX_a= 27722
##$YMIN_a= -29123
##$ZGOPTNS= <>
##$ZL1= 120
##$ZL2= 120
##$ZL3= 120
##$ZL4= 120
##$ABSF1= 0
##$ABSF2= 0
##$ABSG= 0
##$ABSL= 0
##$ALPHA= 0
##$AQORDER= 0
##$ASSFAC= 0
##$ASSFACI= 0
##$ASSFACX= 0
##$ASSWID= 0
##$AUNMP= <proc_1d>
##$AZFE= 0.1
##$AZFW= 0.5
##$BCFW= 0
##$BC_mod= 2
##$BYTORDP= 0
##$COROFFS= 0
##$CY= -3
##$DATMOD= 1
##$DC= 0
##$DFILT= <>
##$DTYPP= 0
##$F1P= 0
##$F2P= 0
##$FCOR= 1
##$FTSIZE= 65536
##$FT_mod= 6
##$GAMMA= 0
##$GB= 0
##$INTBC= 1
##$INTSCL= 5.30512e-09
##$ISEN= 30
##$LB= 1
##$LEV0= 0
##$LPBIN= 0
##$MAXI= 10000
##$MC2= 0
##$MEAN= 0
##$ME_mod= 0
##$MI= 50
##$NCOEF= 0
##$NC_proc= -3
##$NLEV= 6
##$NOISF1= 182.463
##$NOISF2= 159.3651
##$NSP= 0
##$NTH_PI= 0
##$NZP= 0
##$OFFSET= 182.463
##$PC= 4
##$PHC0= -1358.59
##$PHC1= 150.6017
##$PH_mod= 1
##$PKNL= yes
##$PPARMOD= 0
##$PSCAL= 0
##$PSIGN= 0
##$REVERSE= no
##$SF= 81.0140089999434
##$SI= 65536
##$SIGF1= 159.3651
##$SIGF2= -187.1042
##$SINO= 113.3802
##$SIOLD= 16384
##$SREGLST= <1H.CDCl3>
##$SSB= 0
##$STSI= 65536
##$STSR= 0
##$SW_p= 29940.119760479
##$SYMM= 0
##$S_DEV= 0
##$TDeff= 32768
##$TDoff= 0
##$TI= <>
##$TILT= no
##$TM1= 0
##$TM2= 0
##$TOPLEV= 0
##$USERP1= <user>
##$USERP2= <user>
##$USERP3= <user>
##$USERP4= <user>
##$USERP5= <user>
##$WDW= 1
##$XDIM= 65536
##$YMAX_p= 423654316
##$YMIN_p= -2876051
$$ End of Bruker specific parameters
$$ ---------------------------------
##NTUPLES= NMR SPECTRUM
##VAR_NAME=  FREQUENCY,     SPECTRUM/REAL,   SPECTRUM/IMAG
##SYMBOL=    X,             R,               I
##VAR_TYPE=  INDEPENDENT,   DEPENDENT,       DEPENDENT
##VAR_FORM=  AFFN,          ASDF,            ASDF
##VAR_DIM=   65536,         65536,           65536
##UNITS=     HZ,            ARBITRARY UNITS, ARBITRARY UNITS
##FACTOR=    0.456856943014862, 1,           1
##FIRST=     14782.0589164792, 0,            0
##LAST=      -15158.0608439998, 0,           0
##MIN=       -15158.0608439998, -2876051,    0
##MAX=       14782.0589164792, 423654316,    0
$$ Real data points
##PAGE= N=1
##DATA TABLE= (X++(R..R)), XYDATA
$$ [...]
##PAGE= N=2
##DATA TABLE= (X++(I..I)), XYDATA
36870b26265M6293O0942J30969J43582J8708j08564p3238Q1658J78415J24086
36860C76586k3784j31678r1056P2695J85344J11532n9855j27280m1326O7212Q6826
36849D25216K3304n7205o1133Q2024K74593K74709K7069j83278j21863K5416l9913
36838F68939k20088j89494M3585J62815Q2588K6768O8126L6273o4029l11K12316
36827H27488K31831m9942k87379k20460m0193M008k0812L402k3684j40162j19531
36816A64566J31994K92253Q7513k35476k73157o9283L1590m5214p3516M4394J74221
36805B29885K12094J61123K0612j50371j67693K9269J93474R3832j24585j82383
36795C15257j02448q3512r7587J3933J63913J40741K9909J02837L19578L57431
$$ plain form
36870 -226265 -179972 -119030 11939 155521 174229 65665 -7573 74085 252500 376586
36860 376586 352802 221124 130068 202763 388107 499639 439784 312504 271178 338390 425216
36849 425216 448520 391315 330182 412206 686799 961508 988577 805299 683436 708852 668939
36838 668939 448851 259357 302942 465757 548345 575113 643239 679512 615483 615172 827488
36827 827488 1059319 1009377 721998 501538 461345 465353 444541 447943 424259 284097 164566
36816 164566 296560 588813 676326 440850 167693 98410 130000 84786 11270 55664 229885
36805 229885 441979 603102 623714 473343 305650 334919 528393 622225 497640 315257
36795 315257 212809 129297 31710 45643 209556 350297 380206 483043 802621 1160052
36785A160052J39521p4537j52894k27418l06963j95979P3081J54772o7421k40875
36775B61339q1454J96541K59490J54768J20164J43713N2851j29331k40039k66739
36765D71303k86174k22578K7097K96959K94922L2885j70014j40898m9211q8518
36755A65773j98813k13449j03543M4000J65847K30189J99647Q8385l763L489O9396
36744D47158R1160K8451p1205j32859j04649J2782J49443K06104J41801Q107j05658
36733F70635j33834n7952O7713J16309R9j90417k46996r6321R0704J19288K6126
36722C65354N622J23868K31893J67879n7123k91557l77052k46581J1219J73774
36712A07296Q4237j39533k14354n1724J32357J40774O4523Q7192J66455J22856
$$ plain form
36785 1160052 1299573 1225036 1072142 844724 537761 341782 414863 569635 502214 261339
36775 261339 179885 376426 635916 790684 910848 1054561 1107412 978081 738042 471303
36765 471303 185129 -37449 -10352 286607 581529 614414 444400 303502 254291 165773
36755 165773 -33040 -246489 -350032 -306032 -140185 90004 289651 378036 374273 377762 447158
36744 447158 538318 566769 495564 362705 258056 270838 420281 626385 768186 776293 670635
36733 670635 536801 478849 546562 662871 662970 472553 225557 129236 219940 339228 365354
36722 365354 370976 494844 726737 894616 837493 545936 168884 -77697 -66478 107296
36712 107296 191533 52000 -162354 -214078 -81721 59053 123576 210768 377223 500079
36702E00079l1861r3667J1034J24618J22500P5126O8487M7703m2459j07457l6540
36691F37563J07089J65261R8408P063k0123J6294O9361Q1429K062j55781k92546
36680G16080l09766k07825o8331K7580M4193Q962N956Q2701J47594O1936j30746
36669C78334k00013l4647J78432K04973P7333j318K5205M0476K592J294N3085
36658G25746M4983n3319j04350l0411L4670l9147j41945q7756O3138O8267j07519
36647C72357j97839k8188J96888J86378P072k3072J51226K15208j5255k64506
36637F00269j88759R8049J89033q422j58824k6950J88193J90630J8580p7074m3408
36626G81317o9789k47301l95563l05112l6404J35242O1645q4517l2657K10098
$$ plain form
36702 500079 468218 374551 385585 510203 632703 707829 776316 824019 781560 674103 637563
36691 637563 744652 909913 1008321 1015384 995261 1011555 1080916 1162345 1164407 1008626 716080
36680 716080 406314 198489 130158 157738 201931 210893 216849 299550 447144 509080 378334
36669 378334 178321 143674 322106 527079 604412 603094 628299 668775 671367 672661 725746
36658 725746 770729 717410 613060 582649 617319 578172 436227 348471 411609 479876 372357
36647 372357 174518 146330 343218 529596 536668 513596 664822 880030 864775 600269
36637 600269 411510 509559 698592 690170 531346 504396 692589 883219 901799 824725 781317
36626 781317 711528 464227 68664 -236448 -272852 -137610 -75965 -160482 -193139 16959
36616A6959L48716K12332N928k595J01363K8457k20222l20189j23161J12953J15985
36605B76526l6595j12516o9377j1100L2841Q4749R8625M3477K302L1600L7471
36594C78003n1255j14261k3906J19387J30997K4081m6472l4577l971L6856J02240
36583E17122J11235M454r9149p1187j3293r2054k16679j58685N2726J56413P9504
36572B70407K1504P2856O8079o6366j16255P6503L01550K45393o4187l01872k70893
36561B36719q9853M0436Q8328J42666K10009J79110P792j50579j19500L4535O8900
36550F48563p2736j59148l5019J19614P5219q5060j33460q1623j03667j75095
36540b412j18341L1393M8813p8729j09630L5970J52363J29630J24926K22070K49163
$$ plain form
36616 16959 365675 578007 583935 581340 682703 711160 490938 170749 47588 160541 276526
36605 276526 239931 127415 58038 46938 79779 164528 263153 306630 308932 340532 378003
36594 378003 326748 212487 188581 307968 438965 463046 416574 381997 378026 414882 517122
36583 517122 628357 632811 533662 462475 449182 357128 140449 -18236 34490 190903 270407
36572 270407 291911 364767 432846 366480 250225 326728 628278 873671 809484 507612 236719
36561 236719 146866 187302 275630 418296 628305 807415 815207 664628 545128 579663 648563
36550 648563 575827 416679 381660 501274 576493 491433 357973 276350 172683 -2412
36540 -2412 -120753 -89360 -40547 -119276 -228906 -192936 -40573 89057 213983 436053 685216
36529F85216J13365M529M4429L0411j94370l76606j95215K16784M44513L64520
36519A137576J95663N8619j33370l39804l31469p6431J26046O3886q5450o7560
36509E47706M3151M707j56619j70954K8432J71170N8813j27395j05453Q4475J69887
36498E47920P5986k448L4087L1815j04876j93219n1567J79935K20533M1317j36001
36487F43482j59278o9757L2614O5876k4887j60353j25467J25365K88736J01257
36477G17588k15576k37095K3614J61487M8116n210J59337K57752P2568j63498
36467H19083j66783m1552j7694m8580m96J4240j42470k81217j35208J68840K67228
36456D35391J10169n700P1797J69180J22289n377r7075j33962j13861k0947P3760
$$ plain form
36529 685216 798581 803110 847539 877950 683580 306974 111759 328543 773056 1137576
36519 1137576 1333239 1391858 1258488 918684 587215 510784 636830 700716 615266 547706
36509 547706 590857 595564 438945 267991 296423 467593 526406 399011 293558 378033 547920
36498 547920 623906 621458 655545 687360 582484 389265 337698 517633 738166 779483 643482
36487 643482 484204 414447 447061 512937 488050 327697 202230 327595 616331 717588
36477 717588 502012 264917 288531 450018 498134 492924 652261 910013 982581 819083
36467 819083 652300 610748 593054 544474 543978 558218 415748 134531 -677 168163 435391
36456 435391 545560 539860 611657 780837 903126 897749 800674 666712 552851 531904 605664
36445F05664N3714o5648j48480j36342q8910l7801M3292J33371J83254K17365
36435G59479K58894K00953m7995l25036l56819j50810L060l3962p0592N6775J91788
36424D85735J06706j23343k12016o2074J17544J08570l7752q9427M6610J81972
36414E22525Q2959j87356k95073o3857K57562L00527N5412j48325j01682O3875
36404D86567J41340J15656P3412K2930n7768j08158o3160J6657J4893o8081j09901
36393D64387k7964J21886K11939J70176M5008m0860k0598K8124k9552j93673k91854
36382D37019j88162K4898J32026P6678L0107J36457K84263K43249m158k10193
36372I62184j87463o0344p7070k50790l41946j86271J04459K99756K90499J29041
$$ plain form
36445 605664 659378 593730 445250 308908 219998 182197 225489 358860 542114 759479
36435 759479 1018373 1219326 1171331 846295 489476 338666 341726 307764 237172 293947 485735
36424 485735 592441 469098 257082 195008 312552 421122 383370 293943 340553 522525
36414 522525 605484 418128 123055 59198 316760 617287 672699 524374 422692 486567
36404 486567 627907 743563 816975 839905 782137 673979 610819 627476 642369 574288 464387
36393 464387 436423 558309 770248 940424 985432 944572 923974 952098 922546 728873 437019
36382 437019 248857 273755 405781 482459 512566 649023 933286 1176535 1172377 962184
36372 962184 774721 714377 637307 386517 44571 -141700 -37241 262515 553014 682055
36362F82055o5152j79290j63668p3625j1211m593J374L7641P0728O5419P305j10955
36350B56028k24369j72234R8652L52535L01858J7045j48076o1391M5558J1552
36340D77158p865J09062J71956J361k26800k45787j03956j5590J0698P9806J06771
36329C56814m0638k02776j01137J97412L48198K47933J27839J03125L715k37469
36319H03016l67851j78136J57360L03639J76538l3816j42516j27976o6464j5136
36309E08658L8354J25975J98594J44773l2861j64088j38443o2735m6160J7078
36299E89145K25465L75683K04340j49535k74671q3148P5721l7883k34905k55679
36289D34533j45275q6054q5917l1734R7171K26204K87363K29207M1901j70592
$$ plain form
36362 682055 616903 437613 273945 200320 189109 184516 185890 223531 294259 359678 366983 256028
36350 256028 31659 -140575 -41923 310612 612470 629515 481439 420048 465606 477158
36340 477158 469293 578355 750311 751672 524872 279085 175129 159539 170237 250043 356814
36329 356814 316176 113400 12263 209675 557873 805806 933645 1036770 1040485 803016
36319 803016 435165 257029 414389 718028 894566 860750 718234 590258 523794 508658
36309 508658 547012 672987 871581 1016354 983493 819405 680962 618227 572067 589145
36299 589145 814610 1190293 1394633 1245098 970427 887279 963000 925117 690212 434533
36289 434533 289258 203204 117287 85553 182724 408928 696291 925498 967399 796807
36279G96807k75621k90265l08586k65376k3879K81817L10105J9128k11221j27269
36269i4360M7683L7990j9654J37776L82007L54403M0436j90367j13216R4794J66922
36258H44414N9033j16283k56061k81795j49760O2740J90697J66039Q0532K7206
36248F26762j1838o1459n1720O8723J85730J29322o8520j68583m5951J08566M7845
36237G58877j54257j91355J5766J87476R7417j15093k00115j56919j27273j05858
36227H666j8439M2030n1686j75257r8174J31884K45474J62331M7005k1696j12464
36216A59674j74473n9025J52231J92901N1530Q369J47624K13403P9939k8283L2266
36205G76156O1645q0652j82020p1717L2335r5316k56246j45536J37304K69091
$$ plain form
36279 796807 521186 230921 -77665 -343041 -366920 -85103 225002 244130 32909 -94360
36269 -94360 -46677 -8687 -28341 109435 491442 845845 886281 695914 582698 677492 844414
36258 844414 903447 787164 531103 249308 99548 162288 352985 519024 599556 626762
36248 626762 614924 553465 501745 570468 756198 885520 817000 648417 602466 711032 758877
36237 758877 604620 413265 429031 616507 713924 598831 398716 241797 114524 8666
36227 8666 -9773 32257 -19429 -194686 -292860 -160976 84498 246829 293834 272138 159674
36216 159674 -14799 -73824 78407 271308 322838 331207 478831 692234 772173 743890 776156
36205 776156 837801 757149 575129 503412 535747 440431 184185 38649 175953 445044
36195D45044K01879J09805O431j90325l29557j71667J79196L56223K45334R1453
36185I43816O8784N7256q0144k55705l03390k02472o7297n408k1367j6665Q2994
36174B00402J77875R0450j37060k25330n0990J48936J33151N995r629M7177n899
36163C75078j43745j86953j02162J0261J26659K46471K43099L9594j70481j55067
36153B82754J486N4580P30J4641Q7202O9251O868P2508J95037J24869j25527k60710
36141E23689j55817L219P6131J32631J94695J40072l4990j41953r4582k8811m5585
36130E68699p6570p6211j01452j31515n3849J04202J73328J25862J05222J26235
36120G63951L7285j46566j85604j0559J23488L3863j09424p6546Q2845J73160
$$ plain form
36195 445044 646923 756728 763159 572834 243277 71610 250806 607029 852363 943816
36185 943816 1012600 1069856 989712 734007 430617 228145 160848 155440 134073 117408 200402
36174 200402 378277 468727 331667 106337 55347 204283 337434 343429 333800 380977 375078
36163 375078 231333 44380 -57782 -47521 79138 325609 568708 608302 437821 282754
36153 282754 284240 338820 339550 354191 441393 510644 517512 590020 785057 909926 784399 523689
36141 523689 367872 371091 447222 579853 774548 914620 879630 737677 643095 614284 568699
36130 568699 492129 415918 314466 182951 129102 233304 406632 532494 637716 763951
36120 763951 801236 654670 469066 458507 581995 615858 506434 429888 512733 685893
36110F85893J30576R328j31127j93949q4176J02105J23408n9514j92171j00898
36100B89475O5887J06220M4193j4557p9727j52373j19004L9227J28541K7146j00048
36089B34980o5771M8976P4581L6407L3554J1684r4498j48764j1485J76902J87362
36078D83928P5476P3045J74682J42152p9939k45395j69000K5328J13916N7712
36068F51905k4654m8366k6373j937Q029J2222J4349l327m3656n9700j9309J2440
36056D71623l7924q6239K9731K67576L60496J73182r6889j99167j44620q8226
36046F49543n9809p613K1089l6308q6200j2695R0746N6253m9211j1858J45347
36035F99284J53703o4905k27002r6917J50444J78329l5826k00403j42358j9638
$$ plain form
36110 685893 816469 825797 694670 500721 416545 518650 642058 582544 390373 289475
36100 289475 355362 461582 505775 491218 411491 259118 140114 179341 307882 335028 234980
36089 234980 169209 218185 292766 329173 362727 374411 279913 131149 119664 296566 483928
36078 483928 559404 632449 807131 949283 869344 623949 454949 480277 594193 651905
36068 651905 627251 578885 552512 550575 558604 570826 585175 581848 538192 478492 459183 471623
36056 471623 433699 347460 377191 644767 1005263 1178445 1081556 882389 737769 649543
36046 649543 589734 582121 603210 566902 480702 468007 558753 615006 565795 553937 699284
36035 699284 852987 788082 561080 464163 614607 792936 757110 556707 414349 394711
36025C94711m6414j71982j64359N1380K78096K94219J19301l6168l7095M2923
36015G24612N1643n0712j65728j89829j29124o3778j5569Q7508K65347L67924
36005H82294K29158p1846k58809k03315n6509K1790O1111R7235K7752j53895k05580
35994C69386J2929K30614J32973j22357j43243O0878J27737j9617p6261N6374
35984F29413R0517r8056k21486r5170M2531j4981q9532k2685k1649k28305l22414
35973c51817r091M02508M12526J02698l5349R4611J20052r1373k00282J1371K74266
35962G30120K57343K6461j31597j12630l5217k4671r5047j60998j09363O2469
35952D06870J90709J39046L678k8115K7702n054j50987k30351j36861K3498J05767
$$ plain form
36025 394711 348297 176315 11956 63336 341432 635651 754952 718784 681689 724612
36015 724612 776255 725543 559815 369986 240862 177084 161515 249023 514370 882294
36005 882294 1111452 1039606 780797 577482 520973 542763 603874 701109 728861 574966 369386
35994 369386 382315 612929 745902 623545 480302 541180 668917 649300 573039 629413
35984 629413 719930 621874 400388 305218 347749 332768 243236 220551 198902 -29403 -351817
35973 -351817 -360908 41600 454126 556824 521475 616086 736138 644765 444483 455854 730120
35962 730120 987463 1013924 882327 769697 734480 709809 614762 453764 344401 406870
35952 406870 597579 736625 740303 712188 739890 734836 583849 353498 216637 240135 345902
35941C45902P9191j2024r4050o8734P7825J86697J05505o9722j13782r042M6639
35930D74405l0968r9561m6170N2552R0243P3205M1092N179J2784J09527J97686
35919H79974J15782q6673j56882j1468J06171j2253k01921j57091J05505K52631
35909H33775R8511j49490j96259o2515k2717j81499l01604j44252J62445K81941
35899C18336J39586L800O4917J75775J33487K034l9763j0278n4525j57741j59265
35888D16363j2819J59567K47044K22150P9342j30743k50862j76013k8446n124
35878E20459q8691r1071M1009J54279J30719L7653R140Q8411J92621J68385n7081
35867A105833l14045l08074r805K38403J66118o1297j37429p1177n4455n3948
$$ plain form
35941 345902 425093 413069 319019 250285 328110 514807 620312 550590 436808 427766 474405
35930 474405 443437 343876 297706 350258 440501 513706 554798 559977 572761 682288 879974
35919 879974 995756 909083 752201 740733 846904 834651 632730 475639 581144 833775
35909 833775 932286 782796 586537 524022 501305 319806 18202 -126050 36395 318336
35899 318336 457922 461722 526639 702414 835901 837935 798172 787894 733369 575628 416363
35888 416363 403544 563111 810155 1032305 1111647 980904 730042 554029 525583 520459
35878 520459 431768 340697 381706 535985 666704 704357 713497 801908 994529 1162914 1105833
35867 1105833 791788 483714 473909 712312 878430 817133 679704 608527 554072 500124
35857E00124R2724K82614K50152K3531j09366p6891p4577j38660q8296O1276O5045
35846G87676p7915o3600J56001K10329o3196k74924q8909K10869J61063j59928
35836G97466k89999r0682J31126J38329J9766p1728j19422j28204n4864P0227
35826D02015J17831K4867j14614j58034n5008J15199K04824J31806j6367p6504
35816E76015k7296q353q8135j51735r3169J8005O3385N1141N6624Q6915J07589
35805E90986J19476J22564Q6998K6603L138K855o4412j78369j73475P162J69357
35794G12883J14019q5963j92671j06336O1154J54946J15457p558j03504r5818
35784E66609j7989M8690R0803J25825J00806j7877j01752j7874J02402J8871j92851
$$ plain form
35857 500124 592848 875462 1125614 1149145 1039779 962888 888311 749651 661355 722631 787676
35846 787676 709761 646161 802162 1012491 949295 674371 585462 796331 957394 797466
35836 797466 507467 416785 547911 686240 706006 634278 514856 386652 331788 402015
35826 402015 519846 544713 430099 272065 217057 332256 537080 668886 652519 576015
35816 576015 548719 540366 452231 300496 207327 225332 288717 339858 396482 483397 590986
35805 590986 710462 833026 920024 946627 949765 952620 888208 709839 536364 543526 712883
35794 712883 826902 740939 548268 441932 503086 658032 773489 765931 662427 566609
35784 566609 548620 597310 688113 813938 914744 896867 795115 777241 879643 898514 705663
35773G05663j98335M8496J80784l435k06557j22257P5930P0158n2847N758J93143
35762F96501J77346o9790j87734Q401K29899J33002k01021l86464k22109R3732
35752B71763K28193J05868l5788K357R0506j0940k17166j88588J21025L16420
35742F83650J35143j38988j15465J03114J24526q9429j93949l8005J25126P3154
35732F68877p1938j02895m4898l8049p1158k4221R5960J32371Q195j28037p0254
35721C53953J55361K77742J25771j15446j41797M3189J53881O3460m1074o367
35711H68673N6408J9006l8220k6505m9100j89772k91383j74760O9182K15772J97695
35700F56996P4974j17488k86870k31409P9595L36870K64617J4516q4163j5119
$$ plain form
35773 705663 507328 555824 736608 733173 526616 404359 480289 550447 497600 503358 696501
35762 696501 873847 804057 616323 624724 854623 987625 786604 400140 178031 271763
35752 271763 499956 605824 570036 572393 662899 651959 434793 246205 367230 683650
35742 683650 818793 679805 564340 667454 791980 702551 508602 470597 595723 668877
35732 668877 596939 494044 449146 411097 339939 315718 411678 544049 552244 424207 353953
35721 353953 509314 787056 912827 797381 655584 698773 852654 916114 875040 868673
35711 868673 925081 944087 905867 879362 830262 640490 349107 174347 243529 459301 656996
35700 656996 731970 614482 327612 96203 175798 512668 777285 791801 707638 692519
35690F92519l859p9879n9758Q2365J53987N6613j02281k01518j89580k5043K36938
35679E60504L62519J84315j32594k95962k62920j70681k8777K07332L70939K53137
35669A047812k4134j56726j27576j60011k47615j46085J45818L11076K01813L3804
35659H78176l6L0946L7652O3620R2472J6119j07824p8621P4146O6200j76687l54220
35647E41943k36404K2393J58610J15460m1027k41613l27474j32910K15776L67795
35637D42549K32037R1942J23363J44704O641j27097r9384k9367l5337m792J20784
35626H66043J48063j9416j44061n0616M3360r1104k73387k27314n3532l368j2253
35615A82415J19083K59705J22845j90539k70613r919K56631K54418P6924n8399
$$ plain form
35690 692519 688660 608781 549023 631388 785375 841988 739707 538189 348609 323566 560504
35679 560504 923023 1107338 974744 678782 415862 245181 216404 423736 794675 1047812
35669 1047812 1023678 866952 739376 579365 331750 185665 331483 642559 844372 878176
35659 878176 878140 909086 946738 1010358 1102830 1118949 1011125 932504 1006650 1072850 896163 541943
35647 541943 305539 327932 486542 602002 560975 319362 -8112 -141022 74754 442549
35637 442549 674586 766528 889891 1034595 1041236 914139 814755 785388 750051 745259 866043
35626 866043 1014106 994690 850629 800013 843373 752269 478882 251568 198036 194668 182415
35615 182415 301498 561203 684048 493509 222896 212977 469608 724026 800950 742551
35605G42551p6581q583Q2959R8979M691p1428j1237P4729R572j31579j14160P0536
35593F70449J69029L8586j62705k04895m3731J74905K47244P2436k06067k92477
35583D62774r8319J09150Q1353m9690k1936J05365P6847q4823j06201N5098J35806
35572F65424K5012o4874O086P0593k2618j33119p6959O3957R0010m315n6450J3928
35560E76675J25756J56222N7181r4229j34899M756J60164J07426j14991k30539
35550F13522j02110J00264J66620R4820p054q2008r0232J2368J52350J57275N493
35539A021308j06037n6748J4124m1033j28998j01301k3702m1199j03814o7130
35529C65470K6599K2204m7469J169J68873K36785J09174m1717n4571M859J3220
$$ plain form
35605 742551 665970 657387 740346 839325 844016 772588 761351 836080 845652 714073 599913 670449
35593 670449 839478 878064 715359 510464 466733 641638 888882 961318 755251 462774
35583 462774 364455 473605 554958 505268 483332 588697 665544 580721 474520 529618 665424
35572 665424 690436 625562 631648 702241 679623 546504 469545 533502 623512 619197 562747 576675
35560 576675 702431 858653 915834 821605 686706 691462 851626 959052 844061 613522
35550 613522 511412 611676 778296 873116 866062 784054 693822 706190 858540 1015815 1021308
35539 1021308 915271 858523 872647 831614 702616 601315 577613 536414 432600 365470
35529 365470 392069 414273 366804 367973 536846 773631 882805 841088 786517 791376 804596
35518H04596r528m007k0943j03833j38393m208J88573K05814K2170j31680r0501
35507G18060L5702N4146l5181q0163k2206M1757L7208J8971M9976P7735K6028
35496I22033n2291l7687N1496N4955p8656j69316n3014J43010J48648n1324j71029
35485G06825l0587J86301K15126R1627M9183J27310J25995m6257k10008j82408
35475A033107l0534N5938J8310o2030j11540j03066j7334J17188J89958J17545
35465A207542l6367j26845q8561K3994J13716J05803p322j28768j28169n893R1346
35454A020476P7478M5554R3656J49806R8785j6021p1653p3811j21923k11062k30865
35443G60420j44730l0558M5793Q0029P3978L7280J3491J5094p876n1089j4409
$$ plain form
35518 804596 795068 791061 770118 666285 527892 523684 712257 918071 940241 808561 718060
35507 718060 753762 807908 772727 692564 670358 712115 749323 768294 818270 896005 922033
35496 922033 869742 832055 883551 938506 859850 690534 637520 780530 929178 877854 706825
35485 706825 676238 862539 1077665 1169292 1218475 1345785 1471780 1425523 1215515 1033107
35475 1033107 1002573 1058511 1076821 1014791 903251 800185 782851 900039 1089997 1207542
35465 1207542 1171175 1044330 955769 979763 1093479 1199282 1191960 1063192 935023 929130 1020476
35454 1020476 1097954 1143508 1237164 1386970 1485755 1469734 1398081 1324270 1202347 991285 760420
35443 760420 615690 585132 630925 710954 784932 822212 835703 850797 842921 791832 777423
35432G77423J12587J64409N3062n1330L670O5034p1743k74851k68381r4694j6309
35421C98877l9109N1275K12209J66214n8544r3943J36519K32162k8451k96987
35411F80222k09724O1249J50554O4900L8750Q7884Q2708O6266J38152J82063N0464
35400A393488j20917j16327k5794q3720k29874j94235L5638J85641J27424J8901
35390I90225r607j7355n1464l8296M9637J13392P7672k1186j16061j50243o2631
35379G64083J20637K18866R1740j27048j69676L779J57012R9890r2938k08544
35369H57801j30309O4066J69578M8806j90583k91867j69377J708P9798J44149
35359E83770K63136L01725J61196J773j9071l2078j89955l05651j19852K01086
$$ plain form
35432 777423 890010 1054419 1107481 1056151 1059821 1124855 1053112 778261 509880 415186 398877
35421 398877 359768 411043 623252 789466 730922 636979 773498 1005660 977209 680222
35411 680222 470498 531747 682301 747201 785951 873835 956543 1022809 1160961 1343024 1393488
35400 1393488 1272571 1156244 1130450 1046730 816856 622621 658259 843900 971324 990225
35390 990225 980618 963263 911799 873503 923140 1036532 1114204 1093018 976957 826714 764083
35379 764083 884720 1103586 1195326 1068278 898602 902381 1059393 1159283 1066345 857801
35369 857801 727492 791558 961136 1009942 819359 527492 358115 359823 439621 583770
35359 583770 846906 1148631 1309827 1311600 1292529 1260451 1070496 764845 644993 846079
35349H46079K44600j7359j90334p7058O6280k154j47688j43357l6333j4695q5781
35338D42200r0231M5936K16540K67205J57176k901p6799o6757p5336r2223J1794
35327G36604K01024K17567j3629j65100K9359L03133K14293j67382l48764j40654
35317H66451J21231J15663q2481k39933k57808j35849P4014K03274J12967n5647
35307G21882m3987J00265Q2079j30486k23028n2178J27446J06682M1077J18815
35297H48567K15505J33852l9963p5386N2823J63185J20276n0075k09477j96720
35287I62587J5239K19045J84208k3118j33062q1527n8548j20519q0269J11547
35277I95583K04047M1799j62972j64306m5694k1827p9540o0035M2037R1317M2916
$$ plain form
35349 846079 1090679 1073320 882986 805928 872208 870054 722366 579009 542676 527981 442200
35338 442200 351969 397905 614445 881650 1038826 1035925 959126 892369 817033 724810 736604
35327 736604 937628 1155195 1141566 976466 1005825 1308958 1523251 1355869 1007105 866451
35317 866451 987682 1103345 1020864 780931 523123 387274 461288 664562 777529 721882
35307 721882 677895 778160 860239 729753 506725 454547 581993 688675 729752 848567
35297 848567 1064072 1197924 1157961 1082575 1135398 1298583 1418859 1368784 1159307 962587
35287 962587 977826 1196871 1381079 1357961 1224899 1143372 1084824 964305 884036 995583
35277 995583 1199630 1241429 1078457 914151 868457 846630 767090 707055 749092 840409 883325
35266H83325j8968k7133J673Q855m8781j32642j26498J147J02855O9074L5567
35255G48474J48008K41617Q1857j70065j47992R5644J34717j18573k65351j15291
35245F33045O859j20257k11783j6270K11531J65133J0441L9402J50005J06848
35235I74954J5952Q7949J83509N2450j79519k06529n2888L1435K0672M7230N3165
35224A028380o7250j35954N1187K75401J72644j52182k76299j39902n9310j01427
35214E95288k822K38201K50463o9442l06445j52830J32817J67174M668m4259Q4521
35203H97334J87045J31788k1392j63279k19622j50956L872J25146J31988O4275
35193I86199P009j3607l3707r1317j59430j26503P9986L16991L17139N0537j79861
$$ plain form
35266 883325 864357 837224 838897 847752 798971 666329 539831 540978 643833 712907 748474
35255 748474 896482 1138099 1219956 1049891 901899 997543 1132260 1013687 748336 633045
35245 633045 639904 519647 307864 291594 503125 668258 678699 718101 868106 974954
35235 974954 990906 1078855 1262364 1314814 1135295 928766 875878 907313 927985 975215 1028380
35224 1028380 961130 825176 876363 1151764 1324408 1172226 895927 756025 696715 595288
35214 595288 592466 830667 1081130 1011688 705243 552413 685230 852404 857072 812813 897334
35203 897334 1084379 1216167 1194775 1031496 811874 660918 664790 789936 921924 986199
35193 986199 993208 979601 945894 854577 695147 568644 648630 965621 1282760 1333297 1153436
35182A153436j56135n6849j19435j96926L605L67701M66716J90422j06011j45331
35172A401193n1412j7594K278Q8610J24955P20j46907j15323N6974J52152O9189
35161A564835q7516j72968j49537q9581q3078j27209j17915m015R6042M2302r9155
35150G72205j30823k1942M1968n0686j63293j13060P7465K34489K59914K01314
35140A107551J28339L5113j01812k15075j79646K753J31412L7292j61616k05382
35130E78929p3240Q440l3506L16J86036K74011R9632q9970j6607J61783J18738
35119A214562r1902j52395k4250M7233J2164O0767J78166R9780j87876l13008
35109H43241o4587K65008K97655O3954j39964j77809j28927p1085k6778m0515
$$ plain form
35182 1153436 997301 940452 821017 624091 627696 995397 1462113 1652535 1546524 1401193
35172 1401193 1349781 1332187 1334465 1423075 1548030 1548750 1401843 1286520 1343494 1495646 1564835
35161 1564835 1477319 1304351 1154814 1065233 982155 854946 737031 733016 829058 871360 772205
35150 772205 641382 619440 661408 610722 447429 334369 411834 646323 906237 1107551
35140 1107551 1235890 1271003 1169191 954116 774470 777223 908635 945927 784311 578929
35130 578929 505689 514129 480623 480939 666975 940986 1040618 950648 934041 1095824 1214562
35119 1214562 1122660 970265 946015 993248 1005412 1066179 1244345 1344125 1156249 843241
35109 843241 778654 1043662 1341317 1405271 1265307 1087498 958571 887486 860708 820193
35099H20193j27135j82711q2257J44035L13513K70879M1109j82296k12021n9119
35089G44190Q4190Q3869M662m3770p2870j11601p4435R0010K27739J63750j9791
35078A075943j00886m8530j7458o6839j13993j30834j54612j30141K3729K06932
35068E43311K32055J15458M0489M1763j8896j47723j55005L9131K55285K90277
35058A236145J40246n5859j58616j09978j613j9334j83730k48292m3721K09751
35048G64999J93962k3878j14324k360R2212P9023Q2942J14187M1574p3969j0646
35037A143722J84903J94986l6871j64530J0867K18161J54531o8020j54869o2996
35027A419884L3899L8406j5257p6293j03881p3596k7285j3997J6214J10181J50989
$$ plain form
35099 820193 693058 510347 428090 572125 885638 1156517 1197626 1015330 803309 744190
35089 744190 828380 912249 916911 873141 800271 688670 614235 704245 931984 1095734 1075943
35078 1075943 975057 926527 909069 842230 728237 597403 442791 312650 336379 543311
35068 543311 775366 890824 931313 973076 954180 806457 651452 690583 945868 1236145
35058 1236145 1376391 1320532 1161916 1051938 1050325 1030991 847261 598969 555248 764999
35048 764999 958961 935083 820759 818399 910611 989634 1072576 1186763 1228337 1154368 1143722
35037 1143722 1328625 1523611 1486740 1322210 1333077 1551238 1705769 1637749 1482880 1419884
35027 1419884 1453783 1492189 1476932 1400639 1296758 1223162 1195877 1181880 1198094 1308275 1459264
35016A459264J3838j71491j77691m6478P480J40J13788K63629J66677j27504k41213
35005A260439q9952j7929j72523k41110k8169J87401J53316N4502R5512R3466
34995A294953j23898k83585p9569K56864K65167m1200k20719o3996J80896K24526
34985A409439O9742r2294j15903j7640M1272n5284j70244n9031K26179L25881
34975A562117Q4716j97713k07866n0878j1640j03385j17655K2269J94763K73981
34965A448709K21909P5415n1225o2673l6321j20307k56600k34548n0209O6770
34955A000920L5073J8827P8310P0579j2321J7614J51132J27180q5405j73656k1841
34944A206412P4867n3760j61703p5999n225p5847m7708J76540K57397K3121j32823
$$ plain form
35016 1459264 1473102 1301611 1123920 1077442 1084922 1085062 1198850 1462479 1629156 1501652 1260439
35005 1260439 1170487 1152558 980035 738925 710756 898157 1051473 1105975 1201487 1294953
34995 1294953 1171055 887470 807901 1064765 1329932 1288732 1068013 1004017 1184913 1409439
34985 1409439 1479181 1386887 1270984 1253344 1294616 1239332 1069088 1010057 1236236 1562117
34975 1562117 1646833 1449120 1241254 1190376 1178736 1075351 957696 979965 1174728 1448709
34965 1448709 1670618 1746033 1694808 1632135 1595814 1475507 1218907 984359 934150 1000920
34955 1000920 1035993 1054820 1133130 1203709 1191388 1209002 1360134 1487314 1401909 1228253 1206412
34944 1206412 1281279 1227519 1065816 989817 984592 908745 861037 1037577 1294974 1318095 1185272
34933A185272Q4265K99620J01556k04185r6117K65529L09846k2204k75114k38001
34923A410467j06882l184J18191J68265L0200j23326o6929N6028p476j19221j667
34912A354466J86130P2377k52224l41920j09245J01762J11932P1794O5430L0381
34902A290883L4539J71847K43162Q939l20875l43752j21803m4766j16085J6755
34892H18844L25972L45512l3856l11608j31449K11245K63331K1828j93077j82868
34882A133874M671J94485K24556J13047O1047J33930R6940j85812m15649k84578
34872A076511q170J5078j33921r5532Q7185Q2015o3160q386J82421J11651j75229
34861A070463j83893J56246L04748o439l37073k54395O1210K15147J43394j1693
$$ plain form
34933 1185272 1269537 1569157 1670713 1466528 1370411 1635940 1945786 1923582 1648468 1410467
34923 1410467 1303585 1300401 1418592 1586857 1617057 1493731 1426802 1482830 1475354 1356133 1354466
34912 1354466 1540596 1612973 1360749 1018829 909584 1011346 1123278 1195072 1260502 1290883
34902 1290883 1325422 1497269 1740431 1749370 1428495 1084743 962940 918174 802089 818844
34892 818844 1144816 1490328 1456472 1144864 1013415 1224660 1487991 1509819 1316742 1133874
34882 1133874 1138545 1333030 1557586 1670633 1731680 1865610 1962550 1776738 1361089 1076511
34872 1076511 1068341 1083419 949498 853966 941151 1023166 960006 951620 1134041 1245692 1070463
34861 1070463 886570 1042816 1347564 1341125 1004052 749657 810867 1026014 1169408 1157715
34851A157715j74928k54186j28603J04699J93715J33423J47817K33620J53866
34842A567138o8001j30481m584M632j56616j77177J4792Q3797r2473j72565M8376
34831I16838K85794K60480R2729k8092j31157k07230r8089J45255K09163J0365
34821A456056j63099j43577p8883k9785J27341K83340J38769j93513k24337R6925
34811A269237K36714l2110k60290j29624M4621k5978r7930L9505J20074l8269
34801A125950j23719O6836K03210N9843k8077J58265K19531j15940l69728r6677
34791A099494K86734J89603j46971j18616J91067K49312L8155l9945K0300r7834
34781A671299l11375k58266k3669j5357j93383j32686J82716L13796J28749l0058
$$ plain form
34851 1157715 982787 728601 599998 704697 898412 1031835 1179652 1413272 1567138
34842 1567138 1499137 1368656 1364072 1368704 1212088 1034911 1049703 1133500 1041027 868462 916838
34831 916838 1202632 1463112 1555841 1527749 1396592 1189362 1091273 1236528 1445691 1456056
34821 1456056 1292957 1149380 1070497 1040712 1168053 1451393 1590162 1396649 1172312 1269237
34811 1269237 1505951 1473841 1213551 1083927 1128548 1102570 1004640 1044145 1164219 1125950
34801 1125950 1002231 1069067 1272277 1332120 1304043 1462308 1681839 1565899 1196171 1099494
34791 1099494 1386228 1575831 1428860 1310244 1501311 1750623 1788778 1748833 1769133 1671299
34781 1671299 1359924 1101658 1077989 1062632 869249 736563 919279 1233075 1361824 1331766
34771A331766O505J3629j14092j62186k2156J27931J57895J24779N1403p5171
34761A440303j09333P4189K57384J33548j68490k36341j3848J47622P5342k2367
34751A578009J3276N8971k16p2805n1888L1617J00994J09227L8160m6735l7944
34740A720666O205j04494l15168k85794O0775L14291J97482J1889P7147J50616
34730A833615q1501l30039j51561K31998K52166p4640k37148j09024k1591l9109
34720A273166R7243L00901J63595k53103l65426O650L17594J52848j78341k10332
34710A304795J5334J82366J96545J30402j6945k12447k69541p4216K20782L66450
34700A843525K53639n3708l52026l87167j21376J36616R9708r1048j04836N6747
$$ plain form
34771 1331766 1338271 1351900 1237808 1075622 1053466 1181397 1339292 1464071 1515474 1440303
34761 1440303 1330970 1405159 1662543 1796091 1627601 1391260 1377412 1525034 1600376 1578009
34751 1578009 1591285 1650256 1650040 1577235 1525347 1556964 1657958 1767185 1805345 1758610 1720666
34740 1720666 1726871 1622377 1307209 1021415 1082190 1396481 1593963 1605852 1682999 1833615
34730 1833615 1752114 1422075 1270514 1502512 1754678 1680038 1442890 1333866 1312275 1273166
34720 1273166 1370409 1671310 1834905 1581802 1216376 1223026 1540620 1693468 1515127 1304795
34710 1304795 1320129 1502495 1699040 1829442 1812497 1600050 1330509 1256293 1477075 1843525
34700 1843525 2097164 2043456 1691430 1304263 1182887 1319503 1419211 1328163 1223327 1280074
34690A280074J24700M5726N621L7466J3506j8033R9096K58162K02631j7243j18447
34679A913259p7595j09009j92930j09644O9199L7478j69557j80414O4092J92801
34669A437680M3195r5420k1240Q9852R8940J35128K29039J74211m3130j18692
34659A929563M3557J08536j32550l80391k94630q470J22407K6149r8740j04641
34649A210790J1315J75720K59917J80983M2788J469J552j09057k40787j64903
34639A369787N9790J31553k331p9797J1344R6793R5368J25800J65874L1497k08054
34628A797624k27409J6583J70678N5434p3801r171P8444m40j29326j36932o1624
34617A480060J1913R1319J27374L0320p8814K3509K32712J88617j27756k96903
$$ plain form
34690 1280074 1404774 1450500 1456121 1493587 1507093 1489060 1588156 1846318 2048949 2031706 1913259
34679 1913259 1835664 1726655 1533725 1424081 1493280 1530758 1361201 1180787 1244879 1437680
34669 1437680 1480875 1385455 1364215 1454067 1553007 1688135 1917174 2091385 2048255 1929563
34659 1929563 1973120 2081656 1949106 1568715 1274085 1265615 1388022 1414171 1315431 1210790
34649 1210790 1222105 1397825 1657742 1838725 1881513 1882982 1884534 1775477 1534690 1369787
34639 1369787 1429577 1561130 1558799 1479002 1490346 1587139 1682507 1808307 1974181 2005678 1797624
34628 1797624 1570215 1586798 1757476 1812910 1739109 1729938 1808382 1807942 1678616 1541684 1480060
34617 1480060 1491973 1583292 1710666 1740986 1662172 1685681 1918393 2107010 1979254 1682351
34607A682351r6645J87871K51389J53996M4974r4949k41377k28667n1274P2662
34597A680331O9864R1334J40769L9302j52786j44876M5948O5797j39973k03335
34587A492375r108Q7986n6662q4629J81091L50430J29417j79907k35991j92382
34577A482620k59676k43120J8912K22557R4478r8163k0958J43163Q2987m8082
34567A374718L8711J80880O1599j79298j77193L0942J28909Q6476J08895J75447
34557A830086R9340o9617j28443r8339j32218j65548l7981J46951J52287J3473
34547A609991k2372J01655K02446J55411J2285j14599j22279J9981J65093J16634
34537B124246n5271p4520Q6198J39247k0167j35735o2003N161m3777k6244R2677
$$ plain form
34607 1682351 1585706 1773577 2024966 2178962 2223936 2128987 1887610 1658943 1607669 1680331
34597 1680331 1750195 1841529 1982298 2021600 1868814 1723938 1769886 1835683 1695710 1492375
34587 1492375 1483267 1571253 1514591 1429962 1611053 1961483 2090900 1910993 1675002 1482620
34577 1482620 1222944 979824 998736 1221293 1315771 1217608 1196650 1339813 1422800 1374718
34567 1374718 1413429 1594309 1655908 1476610 1299417 1330359 1459268 1545744 1654639 1830086
34557 1830086 1929426 1859809 1731366 1633027 1500809 1335261 1297280 1444231 1596518 1609991
34547 1609991 1587619 1689274 1891720 2047131 2059416 1944817 1822538 1842519 2007612 2124246
34537 2124246 2068975 1994455 2080653 2219900 2199733 2063998 2001995 2007156 1963379 1937135 2029812
34526B029812M7753j74815j64739K02756M35302K03482j01531o3381N9902j05005
34516B369536l08119j52231J30747Q2745j52397j19358J10761J11433j01712j47873
34506A823532k894K8826n3809N068J30730J3630k60675k89130l7818J25512Q0033
34495A563005P9640K11966K49168R0970q9785j76248j94332r9864J34683K88443
34485B057646J46717j00743j24924k231m3217j96844j33543J40033K65444J29320
34475B137658m755R389J4106r1891j88884j84167j14981K081J56548K33467J69422
34464B137993J05894J42279J25861l7529j23059K2969J26223p0013k99327j88690
34454A942601R9367J63619M3008L7014Q7543n3896k40703j43218J07141J12399
$$ plain form
34526 2029812 2077565 1902750 1738011 1940767 2376069 2579551 2478020 2414639 2474541 2369536
34516 2369536 2061417 1909186 2039933 2122678 1970281 1850923 1961684 2073117 1971405 1823532
34506 1823532 1820638 1849464 1795655 1800723 1931453 1945083 1684408 1395278 1357460 1482972 1563005
34495 1563005 1642645 1854611 2103779 2194749 2104964 1928716 1734384 1634520 1769203 2057646
34485 2057646 2204363 2103620 1978696 1976465 1933248 1736404 1602861 1742894 2008338 2137658
34475 2137658 2132903 2142292 2156398 2064507 1875623 1691456 1576475 1578556 1735104 1968571 2137993
34464 2137993 2243887 2386166 2512027 2474498 2351439 2374408 2500631 2430618 2131291 1942601
34454 1942601 2041968 2205587 2248595 2285609 2373152 2319256 2078553 1935335 2042476 2154875
34444B154875q5128j17224J2973o536j38975o3652J71640K16937Q0967P4684J58564
34433B459125K5204k18893j70475R0691Q4212j84088j90648J56899L18151M7972
34423B418150k11881j16328P6719O2796l9545n5488o9979j30044r6500K1724L1424
34412A891048l9074K2221J21370k8475k63500j02733L68223M71564M797l91496
34402B053945k34539J27582K21376J71347K53676K96953O0996k18430j87430L2995
34392B578471P2874j01160k20669j60627l1493M3362K2921n6484o6333P4335K11231
34381B366428J36590m8060n4347J16485J78411N1045m4626j0734O550l8611k2646
34370B636485L8034L44p7418k6632M6610p9877k56436j49946J26971J54293m6964
$$ plain form
34444 2154875 2069747 1952523 1965496 1958960 1819985 1756333 1927973 2144910 2225877 2300561 2459125
34433 2459125 2484329 2265436 2094961 2185652 2269864 2085776 1895128 2052027 2370178 2418150
34423 2418150 2206269 2089941 2166660 2229456 2189911 2134423 2064444 1934400 1837900 1859624 1891048
34412 1891048 1851974 1874195 1995565 1967090 1703590 1600857 1969080 2440644 2445441 2053945
34402 2053945 1819406 1946988 2168364 2339711 2593387 2890340 2951336 2732906 2545476 2578471
34392 2578471 2651345 2550185 2329516 2168889 2137396 2180758 2203679 2147195 2080862 2155197 2366428
34381 2366428 2503018 2454958 2400611 2517096 2695507 2746552 2701926 2691192 2697742 2659131 2636485
34370 2636485 2674519 2674863 2597445 2570813 2617423 2537546 2281110 2131164 2258135 2412428 2365464
34359B365464m1807K08294K41541p6992k93519j26721J20621J31916Q674p1523
34349B465948j19766r6634R5885K75078J45438j35933j29770J21200J44535j07114
34339B658867j76045L8463J07432r3198j62478K2406Q3073o0465N707L22429L50682
34328C096873m2288k54722L069J99155k8268k27182j4697K13128N5428j59160
34318B841336m4093J25648M359j51594l5253R2384l8009j18525J24425L10094
34308C110772N7443k80595k12727N5902N7822j21082j20955R249L6020N3760J81710
34297B827319J57147j79022m01854j12276L55878M31568J45965r2179j91195k72880
34287B668471k26512N6466L04434K47520Q6549J17181K11034J17216n7025q8738
$$ plain form
34359 2365464 2323657 2531951 2773492 2696500 2402981 2276260 2396881 2528797 2537471 2465948
34349 2465948 2346182 2249548 2345433 2620511 2765949 2630016 2500246 2621446 2765981 2658867
34339 2658867 2482822 2521285 2628717 2535519 2373041 2395447 2478520 2418055 2423762 2746191 3096873
34328 3096873 3054585 2799863 2802932 3002087 2973819 2746637 2731940 2945068 3000496 2841336
34318 2841336 2797243 2922891 2927250 2775656 2740403 2832787 2794778 2676253 2800678 3110772
34308 3110772 3168215 2887620 2674893 2730795 2788617 2667535 2546580 2555829 2591849 2645609 2827319
34297 2827319 2984466 2805444 2403590 2291314 2647192 3078760 3224725 3132546 2941351 2668471
34287 2668471 2441959 2498425 2802859 3050379 3136928 3254109 3465143 3582359 3525334 3436596
34277C436596k2602M4744J71939K62128L7706l70033l99152K8127K46388p9163
34267C356678l64105j11996K58756K29068P0486J91348K91673j8790l73441k56832
34257C272845P5236R8860n8030k108J10756l8331j92734J8620L11141K24802m7005
34246C774052p1897J9622r0863j94366O115K06791M2645j61979J5390K53503P5464
34235C874477k27407j38913J12892M1103j38847J6350K24468l666l43313j87331
34225C229813K12723J92930j10009o8830K39726K34719n0146j07570L3774l0510
34215C776620j69781J0422K62004R4467k08828m3256L42830K48972j70294j72677
34205C970479K07440K59053q1586j93263K8654Q3944p5998j5305K17161J64267
$$ plain form
34277 3436596 3413994 3458738 3630677 3892805 3930511 3560478 3161326 3189453 3435841 3356678
34267 3356678 2992573 2880577 3139333 3368401 3438887 3630235 3921908 3903118 3529677 3272845
34257 3272845 3348081 3446941 3388911 3386803 3497559 3459228 3266494 3285114 3596255 3821057 3774052
34246 3774052 3702155 3721777 3630914 3436548 3442663 3649454 3692099 3530120 3545510 3799013 3874477
34235 3874477 3647070 3508157 3621049 3662152 3523305 3539655 3764123 3760457 3417144 3229813
34225 3229813 3442536 3635466 3525457 3456627 3696353 3931072 3880926 3773356 3807130 3776620
34215 3776620 3606839 3617261 3879265 3973732 3764904 3721648 4064478 4313450 4143156 3970479
34205 3970479 4177919 4436972 4355386 4162123 4190777 4274721 4198723 4183418 4400579 4564846
34195D564846p2390r327J97827J3531l43656j95052K93839L23318j07557k31553
34185D433826O0083J06781j81138j72125J97203K62557q2735j86390R7121J60065
34175D695248j35131j91841J26663K20267p1127j63807J22953K35769j7612j33134
34165D688248N3641O9063j87218j90662J67904L18568O1611j10749K0586Q8401
34155D979393j7351K9625J80595J7446l25719k74062R4363J45537j00708k4203
34145D704916L19727K46429j82322j77775K64148K81970k24181l39906J88184
34136E081190M76266R8690k45116j08114J3470j61433j58797J56120K12262r1599
34126E272939j01110K98355L89324R300j13169J99884K04223k67022l89653P2826
$$ plain form
34195 4564846 4492456 4483129 4680956 4694487 4350831 4155779 4449618 4772936 4665379 4433826
34185 4433826 4493909 4600690 4419552 4247427 4444630 4707187 4624452 4438062 4535183 4695248
34175 4695248 4560117 4368276 4494939 4715206 4644079 4480272 4603225 4838994 4821382 4688248
34165 4688248 4741889 4810952 4623734 4433072 4600976 4919544 4981155 4870406 4890992 4979393
34155 4979393 4962042 4991667 5172262 5189708 4863989 4589927 4684290 4829827 4729119 4704916
34145 4704916 5024643 5271072 5088750 4910975 5175123 5457093 5232912 4893006 5081190
34136 5081190 5557456 5656146 5411030 5302916 5316386 5154953 4996156 5152276 5364538 5272939
34126 5272939 5171829 5470184 5859508 5868808 5755639 5955523 6159746 5892724 5503071 5575897
34116E575897K57923j71441l80470L9494L08584k3058k44979J00053L76190J59796
34106E997989J3288K41816K48028j74327k95221J16692K47757j81378k87408K88303
34096F215539O08216J59990k08412O5302K47701j39325l40960P6878K76329k11375
34086F749883m67934R1444N42952J59501k49975P4428M27316Q2706k98599j5529
34076G096193L10042K2885k62057O6081L69110N6106k16251J06368L00409j87057
34066G661829n15337Q095N58711L05702j01394R8639L35487P9k45297J60801M33378
34055H700693l4904l75852J08340N21289O2811m11429m3899L90351P5423k30648
34045H762175J98753M89493r3471n19652J00335O84102J47034n03960n1461O36855
$$ plain form
34116 5575897 5833820 5662379 5281909 5321403 5629987 5606929 5361950 5462003 5838193 5997989
34106 5997989 6011277 6253093 6501121 6326794 6031573 6148265 6396022 6214644 5927236 6215539
34096 6215539 6823755 6983745 6775333 6840635 7088336 6949011 6608051 6684929 6961258 6749883
34086 6749883 6281949 6373393 6916345 7075846 6825871 6900299 7327615 7410321 7111722 7096193
34076 7096193 7406235 7429120 7167063 7233144 7602254 7658360 7442109 7548477 7848886 7661829
34066 7661829 7146492 7154587 7713298 8019000 7917606 8016245 8351732 8351811 8106514 8267315 8700693
34055 8700693 8665789 8289937 8398277 8919566 8982377 8570948 8527049 8917400 8992823 8762175
34045 8762175 8960928 9450421 9356950 8837298 8937633 9621735 9768769 9264809 9213348 9850203
34035I850203L02090l36472q0248M38900J51513k69915J55886O23882J24523m13936
34025A0546426J44637Q26350L18246n01071k30931M04343P5858n19968j08650
34016A0955240N97702L62240p4898M41227R95211L44556m76904l7847O87209K16076
34006A4009812m96739K9200P57462J22330p68539j88619P87352L33727n11040
33997A4074946J31611J192779O59321m55595o4248Q82687L20699o95487K9087
33988A6075800J374488Q97773m23878o4513J126857O86041m61739K01975J615938
33979B1028742J021924n47164j22715J393050R66681n35256j6874J613714J127210
33970B5929312n26520N8191J892726J343731n92632k1872K103156J646384m74123
$$ plain form
34035 9850203 10152293 9815821 9735573 10174473 10325986 10056071 10211957 10835839 10960362 10546426
34025 10546426 10691063 11517413 11835659 11334588 11103657 11508000 11583858 11063890 10955240
34016 10955240 11552942 11915182 11840284 12281511 13276722 13621278 13144374 13106527 13793736 14009812
34006 14009812 13513073 13542273 14299735 14422065 13653526 13464907 14252259 14585986 14074946
33997 14074946 14206557 15399336 16058657 15603062 15538814 16421501 16742200 16046713 16075800
33988 16075800 17450288 18348061 17924183 17859670 18986527 19672568 19210829 19412804 21028742
33979 21028742 22050666 21503502 21380787 22773837 23740518 23205262 23188388 24802102 25929312
33970 25929312 25402792 25460983 27353709 28697440 28104808 28082936 30186092 31832476 31358353
33961C1358353J34378K565503K082947n02018j03806K668710K548018R4920P76334
33952D1623339L890620L531483N03075J294984N046109M577999Q56456K044841
33944F3368906P232809P074909K244642L386194J0136350J0421406M493699O303402
33936A14662317J5130769J3832607M978938J3717777L4539524J4663586p0543111
33929A40982407j55776740j51897010o1668538K3250066M0210856J7553326Q343898
33922a39001735J5878313J4427405L572263K214250J0005373J0706923L474314
33915g8722894J633434O491650P031642J962465O97202M413885M831667Q65015
33907e0795934k5176L241174L872683P28543m4834K680224L272668N86472k49873
$$ plain form
33961 31358353 31492731 34058234 36141181 35639163 35535357 38204067 40752085 40847005 41623339
33952 41623339 45513959 49045442 49548517 50843501 55889610 60467609 61324065 63368906
33944 63368906 70601715 77676624 79921266 83307460 93443810 103865216 108358915 114662317
33936 114662317 129793086 143625693 148604631 162322408 196861932 211525518 140982407
33929 140982407 -14794333 -166691343 -228359881 -205109815 -164898959 -147345633 -139001735
33922 -139001735 -123123422 -108696017 -105123754 -102909504 -92904131 -82197208 -78722894
33915 -78722894 -77089460 -70597810 -63566168 -61603703 -60906501 -56492616 -51660949 -50795934
33907 -50795934 -50821110 -47579936 -43707253 -42978710 -43023544 -40343320 -37070652 -36484180 -36734053
33898c6734053J857904K215533j13734o28702J619449K311406L45666l24687J400991
33889b8050227J893720J38053m53290J078800J518377j2380m25548J104197J572317
33880b1635981J33812l53900R15716J199909k24649o07182Q04937J258313j33780
33871a8642805p31671M70526J058352M8605l37948P30133J039919j63084n69761
33862a7097734O77936J256438J09203n99255L12235R36635J22886m45566K33351
33853a4493871N81886k14668n16389M32187R04527P6466l50441M72602Q58773
33844a2248928p2887o32990J62820P19885J596n25416J52803O61606M4661l55475
33834a2092325L75421Q75934J91196l65519J76834N82334m9038m36761L32939
$$ plain form
33898 -36734053 -34876149 -32660616 -32774350 -33403052 -31783603 -29472197 -29126531 -29451218 -28050227
33889 -28050227 -26156507 -26018454 -26471744 -25392944 -23874567 -23886947 -24312495 -23208298 -21635981
33880 -21635981 -21502169 -21856069 -20940353 -19740444 -19965093 -20572275 -19767338 -18509025 -18642805
33871 -18642805 -19374476 -18903950 -17845598 -17796993 -18134941 -17404808 -16364889 -16527973 -17097734
33862 -17097734 -16419798 -15163360 -15054157 -15653412 -15341177 -14404542 -14281656 -14727222 -14493871
33853 -14493871 -13911985 -14126653 -14643042 -14210855 -13306328 -13229862 -13580303 -13107701 -12248928
33844 -12248928 -12321815 -12954805 -12791985 -12072100 -12070504 -12595920 -12443117 -11781511 -11736850 -12092325
33834 -12092325 -11716904 -10840970 -10649774 -11015293 -10838459 -10256125 -10305163 -10741924 -10408985
33825a0408985Q97916J63533o08210j79508M40356Q3988l99578Q538M92512J47868
33815i361570j79731L39789P53252J46304n32820k54319K05028r3016m04095J28931
33805i252247O82001L03570k54128M156M62674J92076k72573r3009K40790J1170
33795g975520k59084P2127M23616J69450j06334J49295L01500j07116k70813K89552
33785g313327N68804j04820o60305j77799L93622K3504m59082K8365P41586N06341
33775f453111j26734l9155L36983l28n81294l46338L35097L99978L1539P2647
33765f370716K89196j2267l86344l8852M81378J54014n69113m66353L18860N87579
33755f012618J38004j55232k1295N291j50723n4777K01987J60176m4729J7729
$$ plain form
33825 -10408985 -9511069 -9347536 -9955746 -10135254 -9694898 -9610910 -10010488 -10001950 -9509438 -9361570
33815 -9361570 -9541301 -9201512 -8448260 -8301956 -8834776 -9089095 -8884067 -8977083 -9381178 -9252247
33805 -9252247 -8570246 -8266676 -8520804 -8516648 -8053974 -7861898 -8134471 -8227480 -7986690 -7975520
33795 -7975520 -8234604 -8162477 -7738861 -7569411 -7675745 -7526450 -7224950 -7332066 -7602879 -7313327
33785 -7313327 -6744523 -6849343 -7509648 -7687447 -7293825 -7270321 -7729403 -7701038 -6959452 -6453111
33775 -6453111 -6579845 -6619000 -6282017 -6282345 -6863639 -7209977 -6874880 -6474902 -6443363 -6370716
33765 -6370716 -6081520 -6093787 -6480131 -6518983 -6037605 -5883591 -6452704 -6919057 -6600197 -6012618
33755 -6012618 -5874614 -6029846 -6051141 -6045850 -6196573 -6251350 -6049363 -5889187 -5933916 -5916187
33745e916187J56530q780j64086R8417L49901Q1141k36596Q752L45435O8403l66568
33734e583638j36800L86330K80541k61137l41248J7741Q8692j01551N5535M21315
33724e174220L26528j15554k01472P4025J33454k8804J3409J06906j71121m88939
33714e525788k33934K86185L03895n3865p8005J70721P6500k41490j40974K50213
33704e186542K30172j40489j47903K37954L46241N1614j13338j9763k3776r4245
33694d860075P4908K39844k8709l62800j07040M13830L41849j94164k82585J64258
33684d600684L24037k5123k11109K2711J51198l4617j11685K8614o209k10327
33674d673194j29381J84974J96837o4516k7354K86145K43733j74006k62156J24821
$$ plain form
33745 -5916187 -5759657 -5768437 -5932523 -5834106 -5484205 -5403064 -5639660 -5630908 -5285473 -5217070 -5583638
33734 -5583638 -5720438 -5334108 -5053567 -5314704 -5655952 -5638211 -5549519 -5651070 -5595535 -5174220
33724 -5174220 -4847692 -4963246 -5164718 -5090693 -4957239 -4986043 -4972634 -4865728 -5036849 -5525788
33714 -5525788 -5759722 -5473537 -5169642 -5223507 -5301512 -5130791 -5054291 -5295781 -5436755 -5186542
33704 -5186542 -4956370 -5096859 -5244762 -5006808 -4660567 -4608953 -4722291 -4742054 -4765830 -4860075
33694 -4860075 -4785167 -4545323 -4574032 -4936832 -5043872 -4630042 -4288193 -4482357 -4764942 -4600684
33684 -4600684 -4276647 -4301770 -4512879 -4490168 -4338970 -4373587 -4485272 -4456658 -4462867 -4673194
33674 -4673194 -4802575 -4617601 -4420764 -4485280 -4512634 -4226489 -3982756 -4156762 -4418918 -4294097
33664d294097K98799r969k14351Q671J89476J9019j17104N6713K16966J23575
33654c722302K6789P6460L8785j35658j44199N9955J51407O1765N7786J21070
33644c408142l4314k83644j98774J25044J53049j29850j81776J03272K27302K2032
33634c605801j06210L86K0722j13558p7446J27328J22948p1481m1997J74769J19803
33623c450537j52032r8947K56713K98523k5838o3633L09199L92630p1974l98311
33613c004207j45171J81707J07414n3875M9211J39387m3610j81157n570J73229
33603b782642O5101r4958p4227o8010k05693k35988o1426K2060o9024o534K52587
33592c258754K71751n0267k04815L3918J88575n4542k98644j91050j0046m1829
$$ plain form
33664 -4294097 -3995298 -4005267 -4219618 -4210947 -4021471 -4002452 -4119556 -4062843 -3845877 -3722302
33654 -3722302 -3695513 -3619053 -3580268 -3715926 -3860125 -3800170 -3648763 -3586998 -3529212 -3408142
33644 -3408142 -3442456 -3726100 -3924874 -3799830 -3646781 -3776631 -3958407 -3855135 -3627833 -3605801
33634 -3605801 -3712011 -3711625 -3690903 -3804461 -3881907 -3754579 -3631631 -3703112 -3745109 -3570340 -3450537
33623 -3450537 -3602569 -3701516 -3444803 -3146280 -3172118 -3235751 -2926552 -2533922 -2605896 -3004207
33613 -3004207 -3149378 -2967671 -2860257 -2914132 -2864921 -2725534 -2769144 -2950301 -2955871 -2782642
33603 -2782642 -2717541 -2812499 -2886726 -2954736 -3160429 -3396417 -3457843 -3435783 -3504807 -3511341 -3258754
33592 -3258754 -2987003 -3037270 -3242085 -3208167 -3019592 -3074134 -3372778 -3563828 -3573874 -3615703
33582c615703n9404J11890J80104O861k4339K57787L76392K2684l36224k19831
33572c299783R3802J29131l744L4491J59724J26485J9596o647o8723k08902j62404
33561c186974J22094K19754q6471l62414k11116R7376J54125P4975J36452K10956
33551b831243Q8235m3411N5349J98901J09157j04549k02847k17129k31527j27854
33541c306918J08235K08741P7934K1575K09510L45955J94606k4053q2749j17927
33531b365091k21617j63321J27843L01345J57629k0929l9703j31654l74949l87285
33521c117732k6533K24183N2292j18736J07366L76684K28799r0463j06606P7478
33511b393268J02509M4124J36918K01718r721k44932j42107J21893J51328o433
$$ plain form
33582 -3615703 -3675107 -3563217 -3383113 -3376252 -3400591 -3142804 -2766412 -2743728 -3079952 -3299783
33572 -3299783 -3205981 -3076850 -3080594 -3046103 -2886379 -2759894 -2740298 -2746945 -2815668 -3024570 -3186974
33561 -3186974 -3064880 -2845126 -2931597 -3294011 -3505127 -3407751 -3253626 -3178651 -3042199 -2831243
33551 -2831243 -2743008 -2786419 -2731070 -2532169 -2423012 -2527561 -2730408 -2947537 -3179064 -3306918
33541 -3306918 -3198683 -2989942 -2912008 -2890433 -2680923 -2334968 -2140362 -2164415 -2247164 -2365091
33531 -2365091 -2586708 -2750029 -2622186 -2320841 -2163212 -2184141 -2223844 -2355498 -2730447 -3117732
33521 -3117732 -3144265 -2920082 -2867790 -2986526 -2879160 -2502476 -2273677 -2364140 -2470746 -2393268
33511 -2393268 -2290759 -2246635 -2109717 -1907999 -1917720 -2162652 -2304759 -2182866 -2031538 -2037971
33501b037971o4815n3767j41574k08118j00547j907p6997j06248O9045J52305
33491b570594o3891k12736L4668L27675K13045q2928r5669O5448K6032j11083
33481b470033l7351Q9016m0547k05641k2665K86872K31371q6326j73421n927M7423
33470b387229k8091M2639J71471N1927j69329r1737J73013J61189r5484j21879
33460b293510J31149K09713j1071j26403N7671K18106R5252j60003l43557m27477
33450b650130l52565m6931K86111L25504J15334o583N1279P8666J2616L255M9055
33439b134389n562j20936j12307j4772p740m2416M8312J54046M0884j71279j42904
33428b509063J16183K59369J62559M2924K7305M523q2866j45597j40518q4848
$$ plain form
33501 -2037971 -2102786 -2156553 -2298127 -2506245 -2606792 -2608699 -2685696 -2791944 -2722899 -2570594
33491 -2570594 -2634485 -2847221 -2812553 -2484878 -2271833 -2354761 -2450430 -2384982 -2358950 -2470033
33481 -2470033 -2507384 -2418368 -2458915 -2664556 -2687221 -2400349 -2168978 -2255304 -2428725 -2434652 -2387229
33470 -2387229 -2415320 -2372681 -2201210 -2149283 -2318612 -2410349 -2237336 -2076147 -2171631 -2293510
33460 -2293510 -2162361 -1952648 -1963719 -2090122 -2032451 -1814345 -1719093 -1879096 -2222653 -2650130
33450 -2650130 -3002695 -3049626 -2763515 -2438011 -2322677 -2329260 -2277981 -2199315 -2186699 -2183444 -2134389
33439 -2134389 -2139951 -2260887 -2373194 -2387966 -2395706 -2438122 -2389810 -2235764 -2194880 -2366159 -2509063
33428 -2509063 -2392880 -2133511 -1970952 -1928028 -1900723 -1896200 -1979066 -2124663 -2265181 -2350029
33418b350029L5510J31065j4159l42041l89446N4602M83286L54160p0784j47917
33408b255753J49226L12459J94108J14081J55640N7389j75220k01273L2918J72838
33398a443587M8604j13649j43498j26771j09464l5845M832j11079k13425m9982
33388b293864K33368K76240R0975r813J7682l4218j23327k6510J45617P3327j58877
33377a809400j51356J07258K08978L4001q7825L274O7386l9461j42842j32724
33367a942711j19380j25348l7025R6154J11167O5092J17231J55651j0559k00041
33357a889769j08673J11726Q7586q4767j0204K37103K08125r2157j91841l90N5301
33346a677960j64908k83803j22325K8783J8240P2156K48409K72137R4938K4555
$$ plain form
33418 -2350029 -2314519 -2183454 -2197613 -2539654 -2929100 -2874498 -2391212 -2037052 -2107836 -2255753
33408 -2255753 -2106527 -1794068 -1599960 -1485879 -1330239 -1272850 -1448070 -1649343 -1616425 -1443587
33398 -1443587 -1394983 -1508632 -1652130 -1778901 -1888365 -1924210 -1919378 -2030457 -2243882 -2293864
33388 -2293864 -2060496 -1784256 -1693281 -1703094 -1685412 -1719630 -1842957 -1869467 -1723850 -1650523 -1809400
33377 -1809400 -1960756 -1853498 -1644520 -1610519 -1698344 -1695070 -1627684 -1667145 -1809987 -1942711
33367 -1942711 -2062091 -2187439 -2224464 -2128310 -2017143 -1952051 -1834820 -1679169 -1689728 -1889769
33357 -1889769 -1998442 -1886716 -1799130 -1883897 -1894101 -1656998 -1448873 -1541030 -1732871 -1733261 -1677960
33346 -1677960 -1842868 -2126671 -2248996 -2220213 -2201973 -2129817 -1881408 -1609271 -1514333 -1489778
33336a489778J31939J17388q0830j43119J5795R0285j4329l9366L5965q3734l48548
33325a808332l17116L8216J91568l8205j72533N7846K50224Q8524j16589m2071
33315a868468J12039R7964N7031J06004M3059j78182k36880m2779L2982j42509
33305b019739j55951J84144M12036J79995j43872j35903K718o4885j82862r2877
33295b017196L9446Q163J2244K13270L11800P8351j48792k7399J66668L3774k41555
33284a571226k47837n2310J7050j7105O6451J94315J63542N7677N1969N7002m3362
33273a323834r2223J5908M4507j54579k82590q6886J62365J36313R759Q0761J97830
33262a292669Q0151j24786j25239k6217p9320j77035r0872O2268O7672M2696J55897
$$ plain form
33336 -1489778 -1357839 -1240451 -1321281 -1464400 -1448605 -1358320 -1372649 -1412015 -1376050 -1459784 -1808332
33325 -1808332 -2125448 -2087232 -1895664 -1933869 -2106402 -2048556 -1798332 -1709808 -1826397 -1868468
33315 -1868468 -1756429 -1658465 -1601434 -1495430 -1452371 -1630553 -1867433 -1910212 -1877230 -2019739
33305 -2019739 -2175690 -1991546 -1579510 -1399515 -1543387 -1679290 -1676572 -1741457 -1924319 -2017196
33295 -2017196 -1977750 -1969587 -1957343 -1744073 -1432273 -1353922 -1502714 -1530113 -1363445 -1329671 -1571226
33284 -1571226 -1819063 -1871373 -1854323 -1871428 -1804977 -1610662 -1447120 -1389443 -1337474 -1280472 -1323834
33273 -1323834 -1416057 -1400149 -1355642 -1510221 -1792811 -1879697 -1717332 -1581019 -1571260 -1490499 -1292669
33262 -1292669 -1212518 -1337304 -1462543 -1488760 -1568080 -1745115 -1835987 -1773719 -1706047 -1663351 -1507454
33251a507454K21876M7657j37323q0346Q294j20753k11436M0829L30877J82166
33241a225613k28911l36769o4813J84890K37629K32675J67499m5334k06387r0254
33231a375388O5858r3097l62229k55857J50565K92355p013l26561l30643j25771
33221b367781R7573K96207L96377K93496P4713o4980r1097o0902N4272J96663
33211a175459J19906j95783l23508k675L47989K27405j50286k26351J1239J36638
33201a230885O6872P1469J49112N0181j65305k03995r8009j11089j83795n4964
33191a710408J65602J42470o0780r6508K7420K6077n8293L5816J87123O2042k09509
33180a488948k16078k7285m6806j94594l7812L04926K63277j34563k21130J51112
$$ plain form
33251 -1507454 -1285578 -1237921 -1375244 -1455590 -1447296 -1568049 -1779485 -1738656 -1407779 -1225613
33241 -1225613 -1454524 -1791293 -1856106 -1671216 -1433587 -1200912 -1033413 -1078747 -1285134 -1375388
33231 -1375388 -1309530 -1402627 -1764856 -2020713 -1870148 -1577793 -1584806 -1911367 -2242010 -2367781
33221 -2367781 -2270208 -1974001 -1577624 -1284128 -1209415 -1274395 -1365492 -1426394 -1372122 -1175459
33211 -1175459 -1055553 -1251336 -1574844 -1577519 -1229530 -1002125 -1152411 -1378762 -1367523 -1230885
33201 -1230885 -1164013 -1092544 -943432 -893251 -1058556 -1262551 -1360560 -1471649 -1655444 -1710408
33191 -1710408 -1544806 -1402336 -1463116 -1559624 -1532204 -1506127 -1564420 -1528604 -1341481 -1279439 -1488948
33180 -1488948 -1705026 -1732311 -1779117 -1973711 -2011523 -1706597 -1443320 -1577883 -1799013 -1647901
33170a647901L31896J9362k22750J1004K68003P3442k58113k26350K8419R6084
33160a526904K3994R0851K14151J34812o1615r4026K3167M2941r1641k09826j95544
33149a649640p3696Q3411J81629J56824Q5099Q9332J17617K8291j18051j28853
33139a228037k6641n822n6901O497J48092J27828o0006j63220j08547o2327n0670
33128a479754N3350J67286Q6186p3707j4109J76301J43637n0036l76K48134J97096
33117e45992j89451l19293K6298K71988j716l76833l24214j2770J10251M3482
33107a318250K6178L0451n2435p6858N8417J07180j11922l18705j90618J17344
33097a729218K52336J81968Q0024k2886j32836j11655P5200J96780J23779N8087
$$ plain form
33170 -1647901 -1316005 -1296643 -1519393 -1508389 -1240386 -1166944 -1425057 -1651407 -1622988 -1526904
33160 -1526904 -1502910 -1412059 -1197908 -1063096 -1124711 -1218737 -1195570 -1152629 -1244270 -1454096 -1649640
33149 -1649640 -1723336 -1639925 -1458296 -1301472 -1216373 -1127041 -1009424 -981133 -1099184 -1228037
33139 -1228037 -1254678 -1260500 -1317401 -1310904 -1162812 -1034984 -1094990 -1258210 -1366757 -1429084 -1479754
33128 -1479754 -1426404 -1259118 -1172932 -1246639 -1260748 -1084447 -940810 -990846 -991222 -743088 -545992
33117 -545992 -735443 -1054736 -1028438 -756450 -758166 -1134999 -1459213 -1471983 -1361732 -1318250
33107 -1318250 -1292072 -1261621 -1314056 -1390914 -1332497 -1225317 -1337239 -1655944 -1846562 -1729218
33097 -1729218 -1476882 -1294914 -1214890 -1237776 -1370612 -1482267 -1407067 -1210287 -1086508 -1028421
33087a028421J29135J13015j37431l40622k15139O0184J59490Q1509j2411j16169
33077a306860k17846j50729P3826J28424j11016k80786j13422R9120L5223p3991
33067a918057J15878M01165L59961P1176n3676L7430N0109q2395j39299n5726
33057a213434M651k4570o0854p9108q4185O284J93684K78854J59969L5298N2585
33046g30826K6615j90733l54172k03421P2397J38329L6908J4524N9580J8534m1646
33035a153911J3371P2509k29n2418O8840J59090n464k18394j66669L0076N4424
33024a198775n7107n8176K3502J1862j6179P8374J25690m9212j92340j6446K14752
33013a134055Q4989k15707j82459J24863J96678k4817r0796J07033J63882o1911
$$ plain form
33087 -1028421 -899286 -786271 -923702 -1264324 -1479463 -1419279 -1259789 -1178280 -1190691 -1306860
33077 -1306860 -1524706 -1675435 -1601609 -1473185 -1584201 -1864987 -1978409 -1879289 -1844066 -1918057
33067 -1918057 -1802179 -1401014 -1041053 -969877 -1023553 -986123 -936014 -1018409 -1157708 -1213434
33057 -1213434 -1208783 -1233353 -1294207 -1373315 -1457500 -1451216 -1257532 -978678 -818709 -783411 -730826
33046 -730826 -704211 -894944 -1249116 -1452537 -1380140 -1241811 -1204903 -1190379 -1130799 -1112265 -1153911
33035 -1153911 -1140540 -1068031 -1068260 -1120678 -1051838 -892748 -898212 -1116606 -1283275 -1253199 -1198775
33024 -1198775 -1255882 -1314058 -1290556 -1278694 -1294873 -1216499 -1090809 -1140021 -1332361 -1348807 -1134055
33013 -1134055 -1049066 -1264773 -1447232 -1322369 -1125691 -1150508 -1241304 -1134271 -970389 -1032300
33003a032300j86796m164J60256L5178j69597j76779n6975L736N472J6362L5873
32992a369734Q1696J50847R0437j76871l55095j12342L27456M07797N7544k24965
32982a123230j53226J8305N1862O6080J35904O9681j67624k60962m4873J92098
32972a215985J63474l212n6900n43N9418J35257J96837P6693k29741m28711l17849
32961a621262q0704Q793m4067o8568o513R9038K13877K70929J87733K3772n8039
32950a075011m2472o1664j13541m8430J14532J55329J5460j05183r7458q0012
32940a338450r9041k8890J07712P5404j48310k29337K0774L08275K79381K4790
32930a027692j06301k656J57497K17732J78024R3233L420o8673j21794j34997
$$ plain form
33003 -1032300 -1219096 -1223260 -1063004 -1027826 -1197423 -1374202 -1431177 -1427441 -1421969 -1405607 -1369734
32992 -1369734 -1288038 -1137191 -1046754 -1223625 -1578720 -1691062 -1363606 -955809 -898265 -1123230
32982 -1123230 -1276456 -1258151 -1206289 -1140209 -1004305 -934624 -1102248 -1363210 -1408083 -1215985
32972 -1215985 -1052511 -1055723 -1112623 -1113166 -1053748 -918491 -721654 -644961 -874702 -1303413 -1621262
32961 -1621262 -1701966 -1693173 -1737240 -1805808 -1812321 -1713283 -1499406 -1228477 -1040744 -1016972 -1075011
32950 -1075011 -1117483 -1179147 -1292688 -1341118 -1226586 -1071257 -1055797 -1160980 -1258438 -1338450
32940 -1338450 -1437491 -1466381 -1358669 -1283265 -1431575 -1660912 -1640138 -1331863 -1052482 -1027692
32930 -1027692 -1133993 -1136649 -979152 -761420 -583396 -490163 -486743 -555416 -677210 -812207
32920h12207m7370J14375J67392J5294j39333p7610M9247m8855k72795k55871
32910a307733J3511J55766K9796q1473j5487K7289n9385p1627N6761O3358j34040
32899a323264j96036P1059L36940K73174N8833k927K676j23139k40053j29671
32889a272408N9665O5741j3491O9856K18997J48732r4057j89277n2964Q3211O1478
32878i14517m3099j12375q2102P4625K41534J71054j62695l96019k36761R0749
32868a369606J79653L5997l4188K0146j2380j30547q8371J37937K56832J18263
32858h86264q0134j43634j30277j29525o6159J14104K68321K35423O7398n3479
32848h04226n2377j5542m1266j03405q0325P3012K16793J83202L2268r353R7115
$$ plain form
32920 -812207 -859577 -745202 -577810 -562516 -701849 -779459 -730212 -779067 -1051862 -1307733
32910 -1307733 -1294222 -1138456 -1108660 -1190133 -1205620 -1178331 -1237716 -1309343 -1252582 -1189224 -1323264
32899 -1323264 -1519300 -1448241 -1111301 -838127 -779294 -782221 -779545 -902684 -1142737 -1272408
32889 -1272408 -1212743 -1147002 -1160493 -1090637 -871640 -722908 -816965 -1006242 -1059206 -975995 -914517
32878 -914517 -957616 -1069991 -1152093 -1077468 -835934 -664880 -827575 -1223594 -1460355 -1369606
32868 -1369606 -1189953 -1153956 -1188144 -1167998 -1180378 -1310925 -1399296 -1261359 -1004527 -886264
32858 -886264 -966398 -1110032 -1240309 -1369834 -1435993 -1321889 -1053568 -818145 -750747 -804226
32848 -804226 -856603 -872145 -913411 -1016816 -1097141 -1024129 -807336 -624134 -591866 -601219 -504104
32837e04104J22244m8894j91277r3714P9714N3331j03344j08775L8346N9040j17735
32826h15168k16287n6008J57690J42526o0613j75502o8533J23777K10676J66043
32816e91399J04222J00183R7184Q984j37986k29927k08745j13498o665M4664m0544
32805i73527k39517l39210j66234J14526J77842K8832J2272K49782M08266K15040
32795e11928j11410k09950r8679m2703r8173j15369o2727k8671J1999J34639K30437
32784i02535J23150j12714k15802j07767L6780P8854N0571O435m9726p9930l9970
32773a212654r75p5533k12361k14433J4552L40352N16004L83650K5267k48545
32763f84676j87778O6454J24737j03559k66715j20948Q8248N7677o2701L3476
$$ plain form
32837 -504104 -381860 -430754 -622031 -715745 -636031 -582700 -686044 -794819 -756473 -697433 -815168
32826 -815168 -1031455 -1087463 -929773 -787247 -847860 -1023362 -1091895 -968118 -757442 -591399
32816 -591399 -487177 -386994 -289810 -280826 -418812 -648739 -857484 -970982 -977647 -932983 -973527
32805 -973527 -1213044 -1552254 -1718488 -1603962 -1426120 -1397288 -1385016 -1135234 -726968 -511928
32795 -511928 -623338 -833288 -931967 -974670 -1072843 -1188212 -1250939 -1279610 -1267611 -1132972 -902535
32784 -902535 -779385 -892099 -1107901 -1215668 -1178888 -1100034 -1049463 -1043028 -1092754 -1172684 -1212654
32773 -1212654 -1213629 -1289162 -1501523 -1715956 -1701404 -1361052 -845048 -461398 -436131 -684676
32763 -684676 -872454 -806000 -681263 -784822 -1051537 -1172485 -1084237 -1026560 -1089261 -1055785
32753a055785K34718J86837q8266k19616r3131K3571j3223k7243Q2265J46628
32743h23245O6675M978P9309J49063P0971o7083j16846p9835l0264l052l6223
32732g85552j42110j88584k3533K36354K86338O8060j38548j43395q4350j10950
32722a026270j19617O008J41878J34943O5679P0759P7049m6346k10617k32233
32712a138767j34799p8157n8057O2882K46284K65325N8237j25533m9340J85562
32702g66363K76304J08371j23701j82324o6465L2229o61o8475j9339J41215K62411
32691d06798K35829R2792p1669j88040k15816j42810k5852K4653m0032j29642
32681h67385j08464K9851J35251R1197r372K6465J96302K50383K9800k66121l20657
$$ plain form
32753 -1055785 -821067 -634230 -722496 -942112 -1035243 -1011672 -1024895 -1052138 -969873 -823245
32743 -823245 -756570 -751592 -672283 -523220 -452249 -519332 -636178 -716013 -746277 -749329 -785552
32732 -785552 -927662 -1116246 -1139779 -903425 -617087 -549027 -687575 -830970 -915320 -1026270
32722 -1026270 -1145887 -1139879 -998001 -863058 -797379 -726620 -649571 -695917 -906534 -1138767
32712 -1138767 -1273566 -1351723 -1409780 -1346898 -1100614 -835289 -777052 -902585 -951925 -766363
32702 -766363 -490059 -381688 -505389 -687713 -754178 -721949 -722610 -791085 -810424 -669209 -406798
32691 -406798 -170969 -78177 -149846 -337886 -553702 -696512 -722364 -697711 -737743 -867385
32681 -867385 -975849 -945998 -810747 -719550 -728922 -702457 -506155 -255772 -225972 -492093 -812750
32670h12750j27228M2261N7762N0937Q7078K1334j87881k96618j09859K06271
32660a068693L55487K84286J24519n8416k27665k46191n2561J48158J27554k8674
32650f42196p9487k1408l5928j21648r8971L4934P2192m3290j03191L0254K08077
32639h00662K18882O1843r6659j24947k8314P2186N5990m1725m8026R7153K18179
32628d16100J52290j1340r9090j11397j18218n9636R9010J68756l209k03002j19972
32617g21908J46165K17896K7137j19571n9302L4944K2769j5951l2350r5662j51627
32606g47460m2032J49992J34998r5565j92769q500J52571M9617r0586K6125K52859
32595d10750K32878m5389k52390j95040k4298K2907q9001j89750j19172O0372
$$ plain form
32670 -812750 -939978 -897717 -839955 -789018 -701940 -680606 -868487 -1165105 -1274964 -1068693
32660 -1068693 -713206 -428920 -304401 -362817 -590482 -836673 -889234 -741076 -613522 -642196
32650 -642196 -721683 -743091 -779019 -900667 -999638 -964704 -892512 -935802 -1038993 -1008739 -800662
32639 -800662 -581780 -519937 -616596 -741543 -769857 -697671 -641681 -683406 -731432 -634279 -416100
32628 -416100 -263810 -275150 -374240 -485637 -603855 -663491 -564481 -395725 -398934 -601936 -721908
32617 -721908 -575743 -357847 -330710 -450281 -509583 -474639 -451870 -467821 -500171 -595833 -747460
32606 -747460 -789492 -639500 -504502 -600067 -792836 -801336 -648765 -599148 -689734 -663609 -410750
32595 -410750 -177872 -223261 -475651 -670691 -694989 -672082 -761083 -950833 -1070005 -1009633
32585a009633J10795n0911j77574l2250K07276J76136j03246k33394m7771J73891
32575i86681J80691O8668n645o8031j18433k7302J68419J95833k3302j97782j36550
32564i50115n0625j33507j92345j8587J91960J63302K1861N6258K00436J71311
32554e40051j9109j00268j4503L0344m8635j08975p6550m0746l5244J7677J14550
32543h21510J43705Q3236M2336P4888R8302K4220j26867k43013k08173k9193J05540
32532h56529K3603j51969j23239J25372K60048J14130l8109N5807J96574Q2802
32522c11510j62273j97546k5899N7482j5520k3714J05604J74181P3983m8038o1420
32511d34670k9667m0240p1217r6331j44924k00568j86250q8769K0603R6987J45297
$$ plain form
32585 -1009633 -898838 -949749 -1127323 -1159573 -952297 -776161 -879407 -1112801 -1160572 -986681
32575 -986681 -805990 -737322 -742967 -810998 -929431 -956733 -788314 -592481 -615783 -813565 -950115
32564 -950115 -1000740 -1134247 -1326592 -1345179 -1153219 -989917 -968056 -911798 -711362 -540051
32554 -540051 -559160 -659428 -673931 -643587 -692222 -801197 -877747 -918493 -953737 -936060 -821510
32543 -821510 -677805 -594569 -552233 -477345 -379043 -354823 -481690 -724703 -932876 -962069 -856529
32532 -856529 -832926 -984895 -1108134 -982762 -722714 -608584 -646693 -590886 -394312 -311510
32522 -311510 -473783 -671329 -697228 -639746 -655266 -678980 -573376 -399195 -325212 -373250 -434670
32511 -434670 -464337 -504577 -575794 -672125 -817049 -1017617 -1203867 -1292636 -1272033 -1175046 -1029749
32500a029749J52333J06544N7767N6817P5042O5068L5465r03n0777n9870L3772
32489e58491J08231m7288l37943l56236L2718M00395L29834r37j57150j09076
32479f95943j27764k14661j26761J10941J95946N1981p9070p1083m8616n8776
32469a063806Q581J21660R3062p1189j52672j04527j03366j61983o8319J93091
32459a309468L36104K25959Q3394Q0885P9537m6018j48551r6129k9839r2840j51369
32448a068335l8176J32159J44997K4092m6277j4285L2423N2506O3007M7992R99
32437f68898j9943J0996L1331J5407K7385O4225P054j56063k28987q2953J16129
32426h84317J33897K626o3133o498K0078p1922j59294q3147J25513K60488J65972
$$ plain form
32500 -1029749 -877416 -770872 -713105 -656288 -581246 -516178 -480713 -481616 -532393 -592263 -558491
32489 -558491 -450260 -497548 -835491 -1191727 -1159009 -758614 -428780 -429717 -586867 -695943
32479 -695943 -823707 -1038368 -1165129 -1054188 -858242 -806261 -885331 -956414 -1005030 -1063806
32469 -1063806 -1055225 -933565 -840503 -911692 -1064364 -1168891 -1272257 -1434240 -1502559 -1309468
32459 -1309468 -973364 -747405 -664011 -583126 -503589 -549607 -698158 -794287 -824126 -916966 -1068335
32448 -1068335 -1106511 -974352 -829355 -805263 -851540 -865825 -833402 -780896 -717889 -669897 -668898
32437 -668898 -688841 -677845 -646514 -631107 -603722 -539497 -532443 -688506 -917493 -1000446 -884317
32426 -884317 -750420 -747794 -810927 -817425 -797347 -869269 -1028563 -1111710 -986197 -725709 -559737
32415e59737q0438k41870j92405n2236L823j0842L5429J45365J87074J22059O5159
32404e78619R1412J32776J04271J1330r3381j56527j29812l1843K5222k0340p2339
32393g17850m2624k2836j11021j84159q2834Q3717J02394L0820P1304J47583J1834
32382g13672k44758k41181O9049K78806J62368j9023k6810q594j02289j10458
32372i56562J04771K79315J63767m1960m8472K7711o1032j91968j03727P8360
32362g49797L7062j52463j33498R6773J60519o4365k43927j30301Q9875J41048
32352i49074L8463m1301l0901L1735J00007J12137L8321k2556M1013J32550N2579
32341d97027j60999k43522j04723M0793L6522J5348J19099K21956J38601n9612
$$ plain form
32415 -559737 -640175 -882045 -1074450 -1126686 -1122863 -1133705 -1098276 -952911 -765837 -643778 -578619
32404 -578619 -487207 -354431 -250160 -238830 -332211 -488738 -618550 -650393 -625171 -645511 -717850
32393 -717850 -760474 -783310 -894331 -1078490 -1161324 -1077607 -975213 -944393 -873089 -725506 -713672
32382 -713672 -958430 -1199611 -1130562 -851756 -689388 -708411 -735221 -743815 -846104 -956562
32372 -956562 -851791 -572476 -408709 -450669 -499141 -471430 -532462 -724430 -828157 -749797
32362 -749797 -712735 -865198 -998696 -901923 -741404 -805769 -1049696 -1179997 -1090122 -949074
32352 -949074 -910611 -951912 -982813 -951078 -851071 -738934 -700613 -723169 -682156 -549606 -497027
32341 -497027 -658026 -901548 -1006271 -965478 -928956 -913608 -794509 -572553 -433952 -493564
32331d93564j53962r7083j8526J9528P2745J42954J38069L1891p2578q7362m9281
32320e67169l2816k9089J6233Q4190Q8308J3620k4290P4005K19952K10120n896
32309D7168k27191k42594r4627M881k3749n6374o743J9271r1591k34100j99052
32298a104701J6907J77380J22597k0988m1859N8017J09482N3400o593j4172k8053
32287f78583m3366M8474K26894K71170P7534j26404q3724J12423J69302K2591
32277c689j34168j81559j72695j25996J4731J93991K54382J63113K7166j09245
32267g3969k55857k96399j07962J36185J12065j53335k70449p5326J30865Q9154
32257g65028l0010K0045J40914J09939k7005q2773n8918o7298p8812r940P6184
$$ plain form
32331 -493564 -647526 -744609 -763135 -743607 -670862 -527908 -389839 -357948 -430526 -517888 -567169
32320 -567169 -599985 -629074 -612841 -528651 -440343 -426723 -451013 -377008 -157056 53064 47168
32309 47168 -180023 -422617 -517244 -512363 -536112 -592486 -599229 -579958 -671549 -905649 -1104701
32298 -1104701 -1087794 -910414 -787817 -808805 -850664 -792647 -683165 -629765 -636358 -650530 -678583
32287 -678583 -721949 -673475 -446581 -175411 -97877 -224281 -308005 -195582 -26280 -3689
32277 -3689 -137857 -319416 -492111 -618107 -603376 -409385 -155003 8110 35276 -73969
32267 -73969 -329826 -626225 -734187 -598002 -485937 -639272 -909721 -985047 -854182 -765028
32257 -765028 -795038 -774993 -634079 -524140 -551145 -633918 -692836 -760134 -838946 -848886 -772702
32246g72702Q4251O3219O9650K9479o4954m1493J30547J60204j16546l61070j94117
32235a013532J73692K26014p6707k81544j58229N6215J52080K12324K81586K04402
32225b23699l6199j79636p9033O3239L1218r5920j44325j11254n3050O5997K21073
32214e41589K23544j8424k84191k85998k7863K42009L39363K55105N2841j80907
32204b26110l28657l16103j84934k8133J06367K01767K30248J85331J04729K0312
32194b35183o0959j07673p3976J2495N1257q099j06395j54715j12893M991J27951
32183f63199J50900N3086l5172L669Q3893L9406r4331j14607K1244J14529L5124
32172d05458q8531r7032m0237m3550p0887K671J53602K16614J19551j9900n7629
$$ plain form
32246 -772702 -688451 -625232 -555582 -526103 -591057 -632550 -502003 -341799 -458345 -819415 -1013532
32235 -1013532 -839840 -613826 -690533 -972077 -1130306 -1074091 -922011 -709687 -428101 -223699
32225 -223699 -259898 -439534 -518567 -455328 -424110 -520030 -664355 -775609 -828659 -762662 -541589
32214 -541589 -318045 -336469 -620660 -906658 -934521 -692512 -353149 -98044 -45203 -226110
32204 -226110 -554767 -870870 -1055804 -1083937 -977570 -775803 -545555 -360224 -255495 -235183
32194 -235183 -296142 -403815 -477791 -465296 -414039 -422138 -528533 -683248 -796141 -791150 -663199
32183 -663199 -512299 -459213 -494385 -490716 -406823 -367417 -461748 -576355 -555111 -440582 -405458
32172 -405458 -493989 -591021 -631258 -674808 -745695 -743024 -589422 -372808 -253257 -273157 -330786
32161c30786M572N1662J4481n2893n6829Q559N3997R300r8646j88572j99114j20276
32149i04545j4302L517r8802j65151k9427J98473K32390M4904n8211P7119J88247
32138e25788M0859j47736o0238J78128K11677M4810k9719P841q6052k65309j87764
32127h19291J44988K71564n849k71334j51186J18040J33732l3396o6492J4867
32117f64357l5376j74685j36541O6200J44767L9823J0278J50622K06183K3603
32107c69483j42019q344K67777K88499j2630k71621j98643L9607P5975j45358
32097d76240l09388j76712J07638K51035K01620J25778R6866L2511p6660j08962
32087c32514l3933R688n6744j18924o8015K2122L3674p919j0173K3277K5390j0763
$$ plain form
32161 -330786 -326214 -274552 -260071 -312964 -369793 -361234 -307237 -297937 -396583 -585155 -784269 -904545
32149 -904545 -918847 -915330 -1014132 -1179283 -1208710 -1010237 -777847 -732943 -791154 -714035 -525788
32138 -525788 -484929 -632665 -692903 -514775 -303098 -258288 -288007 -280166 -366218 -631527 -819291
32127 -819291 -674303 -402739 -408588 -679922 -831108 -713068 -579336 -612732 -679224 -664357
32117 -664357 -699733 -874418 -1010959 -944759 -799992 -760169 -749891 -599269 -393086 -369483
32107 -369483 -511502 -519846 -252069 36430 23800 -247821 -446464 -406857 -330882 -476240
32097 -476240 -785628 -962340 -854702 -603667 -402047 -276269 -179403 -146892 -223552 -332514
32087 -332514 -366447 -356759 -413503 -532427 -600442 -578320 -544646 -552565 -562738 -539461 -514071 -524834
32075e24834l8245k8421K6067J11691J58281R6000k0924o5325l9989p5958j81557
32064e83214j80420M540J89294J84157M8930n4288j05434j47327j06443Q5070
32054f65135K73198K19435n9399k78944k35662k5227J15021P2884o7655j56893
32044h08377j39562q2413m1204M2426K18246L48798K32426o8967k26837o6692
32034e92156J89988K38877Q5276m6310o3003n9754r3294r8713l0516N4990Q0109
32023c34506L2820k9050k9735L7283P3391J114q9161m9479P4605Q4326n7657j69221
32011d55270j60790j55201j95852j17125J19366K37087M4858k06100j60965J18154
32001i31838K82253K15455J01436M9571k3121j52448k43181k33067j32896O2455
$$ plain form
32075 -524834 -563079 -591500 -565433 -453742 -295461 -199461 -220385 -285710 -325699 -401657 -583214
32064 -583214 -763634 -759094 -569800 -385643 -336713 -391001 -496435 -643762 -750205 -665135
32054 -665135 -391937 -172502 -231901 -510845 -746507 -771734 -656713 -583829 -651484 -808377
32044 -808377 -947939 -1030352 -1071556 -1029130 -810884 -462086 -229660 -298627 -525464 -592156
32034 -592156 -402168 -163291 -78015 -124325 -187328 -247082 -340376 -439089 -469605 -414615 -334506
32023 -334506 -301686 -330736 -360471 -323188 -249797 -248683 -337844 -387323 -312718 -228392 -286049 -455270
32011 -455270 -616060 -771261 -967113 -1084238 -964872 -727785 -682927 -889027 -1049992 -931838
32001 -931838 -649585 -434130 -332694 -283123 -306244 -458692 -701873 -934940 -1067836 -1005381
31991a005381L00412L80087J74085j20509k02012p5432J6662L886K1014P2837
31981d34351J0695j38644j62333l8428R638p4912n4481J72198L32634J87303q6430
31970b77111j65339m5591K0563o5384j48654r0776N5610J51884J38290P9664Q8656
31959b58188J82441K21470P4353j61431k38010q5376Q9835R4882j1560o3385k6739
31948a81708K5878O9357J15037J13741J175j82094l07588k89429j53565j590O9587
31937g21199N1643M0522J16299K14063J97720N8910o9098j10793j32238j82714
31927e36885j87556q2244N3915R8114M7826l156L05L7989O9959O6911J8792m2501
31915d58531o2482l1826Q697M2610R0767J32965J00753j0749j00696q5242k594
$$ plain form
31991 -1005381 -704969 -324882 -150797 -271306 -473318 -548750 -532088 -528202 -507188 -434351
31981 -434351 -423656 -562300 -724633 -763061 -753423 -828335 -882816 -710618 -377984 -190681 -277111
31970 -277111 -442450 -488041 -467478 -532862 -681516 -772292 -716682 -564798 -426508 -346844 -258188
31959 -258188 -75747 145723 220076 58645 -179365 -264741 -174906 -80024 -91584 -154969 -181708
31948 -181708 -155830 -86473 28564 142305 143480 -38614 -346202 -635631 -789196 -790786 -721199
31937 -721199 -669556 -629034 -512735 -298672 -100952 -42042 -111140 -221933 -354171 -536885
31927 -536885 -724441 -806685 -752770 -654656 -606830 -609986 -609681 -571692 -501733 -434822 -416030 -458531
31915 -458531 -521013 -552839 -544142 -501532 -410765 -277800 -177047 -187796 -288492 -373734 -376328
31904c76328N1470L6795k4773r4704j19520m9159P8955J22263j3480k14004k38338
31893h40823j977K75871K87347L717k57797k02112P6627K18989O4149j73320k21795
31882g71124p0463J21527K63354L32364K71874P3165j22727j76034j35500j19836
31872c33400r9341J6419J49865J36312l881r6318r9062j29243j94460j37262Q8263
31861g02108K86822K60602L8001j97092k86234j80314L0143J51018P1849q7918
31851f15231j39948q5823n4026m5188L8627J49590J31392k445p9195n8137m3970
31840h04354r295J76806L99053L32044m9100l32097k23229N7766J44746J6675
31830b90985j10612j48554j38989p7988K2601M7293m0402p8449L6487J39825N6933
$$ plain form
31904 -376328 -324858 -288063 -312836 -407540 -527060 -576219 -497264 -375001 -388481 -602485 -840823
31893 -840823 -842800 -566929 -279582 -275865 -533662 -735774 -659147 -440158 -376009 -549329 -771124
31882 -771124 -841587 -720060 -456706 -124342 147532 220697 97970 -78064 -213564 -333400
31872 -333400 -432741 -416322 -266457 -130145 -134026 -230344 -329406 -458649 -653109 -790371 -702108
31861 -702108 -415286 -154684 -116683 -313775 -600009 -780323 -750180 -599162 -527313 -615231
31851 -615231 -755179 -841002 -895028 -940216 -901589 -751999 -620607 -623052 -702247 -760384 -804354
31840 -804354 -813649 -636843 -237790 94254 45154 -286943 -510172 -452406 -307660 -290985
31830 -290985 -401597 -550151 -689140 -767128 -744527 -697234 -737636 -816085 -779598 -639773 -582840
31819e82840r4780r2582M3271J22027Q8572L7409K0300L5544J04484J83545J30262
31808d788o7265j86087q8472L5754k3118j39721q9055M4309K7775q8237o9611
31797f48516N7454M3674j31359k16627j16683j4518k2282l3380J1516J4103m4602
31786a101220l5129O8949J29816J07611J17237J51026L8380k05725k87873n6564
31776a073492K43648L24471K31650J70463J61863J04408K0381j228m761q7926
31766H9477j87865j50718J6832J38750J02035m0031j85639k76566k65888j10034
31756h69647J53263L65767L43007M7774l15355m40928k36716N1681J38453N8822
31746g03879O0937J80816J83310k0849j77248o6935J42922J49036m4109j74041
$$ plain form
31819 -582840 -677620 -770202 -726931 -604904 -516332 -478923 -458623 -423079 -318595 -135050 -4788
31808 -4788 -72053 -258140 -346612 -310858 -333976 -473697 -562752 -518443 -490668 -578905 -648516
31797 -648516 -591062 -547388 -678747 -895374 -1012057 -1026575 -1048857 -1082237 -1070721 -1056618 -1101220
31786 -1101220 -1136349 -1067400 -937584 -829973 -712736 -561710 -523330 -729055 -1016928 -1073492
31776 -1073492 -829844 -505373 -273723 -103260 58603 163011 183392 182164 177403 89477
31766 89477 -98388 -249106 -232274 -93524 8511 -31520 -217159 -493725 -759613 -869647
31756 -869647 -716384 -350617 -7610 40164 -275191 -716119 -952835 -901154 -762701 -703879
31746 -703879 -642942 -462126 -278816 -299665 -476913 -543848 -400926 -251890 -295999 -470040
31736d70040j21485j8343J1599j078M688K7382N4698O9177M998j57571k69673
31725h65648j60240Q6267J93032Q0042j4587R3449K38218J58160r4097k26983
31715e12387j36667j5695j3356k2085R0133K24223K00083M5290o1410p5503j08380
31704c85754j74193j38393K4839J37207R0646K4139O9189R9446m2992k13728j48440
31693f58034Q6059J48615m4042j74120k9399J58876R7215j04026j33911J2002
31683f40765N4820r4410k05684j14650L8580O2316n755j2366N9998J04487P1624
31672f81805J2297k1163k4433j5233j4132k1478J2191J28311K45819K06651L50
31661a72625j67254j35613j7989k0989j13031p0011J57871L31500K43092r973
$$ plain form
31736 -470040 -591525 -609868 -598269 -599347 -594659 -567277 -512579 -443402 -438404 -595975 -865648
31725 -865648 -1025888 -939621 -746589 -666547 -681134 -587685 -349467 -191307 -285404 -512387
31715 -512387 -649054 -664749 -678105 -700190 -610057 -385834 -185751 -140461 -201871 -277374 -385754
31704 -385754 -559947 -698340 -673501 -536294 -445648 -421509 -352320 -252874 -295866 -509594 -658034
31693 -658034 -571975 -423360 -467402 -641522 -670921 -512045 -414830 -518856 -652767 -640765
31683 -640765 -585945 -680355 -886039 -1000689 -962109 -899793 -905548 -917914 -857916 -753429 -681805
31672 -681805 -669508 -690671 -715104 -730337 -744469 -765947 -753756 -625445 -379626 -172975 -172625
31661 -172625 -339879 -475492 -493481 -514470 -627501 -697512 -539641 -208141 34951 24978
31651B4978j73618j44736k1696O8789P8903K0114n7056p7451j3266O3879N7316
31640a73844l6390j22499j10511j651J02987P9975q1349k25022j89742k5318O7295
31629g16069L1687L3741J71576K83259J89044j7936j12010o9001n5841j41268
31619d02818k19824k06725j27403j8619R7989J55405J08573L7500K7580j088j53192
31608g02622l04312k31407K3983J88832J65681J25629J55022J15909m2368j30754
31598f36407l1032J00207J02279M8096M5448L8642q144L0903J88019K35782K5746
31587A39539k11300j79055L9327J34812L0068j06021j80863k13973j44397Q3132
31577f08731K90873K33836j9939j54314n0355R6240J09158K3844p7109j71097
$$ plain form
31651 24978 -148640 -293376 -315072 -246283 -167380 -147266 -204322 -281773 -295039 -231160 -173844
31640 -173844 -210234 -332733 -443244 -444895 -341908 -261933 -343282 -568304 -758046 -783364 -716069
31629 -716069 -684382 -650641 -479065 -195806 -6762 -24698 -136708 -205709 -261550 -402818
31619 -402818 -622642 -829367 -956770 -975389 -877400 -721995 -613422 -575922 -548342 -549430 -702622
31608 -702622 -1006934 -1238341 -1214358 -1025526 -859845 -734216 -579194 -463285 -505653 -636407
31598 -636407 -667439 -567232 -464953 -416857 -371409 -332767 -340911 -310008 -121989 113793 139539
31587 139539 -71761 -250816 -211489 -76677 -46609 -152630 -333493 -547466 -691863 -608731
31577 -608731 -317858 -84022 -103961 -258275 -308630 -212390 -103232 -79388 -156497 -327594
31567c27594j96393p7286R9163J40927L4068l3408K4968P8253L0038k7026j2696
31556b66986k6855j68066l07452k10007J38838M39373L66177n1976m02118l30715
31546h19787J6468J76298M786j39396K6573K65070K28193L3187K5668J53890O3977
31535C4927k38708l31246n1062K30282J78884m5233j18693k2924N7899O1971L8730
31524b05173o847o1192m3838M0227M2759r1761j93377j16776K9564N9438j7978
31513e64954n5350L341Q5861J14190P2096R016Q925P4629O6727j01459k56900
31502e43878j71341O3934J52249P5582J07089K73016K18266j92904n34167l87546
31492i39700M4241K52230J25226l8986p4450r5447j47075q1460J50812L54767
$$ plain form
31567 -327594 -523987 -601273 -502110 -361183 -327115 -360523 -335555 -257302 -227264 -254290 -266986
31556 -266986 -293841 -461907 -769359 -979366 -840528 -401155 -34978 -86954 -489072 -819787
31546 -819787 -803319 -627021 -622235 -761631 -735058 -469988 -241795 -208608 -182940 -29050 34927
31535 34927 -203781 -535027 -586089 -355807 -176923 -222156 -340849 -363773 -305874 -243903 -205173
31524 -205173 -212020 -273212 -317050 -276823 -234064 -325825 -519202 -635978 -606414 -546976 -564954
31513 -564954 -620304 -616963 -531102 -416912 -344816 -335800 -326875 -252246 -185519 -286978 -543878
31502 -543878 -715219 -651285 -499036 -423454 -316365 -43349 174917 -17987 -552154 -939700
31492 -939700 -895459 -643229 -518003 -556989 -631439 -726886 -873961 -955421 -804609 -449842
31482d49842L34939J23088j00461k00906j70161r0924l4675K4930J44624K52007
31472a67381J87531l8009j89053j14409L9839N4516o7479j71128j80978j14342
31462g60893J0955J31338J23482j3020q5908K2333J55263J22116o794m3274J3525
31451c30877M0728M9820J32077K14281J21057j33312l27825l14899j52532K9858
31441f71624J46632J59564J05789R3522J52826J54025M070j62351j51011O043
31431a62515J09292P9752R342l5432q1733j38039j64707j48873j00326j5894N7341
31420e91792J6829j13577j17335J24578L86146L52357N0306j97660k08097r9222
31410c97467l3633k0830q446J1978M1368Q6838J10335O5210j4803n7379o2814
$$ plain form
31482 -449842 -114903 8185 -92276 -293182 -463343 -554267 -588942 -564012 -419388 -167381
31472 -167381 20150 -17859 -206912 -321321 -281482 -226966 -294445 -465573 -646551 -760893
31462 -760893 -749938 -618600 -495118 -508138 -594046 -571713 -416450 -294334 -301128 -344402 -330877
31451 -330877 -290149 -240329 -108252 106029 227086 93774 -234051 -548950 -701482 -671624
31441 -671624 -524992 -365428 -259639 -166117 -13291 140734 144804 -17547 -168558 -162515
31431 -162515 -53223 26529 35871 439 -81294 -219333 -384040 -532913 -633239 -649133 -591792
31420 -591792 -574963 -688540 -805875 -681297 -295151 57206 107512 -90148 -298245 -397467
31410 -397467 -431100 -451930 -460376 -448398 -407030 -320192 -209857 -144647 -159450 -216829 -279643
31399b79643p7884q9736m6836M0248J06890J17161P9191K5752J6062P3999J02348
31388F7552j0548j76334j86108m9085q987j30830j59689M2550K19775J25519o8398
31377c34583o6236P9472J17860L0821k3585l6911q1226o2846J09229K45176J18701
31366I5872j33410k09350j11207m7968j2055J28674K34184N3147k75023l43300
31356f20436r3989J24152J15863K6681l4823j26257j98675j18648J2229k6052
31346i39955j38146l8817K04231K46967Q5456N0277J60179Q4307j70675j87870
31336f44046Q8031J82239o7999j93101N4106K13904n9696l38826j42747K35007
31326f73128K51434J5555l139J78164J79866p193o4434L4737M4094l6080j3593
$$ plain form
31399 -279643 -357527 -447263 -494099 -453851 -346961 -229800 -150609 -124857 -108795 -34796 67552
31388 67552 57004 -119330 -305438 -354523 -363510 -494340 -654029 -611479 -391704 -266185 -334583
31377 -334583 -400819 -321347 -203487 -172666 -196251 -233162 -314388 -377234 -268005 -22829 95872
31366 95872 -37538 -246888 -358095 -406063 -418118 -289444 -55260 -2113 -277136 -620436
31356 -620436 -714425 -590273 -474410 -447729 -482552 -608809 -807484 -926132 -913903 -939955
31346 -939955 -1078101 -1116918 -912687 -665720 -580264 -529987 -369808 -285501 -456176 -644046
31336 -644046 -556015 -373776 -441775 -634876 -580770 -366866 -426562 -765388 -908135 -673128
31326 -673128 -421694 -406139 -409278 -231114 -51248 -58441 -122875 -88138 -44044 -80124 -93717
31315i3717L0568j25696l40903k78096q651R0402j0444K77J38324Q8632j39176
31304f48480j27319K18967M25504J86707j47291j41427P6055J07529p4724j78671
31294c03150j03566k8690n5745p1452J1297R5075N1796q4253j53656o9696P4598
31283f37442J27125P9821O5850J31382J34771l2430k37074k58884p9567J22491
31273e83957K03459J44303j8199j96011k43033j00560R1768J64943J39265J36605
31263b61417J55744J03202j5471j04780j30427j15161n4108K1723j170j34464
31253e36329j77919J598K03636J54112p0863j62035m9545M1858j3933r3348q2281
31242g85049j8071N6038J36161J43749J1135j14485k0442J99980K16498m2611
$$ plain form
31315 -93717 -63149 -188845 -529748 -807844 -816495 -726093 -736537 -736260 -597936 -509304 -648480
31304 -648480 -775799 -556832 -131328 55379 -91912 -233339 -157284 -49755 -124479 -303150
31294 -303150 -406716 -435406 -491151 -562603 -551306 -456231 -404435 -488688 -642344 -712040 -637442
31283 -637442 -510317 -430496 -364646 -233264 -98493 -130923 -367997 -626881 -706448 -583957
31273 -583957 -380498 -236195 -254394 -450405 -693438 -793998 -702230 -537287 -398022 -261417
31263 -261417 -105673 -2471 -17942 -122722 -253149 -368310 -422418 -400695 -401865 -536329
31253 -536329 -714248 -712650 -509014 -354902 -425765 -587800 -637345 -595487 -609420 -702768 -785049
31242 -785049 -803120 -747082 -610921 -467172 -456037 -570522 -590964 -390984 -174486 -217097
31232b17097k57118j75526O0563J78108J19303j1114j34268j89548j18030J3621
31222g31106L2661q2438j28463K3629K21924K55807J35653J5464l0957j8486M9134
31211b57178J45456J73602Q1010m1488p8257m4227k9379n0075n2754k5614j6801
31200a95705n1331r2085r5406q0779j17590k14508k48473r7133J47759K39327
31190h05924J09324k3440J1272Q4753L3251l2554N1049J44840J7426k00100j64602
31179g74705J10194K46931R8131o5952n0980p550n6089m2483J13286J83778J4476
31168b30963j71007j31655k817k4381j15610n1845J26290K13338J90350J48763
31158d9537J7704k69193m57333k34490K28089M10679J59860j18322p6065J28830
$$ plain form
31232 -217097 -474215 -649741 -589178 -411070 -291767 -302881 -437149 -626697 -744727 -731106
31222 -731106 -698445 -780883 -909346 -885717 -663793 -407986 -272333 -256869 -287826 -306312 -257178
31211 -257178 -111722 61880 142890 101402 23145 -21082 -50461 -100536 -153290 -178904 -195705
31200 -195705 -247036 -339121 -434527 -515306 -632896 -847404 -1095877 -1193010 -1045251 -805924
31190 -805924 -696600 -720040 -708768 -624015 -590764 -623318 -572269 -427429 -410003 -610103 -774705
31179 -774705 -664511 -417580 -319449 -385401 -436381 -443931 -500020 -542503 -429217 -245439 -230963
31168 -230963 -401970 -533625 -536442 -560823 -676433 -728278 -601988 -388650 -198300 -49537
31158 -49537 -31833 -301026 -758359 -992849 -764760 -354081 -194221 -312543 -388608 -259778
31148b59778J69045K0427j21815j67053j36749k0073J45860J78646l2074k91466
31138e15030l11305j06349M8048L3287J3010J01355J59178M6864j23815j63511
31128h18268q2039m599O4188J74566K25440Q5736j16278j07240J08243K24161
31118b46090R5781o7649q0154m1096n4087n3J67383K02582l4952k30249n4480
31107c43064K52872K04152j64122l45454j56404M7503J6787m4076N4639J34180
31097c42987J7975j20715o9095O3497P2241n644m3637q3477j73143j63694M9329
31086g99350K66036K48885R0611L3891P3095L7401n2837l7923M7994K0702j03993
31075a75488j15089K5405J11174L7054n4468n3748o0563j53491j94594m0073J90027
$$ plain form
31148 -259778 -90733 -70306 -192121 -359174 -495923 -515996 -370136 -191490 -223564 -515030
31138 -515030 -826335 -932684 -884636 -851349 -838339 -736984 -577806 -530942 -654757 -818268
31128 -818268 -900307 -904906 -840718 -666152 -440712 -354976 -471254 -578494 -470251 -246090
31118 -246090 -150309 -217958 -298112 -339208 -393295 -393348 -225965 -23383 -58335 -288584 -343064
31107 -343064 -90192 113960 -50162 -395616 -552020 -504517 -487730 -531806 -477167 -342987
31097 -342987 -325012 -445727 -514822 -451325 -379084 -384728 -428365 -511842 -684985 -848679 -799350
31086 -799350 -533314 -284429 -193818 -159927 -86832 -49431 -102268 -140191 -92197 -71495 -175488
31075 -175488 -290577 -265172 -153998 -116944 -171412 -225160 -285723 -439214 -633808 -673881 -483854
31064d83854K39820N8431j47117j91010j03892j7773K2820M5672K7536p2713j68892
31053g90972r6240J35879K91641K14847M3539k3177j7289n5144n0818J28305L16808
31042I7379K25048n5961j17502J26096K63955K5021k91851k86483m4030O9169
31032A0841k6075r9957l3991N1853M5185k9846j08848j40934q5840J5250L6368
31021c65994o1764j58663j60035j14202n6189P3902K43723K80054J51573O4230
31011a03365J10165R1800r5532k07760o5612P1064r1326l51910l18134m6832P8740
31000i28702j0856l4965Q5024J19332J113m6531O0827J14438K507r6806l9601
30989g74220P6753J52811K41224L31433K56181k6558k78579k67598n3220J25541
$$ plain form
31064 -483854 -244034 -185603 -332720 -523730 -627622 -645395 -622575 -576903 -549367 -622080 -790972
31053 -790972 -887212 -751333 -459692 -244845 -201306 -224483 -241772 -296916 -347734 -219429 97379
31042 97379 322427 266466 148964 275060 539015 564036 272185 -14298 -58328 10841
31032 10841 -15234 -115191 -149182 -97329 -52144 -81990 -190838 -331772 -417612 -402362 -365994
31021 -365994 -427758 -586421 -746456 -860658 -916847 -842945 -599222 -319168 -167595 -103365
31011 -103365 6800 98600 3068 -204692 -270304 -199240 -290566 -642476 -960610 -1007442 -928702
31000 -928702 -939558 -974523 -889499 -770167 -769054 -815585 -754758 -640320 -637813 -734619 -774220
30989 -774220 -697467 -544656 -303432 28001 284182 257624 -20955 -288553 -341773 -216232
30979b16232J22711j8666j31027p1816Q6075Q4954j43962k81445n7074K62986
$$ plain form
30979 -216232 -93521 -112187 -243214 -315030 -228955 -144001 -287963 -569408 -626482 -363496
$$ [...]
##END NTUPLES=NMR SPECTRUM
##END=
