##TITLE=31Pdec_LY-TMF-15.100.2
 D2O, 24 sc
 6.3.2020
##JCAMPDX= 6.0         $$ Bruker NMR JCAMP-DX V2.0
##DATA TYPE= NMR SPECTRUM
##DATA CLASS= NTUPLES
##ORIGIN= UXNMR, Bruker Analytische Messtechnik GmbH
##OWNER= root
$$ XWIN-NMR		Version 3.5
$$ Fri Mar  6 18:51:49 2020 Russian Standard Time (UT+4h)  she@DPX200
##.OBSERVE FREQUENCY= 81.013821
##.OBSERVE NUCLEUS= ^31P
##.ACQUISITION MODE= SIMULTANEOUS
##.ACQUISITION SCHEME= undefined
##.AVERAGES= 24
##.DIGITISER RES= 17
##SPECTROMETER/DATA SYSTEM= spect
##.PULSE SEQUENCE= zgpg30
##.SOLVENT NAME= D2O
##.SHIFT REFERENCE= (INTERNAL, D2O, 0, 182.463)
##AUDIT TRAIL= $$ (NUMBER, WHEN, WHO, WHERE, WHAT)
$$ ##TITLE= Audit trail, XWIN-NMR		Version 3.5
$$ ##JCAMPDX= 5.01
$$ ##ORIGIN= Bruker BioSpin GmbH
$$ ##OWNER= she
$$ F:/spectra/data/she/nmr/P31/1/pdata/1/auditp.txt
$$ ##AUDIT TRAIL=  $$ (NUMBER, WHEN, WHO, WHERE, WHAT)
(   1,<2020-03-06 18:50:59.57 +0400>,<she>,<DPX200>,
      <created by zg, POWCHK disabled, PULCHK disabled
       configuration hash MD5:
       00 E9 B6 7A A2 85 ED C7 34 08 36 98 17 FE 4E 26
       data hash MD5: 32K
       33 40 44 D4 34 6E D3 D9 10 30 62 DE 98 CD F4 DA>)
(   2,<2020-03-06 18:51:02.43 +0400>,<she>,<DPX200>,
      <Start of raw data processing
       efp BC_mod = 2 LB = 1 FT_mod = 6 PKNL = 1 PHC0 = -1357.452 PHC1 = 150.6017 SI = 64K 
       data hash MD5: 64K
       4C AB 11 4C DF 01 AF D7 60 3D 0E 33 B3 76 02 BA>)
(   3,<2020-03-06 18:51:15.75 +0400>,<she>,<DPX200>,
      <pk PHC0 = -3.602518 PHC1 = 0 
       data hash MD5: 64K
       45 A1 9D BC AF 98 18 7A 09 2A 56 F1 B1 06 D3 F4>)
$$ ##END=
$$ 
$$ hash MD5
$$ 7E 43 99 B5 3A 1D FC 81 23 E8 86 A4 C1 21 2E 13
##$RELAX= 
##$RELAX= 
##$RELAX= 
##$RELAX= 
##$RELAX= 
##$RELAX= 
##$RELAX= 
##$RELAX= 
$$ Bruker specific parameters
$$ --------------------------
##$DU= <F:/spectra>
##$EXPNO= 1
##$NAME= <P31>
##$PROCNO= 1
##$TYPE= <nmr>
##$USER= <she>
##$AMP= (0..31)
100 100 100 100 100 100 100 100 100 100 100 100 100 100 100 100 100 100 
100 100 100 100 100 100 100 100 100 100 100 100 100 100 
##$AQSEQ= 0
##$AQ_mod= 1
##$AUNM= <au_zg>
##$AUTOPOS= <>
##$BF1= 81.014009
##$BF2= 200.13
##$BF3= 200.13
##$BF4= 200.13
##$BF5= 200.13
##$BF6= 200.13
##$BF7= 200.13
##$BF8= 200.13
##$BYTORDA= 1
##$CFDGTYP= 0
##$CFRGTYP= 5
##$CHEMSTR= <none>
##$CNST= (0..31)
1 1 145 1 1 1 1 1 1 1 1 1 1 1 1 1 1 1 1 1 1 1 1 1 1 1 1 1 1 1 1 1 
##$CPDPRG= <waltz16>
##$CPDPRG1= <>
##$CPDPRG2= <waltz16>
##$CPDPRG3= <>
##$CPDPRG4= <mlev>
##$CPDPRG5= <mlev>
##$CPDPRG6= <mlev>
##$CPDPRG7= <mlev>
##$CPDPRG8= <mlev>
##$CPDPRGB= <>
##$CPDPRGT= <>
##$D= (0..31)
0 1 0 0 0 0 0 0 0 0 0 0.03 2e-05 3e-06 0 0 0 0 0 0 0 0 0 0 0 0 0 0 0 0 
0 0 
##$DATE= 1583506259
##$DBL= (0..7)
120 120 120 11 120 120 24 19 
##$DBP= (0..7)
150 150 150 150 150 150 150 150 
##$DBP07= 0
##$DBPNAM0= <>
##$DBPNAM1= <>
##$DBPNAM2= <>
##$DBPNAM3= <>
##$DBPNAM4= <>
##$DBPNAM5= <>
##$DBPNAM6= <>
##$DBPNAM7= <>
##$DBPOAL= (0..7)
0.5 0.5 0.5 0.5 0.5 0.5 0.5 0.5 
##$DBPOFFS= (0..7)
0 0 0 0 0 0 0 0 
$$ [...]
##$SUBNAM2= <"">
##$SUBNAM3= <"">
##$SUBNAM4= <"">
##$SUBNAM5= <"">
##$SUBNAM6= <"">
##$SUBNAM7= <"">
##$SUBNAM8= <"">
##$SUBNAM9= <"">
##$SW= 369.568048894756
##$SWIBOX= (0..15)
0 1 3 0 0 0 0 0 0 0 0 0 0 0 0 0 
##$SW_h= 29940.119760479
##$TD= 32768
##$TD0= 1
##$TE= 0
##$TE2= 300
##$TE3= 300
##$TEG= 300
##$TL= (0..7)
0 120 53 12 22 120 120 120 
##$TP= (0..7)
150 150 150 150 150 150 150 150 
##$TP07= 0
##$TPNAME0= <>
##$TPNAME1= <>
##$TPNAME2= <>
##$TPNAME3= <>
##$TPNAME4= <>
##$TPNAME5= <>
##$TPNAME6= <>
##$TPNAME7= <>
##$TPOAL= (0..7)
0.5 0.5 0.5 0.5 0.5 0.5 0.5 0.5 
##$TPOFFS= (0..7)
0 0 0 0 0 0 0 0 
##$TUNHIN= 0
##$TUNHOUT= 0
##$TUNXOUT= 0
##$USERA1= <user>
##$USERA2= <user>
##$USERA3= <user>
##$USERA4= <user>
##$USERA5= <user>
##$V9= 5
##$VALIST= <valist>
##$VCLIST= <CCCCCCCCCCCCCCC>
##$VD= 0
##$VDLIST= <DDDDDDDDDDDDDDD>
##$VPLIST= <PPPPPPPPPPPPPPP>
##$VTLIST= <TTTTTTTTTTTTTTT>
##$WBST= 1024
##$WBSW= 4
##$XGAIN= (0..3)
0 0 0 0 
##$XL= 0
##$YL= 0
##$YMAX_a= 29981
##$YMIN_a= -28604
##$ZGOPTNS= <>
##$ZL1= 120
##$ZL2= 120
##$ZL3= 120
##$ZL4= 120
##$ABSF1= 0
##$ABSF2= 0
##$ABSG= 0
##$ABSL= 0
##$ALPHA= 0
##$AQORDER= 0
##$ASSFAC= 0
##$ASSFACI= 0
##$ASSFACX= 0
##$ASSWID= 0
##$AUNMP= <proc_1d>
##$AZFE= 0.1
##$AZFW= 0.5
##$BCFW= 0
##$BC_mod= 2
##$BYTORDP= 0
##$COROFFS= 0
##$CY= -3
##$DATMOD= 1
##$DC= 0
##$DFILT= <>
##$DTYPP= 0
##$F1P= 0
##$F2P= 0
##$FCOR= 1
##$FTSIZE= 65536
##$FT_mod= 6
##$GAMMA= 0
##$GB= 0
##$INTBC= 1
##$INTSCL= 5.30512e-09
##$ISEN= 30
##$LB= 1
##$LEV0= 0
##$LPBIN= 0
##$MAXI= 10000
##$MC2= 0
##$MEAN= 0
##$ME_mod= 0
##$MI= 50
##$NCOEF= 0
##$NC_proc= -3
##$NLEV= 6
##$NOISF1= 182.463
##$NOISF2= 159.3651
##$NSP= 0
##$NTH_PI= 0
##$NZP= 0
##$OFFSET= 182.463
##$PC= 4
##$PHC0= -1361.055
##$PHC1= 150.6017
##$PH_mod= 1
##$PKNL= yes
##$PPARMOD= 0
##$PSCAL= 0
##$PSIGN= 0
##$REVERSE= no
##$SF= 81.0140089999434
##$SI= 65536
##$SIGF1= 159.3651
##$SIGF2= -187.1042
##$SINO= 113.3802
##$SIOLD= 16384
##$SREGLST= <1H.CDCl3>
##$SSB= 0
##$STSI= 65536
##$STSR= 0
##$SW_p= 29940.119760479
##$SYMM= 0
##$S_DEV= 0
##$TDeff= 32768
##$TDoff= 0
##$TI= <>
##$TILT= no
##$TM1= 0
##$TM2= 0
##$TOPLEV= 0
##$USERP1= <user>
##$USERP2= <user>
##$USERP3= <user>
##$USERP4= <user>
##$USERP5= <user>
##$WDW= 1
##$XDIM= 65536
##$YMAX_p= 326166919
##$YMIN_p= -3751390
$$ End of Bruker specific parameters
$$ ---------------------------------
##NTUPLES= NMR SPECTRUM
##VAR_NAME=  FREQUENCY,     SPECTRUM/REAL,   SPECTRUM/IMAG
##SYMBOL=    X,             R,               I
##VAR_TYPE=  INDEPENDENT,   DEPENDENT,       DEPENDENT
##VAR_FORM=  AFFN,          ASDF,            ASDF
##VAR_DIM=   65536,         65536,           65536
##UNITS=     HZ,            ARBITRARY UNITS, ARBITRARY UNITS
##FACTOR=    0.456856943014862, 1,           1
##FIRST=     14782.0589164792, 0,            0
##LAST=      -15158.0608439998, 0,           0
##MIN=       -15158.0608439998, -3751390,    0
##MAX=       14782.0589164792, 326166919,    0
$$ Real data points
##PAGE= N=1
##DATA TABLE= (X++(R..R)), XYDATA
$$ [...]
37041C68694j7567j51748k33804j80813o5567j1471N648P5042J30506L0838j52736
37030b02978j68883L9269K12755J40015m4492q1763K6961N3536r0776k17257j26203
37019d59816J24503K99465K67267J14053r078o4880j10282j52775j20894N707
37009a06730J20287J06972q242r1689o7508J1789N1960J8657n1611j00492r5822
36998b12429m8042J6641Q8514J52965J58569P6223j5664n624P2203N8233q2438
36987B59151j71895p7240Q3531J29930Q3775O9343N8069o5602k41240k71266j21446
36976b64890K8353N1520M16n0484q7799o2015Q0587K26428J78834j9730q7056
36965e836P2569J88665L8090j88304j71029M1124R5268j53891m38529m15008n1401
$$ plain form
37041 368694 351127 199379 -34425 -215238 -280805 -292276 -286628 -211586 -81080 -50242 -202978
37030 -202978 -371861 -332592 -119837 20178 -24314 -106077 -79116 -25580 -116356 -333613 -459816
37019 -459816 -335313 -35848 231419 345472 336394 271514 161232 8457 -112437 -106730
37009 -106730 13557 120529 112287 20598 -46910 -35121 16839 35496 -16115 -116607 -212429
36998 -212429 -260471 -243830 -155316 -2351 156218 232441 216777 211153 283356 341589 259151
36987 259151 87256 10016 93547 223477 307252 376595 434664 369062 127822 -143444 -264890
36976 -264890 -236537 -185017 -184601 -235085 -322884 -384899 -304312 -77884 100950 81220 -5836
36965 -5836 66733 255398 293488 105184 -65845 -24721 70547 -83344 -521873 -936881 -988282
36954i88282L62724N06750L12049M31j64889j56377j32572j38826m6900J51864
36944b94028K27715N1585j47297r3288J17217J77950M7552m2884j1534k4746j38692
36933a30450j64254o555J38606R7042k129L8619J46676J14258l9946r8393k18
36922I3256O9642j7674j41681j26804R490J07188P7579l1837j36375j87788j70666
36911d55670j02412l6827j3829o739L5164J00370J26764R8094O6380O7150P6627
36900d4928P3369P2464O4768j447j21013j83291j00045O6527J76218J65716O5078
36889B33416p3765j75809j44732J2006J21669N1723p9682o8828M6564M4119j03831
36878a37150j61560j0174J48359J02670n6614j08976k9307M7277P0025Q8778R9466
$$ plain form
36954 -988282 -625558 -118808 193241 193672 28783 -127594 -260166 -398992 -445892 -294028
36944 -294028 -66313 -14728 -162025 -255313 -138096 39854 87406 44522 32988 8242 -130450
36933 -130450 -294704 -301259 -162653 -65611 -67740 -29121 117555 231813 191867 93474 93256
36922 93256 162898 145224 3543 -123261 -113771 -6583 70996 39159 -97216 -285004 -455670
36911 -455670 -558082 -594909 -608738 -615477 -580313 -479943 -353179 -255085 -188705 -121555 -44928
36900 -44928 28441 100905 165673 164226 43213 -140078 -240123 -173596 2622 168338 233416
36889 233416 159651 -16158 -160890 -148884 -27215 24508 -55174 -124002 -77438 -33319 -137150
36878 -137150 -298710 -308884 -160525 -57855 -114469 -223445 -252752 -205475 -135450 -46672 52794
36867E2794N6054l051j252K5611l2464j75974k69816k09480l2143J35561J85718
36856b68442J08456M561j9550J2862n139p5057q2978j3930J86o7752l9426J67942
36844b78267L29212K11694n7425j65573n6348N6184N2994K7490M6244L7147m2208
36833A61144j15091j13719n8229J4495Q4075J11275P1745o36p9384j67927j80203
36822b72455K3778L34202L58587l9994l98481k28470K35714L36783l9737l39168
36812b9241k14582L2730N7723j7816J8948N1085n6384j11067M4355J50131n5199
36801a29317l01681j51548K74844M32173J41136k18628l08760j95039n0474J06395
36791d00899K48058K38710O0091r9087j06702l7688K6854J23872K25525J69304
$$ plain form
36867 52794 108848 105797 104545 130156 97692 -78282 -348098 -557578 -589721 -454160 -268442
36856 -268442 -159986 -155425 -174975 -162113 -167252 -242309 -325287 -339217 -339031 -406783 -446209 -278267
36844 -278267 50945 262639 205214 39641 -16707 39477 92471 119961 166205 203352 161144
36833 161144 46053 -67666 -125895 -111400 -27325 83950 155695 155059 75675 -92252 -272455
36822 -272455 -248677 85525 444112 404118 5637 -222833 12881 349664 309927 -29241
36812 -29241 -243823 -211093 -153370 -171186 -152238 -101153 -157537 -268604 -224249 -74118 -129317
36801 -129317 -430998 -582546 -307702 124471 265607 46979 -261781 -456820 -507294 -400899
36791 -400899 -152841 85869 145960 46873 -59829 -97517 -70663 53209 278734 448038
36781D48038p2046k52222j68492L8024R1878k7922j15289p7510k9808n4396n9907
36770b79652N1754K01827K12174K9044j93585k46516q9103J00888J25992k069
36760h9246r3377l6716P2966J07282R2417J15460J28269J2268j80659k40584j04740
36749b16660K8769J358o0977J7918J24896J8836k23305k41822O0207L19176K23244
36738E1640n2928j66459j21160j37842j79767j8484K69521L04243o971k63175
36728c21382j38073J60400K39054Q2190j9248N4843J41666J04401N082l9041j482
36717B68410O5019P7949j8731j62803j90373l5847J49931J80356O0302p1238j43719
36706A79256j74957j61120q7761p346J8255J6573M3786P8427P6384O4162O9964
$$ plain form
36781 448038 375992 123770 -44722 -6698 85180 57258 -58031 -135541 -165349 -219745 -279652
36770 -279652 -227898 -26071 186103 215147 21562 -224954 -314057 -213169 -87177 -89246
36760 -89246 -182623 -219339 -146373 -39091 53326 168786 297055 309323 128664 -111920 -216660
36749 -216660 -187891 -186533 -247510 -229592 -104696 -85860 -309165 -550987 -490780 -171604 51640
36738 51640 -1288 -167747 -288907 -426749 -606516 -625000 -355479 -51236 -58207 -321382
36728 -321382 -459455 -299055 -60001 22189 2941 57784 199450 303851 308933 269892 268410
36717 268410 333429 411378 392647 229844 39471 3624 153555 333911 394213 322975 179256
36706 179256 4299 -156821 -244582 -251928 -233673 -217100 -173314 -94887 -18503 45659 115623
36695A15623M3250l4247n1008O7180J78488R6397j20638k46522k16537j69815
36685c37829j70653j10910N8801J98016J75856O4002K1787P0107Q0297l2810j70713
36674a54049j39028J03643L23478K48783n8079k31846q9699J08986N6496j39880
36664B8805j55026K2772R5879l3583j11166L0149J86419J04009j37889k56645
36654b26276j43884N3178J51544J07099J0199j8959M0859P5591j3297j46791j64536
36643b75273n6149M6612Q6525J10134R0530n0258k03151j14895K14337M14511
36633B62923K08393j91033l52646j70667P3760J15073l6273k05172k45646j14422
36623f55710J17298L01942L41961K76481J92974R9590l8068j78554k22514j42356
$$ plain form
36695 115623 158873 124626 73618 140798 319286 415683 295045 48523 -168014 -337829
36685 -337829 -508482 -619392 -560591 -362575 -186719 -122717 -100930 -30823 49474 16664 -154049
36674 -154049 -293077 -189434 134044 382827 324748 92902 3203 112189 168685 28805
36664 28805 -126221 -103449 -7570 -41153 -152319 -122170 64249 168258 30369 -226276
36654 -226276 -370160 -316982 -165438 -58339 -48140 -67099 -26240 49351 36054 -110737 -275273
36643 -275273 -331422 -284810 -198285 -88151 2379 -47879 -251030 -365925 -151588 262923
36633 262923 471316 280283 -72363 -243030 -169270 -54197 -90470 -295642 -541288 -655710
36623 -655710 -538412 -236470 105491 381972 574946 674536 636468 457914 235400 93044
36613I3044k1497L8669Q513o3970j04970q1099k5660J3124K9175K6140k6106j19911
36601b34548j41703l894J78491J97785M2620r0229q8756m0873k0161K5195Q9647
36590h6426M4993j16247j91115p5686N1539L8344K0043J31136J87676j1031k43365
36579b50139j36979K05871L01021K2295k00933n8447J87289J63688m0122q7718
36569A05826N2643J25252L3869o4830p5059p2090q8087m8325L4266K9912p4891
36558d1514j17638j7194R3263Q9045L4438K0701n971r8030j40275k7213J08975
36547a01413P3702o3039o3569Q7776J62753P5550O195N6138O4244q1781k09513
36536G043j48810l3542n7137j08624L2643K54788K23252q3451k93213j63380J12780
$$ plain form
36613 93044 71547 110216 118729 54759 -50211 -131310 -156970 -143846 -114671 -88531 -114637 -234548
36601 -234548 -376251 -380145 -201654 -3869 38751 -51478 -140234 -181107 -201268 -176073 -86426
36590 -86426 -41433 -157680 -348795 -424481 -372942 -334598 -314555 -183419 4257 -6774 -250139
36579 -250139 -387118 -181247 119774 142069 -58864 -117311 69978 233666 193544 105826
36569 105826 158469 283721 317590 252760 177701 105611 17524 -30801 3465 33377 -41514
36558 -41514 -159152 -176346 -83083 5962 40400 61101 55130 -42900 -183175 -210388 -101413
36547 -101413 -27711 -90750 -154319 -66543 96210 171760 177955 234093 298337 216556 7043
36536 7043 -141767 -175309 -232446 -341070 -308427 -53639 169613 86162 -207051 -370431 -257651
36525b57651K32839J60395L2517q3120j61418j22168M8042J86581J40985j1958
36515A65044q4254m8758m0733j23061j96687j54853j9696J03057J42325J08951
36505a48665N6930K0674m056k2583k1287q981k5503n7450j2921J31067K25723
36494A32948J25393q3102j78010j01571J272K6524J3993K281l1931o3210k4377
36483a79790M7313M7815N751M2367J15432M6760j42911j95413j7351J40537N7936
36472c1554j32182j72272m0319R4956J22236M0958q8525j36158p073J66678J53231
36461c0024O026L0074K59374L31685P6082j65607r1709O7300j3175j72811r1489
36450B05726R2435K2348k16343k42108o8556o5178k55118k43399P4176K83451
$$ plain form
36525 -257651 -24812 135583 168100 84980 -76438 -198606 -150564 36017 177002 165044
36515 165044 80790 32032 -8701 -131762 -328449 -483302 -502998 -399941 -257616 -148665
36505 -148665 -91735 -71061 -75117 -97700 -118987 -127968 -153471 -210921 -223842 -92775 132948
36494 132948 258341 175239 -2771 -104342 -103070 -76546 -62553 -60272 -92203 -155413 -179790
36483 -179790 -132477 -84662 -78911 -36544 78888 125648 -17263 -212676 -230027 -89490 -31554
36472 -31554 -163736 -336008 -376327 -281371 -159135 -118177 -206702 -342860 -349933 -183255 -30024
36461 -30024 -23998 6076 265450 597135 673217 507610 415901 483201 470026 297215 205726
36450 205726 298161 320509 104166 -137942 -206498 -271676 -526794 -770193 -696017 -412566
36440d12566J06739j82497k16276k4854J43853J90035J52102P8935N3697J24680
36430A3848J49364l0327k39427j45885J69813K39483p5724l32008j76036J43727
36420b83172K19145P1032l4088n5591j08706j42086l4008J30269J67396P1104
36410A295m1801j22247j36167l511K08393K38141M767j87215p2648J63633J91518
36399B44158L9524l7664r482j8320k4451R9889K15080O6651k36812l04695n2555
36388a8677J71272J21341l6098o8350j4821j7474o3924p6755p5162q8907n3189
36377b20744P2182J88963J81500O9229m3754r6403r0898n8078m1119m5466J246
36366h3342J47920K83033K24420k7685k47278k40607n6895J00007R5967k9586
$$ plain form
36440 -412566 -305827 -488324 -704600 -729454 -585601 -395566 -243464 -164529 -110832 13848
36430 13848 163212 132885 -106542 -252427 -82614 156869 81145 -250863 -426899 -283172
36420 -283172 -64027 7005 -27083 -82674 -191380 -333466 -367474 -237205 -69809 1295
36410 1295 -40506 -162753 -298920 -302431 -94038 144103 148870 -38345 -110993 52640 244158
36399 244158 283682 246018 236536 218216 193765 293654 508734 575385 338573 33878 -18677
36388 -18677 152595 273936 237838 169488 154667 137193 73269 -3486 -78648 -167555 -220744
36377 -220744 -148562 40401 221901 291130 247376 150973 60075 1997 -39122 -84588 -83342
36366 -83342 64578 347611 572031 544346 297068 56461 -434 99573 195540 165954
36356A65954j25923q1274N0384R6909j0659j28661r8844K2455O6212J8712J6259
36345h476R6202J37491P1675j3553l2025k2398n2369j07011j31574j08946n6277
36334b27261n163M018l2249n3773k0377J6998J1603K2812J01565J43110K3131
36323a5586j59637j72776J6979J93678K01949J19270P0845N4840K7615O611L428
36312C47216j9635o0416o3547l9175n6286q1453J429J49149J39703q6351k57883
36301b7249j24089J71551K77142J08017q0272p7754K0751L81j62546k74603j80426
36290c49097K8555J08368l2868j96522j36881J10977K79570K31782J10495Q5457
36280B39836J18916P8766m9212j78645k53400k51888j45776L6819J75823J85314
$$ plain form
36356 165954 40031 -41243 9141 106050 95391 -33270 -132114 -109659 -43447 -24735 -8476
36345 -8476 87726 225217 296892 283339 251314 228916 176547 69536 -62038 -170984 -227261
36334 -227261 -232424 -228406 -260655 -314428 -334805 -317807 -306204 -283392 -181827 -38717 -15586
36323 -15586 -175223 -347999 -331020 -137342 64607 183877 254722 309562 337177 343788 347216
36312 347216 327581 267165 203618 164443 108157 26704 28133 177282 316985 230634 -27249
36301 -27249 -151338 20213 297355 405372 325100 247346 268097 268478 105932 -168671 -349097
36290 -349097 -320542 -212174 -245042 -441564 -578445 -467468 -187898 43884 154379 239836
36280 239836 358752 437518 388306 209661 -43739 -295627 -441403 -404584 -228761 -43447
36270d3447J16672O0745K5445j0193j2467L8556Q0262O3796L4764K5927k5502
36259C54558j42091k02639j14407J8532N6487M5686R3473J27156J1408j60295
36249H7868j57281J4272R4015l6445j88677j71860l4209R3365J78842J99848Q1248
36238A60986j30708k15980p2718R3829N4518j09663j55969m7522M9541O3227Q1273
36227b29186J45677J90576J86903J67987J10063l5975j89094j95805o1763M9737
36217A39120O6832O7055O6421k2777j60413j48482M3429J49935j7910k62874k69169
36206c48833l0792J98630K57584J62234l6957k39050k38891K8379K59290J11575
36196A23169k63559l60032k5007L26245L15530P5332p2545r5825j37036j63004
$$ plain form
36270 -43447 73225 133970 159415 149222 136755 175311 255573 319369 354133 380060 354558
36259 354558 212467 9828 -104579 -86047 -29560 16126 109599 236755 248163 87868
36249 87868 -69413 -55141 38874 2429 -186248 -358108 -392317 -298952 -120110 79738 160986
36238 160986 30278 -185702 -258420 -164591 -110073 -219736 -375705 -423227 -373686 -310459 -229186
36227 -229186 -83509 107067 293970 461957 572020 536045 346951 151146 89383 139120
36217 139120 205952 273007 339428 316651 156238 7756 51185 201120 183210 -79664 -348833
36206 -348833 -379625 -180995 76589 238823 201866 -37184 -276075 -247696 11594 123169
36196 123169 -140390 -500422 -525429 -199184 116346 191678 119133 23308 -113728 -276732
36186b76732n4746R1577O9748r2521j68339p8411M3035J09518J68371K18785J73685
36175B03970M1255n2756o3991p1419r1438m1900O3728Q3647k0385j05934q8264
36164a43487o7545j11805j05254L5684J66288J26318J9209N8376K12474K37614
36154D27872M7477j68181k27329j65023r3923k7012N5290R1666K4381p7073r5313
36143b07168k2334O4994J40165K16810K30492Q0407j78753l21756k08205M0661
36133a64687K04210K18520J68254R8041k0755j55243j96037j14109j6432L667
36123B5429k5851m9666q8056j66476k16739j47485J5597J42071J49595R3136R0069
36112a78376J76232K52771J99307M0280o9021o4629p8740k08777k91935j19752
$$ plain form
36186 -276732 -331478 -239901 -170153 -262674 -431013 -509424 -466389 -356871 -188500 30285 203970
36175 203970 245225 192469 128478 57059 -34379 -76279 -12551 71096 50711 -55223 -143487
36164 -143487 -211032 -322837 -428091 -392407 -226119 -99801 -80592 -22216 190258 427872
36154 427872 475349 307168 79839 -85184 -179107 -206119 -150829 -59163 -34782 -111855 -207168
36143 -207168 -229502 -164508 -24343 192467 422959 503366 324613 2857 -205348 -164687
36133 -164687 39523 258043 426297 524338 503583 348340 152303 38194 21762 25429
36123 25429 -422 -50088 -138144 -304620 -521359 -668844 -653247 -511176 -361581 -268445 -178376
36112 -178376 -2144 250627 449934 490214 421193 356564 277824 69047 -222888 -342640
36102c42640J77929K39793k30j82903m1369K20097K53523M7987j46030j97640
36092B8517j59567q6338k1790n0968j46762j02472J47013L03735J07599j97827
36082a78860j79235J08655K00380l7908k14222n8744J80063J85060L7314k1332
36072B1171Q170q421n3228m4619l2906p1223n5172Q0287J65011L8742j48926j44197
36060b45311J4433P8408L58j8774J09800K13459J30246o1757j70149j22113m830
36049g6230N3417j104j07936j48987o1185J14588K84001L45389K13293q3338l23357
36038B08551k76738j8094J14250m0143k40492j89689O7399K57302K47779J17015
36028B47140l4880j46721j48229l9468L9353j6519r6357l6418J08816J42309J7457
$$ plain form
36102 -342640 -164711 75082 74852 -108051 -149420 70677 324200 372187 226157 28517
36092 28517 -131050 -217388 -239178 -290146 -436908 -539380 -392367 -88632 18967 -178860
36082 -178860 -358095 -249440 -49060 -86968 -301190 -359934 -179871 5189 42503 21171
36072 21171 29341 20920 -32308 -76927 -109833 -181056 -236228 -155941 9070 47812 -101114 -245311
36060 -245311 -230878 -152470 -152112 -170886 -61086 152373 282619 220862 50713 -71400 -76230
36049 -76230 -22813 -23917 -131853 -280840 -342025 -227437 56564 401953 615246 531908 208551
36038 208551 -68187 -86281 27969 -12174 -252666 -442355 -374956 -117654 130125 247140
36028 247140 212260 65539 -82690 -122158 -82805 -99324 -195681 -232099 -123283 19026 36483
36017C6483j29139j93522j71185n5334J31700K35924J14934j14476j78841k0630
36007c44086J32116J10031J4658N621N7588N7489J8267M4606J34179J48055O781
35996C85305j63440j60078J8208J21136l1733k57025k19592P7757K65885J44781
35986A81204k9716K9606J95333J78752J8035l5566J1512p1691k74463l05843p8856
35975a81693J19311N8041j30418k12258j64420p4722M6257J82018K13750P7479
35965f6655j03767j75426j31150m2205O5171J61991J71729Q0732q827k1807l810
35954g4024o606j347K3448N872o5956r4494j7013R8783J63399J55358O6069r6466
35942A57023k10398j29697O8226J29486K994n9571Q5172K07427N7406k22706k96927
$$ plain form
36017 36483 -92656 -286178 -457363 -512697 -380997 -145073 -30139 -144615 -323456 -344086
36007 -344086 -211970 -101939 -87281 -81660 -24072 33417 51684 96290 230469 378524 385305
35996 385305 221865 61787 79995 201131 169398 -87627 -307219 -229462 36423 181204
35986 181204 151488 181094 376427 555179 573214 537648 549160 477469 203006 -102837 -181693
35975 -181693 -62382 -4341 -134759 -347017 -511437 -586159 -539902 -357884 -144134 -66655
35965 -66655 -170422 -345848 -476998 -519203 -454032 -292041 -120312 -39580 -48407 -70214 -74024
35954 -74024 -80630 -81977 -58529 -52657 -118613 -213107 -230120 -131337 32062 187420 253489 157023
35942 157023 -53375 -183072 -114846 14640 17634 -41937 43235 250662 308068 85362 -211565
35931b11565j09931R2393J31906N3062l7474p9136m2835K5249L197j18317j55249
35920d48700j0504J12195J7448j06193M5416L34484L03004j11742m00745j89526
35910d54863K29995L28964M9857k11012j82050J6405J37660R7806k2624j02746
35900a12608p2661K6982P4163J2487p2881q6870n4198k9071K9682J61620K64164
35889A40809K11682O0013m1099r0691j83811k46947r4008K06537L06330N8285
35879C27100k30770k27921l1673N5319K0291P3717K03867J85519K1633k1404J00258
35868D75936Q1737j95354l75793j63195J69540J75739p1965j20456J21840K43762
35858C41791n731l22632l01705O124K20396J40993q1382j94315r8289J03534K04648
$$ plain form
35931 -211565 -321496 -229103 -97197 -44135 -81609 -160745 -203580 -178331 -175134 -293451 -448700
35920 -448700 -459204 -347009 -329561 -435754 -390338 -55854 247150 135408 -265337 -454863
35910 -454863 -224868 104096 153953 -57059 -239109 -222704 -85044 12762 -9862 -112608
35900 -112608 -185269 -158287 -84124 -71637 -144518 -231388 -285586 -314657 -284975 -123355 140809
35889 140809 352491 412504 371405 280714 96903 -150044 -244052 -37515 268815 327100
35879 327100 96330 -131591 -163264 -107945 -87654 -13937 189930 375449 397082 375678 475936
35868 475936 557673 362319 -13474 -176669 -7129 168610 96645 -23811 98029 341791
35858 341791 336060 13428 -288277 -282153 -61757 79236 -2146 -196461 -294750 -191216 13432
35847A3432Q2414j56390k77185j96581o1495j0616P863R3817J99829K09942J29685
35836C4715N9761K7746k2706r1916r3114J8087J59539J95440O5280j51866k80142
35825g9176j93422L3703J60404L4900k05133k70419o7099J82996K22310Q0953
35815i9983N330Q5315J19430n9094k72664k15289Q6012K75202J63712l0924n1174
35804E873L8194L5182n4761q8825n2718k0641K5523J00361P0158j29874k69474
35793c41002j31009Q0369J4776k22199j99103J22663K99538J28920m3662O1479
35783b29230K12558J24434n2914n6819J9935l1430j04642R854J91610J68854k1020
35772B31190j22556q8447o1724n1069K3397P0673k4941j03115M5817K44853J40953
$$ plain form
35847 13432 95846 -60544 -337729 -534310 -595805 -606421 -598558 -504741 -304912 -94970 34715
35836 34715 94476 122222 99516 7600 -85514 -67427 92112 287552 352832 200966 -79176
35825 -79176 -272598 -238895 -78491 -43591 -248724 -519143 -586242 -403246 -180936 -99983
35815 -99983 -94653 -9338 110092 50998 -221666 -436955 -350943 -75741 87971 57047 5873
35804 5873 44067 79249 24488 -64337 -117055 -137696 -112173 -11812 58346 -71528 -341002
35793 -341002 -472011 -391642 -376866 -599065 -798168 -675505 -375967 -247047 -290709 -229230
35783 -229230 -16672 107762 54848 -1971 17964 -13466 -118108 -108254 83356 252210 231190
35772 231190 108634 20187 -41537 -92606 -69209 1464 -23477 -126592 -80775 164078 305031
35761C05031j94840l20746r1144J69612K17146J67965J23289l4965k81415l04620
35751b44687j7K51389J17885j60277j44472J22081K08305l3944k86054k62059
35741d31850o1775O5586O1877L0207K8151L9411P1126J44197K01856J38545m0998
35730B46333j67912r8727P3263J13823k5117j16865J1991K05924J97147l475j49524
35719B86861j48105j54036k43974k49497l4485K53199L60274K34181J8841j46162
35709A77097j88167o3916J73859L17594J75794j79606m47296m10449j50530P2483
35699e23137R8468k824m6868N7539K19912K70952J34337j03267k69246k48165
35689d12299q3118N3068K5724j14442k01192j61537o1791N2741K07261L32219
$$ plain form
35761 305031 110191 -210555 -301699 -132087 85059 253024 376313 341348 59933 -244687
35751 -244687 -244704 6685 124570 -35707 -180179 -58098 150207 116263 -169791 -431850
35741 -431850 -493625 -428039 -366162 -335955 -307804 -268393 -197267 -53070 148786 287331 246333
35730 246333 78421 -20306 52957 166780 141663 24798 36789 242713 439860 436385 286861
35719 286861 138756 -15280 -259254 -508751 -543236 -290037 70237 304418 323259 177097
35709 177097 -11070 -74986 98873 416467 592261 412655 -34641 -445090 -595620 -523137
35699 -523137 -424669 -427493 -474361 -416822 -196910 74042 208379 105112 -164134 -412299
35689 -412299 -495417 -442349 -416625 -531067 -732259 -893796 -955587 -902846 -695585 -363366
35679c63366K43636o6254k91550j74163J27439K68736K07842J75296K25546J67415
35669E20577l5473j52547q6716n7668k04280k97533j01992K02278K58629N7692
35659A02967q4022j2675R1435N4381l9265l4127M1650M8315l6404r3274m1639
35648b658N8088J02772P9993M9471K3554m7971j51656j64837k2774J35722J18339
35637A78043m5592j22335P533J80968J70385l1005k28169k68197j80053q9132
35627d27554n5269j8737R3126K25937K28912N7766j33801j81216j06744k5092
35617c42672N4563J69467K23433R1365j12098j18105R0552K05008L5397j93531
35607A03379j69997N0214J40380k5891k20543j87961L8407K07208J49597n7607
$$ plain form
35679 -363366 -119730 -185984 -477534 -651697 -524258 -255522 -47680 127616 353162 520577
35669 520577 485104 332557 245841 188173 -16107 -313640 -415632 -213354 45275 102967
35659 102967 18945 6270 97705 152086 112821 78694 120344 168659 132255 38981 -2658
35648 -2658 55430 158202 238195 287666 311220 263249 111593 -53244 -76018 59704 178043
35637 178043 132451 10116 17649 198617 369002 337997 109828 -158369 -338422 -427554
35627 -427554 -482823 -501560 -408434 -182497 46415 104181 -29620 -210836 -317580 -342672
35617 -342672 -288109 -118642 104791 196156 84058 -34047 56505 261513 296910 103379
35607 103379 -66618 -16404 123976 98085 -122458 -310419 -272012 -64804 84793 27186
35597B7186k04082j70116j5012J29914J86129J31491k1286j80894k10051j04503
35587d31224m0352j12954j48191L3578K76406K77242N7745n9990M4514J39760
35577C6534O8033n963P7410J83093J19687n3274j55488j45531p7705K4232Q8334
35566A59362j6386k33098k64721J8395L16777K96983O6660l5387K5344q686k12845
35555A12398l63096l05297j45326j9053P5200J43343J15240m986p9160k6454N1271
35544d45920K6580o3878p1783O9882K63281L39160K20785M455j40840j55192j13973
35533f7443p4094o982P5939P2616l9893j15054m3459O1430K9598j06467j76274
35522c90083j22458k7901N1938J22402J50673Q7238k5089q6431p0616k5513K0341
$$ plain form
35597 27186 -176896 -347012 -362024 -232110 -45981 85510 64224 -116670 -326721 -431224
35587 -431224 -471576 -584530 -732721 -699143 -422737 -145495 -87750 -147740 -103226 36534
35577 36534 104567 98604 176014 359107 478794 425520 270032 124501 46796 71028 159362
35566 159362 142976 -90122 -354843 -336448 -19671 277312 343972 308585 333929 325243 112398
35555 112398 -250698 -555995 -701321 -720374 -645174 -501831 -386591 -391577 -470737 -497191 -445920
35544 -445920 -419340 -483218 -555001 -485119 -221838 117322 338107 342562 201722 46530 -67443
35533 -67443 -141537 -148519 -72580 36 -39857 -154911 -198370 -136940 -107342 -213809 -390083
35522 -390083 -512541 -540442 -488504 -366102 -215429 -128191 -153280 -239711 -310327 -335840 -315499
35511c15499N9558O5329L8651L4705O3203N2993j326J3045J18316J38396l4962
35500B32409k15657j70404L0291J38491J01990N7180L2154n5319j37962l8521
35490b5348K00269K96804J13750j60597k86053k33988j12851q256L6364K9397
35480a50509O0834J76141K20349N951l44336m59095k00266J40376K41680J40450
35470a68425O2665N3771n242j17231j38072k3373P7491L0983r3583j26833k8433
35459d76282P9882J02833Q9698J05312P8528q3395k72258k57851k1585J75836
35449d79282J40555j8230j04411j01006p0449K8706K21181L50214K56051K6498
35439B49827j29403j66192j71196j56786q9662k3781J950P8256K22921K25880
$$ plain form
35511 -315499 -255941 -190612 -151961 -117256 -54053 -1060 -2386 10659 128975 267371 232409
35500 232409 16752 -153652 -123361 15130 117120 174300 206454 151135 13173 -25348
35490 -25348 174921 471725 585475 424878 138825 -95163 -208014 -216270 -179906 -150509
35480 -150509 -89675 86466 306815 312766 -31570 -490665 -690931 -550555 -308875 -168425
35470 -168425 -105760 -51989 -57231 -174462 -312534 -335907 -258416 -227433 -321016 -447849 -476282
35459 -476282 -396400 -293567 -203869 -98557 -20029 -103424 -375682 -633533 -655118 -479282
35449 -479282 -338727 -356957 -461368 -562374 -632823 -604117 -382936 -32722 223329 249827
35439 249827 120424 -45768 -216964 -373750 -463412 -487193 -485243 -406987 -184066 41814
35429D1814k6587k40185p9038K81135L69844J19820q9071o7555k9292j01277r7005
35418H2603O0822J21688n9101k27796j30834Q8683J54079O9424J1570Q166k4783
35407A54521p3795p7491o8633r0787q7212j7808L5026P381k3008K8805J15690
35396i7311J45469Q9096m7897k13531k51498o0579J70851J52018n1493o6880J91329
35385d0426L43719J36661j55350j74350k578O7512J4286o813k5169j59021k97017
35374b98546k22042K4987J99711K09418J58497J10201M8216J5181O3770J20538
35364D29931Q5698l617p1471j47515k41658k27064n5023P4377o460j40742j00693
35353d04237K7319J4417r5472q3378L4736N8383J067O3039K20925K22830L3084
$$ plain form
35429 41814 15227 -224958 -303996 -22861 346983 466803 377732 310177 280885 179608 82603
35418 82603 143425 265113 206012 -21784 -152618 -63935 90144 159568 171138 179304 154521
35407 154521 80726 3235 -65398 -156185 -243397 -261205 -226179 -218798 -241806 -213001 -97311
35396 -97311 48158 137254 89357 -124174 -375672 -436251 -265400 -113382 -164875 -231755 -40426
35385 -40426 303293 439954 284604 110254 107676 175188 189474 182661 157492 -1529 -298546
35374 -298546 -520588 -495601 -295890 -86472 72025 182226 230442 245623 309393 429931
35364 429931 515629 512012 440541 293026 51368 -175696 -230719 -156342 -162802 -303544 -404237
35353 -404237 -376918 -362501 -457973 -541351 -506615 -448232 -447165 -384126 -163201 59629 92713
35342I2713p7099L2628J70768J63271J02710J02268O6060j09505k99197l01519
35332e6902j11790R5532J73124R8258n3921j63053j51790n4473N4385J70687L00286
35321C00343L34944J46935j91862m32259m10388j82896Q0307K21425J58277k9985
35311e159j18380J3750K00549K15542R2346J2576k4944j38086k34468j08387J28391
35300C3730J08918j93498l32183n4607K64844J67752k01308l32569r7396J55071
35290d81246J83229J25460J34482J08291m9782j79405r7102Q9960J37628L4190
35280E705j8905M3594O7270j9976o2358M8870J57697Q3090p6589j06223l3768
35269H8407n4183j44327p5299J51053K16249j7731k28746q6090K49754L59965
$$ plain form
35342 92713 15614 48242 219010 382281 484991 587259 653319 543814 244617 -56902
35332 -56902 -168692 -73160 99964 198222 144301 -18752 -170542 -225015 -170630 57 300343
35321 300343 635287 782222 590360 158101 -252287 -435183 -354876 -133451 24826 -5159
35311 -5159 -123539 -109789 90760 306302 398648 411224 386280 248194 13726 -94661 33730
35300 33730 142648 -50850 -383033 -437640 -172796 -5044 -206352 -538921 -636317 -481246
35290 -481246 -298017 -172557 -38075 70216 20434 -158971 -256073 -166113 -28485 5705
35280 5705 -13200 30394 97664 77688 15330 64200 221897 304987 228398 122175 88407
35269 88407 34224 -110103 -185402 -34349 181900 164169 -64577 -150667 99087 459052
35259D59052J48760r8372j55246p6744n603R5o2117j45403j26728N4140K38116
35248B29950K06101o542j33720l8016J19416J15948n3704j94817j40945O2517
35238A66188J83061N1222j98181k49117k0092K08040J86701K7213m1229l9607
35228B74199j07524j68559n0784J49312J64601o670r4745o523M6046o5972j76330
35217d2949j19409J3690N7430J8023R61L3253O7594O3161J198r0082j15490k4318
35205a36938Q2561Q8918N3046Q8608J23912J1660j65767j75450j9743M3629q8664
35194i4228k15828j69810l7299N3793J21879J87868J66800L3319q7195j00681
35184a41382n4682J791Q6299J55556J12807l566n3031n0855j36295k42134j17975
$$ plain form
35259 459052 607812 509440 354194 277450 271847 271942 209825 64422 -62306 -8166 229950
35248 229950 436051 429509 295789 257773 377189 493137 439433 244616 103671 166188
35238 166188 349249 400471 202290 -46827 -66919 141121 327822 355035 313806 274199
35228 274199 166675 -1884 -52668 96644 261245 254575 159830 153307 199353 133381 -42949
35217 -42949 -162358 -148668 -91238 -73215 -72254 -39001 28593 91754 92952 2870 -112620 -136938
35205 -136938 -54377 34541 87587 176195 300107 311767 146000 -29450 -49193 -5564 -94228
35194 -94228 -310056 -479866 -517165 -463372 -341493 -153625 13175 46494 -40701 -141382
35184 -141382 -196064 -194273 -107974 47582 160389 156823 103792 52937 -83358 -325492 -443467
35173d43467K11558L58942J31379j44378r9559J53640K61230J57587M0701j3399
35163F14234q4968j56345j24475k6123N81m4478l7342L6653N9022j7411j07221
35152A12127j38650j26183r7010n3852p626L0241O7195Q9515N6035k0419o2835
35141a51462n2544o4068j15912j01673M0965J97412K16395J04459j1647n2911
35131I014m4246n4356j21127j87742j26013Q4238K41331J43568j05697k14838
35121c75868j11419P770M0752J01415K11513J88163k0622j77739j12991K1399
35111b27627L9011P834L8782L6144q9122j76418n9472J29238J71646J15985J31900
35100A17901J63288L7546j76479k29554o9734J06720J56590J11407K5578q2489
$$ plain form
35173 -443467 -231909 127033 258412 114034 14475 168115 429345 586932 627633 614234
35163 614234 529266 372921 248446 222323 222904 178426 141084 177737 236759 219348 112127
35152 112127 -26523 -152706 -249716 -303568 -311194 -280953 -213758 -124243 -68208 -88627 -151462
35141 -151462 -204006 -268074 -383986 -485659 -444694 -247282 -30887 73572 61925 9014
35131 9014 -35232 -89588 -210715 -398457 -524470 -440232 -198901 -55333 -161030 -375868
35121 -375868 -487287 -479517 -438765 -337350 -125837 62326 41704 -136035 -249026 -227627
35111 -227627 -188616 -180782 -142000 -105856 -194978 -371396 -430868 -301630 -129984 -13999 117901
35100 117901 281189 318735 142256 -87298 -157032 -50312 106278 217685 243263 160774
35090A60774j54506j39766r4146q3836n3665N4928J42704Q6969m4915r7467o1684
35079b84610k7378P678Q2522J11145p537j70372j64454M6048K86102L76206K45259
35068E00609o2675l47227l47775o0948J74883J10853n9901k9395J22059R0584
35058I1067r9963j17838J06957K30619K2129k81626l17557o9820J71621J85689
35048g8722P577j79085k28574j35873m36J03124J78195K19304J76922P3545L3388
35037A69365R5851J25932L2478o4311l8670R471p5369k19391k21247o0033J02901
35026a43023J68971J63747J12730K7072m3906q5450j55399k28883j52610R0261
35016b46490K47630J34073p6214j21222l6978j1866l3864J7492Q1783L6442l2375
$$ plain form
35090 160774 6268 -133498 -227644 -311480 -365145 -310217 -167513 -80544 -125459 -222926 -284610
35079 -284610 -311988 -304310 -221788 -110643 -118180 -288552 -453006 -406958 -120856 255350 500609
35068 500609 437934 90707 -257068 -318016 -143133 -32280 -92181 -121576 483 91067
35058 91067 -8896 -126734 -19777 210842 232971 -48655 -366212 -436032 -264411 -78722
35048 -78722 -71145 -250230 -478804 -614677 -615113 -511989 -333794 -114490 62432 135977 169365
35037 169365 265216 391148 423626 359315 320645 330116 254747 35356 -185891 -245924 -143023
35026 -143023 25948 189695 302425 329497 285591 200141 44742 -184141 -336751 -246490
35016 -246490 1140 135213 58999 -62223 -99201 -111067 -144931 -127439 -45656 -9214 -41589
35005d1589M514L0505r3661j73453M5649L65809L50589J596k32403j29735N6335
34994A84156P1359k5384r5795j11579m0049J27859K03451j492k90649k77347J9368
34983b36102J89399Q4500J909J18605K10358J03050l4394n7896j05117k49622
34973B4690k73517n0242J73589J49141q037p6041p6080j05011p8488P9750K07747
34962c2499J36870k1400o5784k4254m9807j30544j24333L745J46471J93934J16552
34951A48951r830l8657O0166Q3488j24852l37937k07410J64422L15975J30565
34941A84881j1380R1081J31727j08943l22217j79562J15913J90724Q8533O8809
34931B49566Q3808q5385l43878l76911j43236R6581J82196J66687R7861j6157
$$ plain form
35005 -41589 -37075 -6570 -100231 -273684 -228035 137774 488363 489959 257556 127821 184156
34994 184156 255515 230131 134336 22757 -17292 110567 314018 312526 21877 -255470 -236102
34983 -236102 -46703 37797 39706 158311 368669 471719 437325 379429 274312 24690
34973 24690 -248827 -299069 -125480 23661 15624 -60417 -136497 -241508 -319996 -240246 -32499
34962 -32499 104371 82971 17187 -7067 -56874 -187418 -311751 -308006 -161535 32399 148951
34951 148951 139121 100464 160630 244118 119266 -218671 -426081 -261659 54316 184881
34941 184881 173501 264582 396309 287366 -34851 -214413 -98500 92224 180757 249566
34931 249566 333374 247989 -95889 -472800 -616036 -519455 -337259 -170572 -72711 -88868
34921h8868q2435k9608K6734l8912j15563l1306J32183J66309Q3025O1137J19005
34910B01701J17175M0643J3582N3609M8624l2328j11281j63725k17621k19534
34900b69155r1577R5964J78492J09534j5143j04368j16736k6771J15688J63286
34890C9214N0039p8670n4846O8843J10073K2576p7048j00068p1589n2104o2958
34879b06538o9482j4183P6284N4615j34292k57921n8878K99252L71418P7950j51888
34868a3663k7888J85419J36686p4033j34076j8117Q2153J11134J12004K3776j74152
34857B09243k81930j42002P5167J29252Q1659J15072J60755L7833j74913k39733
34847b9597j34405l0075P894K7515J2198m6244k8647J06114J62035J9145r3379
$$ plain form
34921 -88868 -171303 -200911 -174177 -213089 -328652 -359958 -227775 -61466 21559 82696 201701
34910 201701 318876 359519 373101 426710 475334 443006 331725 168000 -49621 -269155
34900 -269155 -360732 -264768 -86276 23258 8115 -96253 -212989 -239760 -124072 39214
34890 39214 89253 10583 -44263 24580 134653 157229 80181 -19887 -91476 -143580 -206538
34879 -206538 -276020 -290203 -213919 -159304 -293596 -551517 -610395 -311143 60275 138225 -13663
34868 -13663 -41551 143868 280554 206521 72445 54328 136481 247615 359619 383395 209243
34857 209243 -72687 -214689 -139522 -10270 71389 186461 347216 385049 210136 -29597
34847 -29597 -164002 -194077 -186183 -158668 -146470 -192714 -221361 -115247 46788 65933 -27446
34836b7446N0171K52117J91068l8901r5719L9983Q5331m0275j47463j67149k13790
34825a12073k76117k07669k6957Q7686Q8707P0474M9958M567K5636J52028J90656
34814D6896J1018j55323n8974J22187Q6141n4210n982J27229M3876j41123p5961
34803e4226J47188J29341q3589p2741J36200O9054k90425l58656O4116M07139
34793I3401K50322n0182o1051K7081j15468k99753j89025P3650J38562M1064K8893
34782f2506O0617m7193j83033j10389P8401R7894n4282j30011m3579Q0767J79722
34771a33592K61031K39341O2229q7994j3283J51891J00276j86094m03802l38353
34761c48350p1609K03844L59579L25124J10516j33932k25479j43400k5541J6187
$$ plain form
34836 -27446 22725 274842 465910 427009 331290 371273 456604 416329 268866 101717 -112073
34825 -112073 -388190 -595859 -622816 -535130 -446423 -375949 -325991 -321424 -295788 -143760 46896
34814 46896 57914 -97409 -156383 -34196 51945 -2265 -8247 118982 162858 21735 -54226
34803 -54226 92962 222303 138714 65973 202173 271227 -19198 -377854 -313738 93401
34793 93401 343723 293541 232490 259571 144103 -155650 -344675 -271025 -132463 -91399 -62506
34782 -62506 -1889 -49082 -232115 -342504 -264103 -166209 -220491 -350502 -394081 -313314 -133592
34771 -133592 127439 366780 429009 341015 327732 479623 579899 393805 -9997 -348350
34761 -348350 -419959 -216115 143464 468588 579104 445172 219693 76293 50752 66939
34751F6939m868r071O1798J89840K75079K29961R4964j2297o0922j14525j81833
34740E35065j96488j51403j06813o2459K0282Q3007M5945l062P3125J69120M8986
34729D55305k26970l11795r3793J19457P9761n4083m0180N8227M7356n3140q7419
34718a07274l3997J0558N753k9695p5220o0455R6466L09798L56568J80953j4078
34707F39377o6500m2846l9506k8041m601n2826j39315r3666Q3760J56513K7509
34696D39858j01505r4344r4430j86450j71561O6220K69161J78036n7947j44186
34686A02852q1001l0283L3784J92887K86361J17440j58414k06487m801J60260
34676D12598J42441P0888N1497K0404o9802j43350j33474p2414k3126j8293n3761
$$ plain form
34751 66939 62071 53000 114798 304638 579717 809678 904642 892345 831423 716898 535065
34740 535065 338577 187174 80361 17902 38184 121191 167136 164074 237199 406319 455305
34729 455305 228335 -83460 -177253 -57796 21965 -32118 -72298 -14071 33285 -19855 -107274
34718 -107274 -141271 -130713 -124960 -154655 -229875 -290330 -193864 115934 472502 653455 639377
34707 639377 572877 530031 490525 462484 457883 405057 265742 172076 255836 412349 439858
34696 439858 338353 244009 149579 -36871 -208432 -142212 126949 304985 247038 102852
34686 102852 21851 -8432 25352 218239 504600 622040 463626 257139 252338 412598
34676 412598 555039 625927 677424 697828 628026 484676 351202 278788 255662 237369 183608
34665A83608p7157l7502J3043k5451j08330p5466O7951J08284l8061j67208j08785
34654b65074J6537K9762k2496m534O7434J02566R7682P5242K0501j5212M7785
34643A50193J01967m4777k67081j95472J57982K87761l4899l41794j91006J31276
34633b45850J22221j01982p6207J69907J89192q0161k25675p7544O4383N162n2700
34622c09254O7367K24155K49037J82840Q4979q4643k65503k64686n8720J21445
34612e2983J28538R1490J48987K10295J34118k1031q8526m2631j8051j06864k24679
34601A58663k09959m4230Q5274J7406j38701j40616K8233J44283J04347M8215
34591E2915O4269N6655J62J6566P5398k6502k25073j45626K52462M40652R8449
$$ plain form
34665 183608 106451 68949 81992 56541 -51789 -127255 -59304 48980 10919 -156289 -265074
34654 -265074 -248537 -218775 -241271 -245805 -178371 -75805 21877 97119 117620 102408 150193
34643 150193 252160 207383 -59698 -255170 -97188 190573 155674 -186120 -377126 -245850
34633 -245850 -123629 -225611 -301818 -131911 57281 -22880 -248555 -326099 -261716 -256554 -309254
34622 -309254 -241887 -17732 231305 414145 499124 414481 148978 -115708 -174428 -52983
34612 -52983 75555 167045 316032 526327 660445 639414 550888 508257 490206 383342 158663
34601 158663 -51296 -95526 -10252 7154 -131547 -272163 -243930 -99647 4700 52915
34591 52915 117184 173839 174001 190567 265965 239463 14390 -131236 121226 561878 660327
34580F60327l12231k32342J20619J53197j23331j86673P3462K20039N5966r5253
34570C33780r243R0411j4268j72919j58395L036J48493J74586L8356j99294l10223
34559g5680j33857J34877J65922l0974j56253j05274n6012q2215m6589P8658J31206
34548a76191O9731N4593J37537J52592Q252j47880j44206R373J73962K08185O6196
34537D12144j14542j18356L9268Q9966m8414q6924J35119K92052Q2049k15526
34527D66836j66000R3504R8022j55053k42309m3803J38754J55822J56607J71635
34517F74015O6325q9751r6860m2458j53385k92794j45026J58543J91286k8776
34507B41119q6889M9382q283k72896k80750O1655K51398M4074j50189j7487J58001
$$ plain form
34580 660327 348096 115754 236373 389570 266239 79566 153028 373067 429033 333780
34570 333780 324537 414948 400680 227761 69366 72402 220895 395481 433837 234543 -75680
34559 -75680 -209537 -74660 91262 60288 -95965 -201239 -257251 -339466 -386055 -307397 -176191
34548 -176191 -106460 -51867 85670 238262 246514 98634 -45572 -36199 137763 345948 412144
34537 412144 297602 179246 218514 308480 260066 173142 308261 600313 682362 466836
34527 466836 300836 394340 492362 337309 95000 51197 189951 345773 502380 674015
34517 674015 740340 650589 553729 511271 357886 65092 -79934 78609 269895 241119
34507 241119 154230 203612 195329 -77567 -358317 -296662 -45264 -1190 -151379 -168866 -10865
34496a0865Q6433k4024O2791J58925O1038m3786M4143J56093R3237k4448m7037
34485E12500o7249j38058r4337R0575J52996j5213j56808j07807n6181j24149
34475c731j27717J4937Q0488j7895m4885O6021L0941k11443k68710M3414L18867
34464a19713K01276p3318j45063q0257p3981m8604O8472R2916k7571q711K37897
34453B3343L41085J04078j05160j923J06931p5246k54136r2472J54469J14224
34443C15193m8136k7852Q088j85053l42106j35485J66737J43619l0085M9397K33008
34432A47325J19979j38806q5058J98626K19602p5427k74143k27261j53283j00097
34422c68543P0561K36506J60106L646J03904L19856K22382j38080k93135j48115
$$ plain form
34496 -10865 75568 51544 114335 273260 334298 290512 334655 490748 583985 559537 512500
34485 512500 445251 307193 212856 303431 456427 441214 284406 176599 120418 -3731
34475 -3731 -131448 -116511 -36023 -53918 -98803 -32782 -1841 -213284 -481994 -438580 -119713
34464 -119713 81563 8245 -136818 -217075 -291056 -339660 -271188 -178272 -205843 -214554 23343
34453 23343 364428 468506 363346 361423 468354 393108 138972 46500 200969 315193
34443 315193 267057 239205 247293 62240 -279866 -415351 -248614 -104995 -135080 -85683 147325
34432 147325 267304 128498 43440 242066 461668 386241 112098 -115163 -268446 -368543
34422 -368543 -297982 -61476 98630 102276 206180 526036 748418 610338 317203 169088
34412A69088o5088j51130j15732R6732J61174j9301j31901k8175M5275n0891j02234
34401a92183K3078J21489K7448j17178j31180l8237O6159J32958R7825m6642j26910
34390a83373k72J68879J35265k4721p1689m0660j23956k28789j01395J72314K52231
34379d6166J02062R112O1818O4735k2247k2742M9714j8027j89371j68735P6589
34368a03258K13241O7577j34503j63897p0681K9229J19831J51170N0516o2448
34358I6777K9008K70930L56626J63701r5692j96018j26180K571M6826j21182m20607
34347F760n17887k40105J09210J55652L666J0514J85042K51327J77209J63684
34337C05072J94355P5136j31717j80394r8592j08788j55057o98K51336K57150
$$ plain form
34412 169088 104000 -47130 -162862 -66130 95044 75743 -56158 -84333 -39058 -89949 -192183
34401 -192183 -169105 -47616 -20168 -137346 -268526 -306763 -240604 -107646 -9821 -56463 -183373
34390 -183373 -183645 -14766 120499 95778 24089 -16571 -140527 -369316 -470711 -298397 -46166
34379 -46166 55896 65008 126826 191561 169314 146572 196286 178259 -11112 -179847 -103258
34368 -103258 109983 177560 43057 -120840 -191521 -162292 -42461 108709 159225 96777
34358 96777 125785 396715 753341 917042 821350 625332 499152 501723 548549 427367 6760
34347 6760 -511127 -751232 -642022 -486370 -482704 -472190 -287148 -35821 141388 305072
34337 305072 499427 574563 442846 262452 163860 55072 -99985 -100683 150653 407803
34327D07803L4777n8461M3496M6472j08272j31190M6783J24015k7958j59824j17456
34316A00185o1667q5375n0635O2704O6050n5733p3472O2874J23606K5327l0305
34305H3559N5671J25291Q7248M2415K3922m5261j10554n0938L1722l7811j29569
34294G5695p054J75893P6402k00961k28384N077P9298r7385j43363P6733K11590
34283B3541P6339l9264O4010J53056K9528j28236j26864n7080l6967k4393k2581
34272h8911j10272j85190n5998J75699K32835J48404J70989K30236M3570k68027
34262B93335k81656j0066J00150m4220o8619J12612J29725j08485k17154n9529
34252a53907K0251j02633r0005J68258L08071J95045J83260L81887L62176n7848
$$ plain form
34327 407803 442580 384119 427615 474087 365815 234625 281408 405423 377465 217641 100185
34316 100185 38518 -46857 -97492 -34788 31262 -24471 -97943 -35069 88537 113864 83559
34305 83559 139230 264521 351769 394184 418106 372845 262291 211353 243075 205264 75695
34294 75695 68641 244534 320936 119975 -108409 -103332 -24034 -121419 -264782 -188049 23541
34283 23541 99880 60616 124626 277682 307210 178974 52110 -4970 -41937 -66330 -88911
34272 -88911 -199183 -384373 -440371 -264672 -31837 116567 287556 517792 561362 293335
34262 293335 11679 1613 101763 57543 -11076 101536 231261 122776 -94378 -153907
34252 -153907 -133656 -236289 -326294 -158036 150035 345080 528340 910227 1272403 1214555
34242A214555m04809l10687o6150k9008o5022L3635J21260O4094K1411L9067j14382
34231E03964m16727m57283j24289J47698J00936K2779J10697J18801m5562m4537
34221h3523K13259K89278p030k25268o3528J19431R384j16260l773P2354r8960
34210A05364k01265l99J93831J37140R7741K42734K33023r6625l17316j48407
34200B45821N0467j563j6130J51444Q8339l21970m56485k135L80850J59866j40215
34189A38289P6148L70628R6843l80221l15215J30364K50824K433j18625l6888
34179B14580l8550p4944N9885J77228N2102m5997J23080J84624j75026m69214
34169G768j68742L10351K61008j38421k19008K5552J13518L7494J27091K66499
$$ plain form
34242 1214555 809746 499059 432909 403901 338879 372514 493774 557868 579279 618346 503964
34231 503964 87237 -370046 -494335 -346637 -245701 -222922 -112225 6576 -38986 -83523
34221 -83523 129736 419014 411984 186716 123188 242619 252003 135743 131970 204324 105364
34210 105364 -95901 -96300 97531 234671 332412 575146 808169 711544 394228 245821
34200 245821 296288 294725 278595 430039 518378 196408 -260077 -262212 118638 278504 138289
34189 138289 214437 585065 681908 301687 -13528 116836 367660 370093 251468 214580
34179 214580 176030 101086 160971 338199 390301 344304 467384 652008 476982 7768
34169 7768 -160974 149377 410385 271964 52956 78508 192026 229520 356611 623110
34159F23110J35396p1018k867J01857j28572l83410j85181J65988Q9105k05074
34149A39334j04535K69289L07314J8475r1213m325r0475k39143n2165K87635K69115
34138G09306j0214n6857P8631k2002k46985j55694J21885J02587j23488q4501
34128C12668J52734J47584l6914j0710J14290l2997k53105r7685K29929K10923
34118G36717k3441O550J61294r648k92608j59137J90606J63591j20154r5660J51752
34107G09862J13282j06765m8926J12305o9132k94452j4831M01332K08644l35633
34097F75686l90719j5475P0503j03373M4415L28752J06969l38388k00275K83611
34087D61706J90824l34633k93694L03508M34544o8118k90816L3854J84509l4983
$$ plain form
34159 623110 758506 687488 684621 786478 657906 274496 89315 255303 344408 139334
34149 139334 34799 304088 611402 629877 538664 534339 443864 204721 152556 440191 709306
34138 709306 699092 642235 720866 698864 451879 296185 418070 520657 397169 312668
34128 312668 465402 612986 576072 565362 679652 646655 393550 295865 525794 736717
34118 736717 713276 719826 881120 871472 578864 419727 610333 773924 653770 558110 709862
34107 709862 823144 716379 667453 779758 710626 416174 401343 802675 1011319 675686
34097 675686 284967 269492 339995 236622 281037 609789 716758 378370 178095 461706
34087 461706 652530 317897 24203 327711 762255 694137 403321 437175 621684 586701
34077E86701k0756K46394J09099l27049k34559L13431L63014j35530k19495K37164
34067I18414K85766k44216m04251M2839K01577j72858k19860K71264L95979r7713
34057I76941k99129J03628K62659j15832k18939J80322K23459k77832l57542K26050
34047G03785M18675j58981m63932K1819L76194M0415k13270Q3378K10187j83074
34037H35196l18808J23016L27683k2787j40169J94967J49259l49679k56698M82623
34027A024603N53762k70194n22658K53255N51639l02283q22495r0210N76053J21778
34017A073250l83118M6270M65731K1428l28162J89123N16845j47450o68292j15845
34007F69780M33914R272l83994J85092O83234J47585l99324L5789M85738L197
$$ plain form
34077 586701 565945 812339 921438 594389 359830 673261 1036275 900745 681250 918414
34067 918414 1204180 959964 555713 598552 800129 627271 407411 678675 1074654 976941
34057 976941 677812 781440 1044099 928267 709328 889650 1113109 835277 477735 703785
34047 703785 1122460 963479 499547 521366 897560 937975 724705 808083 1018270 835196
34037 835196 516388 639404 967087 944300 804131 999098 1148357 798678 541980 1024603
34027 1024603 1578365 1308171 785513 1038768 1590407 1288124 465629 375419 951472 1073250
34017 1073250 690132 736402 1202133 1223561 895399 1084522 1601367 1453917 785625 669780
34007 669780 1103694 1112966 728972 914064 1597298 1744883 1345559 1381348 1867086 1870283
33997A870283m48199J4197L76932j75625m95020K48079P45149L0775n44028Q4076
33987A706619N52072k43873q58488o5425O77781L9176n72425J59710P62650q5038
33977B072759p49706K23824J081588J56193p90071P0940R91819M3931r70299L8670
33967B169648J228811K93714r86019j62564J055334J73903j062938q8274J255027
33958C876642K65317j095634O4793J662736N53424j100591Q8843J879171O80946
33949F875647j074047M52290K508317Q73613j247343J035319M132499K346176
33941A5902471l08009K897513P522079N777986L119193R070440J6556648J3890317
33933G4428638J4610747M3543775Q6041832Q6717128K0824799o1192859r0234503
$$ plain form
33997 1870283 1422084 1436281 1813213 1637588 1142568 1390647 2135796 2166571 1622543 1706619
33987 1706619 2258691 2014818 1156330 1090905 1768686 1807862 1235437 1395147 2157797 2072759
33977 2072759 1323053 1546877 2628465 2784658 1994587 2065527 3057346 3101277 2130978 2169648
33967 2169648 3398459 3692173 2706154 2543590 3598924 3772827 2709889 2621615 3876642
33958 3876642 4141959 3046325 3111118 4773854 5327278 4226687 4315530 6194701 6875647
33949 6875647 5801600 6253890 8762207 9635820 8388477 9423796 13556295 15902471
33941 15902471 15594462 18491975 26014054 31792040 34911233 43981673 60538321 74428638
33933 74428638 89039385 132583160 218624992 305342120 326166919 264974060 174739557
33926A74739557o0618235k3751175j3624727j6283505j0907649k710646l287554
33919D3556066p029548m212474Q34972O2991k926768j136609K469000J690048
33911C3307678j095932m50350J660916N30033j968960j503889K43343p10120k814452
33902B7198267k328086o26429j193347k766165k076516l49428p98971k365764
33894A4693561j910859k54032l62188j628563j336860J8076m2654j080980q62978
33885G232523J14670k33599j295887r61394J78243l173j001248p30936L68120
33876C667319K31599p99293o94683L45954M02784m39346m39588L20596K28833
33867B824175n88323n54921K25624K45954m02556k99538M10708L04576m77941
$$ plain form
33926 174739557 114121322 90370147 76745420 60461915 49554266 46843620 43556066
33919 43556066 36526518 32314044 33149016 33212007 30285239 29148630 31617630 33307678
33911 33307678 32211746 31761396 33422312 33952345 31983385 30479496 30722839 30012719 27198267
33902 27198267 24870181 24243752 23050405 20284240 18207724 17858296 17059325 14693561
33894 14693561 12782702 12528670 12166482 10537919 9201059 9219135 9176481 8095501 7232523
33885 7232523 7347193 7113594 5817707 4856313 5034556 5031383 4030135 3299199 3667319
33876 3667319 3898918 3099625 2404942 2750896 3153680 2714334 2274746 2595342 2824175
33867 2824175 2235852 1680931 1906555 2152509 1749953 1450415 1861123 2165699 1687758
33858A687758m88044K35962L36118k01303j82037L06197J34096m48516k15240
33849A164991N03291K83361o27977o27669K91912N10935k84666o75129j60429
33840C78620J76669r4099j30506K64630K37186k85567l40895K01783L93937N1808
33830H53566J4064L68111K43438m10206o11811j44442J30927n1466l1492K71459
33820F32148J68909l10001l47503R2776J93510j13751o3403L38063K55527k94712
33810E51563l53465K07279M36895M9634j73456L9837M9607k62715k13608K33730
33800E65301K60383k50958m32700k8800J87348p6590j54635J83343K81458p2586
33790D61564k37387q012K9101k27282j31687L39490L54908k32672n05056q6042
$$ plain form
33858 1687758 1199714 1435676 1771794 1570491 1388454 1694651 1828747 1380231 1164991
33849 1164991 1668282 1951643 1323666 695997 987909 1498844 1214178 539049 378620
33840 378620 555289 461190 330684 595314 832500 546933 206038 407821 801758 853566
33830 853566 867630 1235741 1479179 1068973 457162 312720 443647 392181 360689 632148
33820 632148 801057 491056 143553 236329 429839 316088 252685 590748 846275 551563
33810 551563 198098 405377 842272 891906 718450 758287 807894 545179 331571 565301
33800 565301 825684 574726 142026 113226 300574 223984 69349 252692 534150 461564
33790 461564 224177 216165 245266 17984 -113703 225787 580695 348023 -157033 -243075
33780b43075K43062K5801j31023J46598K82316n9579k97490p0344J03299j00177
33770a00612j96042P0983J80688r7091j82433J87790L86704M5828k68642j25923
33760i8750M5224r8097j52167J32831K71615j2350k06469J6513J79061l7071j48801
33749a08461J64890L79063Q0376k60702j59858O0210j0224j21318j077L2693k37726
33738a82134l71058n6932K48585J20062j03401j4915J21845k4162j74339j4637
33728d51086J75828R1306j1130J16421J63272j17915l39485j35242J76404J68988
33718a62639n23k9886m4238j84134j80867J06644K76894M5631k19597j43027L6893
33707d98849O363l6374J25327K11875r966k06407n5151J72980J44459M6806J13930
$$ plain form
33780 -243075 -13 25788 -105235 41363 323679 264100 -33390 -103734 -435 -100612
33770 -100612 -296654 -225671 -44983 -142074 -324507 -136717 249987 295815 27173 -98750
33760 -98750 -53526 -151623 -303790 -170959 100656 88306 -118163 -101650 77411 40340 -108461
33749 -108461 56429 435492 515868 255166 95308 155518 145294 23976 22899 55592 -182134
33738 -182134 -553192 -610124 -361539 -241477 -344878 -359793 -237948 -262110 -436449 -451086
33728 -451086 -275258 -183952 -195082 -78661 84611 -33304 -372789 -508031 -331627 -162639
33718 -162639 -163162 -193048 -237286 -421420 -602287 -495643 -218749 -173118 -392715 -535742 -498849
33707 -498849 -492486 -528860 -403533 -191658 -201624 -408031 -463182 -290202 -145743 -98937 14993
33696A4993J18583j07521k00455R8598L62382J49791k29665k45782L454Q5282
33686D9660k7304r1562j05240j50057q3001J43693K34326M3953j09885k2147K1848
33675i5716j47087j80594J09286K88374O1017j33593R6214L31315O3841l75698
33665A7359l71994l0088J35964R9151J44615J79089j9539j91557J1003L06718
33655B80721J97180j61006k26569O444Q6388o4381j00341O1353J44399N2548l2931
33644B43805l7396l1331L696O9288N225j93649k03742R5925K75453m952l79329
33633a57007l24650K5952J78655O8758j7494k1752m8827N459K17887L09282P9771
33622C16034j41381j9312J70131L8104j78260m5158K37762J66761j72478k81437
$$ plain form
33696 14993 133576 26055 -174400 -75802 286580 436371 206706 -39076 -35622 49660
33686 49660 22356 -69206 -174446 -324503 -407504 -263811 -29485 14468 -95417 -117564 -95716
33675 -95716 -242803 -423397 -314111 -25737 35280 -98313 -2099 329216 393057 17359
33665 17359 -354635 -384723 -248759 -149608 -4993 174096 154557 -37000 -25997 280721
33655 280721 477901 316895 90326 96770 183158 118777 18436 79789 224188 276736 243805
33644 243805 206409 175078 178774 248062 253287 59638 -144104 -48179 227274 222322 -157007
33633 -157007 -481657 -455705 -277050 -208292 -225786 -247538 -296365 -290906 -73019 236263 316034
33622 316034 174653 155341 325472 363576 185316 140158 377920 544681 372203 90766
33612I0766j12019k4392n2746O1844K34129J42131j12915j27001R2830J69921
33602C62548M1800j4638L2456l1829j54945r0862Q2654Q7954r089N0451J51785
33591E08285l591k64123k24120M3037J01410p0417q7082R7971J30547n2307j24985
33580E4625j2432k657j56719j94650m1722N9399L3668M5193O8222p1849k25863
33569d44785n9847L11009M06311J41178p4507n2310m9702j85039k14252m1304
33559b63248P9887J8985k7942M7061Q7630L2437K7251P6096n084j93542k19357
33548c39826r713J89117J90770M0268j80993l78540l42723o405K93832K27108
33538c17105M73J7456J82122J08347j31433j22299J09052J22151j26749k01593
$$ plain form
33612 90766 -21253 -45645 -98391 -36547 197582 339713 226798 99797 192627 362548
33602 362548 404348 389710 422166 390337 235392 144530 227184 315138 306049 356500 508285
33591 508285 504694 240571 16451 59488 160898 90481 3399 101370 231917 179610 54625
33580 54625 42193 39536 -117183 -311833 -353555 -294156 -260488 -215295 -147073 -218922 -444785
33569 -444785 -504632 -193623 212688 353866 279359 227049 177347 -7692 -221944 -263248
33559 -263248 -183361 -164376 -192318 -145257 -57627 -25190 2061 78157 73073 -120469 -339826
33548 -339826 -349539 -160422 30348 70616 -110377 -488917 -831640 -838045 -544213 -317105
33538 -317105 -316632 -299176 -117054 -8707 -140140 -262439 -153387 -31236 -157985 -359578
33528c59578K0872J57920L4385o7075j4832n0632k24405k16783O0673K49627J49453
33517b60375K1415P9821J62534J05350K268o3524j31520j22778P0699K30952N5688
33506A50530k44222j77369J81300K46761r4807k87144n8094J62124M5291j09406
33496a85036M2J50552P1330q2023q9963m1676m5688j0839M8523m6855k08485j03857
33484e43975K18871L06977P9155j8473J58546J80700j11418k40341M3560K68781
33474C42383Q3643j19581L8216K16035J6761k53759j59945O4018j8753k39142
33464c0124j80076M7263P5426j1554P6896J88953J3437k41773j45223J73231K09081
33453A75537p0950k16552o1235J01744R6627P0339R3030L1916j20994j86080j05861
$$ plain form
33528 -359578 -338706 -180786 -146401 -213476 -228308 -278940 -503345 -720128 -659455 -409828 -260375
33517 -260375 -238960 -159139 3395 108745 111013 47489 -84031 -206809 -136110 94842 150530
33506 150530 -93692 -271061 -89761 157000 62193 -224951 -283045 -120921 -75630 -185036
33496 -185036 -184994 -34442 36888 -45135 -135098 -176774 -222462 -233301 -184778 -231633 -440118 -543975
33484 -543975 -325104 -18127 61028 42555 201101 381801 270383 30042 73602 342383
33474 342383 426026 306445 344661 560696 577457 323698 163753 227771 209018 -30124
33464 -30124 -210200 -162937 -87511 -99065 -22169 166784 180221 -61552 -206775 -33544 175537
33453 175537 104587 -111965 -173200 -71456 25171 95510 188540 220456 99462 -86618 -192479
33442a92479p729M1549P8278Q4583L0380m219M1761P9143M9235M8880R2607P677
33430C49666k15821k80811o0280J22185J6055j16637J1737J57060k0914k81037
33420c18797j53016K40436L40088L9659j90418q5256P0808m51j46253j06476P8361
33409b31315J89168J50490O4939L1164L4057K03o2323l9933P9856Q0106j76962
33398A19450m07574k42135J36257J81213j36334k32522J14992L52941P6134k72803
33388c10381j50125J97878K23239P742M137J73936J16578j35846j62196R0715
33378E5677K28714P1278j48503k35652k16161j01510J00078J95312L1712j75963
33368a95018j29443P5489J48951J09855J53078J97351M6898j52376j11889P6560
$$ plain form
33442 -192479 -200208 -158659 -80381 4202 34582 30363 72124 151267 200502 249382 341989 349666
33430 349666 133845 -146966 -207246 -85061 -69006 -185643 -173906 -16846 -37760 -318797
33420 -318797 -471813 -231377 108711 148370 -42048 -127304 -56496 -56947 -203200 -309676 -231315
33409 -231315 -42147 108343 173282 204446 238503 238706 176383 136450 216306 296412 119450
33398 119450 -288124 -530259 -394002 -212789 -349123 -581645 -466653 -113712 -37578 -310381
33388 -310381 -460506 -262628 -39389 -31647 -27510 146426 263004 127158 -35038 55677
33378 55677 284391 355669 207166 -28486 -244647 -346157 -246079 -50767 -19055 -195018
33368 -195018 -324461 -248972 -100021 9834 162912 360263 407161 254785 142896 219456
33358B19456R4901o0777j59123j83492k24779j35279J82479L73550J10968k55236
33348c7332j92160J02964M8445k48860j53526L20371M41880r703l74881k22963
33338c25765L1452k4910j32160J7450J65029P126k14144j47306P9905J66681J54912
33327b21730K14800K50356J19594l4382k8887L1004k6799j35064j61415j42873
33317a35396j23756k5832J17282R2174j19660k10269r033K35822K67370J89323
33307B78025J78183J51405O658j04090m3316K4108r0425k55855k40602p7486N0519
33296a22876J01058J08613K1415j57935k47471j33294K2468L3167k1381L2672
33286c63564J60323K02285J31172L1582o0462j36193j42448o6090J2840M3859
$$ plain form
33358 219456 314357 253580 94457 -89035 -313814 -449093 -266614 106936 217904 -37332
33348 -37332 -229492 -126528 -78083 -326943 -480469 -160098 281782 272079 -102802 -325765
33338 -325765 -294313 -319223 -451383 -433933 -268904 -261778 -475922 -623228 -543323 -376642 -221730
33327 -221730 -6930 243426 363020 328638 299751 330755 303956 168892 7477 -135396
33317 -135396 -259152 -284984 -167702 -75528 -195188 -405457 -414490 -178668 88702 278025
33307 278025 456208 607613 614271 510181 466865 490973 400548 144693 -95909 -173395 -122876
33296 -122876 -21818 86795 108210 -49725 -297196 -430490 -408022 -374855 -396236 -363564
33286 -363564 -203241 -956 130216 161798 101336 -34857 -177305 -243395 -230555 -186696
33276a86696O3096P3997K5448m8219m1294L7561P9816P4992P5399N375k02810
33265d3335l31323j14750K52304K89718l4186k29661o1881J24464N9444j4149
33255a03355J26738K16656j6912l08838k53390N4588K16713J33176j48r1128j59024
33244a84924j20535O4381J88792P8469q1245k1798J67691K03815O0708o9207j27887
33233A58260j83521j93239q1804N2745Q5926Q7082J36336J03323r7612k31159
33223a63663o7627J92947K04511L0199J341J37969J53960j3277j24227r3496r7656
33212A60981j76893j38658M1086J02905n8378j78028l9533J69209J51131m5401
33202a1579j17088M5032K19771J68379o7581k33959j64621M8552J85864J39412
$$ plain form
33276 -186696 -123600 -49603 -24155 -72374 -113668 -76107 3709 78701 154100 159475 -43335
33265 -43335 -374658 -489408 -237104 52614 18428 -211233 -273114 -148650 -89206 -103355
33255 -103355 23383 240039 223127 -85711 -339101 -284513 -67800 65376 65228 -25900 -184924
33244 -184924 -305459 -241078 -52286 26183 -55062 -76860 90831 294646 355354 286147 158260
33233 158260 -25261 -218500 -300304 -247559 -161633 -74551 61785 165108 67496 -163663
33223 -163663 -231290 -38343 166168 196367 197708 335677 489637 476360 352133 258637 160981
33212 160981 -15912 -154570 -113484 -10579 -68957 -246985 -286518 -117309 33822 -11579
33202 -11579 -128667 -83635 136136 304515 236934 2975 -161646 -113094 72770 212182
33192B12182k7642k01217k88721k14489r5J62333J02084o0406n8571Q7559P7105
33181b09878j48310k31133N1891L86389L61486O4068j05760l1599O4695N2162
33171B54011J5611q625r5508k12703k05426m0489J31834J80815J07359k6501j32554
33160c2176j04561N5971J71239R0845r4675j83284j28199l1877L8385P4492N2880
33149i0960j0673j3700Q6321J70346J27585J3174p7505j42354j63763o1569J00543
33138f2555R1604j17524k14450q495K34626K13682P3875R8785J71970M758k71958
33127B14318k56502M8558K16040O9310r7497o1739M607q6275k01341j35680N6012
33116b30189J62840R0345q2772j93537j05216J33961K63976J14018j27300j57513
$$ plain form
33192 212182 184540 -16677 -305398 -519887 -519982 -357649 -255565 -315971 -374542 -286983 -209878
33181 -209878 -358188 -589321 -537430 -151041 210445 274513 168753 137154 201849 254011
33171 254011 269622 260997 165489 -47214 -252640 -293129 -161295 19520 126879 100378 -32176
33160 -32176 -136737 -80766 90473 181318 86643 -96641 -224840 -256717 -218332 -143840 -90960
33149 -90960 -101633 -115333 -29012 141334 268919 282093 204588 62234 -101529 -163098 -62555
33138 -62555 29049 -88475 -302925 -311420 -76794 136888 210763 309548 481518 486276 214318
33127 214318 -42184 6374 222414 291724 194227 132488 137095 50820 -150521 -286201 -230189
33116 -230189 -67349 22996 -59776 -253313 -358529 -224568 39408 153426 26126 -131387
33106a31387n161M1372r8155k07502j53358m5980J3938O2493R9527N4053l2864
33095d03024l8312R155j7437o1947M5109K29727K25630K5988p2188L9779J10592
33084I3072j4898j26231l0728J10575O8775q5287j43507q9478l4723P334O7703
33073a77393P9515j1262j02416p3259L2288J02765J34041J70749J76113R7990
33063D29131j8316j02541j68062k43821k72422j78058J2883J88533K48184J58409
33053E3920j9661j48525j40415o1005j8960P424R8612J94579J55412J2691m3497
33042I0575M4452J19631O4658m5122r5688p4941j2389O4438Q0369k2304j50467
33031F3212j55454o0047o975k894N8162J31865O0974j04682j29518M436L4968
$$ plain form
33106 -131387 -136548 -95176 -193331 -400833 -554191 -600171 -586233 -523740 -424213 -370160 -403024
33095 -403024 -441336 -432181 -449618 -511565 -466456 -236729 -11099 14889 -57299 -17520 93072
33084 93072 78174 -48057 -78785 31790 100565 15278 -128229 -217707 -252430 -245096 -177393
33073 -177393 -97878 -109140 -211556 -284815 -252527 -149762 -15721 155028 331141 429131
33063 429131 410815 308274 140212 -103609 -376031 -554089 -541206 -352673 -104489 53920
33053 53920 34259 -114266 -254681 -315686 -334646 -327222 -228610 -34031 121381 134072 90575
33042 90575 135027 254658 319316 274194 178506 103565 91176 155614 235983 213679 63212
33031 63212 -92242 -152289 -159264 -162158 -103996 27869 88843 -15839 -145357 -140921 -105953
33020a05953j28861k18454m4281J77287J70513K8932K4368J55652J71915k3952
33010B07166k31591k19795K433K07121K01303N8342L7196K01711K58739k1724
33000G00901l68605l36228PJ18926j26308k59631M6577M23192L66368k2826k66390
32989B75983k14402r9172n4088K981P8464O3638k3144m5995M20m959o8625o4487
32977a53386M6872J60460J76596P3927j09955k45843j66941R2035K38895R2357
32967B05017j33365j38453Q013J3260j34618j51645M8727J84106L4199k15995
32957b80754k31761K2628K54452K11524l2874j84984q4422J07664J37335J8535
32947f2657n103J29337J73845k4616k28697j50813R4278J65427J2529r5473k1439
$$ plain form
33020 -105953 -234814 -453268 -497549 -320262 -149749 -120817 -96449 59203 231118 207166
33010 207166 -24425 -244220 -241787 -34666 166637 224979 262175 463886 722625 700901
33000 700901 332296 -3932 -3925 115001 -11307 -270938 -224361 198831 565199 542373 275983
32989 275983 61581 -37591 -91679 -88698 -10234 53404 30260 -15735 -15315 -20274 -88899 -153386
32977 -153386 -106514 53946 230542 304469 194514 -51329 -218270 -126235 112660 205017
32967 205017 71652 -66801 -58788 -45528 -180146 -331791 -283064 -98958 -64759 -280754
32957 -280754 -512515 -489887 -235435 -23911 -56785 -241769 -326191 -218527 -81192 -62657
32947 -62657 -67760 61577 235422 210806 -17891 -168704 -74426 91001 103530 8057 -13382
32936a3382P4921N7391J4750M9701R5748O3525l578l7217p0005j40181j79950
32925h8277j13745N774O2133L0305j4601j2961K5221O4695Q0863N1442k9606j03549
32913d2306o1957J21052K85636K17802o9845k93627k33053j5098P9278Q412l7151
32902d0857N439j8795j64485k37858r5633J16698J83724J13524N0198L2293J0978
32891d4774L372N4507J10074P2561n2705j65627j83223q9730N1044J04260P81
32880a39460j13613l0104J90517K53339O8124r8302l2755J23221J59770J23810
32870E04547J23651N5060j78313l63563k36760P3305J92193L4572j12699k9223
32860F2770J79301K73335J33237j70057m02675l26991R728K46620J43699r2487
$$ plain form
32936 -13382 61539 118930 133680 183381 279129 342654 339076 301859 231854 91673 -88277
32925 -88277 -202022 -196248 -134115 -103810 -118411 -131372 -106151 -41456 39407 90849 61243 -42306
32913 -42306 -104263 16789 302425 520227 450382 156755 -76298 -91396 -12118 -3706 -40857
32902 -40857 -35418 -54213 -218698 -456556 -552189 -435491 -251767 -138243 -88045 -55752 -44774
32891 -44774 -41402 13105 123179 195740 143035 -22592 -205815 -295545 -244501 -140241 -139460
32880 -139460 -253073 -283177 -92660 160679 228803 130501 97746 220967 380737 504547
32870 504547 628198 683258 504945 141382 -95378 -22073 170120 204692 91993 62770
32860 62770 242071 515406 648643 478586 75911 -251080 -241352 5268 148967 56480
32850E6480j32567r005J4643p7942o6094P7671J33813K8165n2038Q857Q8808O1832
32838A32623m2007j61129k65473k62008o0380K29566L69741K86055J03211q6996
32828B43203k67146l36831j84008P8038K02925J51730R2309P4270m826j11686
32818f2022q2226M9753N9220p6826j28684k8131K4791l0176J6351K09553K60532
32807B12135L6018j54312m7600J28524M2840j89190k26333o3770K9798J887L7540
32796a92463J52186J50849L166q4374k2206L6412k869k3078M6780O8383n8306
32785G4480j76127q6177J36208K31364J14003k9705j6527J01313J41345L9257
32775E29434r8235j53228j19556o6614o0637j32679k38860k36445j7293K84789
$$ plain form
32850 56480 -76087 -85092 -70449 -148391 -214485 -136814 -3001 25164 -26874 -18017 70791 132623
32838 132623 90616 -70513 -335986 -597994 -658374 -428808 -59067 226988 330199 243203
32828 243203 -23943 -360774 -544782 -466744 -263819 -112089 -19780 54490 49664 -62022
32818 -62022 -144248 -94495 -35275 -112101 -240785 -268916 -244125 -274301 -257950 -48397 212135
32807 212135 248153 93841 46241 174765 217605 28415 -197918 -261688 -231890 -230003 -192463
32796 -192463 -40277 110572 113738 29364 7158 43570 40701 17623 64403 132786 74480
32785 74480 -101647 -187824 -51616 179748 293751 264046 247519 348832 490177 529434
32775 529434 431199 277971 158415 91801 31164 -101515 -340375 -576820 -594113 -309324
32765c09324L61984J14275j73011j85217J5697J42877J29754J49710K36123J99875
32755F82743j6396j92644j66032o9966q0996j30500o1044P7556R7413l5667j57718
32744e3251j31630N580J10189P4740p2932j77608j13469N0083J21765M1483n6102
32733b01152o1235k9620l5441k5979O8025J81180J88516O9993q2973j69940j37232
32722b35858m016J19792J21181K6972l1473j6793k0029o1524k2709J35633K45223
32711B56399J54711l3478r8172q48Q2739k10k10462l69669l28419j07032J12554
32700e41887J82094J57503J82195K35909J67727j4961j03121n731R2653J6887
32690C69268j36006j70425q0466j181J2228n70j4262q68R7671K40607K39697K17
$$ plain form
32765 -309324 52660 166935 -6076 -191293 -175596 -32719 97035 246745 482868 682743
32755 682743 666347 473703 307671 237705 156709 26209 -34835 42721 140134 104467 -53251
32744 -53251 -184881 -179301 -69112 5628 -67304 -244912 -358381 -308298 -186533 -145050 -201152
32733 -201152 -262387 -292007 -327448 -353427 -285402 -104222 84294 154287 71314 -98626 -235858
32722 -235858 -239874 -120082 1099 28071 -3402 -20195 -40224 -101748 -124457 11176 256399
32711 256399 411110 377632 279460 278612 361351 361141 150679 -218990 -547409 -654441 -541887
32700 -541887 -359793 -202290 -20095 215814 383541 368580 265459 259728 352381 369268
32690 369268 233262 62837 -17629 -18810 -6582 -7152 -21414 -22282 75389 315996 555693 555910
32678E55910k80140l24485j25632P6885J15321L8026k2624J1119J21775J86577
32668C52732O6822j90663l33230k06820K9308J41452J42215J66106J56080l3590
32658B90412k82573k89071m2989J14254J0481r1973N9544K80855K51343M3904
32648C44187O331J92315K74029O3295k12025k87376k35408k49887k76140j35979
32638e16658J06682K07614J24066M2297K6133n4465j92624j69510N8833K10547
32628a57085J08467k7360L3349J24743j1699k43220k51320o8773M597o1662j1268
32617e61231J90590K65125J02576n6904l3845M8018M7969J3692j7580j10023k06278
32606c17891j30265P5182J50541P2609J16663L10538K72437j43388m79497l28545
$$ plain form
32678 555910 275770 -48715 -174347 -97462 17859 55885 33261 44380 166155 352732
32668 352732 419554 228891 -104339 -311159 -281851 -140399 1816 167922 324002 290412
32658 290412 7839 -281232 -324221 -209967 -199486 -291459 -231915 48940 300283 344187
32648 344187 350518 542833 816862 880157 668132 380756 145348 -104539 -380679 -516658
32638 -516658 -409976 -202362 -78296 -35999 -9866 -64331 -256955 -426465 -367632 -157085
32628 -157085 -48618 -75978 -42629 82114 70415 -172805 -424125 -492898 -488301 -549963 -561231
32617 -561231 -370641 -105516 -2940 -59844 -93689 -45671 2298 15990 -1590 -111613 -317891
32606 -317891 -448156 -372974 -222433 -149824 -33161 277377 549814 406426 -73071 -401616
32596d01616K3965O4133j40282j16270K02729L85586J98791q6045j56146n3765
32586g8920Q622m3459j37051j69303o8049J33839K76514K45951J31637Q3037P9111
32575D61929j24j39751k03002j37206j9326N9444M0682q7255k13318j62361N0207
32564c50081J76009Q5863k6222K5680R9029j4150j99275k00722m3353N2341O2722
32553c32159J27897K03521J03183j27370k14065o3718J15465J40668N4366l3020
32543b5232p7390n4078K9944P8635L4257J2995J23950K36879J62659j9784q2856
32532D19979k3415k5550j04397r9526l533J7201n7689n8519O7514J71669J51106
32521D54840M1588j24785l01317l06679k1561L19895L57017J14307m9266m609
$$ plain form
32596 -401616 -377651 -313518 -453800 -570070 -367341 18245 217036 130991 -25155 -78920
32586 -78920 -70298 -113757 -250808 -420111 -488160 -354321 -77807 168144 299781 382818 461929
32575 461929 461805 322054 119052 -18154 -37480 21964 62646 -24609 -237927 -400288 -350081
32564 -350081 -174072 -88209 -114431 -88751 10278 -3872 -203147 -403869 -447222 -394881 -332159
32553 -332159 -204262 -741 102442 -24928 -238993 -302711 -187246 -46578 7788 -25232
32543 -25232 -102622 -156700 -126756 -48121 -13864 -869 123081 359960 522619 502835 419979
32532 419979 396564 371014 266617 167091 163558 180759 123070 64551 132065 303734 454840
32521 454840 496428 371643 70326 -236353 -257914 61981 418998 533305 484039 479430
32511D79430P379j48220k68820j83810k4628K2752l3291j08064j63203j27399
32501e47874N5913K40651K03388K094q1657L291J7265j13325j48278L6543K26080
32490a05909K25633J19268K0610j09750k42735k06699q266R2429k78n3187O5248
32479b03636J47255N2625j7061Q2349J25717o9786k48412j07652J74878K01297
32469A37574m8049k49930k30278p7450J16863L03656L55175J95573j6912q7037
32459C99185o7714j13090j72033r6134N3417Q9284J6527q77N6594M7022o8602
32448A43579j65712j56189p8914m686K2428r496l9514J8369J13124Q2796p3680
32437a47895j41509k4121Q7023L0418p3481p7889p0070j42176j45029M9893K58840
$$ plain form
32511 479430 486809 338589 69769 -114041 -138669 -115917 -149208 -257272 -420475 -547874
32501 -547874 -491961 -251310 -47922 -45828 -127485 -124194 -106929 -220254 -368532 -331989 -105909
32490 -105909 119724 238992 259602 149852 -92883 -299582 -307848 -215419 -215697 -268884 -203636
32479 -203636 -56381 -3756 -20817 61532 187249 117463 -130949 -238601 -63723 137574
32469 137574 89525 -160405 -390683 -468133 -351270 -47614 307561 503134 486222 399185
32459 399185 331471 218381 46348 -49786 3631 92915 109442 108565 165159 212181 143579
32448 143579 -22133 -178322 -257236 -261922 -239494 -248990 -288504 -270135 -157011 -74215 -147895
32437 -147895 -289404 -313525 -226502 -196084 -269565 -347454 -417524 -559700 -704729 -654836 -395996
32426c95996K57280J48809J50093J92254P5292j37757k27422j81725j16817J1983
32416b24006K49555L49013P5048l08113l22639l655J49697l5596j76226o400K07606
32405d5716J50896m4188p5765M0747O6391n4443j53157j25638n4012m9714r7441
32394d42040q3137M5732J71917J32248l2137r2103K4917J01090p403r7627M1095
32383b37448K33712K00254M7669P1037J90197O1800k82138m11775j78585O4684
32373b40593N2652l7427J565O6312M4244O5391J90213J99714j3179j68834m0378
32362A19680J27508O765k49440k39382M7874K41515J66962K7879J3169O7271J01247
32351D31048J36778J54162M1550j90395l27590k11411L7590J59510M9925j56843
$$ plain form
32426 -395996 -138716 10093 160186 352440 427732 289975 62553 -119172 -235989 -224006
32416 -224006 25549 374562 449610 141497 -181142 -184797 -35100 -70696 -246922 -253322 -45716
32405 -45716 105180 60992 -14773 25974 92365 37922 -115235 -240873 -294885 -344599 -442040
32394 -442040 -525177 -479445 -307528 -175280 -207417 -299520 -274603 -173513 -180916 -278543 -237448
32383 -237448 -3736 196518 244187 315224 505421 567221 285083 -126692 -305277 -240593
32373 -240593 -187941 -225368 -223803 -157491 -113247 -47856 142357 342071 328892 160058 119680
32362 119680 247188 253953 4513 -234869 -186995 54520 221482 249361 262530 329801 431048
32351 431048 567826 721988 763538 573143 245553 34142 71732 231242 281167 124324
32341A24324k51955j47050O8989K32218K55298J70496M4323p9603j38358n5968
32331B22714J30637K34572J17764j18347k50100k09756j26337r5038m7162R0886
32321e0167K21605J76683m0336k21626j87864K0162K14187K55541J36708n6673
32311D68220j86112j32458N8483J56578J4614j91460j74152L9533J36299j19j21334
32300F8092m3078N7032k3561j47190r0189N0791L4208r7612j13117j0329J9744
32289b95209j5399O8285K33338K28235K9467r7417n2962m9780j86987k46181r0016
32278d74626P1620M1524k8647P3571K31462J89194k6609j60420j13317k3913p095
32267b27256k4602j2962J8248L2642J6918j9178m5217l2731O225M0685O4959O0479
$$ plain form
32341 124324 -127631 -274681 -205692 26526 281824 452320 496643 417040 278682 222714
32331 222714 353351 587923 705687 587340 337240 127484 1147 -93891 -141053 -50167
32321 -50167 171438 348121 307785 86159 -101705 -81543 132644 388185 524893 468220
32311 468220 282108 149650 208133 364711 379325 187865 13713 53246 189545 189426 68092
32300 68092 25014 82046 58485 -88705 -178894 -128103 -93895 -191507 -304624 -314953 -295209
32289 -295209 -310608 -242323 -8985 219250 248717 151300 98338 48558 -138429 -384610 -474626
32278 -474626 -403006 -361482 -390129 -316558 -85096 104098 77489 -82931 -196248 -220161 -227256
32267 -227256 -251858 -264820 -246572 -213930 -197012 -216190 -261407 -294138 -287913 -247228 -182269 -121790
32255a21790k7545j65746j75245K1905J95951J05105q6545l2003J97651J79997
32245I1735j24356k15165J41830M49359K08506k87508l90883o3436J53918J6512
32235a9488j41767l6681J58613J93582J34046J46457J61758J3644k27252k91901
32225I1011p2996J95649J80226j50597m27186k78423J79779M30266K07668j45373
32215B10024j61170J08743K27654L8869j65850j54475p2736j22657k15458j59445
32205d66501p092K4613r9851j80717p5761J10859J82169R6974m111J2150J22276
32194b84992K02143J82480R4005j4626j15663j52590o2403R6665J43868k52j66328
32183g7693j32303P7467K16479J28006q8745k41430k61947k08031j29715k2991
$$ plain form
32255 -121790 -149335 -315081 -490326 -468421 -272470 -167365 -253910 -285913 -88262 91735
32245 91735 -32621 -247786 -105956 343403 551909 264401 -126482 -189918 -36000 -19488
32235 -19488 -161255 -197936 -39323 154259 288305 434762 596520 610164 382912 91011
32225 91011 18015 213664 393890 243293 -183893 -462316 -282537 147729 355397 210024
32215 210024 48854 157597 385251 424120 258270 103795 31059 -91598 -307056 -466501
32205 -466501 -473593 -448980 -548831 -729548 -805309 -694450 -512281 -415307 -419418 -407268 -284992
32194 -284992 -82849 99631 193636 179010 63347 -89243 -151646 -54981 88887 88635 -77693
32183 -77693 -209996 -132529 83950 211956 123211 -118219 -380166 -588197 -717912 -740903
32173g40903R8135J64319J34814Q3829J20355K06146J55412j04579l63356l54196
32163f00024j01111J20255J48170Q3392O4924R5847J44646K22640K70694J53572
32153F03005j12857k90477k10020J272J09348N7362o5449j91987k62260j78907
32143e40970M3761J95834J17113o3055j02922K1010J35888J44641R3418L1998
32133G6716j3791J3584J13872J43637j786j81321j75190r886Q5530J6216q8206
32122b0625j03439l2826Q9457K20433K42846Q4328j00621q9730N8504O6966j08676
32111C06617j76766K3365K29734J43386j09235j71066J1361J42537M4476j10435
32101C33974j07374n806j637j12097j72234r0179N3566J53919J84685J36578m03
$$ plain form
32173 -740903 -642768 -478449 -343635 -259806 -139451 66695 222107 117528 -245828 -600024
32163 -600024 -701135 -580880 -432710 -349318 -284394 -188547 -43901 178739 449433 603005
32153 603005 490148 199671 -10349 -9077 100271 157633 92184 -99803 -362063 -540970
32143 -540970 -497209 -301375 -184262 -247317 -350239 -329229 -193341 -48700 44718 76716
32133 76716 62925 76509 190381 334018 332232 150911 -24279 -34165 51365 67581 -20625
32122 -20625 -124064 -156890 -67433 153000 395846 480174 379553 289823 348327 415293 306617
32111 306617 129851 153216 382950 526336 417101 246035 257396 399933 444409 333974
32101 333974 226600 220794 219157 107060 -65174 -155353 -101787 52132 236817 373395 372992
32090C72992j38538j25852K4506Q0833q9977k83356k28477M258J11270J8130m7536
32079c01747M0501J24799P5314J2258O8225J47974J01956k8155j08349j20846
32069A1930j17014q2339J797O2278L1360m7101j02575j25612j01263Q837J49269
32058c10433J93955J48903J44049J69379O7760j26146j44788O4497J74690j8536
32048C63330k46173j96053K160N0982k1439j3015L2192m3975j40493o6108O1914
32037b16678K917j42262q0525J44369K10018O0773l4333L7793J04943P5773M9985
32026B12773M0426n0354j61284j34302l7568o1063j20348K1188K55636K25778
32016A90882n5623j78548j0180J10576r531j16691k8010M3429n1975p3830J50294
$$ plain form
32090 372992 234454 108602 133108 213941 123964 -159392 -387869 -383611 -272341 -254211 -301747
32079 -301747 -261246 -136447 -61133 -48875 19350 167324 269280 241125 132776 11930
32069 11930 -105084 -187423 -185626 -123348 -91988 -139089 -241664 -367276 -468539 -459702 -310433
32058 -310433 -116478 32425 176474 345853 413613 287467 142679 207176 381866 363330
32048 363330 117157 -78896 -76736 -25754 -47193 -60208 -28016 -71991 -212484 -278592 -216678
32037 -216678 -213761 -356023 -436548 -292179 -82161 -21388 -55721 -17928 87015 162788 212773
32026 212773 253199 202845 41561 -92741 -130309 -191372 -311720 -290532 -34896 190882
32016 190882 135259 -43289 -53469 57107 47576 -69115 -97125 -53696 -105671 -179501 -29207
32005b9207L39060J93337j03516j85708m6982O2152N9916K6760m2799j69980k21916
31994a18883r3184P0193P3780k6421n4712j2242j5055n1247j9213P6996J51114
31983a8874J74703J56829Q0806k7074q0232p0024q1005j04290k3475J40105J89988
31972C37457N9042p9749j08949j22673j75306j50830k3474L4077l7912n5547N7535
31961b66329R6917m5448j51303n9551M0925k4220p2217R3072K77380J94317n5543
31950B8000j54208l5953J24082K14028J96105J5098k27308k40117K4466J74305
31940A18498n5180l28761k07965J56186K93074J45030K1535m292j15568k70309
31930b47752k32498m7458N202q2399n1709J25956K17603J82200J90889J99268
$$ plain form
32005 -29207 309853 503190 399674 213966 166984 229136 289052 315812 273013 103033 -118883
31994 -118883 -212067 -141874 -68094 -94515 -149227 -161469 -176524 -227771 -246984 -169988 -18874
31983 -18874 155829 312658 393464 366390 286158 216134 135129 30839 7364 147469 337457
31972 337457 396499 316750 207801 85128 -90178 -241008 -264482 -230405 -268317 -323864 -266329
31961 -266329 -169412 -214860 -366163 -425714 -384789 -409009 -481226 -388154 -110774 83543 28000
31950 28000 -126208 -162161 -38079 175949 372054 387152 159844 -80273 -55807 118498
31940 118498 63318 -265443 -473408 -317222 -24148 120882 142417 138125 22557 -247752
31930 -247752 -480250 -527708 -522506 -604905 -656614 -530658 -313055 -130855 60034 259302
31920B59302q155l15208l22645J3313K71837K07651L7280l3138r0498j68854r5990
31909b45105J07335J23390j27190k70833p1993J66076J03232j06282j39475m2057
31899e02902m9098j14298k3026J82354K63222J75180P8718L5773j5740m7008K7117
31888A0292J32629J03497m7077j37747r7214l5379k6194J936J16574K51123K75113
31877E47553J31400j04541k59793j96429K5652J60506L4413k29312l26362j19345
31867c36258J91519K82182P7047j40484n0885K81569M38663J69710k53784l66268
31857B93011r9321J70227J39470q4603k20227j77990p6978k2309M868P0289J66156
31846A62593J80029K0458k02649k26798L1918L03919K85446M7727p9747J2494
$$ plain form
31920 259302 251147 -64061 -386706 -373393 -101556 106095 143375 110237 19739 -149115 -245105
31909 -245105 -137770 -14380 -141570 -412403 -484396 -318320 -215088 -321370 -460845 -502902
31899 -502902 -552000 -666298 -689324 -506970 -243748 -68568 10150 45923 30183 -16825 10292
31888 10292 142921 246418 199341 61594 -35620 -70999 -97193 -95257 21317 272440 547553
31877 547553 678953 574412 314619 118190 143842 304348 338761 109449 -216913 -336258
31867 -336258 -144739 137443 214490 74006 23121 304690 743353 913063 659279 293011
31857 293011 193690 363917 503387 418784 198557 20567 -56411 -78720 -73852 -3563 162593
31846 162593 342622 363080 160431 -66367 -34449 269470 554916 602643 522896 535390
31836E35390R0054n1936l08681m28725l04808m2082J57335J53844J620r2872j5805
31825c06666J21804J81061J85279J73900N0798j96717l11571j03684J77646J64380
31815A36230n5983r5498P9948J17259r2519k27935q4488J26106J67537Q2178m0163
31804A12672k17546l48936k14599J19349K67008Q2970j07153l1085J53282K24247
31794D0209K46452K89375J84640j15223k90223j20777J08787M1135k01582k74921
31784i2128j65927r3228p0669K5290J21026O3585o0174o4557J2091L6831O3040
31773b24820J62524J76716j1163j63486m1637J32200J1258k57104k47288L2404
31763d30396J72831N5439k5547N4762P6832l2151k9508J71703K97339J56922p1338
$$ plain form
31836 535390 625444 573508 264827 -163898 -468706 -510788 -353453 -199609 -197989 -290861 -306666
31825 -306666 -184862 -3801 181478 355378 406176 209459 -102112 -205796 -28150 136230
31815 136230 80247 -15251 64697 181956 89437 -138498 -222986 -96880 70657 152835 112672
31804 112672 -104874 -453810 -668409 -549060 -282052 -199082 -306235 -337320 -184038 40209
31794 40209 286661 576036 760676 645453 355230 234453 343240 384375 182793 -92128
31784 -92128 -258055 -351283 -421952 -396662 -275636 -212051 -272225 -336782 -324691 -287860 -224820
31773 -224820 -62296 114420 103257 -60229 -101866 30334 41592 -215512 -462800 -430396
31763 -430396 -257565 -202126 -227673 -172911 -96079 -128230 -157738 13965 311304 468226 396888
31752C96888j67592j56624j18958k8033P9599O6543l9254k8034J24010J74384
31742C02929K7577r0667k4036P0408M7551K4069Q9605P7372j18660k72770j63966
31731c0588M6554P7366k8648m1367L1973M834r7812n7793J37979K35603J05774
31720C83875o3839o4123M5678O4692n8015j78123j53130m779J14997R7183j060
31709A83356l9283N272M575j10639k11764j49480q66Q333j72067l11673j86447
31698i80683J19195L01300K05457j692p5069j2201j0487j35087k00380n1211J88930
31687f51928K87988K18334J30728Q5074P849r8956j16973j9980O2711N8146N5216
31676A8209J10865J13908l0000k04647k24732r3745K0580K2499k7104l7705J0773
$$ plain form
31752 396888 229296 72672 -46286 -74319 5280 71823 32569 4535 128545 302929
31742 302929 330506 239839 215803 286211 333762 357831 447436 524808 406148 133378 -30588
31731 -30588 15966 93332 64684 23317 55290 60124 -37688 -95481 42498 278101 383875
31720 383875 320036 255913 301591 366283 308268 130145 -22985 -27764 87233 184416 183356
31709 183356 144073 149345 153920 43281 -168483 -317963 -318829 -310496 -482563 -794236 -980683
31698 -980683 -861488 -560188 -354731 -356423 -431492 -443693 -454180 -589267 -789647 -840858 -651928
31687 -651928 -363940 -145606 -14878 70196 78045 -20911 -137884 -157864 -95153 -37007 18209
31676 18209 129074 242982 212982 8335 -216397 -310142 -289562 -267063 -294167 -331872 -321099
31665c21099Q5177J26157P2180n7733j29075m5916P3964J6997k01951k90292o1394
31654g32985K59653K94283J9416j99332j13446R5730J34745L0026K4340J60465
31644b7105K34294J42767K2093j0972l1583j25346k13410j73101j0317J70078
31634b2602K57787J66432q1799k71344j83427Q1468J92170O1995l4137O8386J46652
31623C81581o674k00977j62760O813L0017p0793n8539P6014J26184N9710M0381
31612B20957Q2332K3373j42092k16750j26534j7971R404J6184L5826J2950l9922
31601a42243m0751n474j3785l2087J1538L2888p0448j57415k7814J91553K01478
31590e2560L8422K5352J98913K24772k3682k40109k00178r3554j28183j72656
$$ plain form
31665 -321099 -235922 -109765 -37585 -95318 -224393 -270309 -196345 -179348 -381299 -671591 -732985
31654 -732985 -473332 -179049 -159633 -358965 -472411 -376681 -241936 -211910 -187570 -27105
31644 -27105 207189 349956 372049 361077 329494 204148 -9262 -182363 -192680 -22602
31634 -22602 235185 401617 319818 48474 -134953 -53485 138685 200680 166543 234929 381581
31623 381581 374907 173930 11170 17983 48000 -22793 -81332 -5318 120866 180576 220957
31612 220957 303289 326662 184570 -32180 -158714 -176685 -167281 -151097 -115271 -102321 -142243
31601 -142243 -182994 -188468 -202253 -234340 -222802 -189914 -260362 -417777 -445591 -254038 -52560
31590 -52560 -14138 11214 210127 434899 411217 171108 -29070 -122624 -250807 -423463
31580d23463n0066J21749J53782J00245J01227J26499R6654O0241N9399K0824
31570C67091n8602m9017L7312j4826k27478k82591j4824K51373J60798j36496
31560C2740k43034r6110N4588Q7303Q1275O4290M858k6486L7619Q3701n460j05472
31548c0188l6867J16945J41135L0678o3156j17530j94421k14965o7377J34177
31538c01569J77806Q2001L8690R4809J39765J34230J05196O381j61862k09719
31528A05728k0784J67091P1433j60597j62670N2302J26376l7254j48156n8614
31518f5145J5192p5938j52792m7779J18916J78030J49292Q8847l1181j41590n1254
31507a5402K21535L54037J55146j35254j94153n4027L2921j2106q5813j52933
$$ plain form
31580 -423463 -473529 -351780 -197998 -97753 3474 129973 226627 286868 346267 367091
31570 367091 308489 259472 296784 281958 54480 -228111 -242935 8438 169236 32740
31560 32740 -210294 -306404 -251816 -164513 -83238 -18948 -14090 -40576 -2957 80744 75284 -30188
31548 -30188 -67055 49890 191025 221703 158547 41017 -153404 -368369 -435746 -301569
31538 -301569 -123763 -41762 -3072 91737 231502 365732 470928 477309 315447 105728
31528 105728 84944 252035 323468 162871 201 52503 178879 141625 -6531 -65145
31518 -65145 -49953 -125891 -278683 -326462 -207546 -29516 119776 208623 177442 35852 -15402
31507 -15402 206133 560170 715316 580062 385909 331882 364803 352697 266884 113951
31497A13951k44675k75583j06164K08502M16016L49196R9552j17539j91727j76545
31487G4984j57625j19462J741J47923J54214J0647m4775J37133L25234K03401
31477G33415j35522l01842j85972p4853j47686k19004j11182N7054J34691J79134
31467g1767K21645J00026k05696l58262j23276J89665J41046j48652j71431J67728
31457b58974L95706J92826j57321k32106n3578N2703l2972j37521j17942k1608
31447c70787N8347R3108O3164n0084j66727j28640R5468L05790K81277O2396r1076
31436A52236l5280Q7499P7585l8861q3935j4690L4904l814k4038O1033J50727
31425C63366Q6384j30722l36293l69333j94456P6183K43203J85604J2600m3391
$$ plain form
31497 113951 -130724 -406307 -512471 -303969 112047 461243 560795 443256 251529 74984
31487 74984 -82641 -202103 -200362 -52439 101775 112422 67647 204780 530014 733415
31477 733415 597893 296051 110079 35226 -112460 -331464 -442646 -385592 -250901 -71767
31467 -71767 149878 249904 44208 -314054 -437330 -247665 -106619 -255271 -426702 -258974
31457 -258974 136732 329558 172237 -59869 -113447 -60744 -93716 -231237 -349179 -370787
31447 -370787 -312440 -219332 -156168 -206252 -372979 -501619 -406151 -100361 180916 243312 152236
31436 152236 116956 204455 282040 243179 159244 144554 179458 175644 151606 212639 363366
31425 363366 449750 319028 -17265 -386598 -581054 -504871 -261668 -76064 -63464 -106855
31415a06855O7328J37490J5583j50403j27610N3708J55623Q2690k1647l1825q290
31404F5792n2877j37966j61565q7059L6584J35095J50264Q0597R578K8404J03965
31393A70812R9267l5416j71384j63709l8402O2450P7060O9071Q4960O5667n1525
31382A68851j96792k08765l0341J80474J98544L625j65537r7449J06953J60570
31372A20133j0198j65578j17730m329l1366j08517j3358J62575Q3902k58289m09515
31361g52270q3375L72464M38245J31672j01639p1825q640o5300q2916M4562J38681
31350d0341N3773o5926n5055r882p5113j51247o3687J25298K15610J68433Q5776
31339A87639m252j20157j77851r4375L2068O0021M5174J18473K04990J25087p0815
$$ plain form
31415 -106855 -39527 97963 113546 -36857 -164467 -110759 44864 127554 105907 74082 65792
31404 65792 12915 -125051 -286616 -373675 -337091 -201996 -51732 28865 38443 66847 170812
31393 170812 270079 234663 63279 -100430 -138832 -76382 678 69749 154709 220376 168851
31382 168851 -27941 -236706 -267047 -86573 111971 115596 -49941 -147390 -40437 120133
31372 120133 109935 -55643 -173373 -177702 -209068 -317585 -330943 -168368 -84466 -342755 -752270
31361 -752270 -835645 -463181 -24936 106736 5097 -66728 -75368 -140668 -223584 -179022 -40341
31350 -40341 13432 -52494 -107549 -117431 -192544 -343791 -407478 -282180 -66570 101863 187639
31339 187639 183387 63230 -114621 -208996 -176928 -116907 -71733 46740 251730 376817 306002
31328C06002j44533m2501M1592l76n5582l8708k6880o4525n7473L5538R7639M7586
31316I7779k6197k7911k018j5850k5389L6784J36975J84927J26735m1620k55551
31305A88664l61188k43956o388J18470O2144j3644K4413J19397J68292J59309
31295B15513R6943m5604k10520k40831q4168J08018J73296J22491O0165L6237
31285B31540M9496R0100J10744N5279l5188n0678K0630P3205N2137K32p3889k00291
31273C23317k96759k16162K163J34909R5219L6027N9426O5294j115n919J13062
31262C09462J82594P5253o7316q9982q0472j43393j40577O0591K64021J93011
31252E63192o0889j65048m9876L6999m5983j67519j98439j71745j19388O89J46158
$$ plain form
31328 306002 161469 118968 160560 160184 104602 65894 39014 -25511 -82984 -47446 50193 97779
31316 97779 71582 43671 41653 25803 414 37198 174173 359100 485835 444215 188664
31305 188664 -172524 -416480 -422868 -304398 -242254 -255898 -231485 -112088 56204 215513
31295 215513 312456 266852 56332 -184499 -268667 -160649 12647 135138 195303 231540
31285 231540 281036 371136 481880 537159 501971 451293 471923 545128 597265 597497 523608 323317
31273 323317 26558 -189604 -187441 -52532 42687 78714 138140 203434 202319 196400 309462
31262 309462 492056 567309 499993 410011 329539 186146 45569 106160 370181 563192
31252 563192 502303 337255 287379 324378 278395 110876 -87563 -259308 -378696 -378007 -231849
31241b31849J74952O3018m6515p1822q5403j15591n6090J15676K08010O2368j82454
31230a65700k43714o3002J33694J45727L1987k0636L5941Q4777N2681J2229L1169
31219C5153M3287k4216r2396n1997K6327k638p7423P684K32806L04689Q2434j84972
31207B98738k04621l0292P4671J2953r8001j40857q5460N3787J97852K19370R9866
31196C98006k1670n3892p3683j37840j47212m2027M9041K9615K0956J22889J79314
31185C23497L2347j60581j52004p463K9127l7538n681J06906O4377j51985k51793
31174b10791o3550K18407L16569J90251j0909j40003j32709l2430K8587k0179
31164A43243q3010o1063l0080q0477r2879P8602K85415K44694j4986j77432j12441
$$ plain form
31241 -231849 -56897 6121 -40394 -112216 -197619 -313210 -369300 -253624 -45614 16754 -165700
31230 -165700 -409414 -472416 -338722 -192995 -161008 -181644 -145703 -60926 -8245 3984 35153
31219 35153 78440 54224 -38172 -90169 -63842 -66480 -143903 -136219 96587 401276 483710 298738
31207 298738 94117 63825 138496 151449 53448 -87409 -172869 -119082 78770 298140 398006
31196 398006 376336 322444 248761 110921 -36291 -78318 -29277 338 21294 144183 323497
31185 323497 355844 195263 43259 35796 64923 27385 21704 128610 192987 41002 -210791
31174 -210791 -274341 -55934 260635 450886 439977 299974 167265 134835 163422 143243
31164 143243 60233 -830 -30910 -111387 -204266 -125664 159751 404445 389459 212027 99586
31153I9586j3873k6726m9932L626L7384k1155q1908p1943m5618l1238K2691P9684
31141i9422K2317r9332p3774J17388K02574J5802k38271k76421j04965O6286J20832
31130c46986R1132M1042K3188N7901P4533j7835j57514j72624l6173R1325J17868
31119b34143J25753J63633J42502K6483o9550o7879l3525j7176J4677K9447o6936
31108A3286j98464j43470J01794K45550J26660m3205l4364O2048N9024j464O609
31097A94004K3662n8733j48740j00685J2150J7082o5772q3888k1866J2051L665
31086b17070K8063P4616O4624Q250j6220j676P396K3473P4158J05182M9152n5445
31074A44503j14487r4615j8593P3901J00633j3477j91863k40801r9530Q4381J85513
$$ plain form
31153 99586 85713 58987 9055 12681 50065 28910 -52998 -124941 -170559 -201797 -179106 -99422
31141 -99422 -77105 -176437 -250211 -132823 69751 85553 -152718 -429139 -534104 -467818 -346986
31130 -346986 -255854 -214812 -191624 -133723 -59190 -77025 -234539 -407163 -443336 -352011 -234143
31119 -234143 -108390 55243 197745 224228 154678 86799 53274 36098 50775 80222 13286
31108 13286 -185178 -328648 -226854 18696 145356 102151 67787 129835 188859 187395 194004
31097 194004 217666 158933 10193 -90492 -78342 -61260 -127032 -210920 -232786 -220735 -217070
31086 -217070 -189007 -114391 -49767 -41517 -57737 -59413 -52017 -28544 45614 150796 199948 144503
31074 144503 30016 -64599 -83192 -9291 91342 77865 -113998 -354799 -454329 -369948 -184435
31063a84435K24589J99739L0847k10985k67829n4792J76716K13622J75122K23801
31053E26395K42142P0227j56749k13231j44916j21261r5535O1889K33802K02914
31043F05677K5696p1234p7356j46900k41315j75775J7466J13827O8055L8503N4906
31032B11550r957j32830j32675l169N4305k8436j00430q4260p0121p7255m965
31021c78243J29059J73908J12454P4075N5721p0395k36776k03800J9351J18312
31011b06334l9087j86864r1527J06476J72359J26952J07756J10403P9551O4896
31001B44581R1351M5827j27164k76734k54283j17942O418R5376J32869M9726r4705
30990b04680r0387R4195J93759N6071q2397J2683J59170P2690j11904m7249K13432
$$ plain form
31063 -184435 40154 239893 270740 59755 -208074 -262866 -86150 127472 302594 526395
31053 526395 768537 838764 682015 468784 323868 202607 107072 168961 402763 605677
31043 605677 631373 560139 482783 335883 94568 -81207 -63741 50086 118141 156644 211550
31032 211550 201593 68763 -63912 -67081 -12776 -41212 -141642 -225902 -296023 -373278 -378243
31021 -378243 -249184 -75276 37178 111253 166974 96579 -140197 -343997 -324646 -206334
31011 -206334 -245421 -432285 -523812 -417336 -244977 -118025 -10269 100134 179685 244581
31001 244581 335932 381759 254595 -22139 -276422 -394364 -387946 -292570 -159701 -109975 -204680
30990 -204680 -295067 -200872 -7113 48958 -33439 -20756 138414 211104 99200 51951 265383
30979B65383K60498j7849k61420k09378m6533r964o526J23797K43386J34532r0909
30968C85017j33207K1494R3475k8653j37129r1202n0009j54204k37101j04514
30958d36033Q9451O2634j06150p0950K04063L44384J49757q6118n1407J05228
30948B04859O8232j18473j76859q9308q0475j71515j38859O3779J96751J25376
30938a16492J1696R803M2287Q838k0592L4026J04147J08284P7920L8145n9822
30927B38240j75728j43481N8327J80459K8832k23139k45757O570K51379K43989
30917B19691M0400j12628o1656R8807J38069l6216k52517k88505j50916k0494
30907d25965K5444N7480R1584N9673l782K9223J41142J60539M7569m1161l6930
$$ plain form
30979 265383 525881 508032 246612 37234 -9299 -19263 -25789 98008 341394 475926 385017
30968 385017 251810 273304 366779 338126 200997 109795 59786 -94418 -331519 -436033
30958 -436033 -346582 -283948 -390098 -461048 -256985 87399 237156 151038 99631 204859
30948 204859 273091 154618 -22241 -111549 -192024 -363539 -502398 -438619 -241868 -116492
30938 -116492 -104796 -94993 -52706 -43868 -64460 -30434 73713 181997 259917 298062 238240
30927 238240 62512 -80969 -22642 157817 186649 -36490 -282247 -275677 -24298 219691
30917 219691 260091 147463 85807 184614 322683 286467 33950 -254555 -405471 -425965
30907 -425965 -400521 -343041 -251457 -191784 -195566 -166343 -25201 135338 182907 141746 104816
30896A04816o0442j53663j73888p1643m619l2488J9001K08703K86624Q7930j48541
30885F1790j36127K3983P1926L3627P9023J15286o9074l47797l60115o2194K01118
30874c88554K12980J27802J24208J36400O1419k5099j8949K5619k67q6982j38516
30863C0061r8089R245R4830O9919l5434o7925L1575R6357k5049k00211k00572
30852b95293o5167n148j1172J09524L08868K91023J9101j49669j0628J59398O9500
30841D20337j08048o1507J10888Q1993j21552j61030K1249R4572q9384k31230
30831d3712q4836J24835P3445j28057j23076J07861K29971R0504r0178j24192
30821C2565j16086j78627j90364m8693Q1447L0686n8468K7468J71581J10220p8212
$$ plain form
30896 104816 44374 -109289 -283177 -354820 -359439 -391927 -372926 -164223 122401 210331 61790
30885 61790 -74337 -50354 21572 55199 134222 249508 180434 -167363 -527478 -589672 -388554
30874 -388554 -175574 -47772 76436 212836 274255 249156 230207 255826 255559 168577 30061
30863 30061 -68028 -58783 36047 105966 70532 2607 34182 130539 105490 -94721 -295293
30852 -295293 -360460 -365608 -376780 -267256 41612 332635 351736 202067 191439 350837 420337
30841 420337 312289 250782 361670 443663 322111 161081 182330 276902 187518 -43712
30831 -43712 -128548 -3713 69732 -58325 -181401 -73540 156431 246935 156757 32565
30821 32565 -83521 -262148 -452512 -501205 -419758 -389072 -447540 -420072 -248491 -138271 -216483
30810b16483n9495J87873K96715R3750j27959r2570M5658J5169j25654j39301
$$ plain form
30810 -216483 -275978 -88105 208610 302360 174401 81831 127489 142658 17004 -122297
$$ [...]
##END NTUPLES=NMR SPECTRUM
##END=
