##TITLE=31Pdec_LY-TMF-14.70.3
 D2O, 24 sc
 6.3.2020
##JCAMPDX= 6.0         $$ Bruker NMR JCAMP-DX V2.0
##DATA TYPE= NMR SPECTRUM
##DATA CLASS= NTUPLES
##ORIGIN= UXNMR, Bruker Analytische Messtechnik GmbH
##OWNER= root
$$ XWIN-NMR		Version 3.5
$$ Fri Mar  6 19:01:48 2020 Russian Standard Time (UT+4h)  she@DPX200
##.OBSERVE FREQUENCY= 81.013821
##.OBSERVE NUCLEUS= ^31P
##.ACQUISITION MODE= SIMULTANEOUS
##.ACQUISITION SCHEME= undefined
##.AVERAGES= 24
##.DIGITISER RES= 17
##SPECTROMETER/DATA SYSTEM= spect
##.PULSE SEQUENCE= zgpg30
##.SOLVENT NAME= D2O
##.SHIFT REFERENCE= (INTERNAL, D2O, 0, 182.463)
##AUDIT TRAIL= $$ (NUMBER, WHEN, WHO, WHERE, WHAT)
$$ ##TITLE= Audit trail, XWIN-NMR		Version 3.5
$$ ##JCAMPDX= 5.01
$$ ##ORIGIN= Bruker BioSpin GmbH
$$ ##OWNER= she
$$ F:/spectra/data/she/nmr/P31/1/pdata/1/auditp.txt
$$ ##AUDIT TRAIL=  $$ (NUMBER, WHEN, WHO, WHERE, WHAT)
(   1,<2020-03-06 18:57:42.84 +0400>,<she>,<DPX200>,
      <created by zg, POWCHK disabled, PULCHK disabled
       configuration hash MD5:
       00 E9 B6 7A A2 85 ED C7 34 08 36 98 17 FE 4E 26
       data hash MD5: 32K
       FC E5 B7 E6 08 51 39 1A A6 19 47 24 19 DA 62 43>)
(   2,<2020-03-06 19:00:25.23 +0400>,<she>,<DPX200>,
      <Start of raw data processing
       efp BC_mod = 2 LB = 1 FT_mod = 6 PKNL = 1 PHC0 = -1361.055 PHC1 = 150.6017 SI = 64K 
       data hash MD5: 64K
       01 82 9E 35 89 5C 1B F6 FF 36 86 D7 FC 44 61 10>)
(   3,<2020-03-06 19:00:54.39 +0400>,<she>,<DPX200>,
      <pk PHC0 = 26.45935 PHC1 = -56.20001 
       data hash MD5: 64K
       1B 6B 4C 59 2F 27 6E 8B F3 EA 4C 8D 61 9A 9D AA>)
$$ ##END=
$$ 
$$ hash MD5
$$ F7 52 30 48 6F 12 7B 52 74 B6 16 A5 58 DB BC D8
##$RELAX= 
##$RELAX= 
##$RELAX= 
##$RELAX= 
##$RELAX= 
##$RELAX= 
##$RELAX= 
##$RELAX= 
$$ Bruker specific parameters
$$ --------------------------
##$DU= <F:/spectra>
##$EXPNO= 1
##$NAME= <P31>
##$PROCNO= 1
##$TYPE= <nmr>
##$USER= <she>
##$AMP= (0..31)
100 100 100 100 100 100 100 100 100 100 100 100 100 100 100 100 100 100 
100 100 100 100 100 100 100 100 100 100 100 100 100 100 
##$AQSEQ= 0
##$AQ_mod= 1
##$AUNM= <au_zg>
##$AUTOPOS= <>
##$BF1= 81.014009
##$BF2= 200.13
##$BF3= 200.13
##$BF4= 200.13
##$BF5= 200.13
##$BF6= 200.13
##$BF7= 200.13
##$BF8= 200.13
##$BYTORDA= 1
##$CFDGTYP= 0
##$CFRGTYP= 5
##$CHEMSTR= <none>
##$CNST= (0..31)
1 1 145 1 1 1 1 1 1 1 1 1 1 1 1 1 1 1 1 1 1 1 1 1 1 1 1 1 1 1 1 1 
##$CPDPRG= <waltz16>
##$CPDPRG1= <>
##$CPDPRG2= <waltz16>
##$CPDPRG3= <>
##$CPDPRG4= <mlev>
##$CPDPRG5= <mlev>
##$CPDPRG6= <mlev>
##$CPDPRG7= <mlev>
##$CPDPRG8= <mlev>
##$CPDPRGB= <>
##$CPDPRGT= <>
##$D= (0..31)
0 1 0 0 0 0 0 0 0 0 0 0.03 2e-05 3e-06 0 0 0 0 0 0 0 0 0 0 0 0 0 0 0 0 
0 0 
##$DATE= 1583506662
##$DBL= (0..7)
120 120 120 11 120 120 24 19 
##$DBP= (0..7)
150 150 150 150 150 150 150 150 
##$DBP07= 0
##$DBPNAM0= <>
##$DBPNAM1= <>
##$DBPNAM2= <>
##$DBPNAM3= <>
##$DBPNAM4= <>
##$DBPNAM5= <>
##$DBPNAM6= <>
##$DBPNAM7= <>
##$DBPOAL= (0..7)
0.5 0.5 0.5 0.5 0.5 0.5 0.5 0.5 
##$DBPOFFS= (0..7)
$$ [...]
##$SUBNAM2= <"">
##$SUBNAM3= <"">
##$SUBNAM4= <"">
##$SUBNAM5= <"">
##$SUBNAM6= <"">
##$SUBNAM7= <"">
##$SUBNAM8= <"">
##$SUBNAM9= <"">
##$SW= 369.568048894756
##$SWIBOX= (0..15)
0 1 3 0 0 0 0 0 0 0 0 0 0 0 0 0 
##$SW_h= 29940.119760479
##$TD= 32768
##$TD0= 1
##$TE= 0
##$TE2= 300
##$TE3= 300
##$TEG= 300
##$TL= (0..7)
0 120 53 12 22 120 120 120 
##$TP= (0..7)
150 150 150 150 150 150 150 150 
##$TP07= 0
##$TPNAME0= <>
##$TPNAME1= <>
##$TPNAME2= <>
##$TPNAME3= <>
##$TPNAME4= <>
##$TPNAME5= <>
##$TPNAME6= <>
##$TPNAME7= <>
##$TPOAL= (0..7)
0.5 0.5 0.5 0.5 0.5 0.5 0.5 0.5 
##$TPOFFS= (0..7)
0 0 0 0 0 0 0 0 
##$TUNHIN= 0
##$TUNHOUT= 0
##$TUNXOUT= 0
##$USERA1= <user>
##$USERA2= <user>
##$USERA3= <user>
##$USERA4= <user>
##$USERA5= <user>
##$V9= 5
##$VALIST= <valist>
##$VCLIST= <CCCCCCCCCCCCCCC>
##$VD= 0
##$VDLIST= <DDDDDDDDDDDDDDD>
##$VPLIST= <PPPPPPPPPPPPPPP>
##$VTLIST= <TTTTTTTTTTTTTTT>
##$WBST= 1024
##$WBSW= 4
##$XGAIN= (0..3)
0 0 0 0 
##$XL= 0
##$YL= 0
##$YMAX_a= 11690
##$YMIN_a= -5496
##$ZGOPTNS= <>
##$ZL1= 120
##$ZL2= 120
##$ZL3= 120
##$ZL4= 120
##$ABSF1= 0
##$ABSF2= 0
##$ABSG= 0
##$ABSL= 0
##$ALPHA= 0
##$AQORDER= 0
##$ASSFAC= 0
##$ASSFACI= 0
##$ASSFACX= 0
##$ASSWID= 0
##$AUNMP= <proc_1d>
##$AZFE= 0.1
##$AZFW= 0.5
##$BCFW= 0
##$BC_mod= 2
##$BYTORDP= 0
##$COROFFS= 0
##$CY= -3
##$DATMOD= 1
##$DC= 0
##$DFILT= <>
##$DTYPP= 0
##$F1P= 0
##$F2P= 0
##$FCOR= 1
##$FTSIZE= 65536
##$FT_mod= 6
##$GAMMA= 0
##$GB= 0
##$INTBC= 1
##$INTSCL= 5.30512e-09
##$ISEN= 30
##$LB= 1
##$LEV0= 0
##$LPBIN= 0
##$MAXI= 10000
##$MC2= 0
##$MEAN= 0
##$ME_mod= 0
##$MI= 50
##$NCOEF= 0
##$NC_proc= -6
##$NLEV= 6
##$NOISF1= 182.463
##$NOISF2= 159.3651
##$NSP= 0
##$NTH_PI= 0
##$NZP= 0
##$OFFSET= 182.463
##$PC= 4
##$PHC0= -1334.596
##$PHC1= 94.40169
##$PH_mod= 1
##$PKNL= yes
##$PPARMOD= 0
##$PSCAL= 0
##$PSIGN= 0
##$REVERSE= no
##$SF= 81.0140089999434
##$SI= 65536
##$SIGF1= 159.3651
##$SIGF2= -187.1042
##$SINO= 113.3802
##$SIOLD= 16384
##$SREGLST= <1H.CDCl3>
##$SSB= 0
##$STSI= 65536
##$STSR= 0
##$SW_p= 29940.119760479
##$SYMM= 0
##$S_DEV= 0
##$TDeff= 32768
##$TDoff= 0
##$TI= <>
##$TILT= no
##$TM1= 0
##$TM2= 0
##$TOPLEV= 0
##$USERP1= <user>
##$USERP2= <user>
##$USERP3= <user>
##$USERP4= <user>
##$USERP5= <user>
##$WDW= 1
##$XDIM= 65536
##$YMAX_p= 368582789
##$YMIN_p= -9734897
$$ End of Bruker specific parameters
$$ ---------------------------------
##NTUPLES= NMR SPECTRUM
##VAR_NAME=  FREQUENCY,     SPECTRUM/REAL,   SPECTRUM/IMAG
##SYMBOL=    X,             R,               I
##VAR_TYPE=  INDEPENDENT,   DEPENDENT,       DEPENDENT
##VAR_FORM=  AFFN,          ASDF,            ASDF
##VAR_DIM=   65536,         65536,           65536
##UNITS=     HZ,            ARBITRARY UNITS, ARBITRARY UNITS
##FACTOR=    0.456856943014862, 1,           1
##FIRST=     14782.0589164792, 0,            0
##LAST=      -15158.0608439998, 0,           0
##MIN=       -15158.0608439998, -9734897,    0
##MAX=       14782.0589164792, 368582789,    0
$$ Real data points
##PAGE= N=1
##DATA TABLE= (X++(R..R)), XYDATA
$$ [...]
36639D00349L95283K173161L79685k128249j307055J401353J699704m47738j280915
36630A285578J92435J047976p1009r22222n5767P83858J43669o34240j75576M74639
36620B069341N5980n92181l29063J16678l53314j114563r66830r2949O14672R98364
36610D06135J118939N22549p20295j408105q03745K82818R46669J363894J561587
36601C270446O61736j346252k663560k013806m84617M34612J073203K095753K424307
36592C451822Q88468j255598j849646j044781o22122p66693q2752J397488J826298
36583A942484N31240q44971q83843k53999k32786q36613j307403j378409j213962
36574d478262q02365r0998O62443J062068R13795M00930J19244O14060J552724
$$ y = [400349, 795632, 2968793, 3348478, 1220229, -86826, 1314527, 3014231, 2566493, 1285578, 1478013, 2525989, 2454980, 1532758, 1476991, 2260849, 2404518, 1770278, 1594702, 2069341, 2125321, 1533140, 1204077, 1320755, 967441, -147122, -1113952, -1206901, -592229, 406135, 1525074, 2047623, 1327328, -80777, -884522, -601704, 344965, 1708859, 3270446, 3932182, 2585930, -77630, -2091436, -2576053, -2141441, -1068238, 1027515, 3451822, 4340290, 3084692, 1235046, 190265, -431857, -1198550, -1281302, 116186, 1942484, 2473724, 1628753, 744910, 490911, 258125, -578488, -1885891, -3264300, -4478262, -5280627, -5371625, -4709182, -3647114, -2733319, -2332389, -2213145, -1599085, -46361]
36565d6361J870120J173032K94181j18860o04455j577505k079695j177495K46375
36556b020663O54292J54358r121L04557K60028J6511M77364J144624M70482j290892
36546A61540j835613k42831J426284J203938O4451L5905Q77993P22800o44881
36537A769586j318387k50898J124239J076122R8863k5140Q87424R86056q37657
36528C510208l027273l244886j405702N28715J405959J836658K192937J649490
36520C446106Q7425r10817m12586J09100p94773j762738o56811J538339J713425
36511B356670n82348k286720j429391J28380m6181j224575j064293N79728J645704
36502a923026J083400L8880k40611j6707n9702k67776j32812J03624k48472r95021
$$ y = [-46361, 1823759, 2996791, 3290972, 3172112, 2567657, 990152, -1089543, -2267038, -2020663, -1366371, -1212013, -1221134, -916577, -656549, -640038, -162674, 981950, 1452432, 161540, -1674073, -1916904, -490620, 713318, 777769, 813674, 1691667, 2414467, 1769586, 451199, 200301, 1324540, 2400662, 2499525, 2474385, 3361809, 4347865, 3510208, 482935, -2761951, -4167653, -3638938, -2232979, -396321, 1796616, 3446106, 3533531, 2622714, 2210128, 2319228, 1524455, -238283, -895094, 643245, 2356670, 1774322, -512398, -1941789, -1813409, -1859590, -3084165, -4148458, -3568730, -1923026, -839626, -800746, -1041357, -1058064, -1117766, -1385542, -1518354, -1414730, -1663202, -2658223]
36492b658223r73201K84612J494915J054403p44876j879700j043378R72473K528931
36483i64044K791200J804379M5309j462628j619656o13398J10605o3203j3171
36474A5393J048993J929900J188756o18602j860546j946991j111130O48024K646004
36465A939801K874565N25253j936383j708947K55455Q55498k75558p48645O9997
36456A851036J68586j090056j662621n77721L24806j81747o16994J90676Q73468
36447g20567K75233k47526M71834Q79781n09917j928047r43269J291686J554828
36438A24036m85130j851896p09519J346331J879436O48805n68559k06814J361177
36429A537867K054921M70657j921650k250742k54702J099286l9184j651771j160485
$$ y = [-2658223, -3631424, -3346812, -1851897, -797494, -1542370, -3422070, -4465448, -3492975, -964044, 1827156, 3631535, 3676844, 2214216, 594560, -18838, 91767, 28564, 15393, 1064386, 2994286, 4183042, 3564440, 1703894, -243097, -1354227, -706203, 1939801, 4814366, 5339619, 3403236, 1694289, 1949744, 2805242, 2529684, 1781039, 1851036, 2019622, 929566, -733055, -1310776, -985970, -1167717, -1784711, -1594035, -720567, -445334, -692860, -221026, 658755, 148838, -1779209, -2722478, -1430792, 124036, -361094, -2212990, -2922509, -1576178, 303258, 952063, 383504, 176690, 1537867, 3592788, 4063445, 2141795, -108947, -363649, 735637, 696453, -955318, -2115803]
36420b115803N97440J066087K9027o76233l92934J7662K61595N60821K84108r09371
36410a277601j398450K41094K198538J564906j048177k310128j327654m18460
36402c775932n61923K7943J842158K421341M84385j625148j694637q77897q93167
36393d652877q14131N80248J712105O81465j018243o71050J100757J488169L60276
36384a233281K12430J416793J400281o94960k135328r36001R40492Q24494n59550
36375g64630o53691Q70852K082702J889179R16898j36245r72826r14934L32445
36366B649750J356813N18538j284178j492993K26671J296267J24480j623919j876197
36357a04768j095002o82645l83042N49303J125525J16723j241343p50434J079591
$$ y = [-2115803, -1518363, -452276, -423249, -1099482, -1492416, -1474754, -1213159, -652338, -368230, -1277601, -2676051, -2434957, -236419, 1328487, 280310, -2029818, -3357472, -3775932, -4337855, -4309912, -2467754, -46413, 437972, -1187176, -2881813, -3759710, -4652877, -5467008, -4886760, -3174655, -2493190, -3511433, -4182483, -3081726, -1593557, -1233281, -1020851, 395942, 1796223, 1101263, -1034065, -1970066, -1029574, -205080, -764630, -1418321, -547469, 1535233, 3424412, 4341310, 4205065, 3232239, 2317305, 2649750, 4006563, 4525101, 3240923, 1747930, 1974601, 3270868, 3395348, 1771429, -104768, -1199770, -1882415, -2265457, -1716154, -590629, -473906, -1715249, -2465683, -1386092]
36348a386092J645084M14162l84979L81534J043896K05975j031937j254612r42686
36339a309655r88159q88366n4116O77239M86712J53422N91752J099386O87071
36330D55286n4737r8805J21829l05837q89727n92885K68949O75511O16311N46364
36320G42259J23760p51725p74656P66602J890352L85539k331144k693438j68281
36311b810732J959184J401711k90867o77865J58688N72791N2909n40565n24252
36302f98998p3687J89292j98764r45156j052168r3498R27953R14940L13091J90382
36292e26613L57424K3903l05584L90183J378970R61555n68190j137941k45730
36283C27977L38789l60996j186443j173053q23883l41454R17317K298705J777316
$$ y = [-1386092, 258992, 673154, 288175, 669709, 1713605, 1919580, 887643, -366969, -1309655, -2297814, -3186180, -3240296, -2563057, -2076345, -1922923, -1331171, -231785, 455286, 400549, 301744, 423573, 117736, -771991, -1364876, -1095927, -420416, 195895, 742259, 866019, 114294, -660362, 106240, 1996592, 2382131, 50987, -2642451, -2810732, -851548, 550163, 259296, -418569, -259881, 312910, 365819, -174746, -698998, -772685, -583393, -782157, -1727313, -2779481, -2872979, -1945026, -1030086, -716995, -526613, -169189, -145286, -450870, -60687, 1318283, 2279838, 1711648, 573707, 327977, 666766, 305770, -880673, -2053726, -2877609, -3219063, -2301746, -3041, 1774275]
36274A774275o78888k195480j046525P59504P87727k17242k26799N91212P93283
36265C41067M94675O98459R37419J14369j090493j024824K29757J051564P52307
36256B504300p497p72519j449127j444511m59977L96696R1651l84593M74505J862953
36246H11881J631505k28759j470556j023460k29487k83668o06547m16853m2665
36237a858609J13685L41927O37658L73404l94135o62152j62348Q4191l95656n61802
36227b483837L00688J080233M66935q17922q72978O16051J759515Q79021j252426
36218c24720k163915n78696J943149K725242J146488p84953j235927p16368o21583
36209f11283q77360n68238k209j91178p17813k48144R10652J040703P6947k1288
$$ y = [1774275, 1095387, -1100093, -2146618, -1387114, -599387, -816629, -1043428, -452216, 341067, 835742, 1534201, 2471620, 2585989, 1495496, 470672, 700429, 1751993, 2504300, 2496803, 1724284, 275157, -1169354, -1629331, -1232635, -1140984, -1525577, -1051072, 811881, 2443386, 2214627, 744071, -279389, -508876, -792544, -1399091, -1815944, -1858609, -1744924, -1402997, -765339, -391935, -786070, -1448222, -1610570, -1526379, -1922035, -2483837, -2183149, -1102916, -635981, -1453903, -2326881, -1710830, 48685, 927706, -324720, -2488635, -3067331, -1124182, 1601060, 2747548, 1962595, 726668, 10300, -611283, -1488643, -2056881, -2059090, -2250268, -2968081, -3216225, -2305573, -1264870, -1187923, -1209211]
36199a209211J236004J549717m58565k488461j726721Q70937K015554Q28869m98037
36190A20086m27049J76016K72841K23029L36226j07794j261165j767102p37721
36181c172633O11227P21363M2738L9048O30236M80347m68344p13879K67072J001180
36171e61645L13850q33837q99426n0287L73091k0332l76221n8390P32558J575687
36161A95048K038196J506404r9524j585416j584881l65008N72765O27296N44602
36152A849482O81252L65456n33814q97763q3195Q52401O63901l01709q92640r23300
36142G80071j001171j113378n91579N96830J432012R32616o60415j870807j308387
36133b804208O59157J915177J060578n81118p59858K80905K26243j329243j890331
$$ y = [-1209211, 26793, 1576510, 1117945, -1370516, -3097237, -2226300, -210746, 618123, 120086, -306963, -130947, 141894, 364923, 701149, 593355, -667810, -2434912, -3172633, -2561406, -1840043, -1797305, -1758257, -1128021, -647674, -1116018, -1829897, -1562825, -561645, -247795, -1081632, -1981058, -2031345, -1658254, -1678586, -2054807, -2113197, -1380639, 195048, 2233244, 3739648, 3640124, 2054708, 469827, 104819, 677584, 1304880, 1849482, 2530734, 2896190, 2362376, 1464613, 1381418, 2233819, 2897720, 2596011, 1703371, 780071, -221100, -1334478, -1926057, -1329227, 102785, 1035401, 374986, -1495821, -2804208, -2145051, -229874, 830704, 249586, -510272, -229367, -3124, -1332367, -3222698]
36124c222698q8827J841894J439626l31842j110581r64352j404419j932826p54482
36115f528507J646771K754702J846167P61156N98796L38433o66035j326365q78093
36106a452975k20742k50983o06319q54727j237535j498677p09937R13094J694889
36097d223912Q98548j23321p5719N16791O65103N48489O75596O68880K1640q56908
36087a284813j204686p38171M42994J740988J810597Q635j821393j095522J605365
36078e36006K811149J091941j016964j261574q59013j435153j699631q1585J661105
36069a325731R28516j189947j462358L32410J363687M59408o19658o85005n86174
36060b784852o95513k1396J331214J598541L10843o54355p1982Q87238J074262
$$ y = [-3222698, -3311525, -1469631, -30005, -361847, -1472428, -2436780, -3841199, -5774025, -6528507, -4881736, -2127034, -280867, 480289, 1079085, 1417518, 751483, -574882, -1452975, -1673717, -1924700, -2531019, -3385746, -4623281, -6121958, -6831895, -5918801, -4223912, -3325364, -3448685, -3524404, -3007613, -2342510, -1794021, -1118425, -449545, -427905, -1284813, -2489499, -3227670, -2784676, -1043688, 766909, 775544, -1045849, -2141371, -536006, 2275143, 3367084, 2350120, 1088546, 229533, -1205620, -2905251, -2986836, -1325731, -397215, -1587162, -3049520, -2717110, -1353423, -894015, -1513673, -2198678, -2784852, -3480365, -3501761, -2170547, -572006, -261163, -915518, -987500, -100262, 974000]
36051I74000J203536J810695J555098n25451k739782k774975r00325O89121Q83667
36042A75584L44326j21948k57833J10317Q03407R00582j33600j286086j155408
36033f20659L5442P52578K52914p21009j176173p82190K81602J389226J522722
36024I34453K91577j152101j215996Q0510J098434O94710n90842j604379j868078
36015c331712j474258n64727N45177J282902J337801R42831M38680j4325j76395
36006a014026J88320O91537M57049o37460j442082r24246L39780Q62945K57444
35997a220739l32358N1414Q69857J019375M87231K53397O68022Q02372j98305
35988B400266j720675k320399j530613l09497L73757O46164J029779J285007P42599
$$ y = [974000, 2177536, 3988231, 5543329, 5017878, 2278096, -496879, -1397204, -708083, 175584, 519910, 397962, 140129, 250446, 1053853, 1954435, 1820835, 534749, -620659, -585217, 167361, 420275, -300734, -1476907, -2259097, -1977495, -588269, 934453, 1226030, 73929, -1142067, -1061557, 36877, 731587, 140745, -1463634, -3331712, -4805970, -5370697, -4825520, -3542618, -2204817, -1261986, -823306, -837631, -1014026, -825706, -134169, 322880, -314580, -1756662, -2680908, -2341128, -1478183, -1220739, -1553097, -1501683, -631826, 387549, 874780, 1128177, 1796199, 2598571, 2400266, 679591, -1640808, -3171421, -3480918, -3107161, -2460997, -1431218, -146211, 596388]
35979E96388m24971j113242o79026K07319N06318J59976p1264Q6112J4340o43611
35969a361661j066750k52456J214452J375571n69433k700231k423894J60077K239641
35960c384684J895428L43681k41865J88081J72653m70681n42875Q792k95136j681345
35950d007951k026237J10049K923990L544749J726073l76477j311738j302982
35942g20524o67695N18425J204632Q7905j934769k172376Q2385K156166J664604
35933B18753k31591r59289l78574k63078q92432p14454P07232J784852J442663
35924G14082N72468J63633k61536j199125j619636m46312J285856J458942j47142
35915E21230j446971r04965N08984R53300L52755K14318J081860J517797K15464
$$ y = [596388, 171417, -941825, -1620851, -1413532, -907214, -747238, -818502, -732390, -718050, -1361661, -2428411, -2680867, -1466415, -90844, -660277, -3360508, -5784402, -5624325, -3384684, -1489256, -1145575, -1387440, -1199359, -1026706, -1497387, -2040262, -2031470, -2326606, -4007951, -6034188, -5924139, -3000149, 544600, 2270673, 1894196, 582458, -720524, -1388219, -869794, 334838, 422743, -1512026, -3684402, -3602017, -1445851, 218753, -12838, -972127, -1350701, -1613779, -2506211, -3220665, -2513433, -728581, 714082, 1286550, 1450183, 1188647, -10478, -1630114, -2076426, -790570, 668372, 521230, -925741, -1830706, -1321722, -368422, -15667, 198651, 1280511, 2798308, 3013772]
35906C013772j802832k238946n36621J334338J404059N141j061132q49387Q5264
35897f46344Q13189Q33968L0123j222679j930045j301222J82060J153229R01491
35888a186230j6540o98725q16528n33238r4601K64219L38562N4361m95845r36068
35878d120633n45373J017818K638685K374543k500k023385j381477R08969J825972
35869F92619M43351j135599j026949J71977R53318J005031P82039L34458l05049
35860A915196n25395P987N81961L79020m04928j067921j364473j317203p86471
35851b582227Q0320O54228P35979R23186J395049J215898j99212j692922j630675
35842a100376j49289R97199O97424m01074j074537r72089n76963k19633L69886
$$ y = [3013772, 1210940, -1028006, -1564627, -230289, 1173770, 1178911, 117779, -731608, -646344, 166845, 1000813, 1030936, -191743, -2121788, -3423010, -3240950, -2087721, -1186230, -1202770, -1901495, -2718023, -3251261, -3345862, -3081643, -2743081, -2688720, -3184565, -4120633, -4666006, -3648188, -1009503, 1365040, 1362540, -660845, -2042322, -1133353, 692619, 1135970, 371, -1026578, -854601, 98717, 1103748, 1885787, 2220245, 1915196, 1389801, 1397788, 1979749, 2358769, 1953841, 885920, -478553, -1795756, -2582227, -2501907, -1847679, -1111700, -188514, 1206535, 2422433, 2223221, 530299, -1100376, -1249665, -252466, 444958, 43884, -1030653, -2002742, -2579705, -2799338, -2429452]
35833b429452J372804K004070J082176j067963k174550o98858J645076J784767
35825A518070m65217k123576j344484K73229O19663O6895j6816K23854Q1124J57382
35815a009876J082317J604808L48191j441461j417559J61401Q56307k5325o39942
35806d81139n1381K30211q64775j832358q75548J223131K125485J004044p66656
35797b88986j584203j210760m33447J38894O12444J221530J548831R52862j42844
35788H14321l73222N58039J079463K6542j348704j182873L5568K51888q51462
35779i90440j471479o16622O59262J273534J384495J141441J47676j034919p59948
35770b67000J161607K427413J162763j371581k458877j399519J62737P85064O25608
$$ y = [-2429452, -1056648, 947422, 2029598, 961635, -1212915, -1911773, -266697, 1518070, 1052853, -1070723, -2415207, -2141978, -1522315, -1455420, -1472236, -1248382, -1167258, -1009876, 72441, 1677249, 2025440, 583979, -833580, -672179, 184128, 158803, -481139, -532520, -302309, -1167084, -2999442, -3874990, -2651859, -526374, 477670, -288986, -1873189, -3083949, -3517396, -3378502, -2766058, -1544528, 4303, 957165, 814321, 441099, 999138, 2078601, 2105143, 756439, -426434, -390866, -138978, -990440, -2461919, -3078541, -2419279, -1145745, 238750, 1380191, 1527867, 492948, -267000, 894607, 3322020, 4484783, 3113202, 654325, -745194, -582457, 202607, 828215]
35761H28215M35274L70394J23761l60241o33988k05147P16269J167380N44063
35752B985980m77279p63468k33132K66048L33790K42118q792o00944r33613j79556
35742F31152J081984J320821M00493k01427M8459j41684j341795j907760n02739
35733f12496J441732J589391K501j241589j118359n65368n40849p76660o53616
35724b475313j46284M12657P74378Q02300N25535J53800k47910q07668j269586
35715b278091r19469L62554J494539J351061J89867p46816p80754k94862J12404
35706a509567K93583L59965L26076J13604k70535o63243q97565j020098j122969
35697d390749q94725J22726J504622J939709R75111n2745R9348O20923R2554q50916
$$ y = [828215, 1263489, 1633883, 1757644, 1397403, 763415, 558268, 1274537, 2441917, 2985980, 2508701, 1745233, 1512101, 1778149, 2111939, 2354057, 2345265, 1744321, 810708, 631152, 1713136, 3033957, 3434450, 3233023, 3281482, 3139798, 1798003, -109757, -612496, 829236, 2418627, 2421128, 1179539, 61180, -504188, -1045037, -1821697, -2475313, -2621597, -2208940, -1434562, -632262, -106727, 47073, -200837, -1008505, -2278091, -3197560, -2835006, -1340467, 10594, 200461, -546355, -1327109, -1621971, -1509567, -1215984, -856019, -529943, -416339, -686874, -1350117, -2247682, -3267780, -4390749, -5285474, -5162748, -3658126, -1718417, -743306, -796051, -696703, -75780, 16774, -834142]
35687h34142l66079J358473K020663O61942r98689j311692p27633k81863L541
35678d75479K45216J1526n12182l47207M28554M43162n08223p57816M73221J697547
35668F98319J674040J095226N56770o67046k311433k322820l57300P21333p15073
35659a627984j963088l57222K038152J845169Q0340P8265J517553J351340l71529
35650B590996o94891N51647L89311j550495j971707K03987J713446N51221p45438
35641A038077J67005J378866L62909j595084j828578o22131Q5921L10983J142853
35632D40821J790447O95829j292034j764839l76989Q33570N83423k59022m04385
35623B46821L78490J522251K151632J490809j68614j275369p99626K80055L10225
$$ y = [-834142, -1200221, 158252, 2178915, 2840857, 1842168, 530476, -197157, -479020, -475479, -230263, -218737, -730919, -1078126, -649572, -206410, -714633, -1472449, -999228, 698319, 2372359, 3467585, 4024355, 3357309, 1045876, -1276944, -1634244, -912911, -1627984, -3591072, -3948294, -1910142, -64973, 15367, 93632, 1611185, 2962525, 2590996, 1896105, 2447752, 2837063, 1286568, -685139, -481152, 1232294, 1783515, 1038077, 1205082, 2583948, 2946857, 1351773, -476805, -1098936, -1013015, -702032, 440821, 2231268, 2927097, 1635063, -129776, -506765, 326805, 910228, 651206, 246821, 625311, 2147562, 4299194, 5790003, 5621389, 4346020, 3546394, 3826449, 4136674]
35614D136674p23381j341218p14545L61526N77606m22645j611370j492367J26688
35605a103032J477740R28345n08340l56173J576679K681265J361149p97085j689541
35596C571007j411404r76245m12791K15196j01171j307002j321129P49433K377176
35587A383070J179474j091433j196405M28191P05227p89501j436521l43058L61739
35578g99217l73284p03114N92768J835471J277842k45190j045137q79655j78426
35569e17942R76296J783110P99201j414207j959974K34070K146740R17549j635607
35560A329236j734559N36155J567277j19991k051244k049610j122865r14703r22549
35551e482853m8565R56028O58220m87519o58865O52314K034051K143601J094423
$$ y = [4136674, 3413293, 2072075, 1357530, 1719056, 2296662, 1874017, 262647, -1229720, -1103032, 374708, 1303053, 794713, 438540, 2015219, 4696484, 6057633, 5260548, 3571007, 2159603, 1183358, 770567, 985763, 884592, -422410, -1743539, -994106, 1383070, 2562544, 1471111, 274706, 702897, 1408124, 618623, -817898, -1160956, -799217, -1172501, -1875615, -1282847, 552624, 1830466, 1585276, 540139, -339516, -517942, 458354, 2241464, 3040665, 1626458, -333516, -99446, 2047294, 2964843, 1329236, -405323, 130832, 1698109, 1578118, -473126, -2522736, -3645601, -4560304, -5482853, -5531418, -4575390, -3917170, -4404689, -5063554, -4411240, -2377189, -233588, 860835]
35542H60835j62131q40601o15287K52454R38827Q67738N40389Q81068J741031
35533D464323J879896O63776j009839j890172j806533j422144j130582q27741
35525a079016m10177J14492P73490J351842J238169J82399r45814q78284M48026
35516G95127J580372J149348n18627j716703j277979N9100N27075l91709j198781
35507i92777n17288O71106L17263j369637j836297k9170J745625J205127n43425
35498a349473j045473l22712n4916j42241P21329J627372K99157k343844k373463
35489d984264J061573L559243J669488j934614k545199j70960J422080Q00974
35481a121679O4677N12667R03299M43085K96268J133745J695626R39202l36763
$$ y = [860835, 698704, -141897, -757184, -504730, 434097, 1301835, 1842224, 2723292, 4464323, 6344219, 7007995, 5998156, 4107984, 2301451, 879307, -251275, -1079016, -1489193, -1374701, -601211, 750631, 1988800, 2171199, 1225385, 347101, 795127, 2375499, 3524847, 3006220, 1289517, 11538, 70638, 597713, 206004, -992777, -1510065, -838959, -521696, -1891333, -3727630, -3756800, -2011175, -806048, -1349473, -2394946, -2717658, -2772574, -2914815, -2193486, -566114, -266957, -2610801, -4984264, -3922691, -363448, 1306040, -628574, -3173773, -3344733, -1922653, -1121679, -1057002, -544335, 358964, 802049, 1098317, 2232062, 3927688, 4866890, 4530127]
35472D530127j064569j426482j787443j605358n03510P35688J228542J083873
35464A190868O79985j16488j189070j627372r03502J72147N61602L98171M16416
35455d17243O15059M64405L7797n7170K41504K83246k85923r61010j034453m50381
35445a564169K11116M18178J46147l04959p00865r02974p29461j98830J88578
35436c437239j9048m20269k19688M40799O07347K23501M12577J424197J809807
35427H21984P89922j18132M39989J031996l18716k328136j936679O74745J875326
35418I32299L496k222322k062552n56129O4298J60308J154981K090783R39106
35409E04268j518911k292843o23575J029269R29012L58707Q76605J544534O99831
$$ y = [4530127, 3465558, 2039076, 251633, -1353725, -1857235, -1121547, 106995, 1190868, 1870853, 1754365, 565295, -1062077, -1965579, -1793432, -1231830, -833659, -417243, 197816, 662221, 700018, 642848, 884352, 1167598, 881675, -79335, -1113788, -1564169, -1353053, -934875, -788728, -1093687, -1794552, -2697526, -3426987, -3625817, -3437239, -3456287, -3876556, -4096244, -3655445, -3048098, -2824597, -2412020, -987823, 821984, 1611906, 1493774, 1933763, 2965759, 2647043, 318907, -1617772, -943027, 932299, 935795, -1286527, -3349079, -3905208, -3840910, -3680602, -2525621, -434838, 504268, -1014643, -3307486, -3931061, -2901792, -1972780, -1614073, -737468, 807066, 1506897]
35400A506897r62885j205475L55668J622005J018278m65443r78437l69764J00216
35391F21060q4146k26657L2168J51293J016L18990J136376J140129k52799j488225
35381A349205j109884k23473o45311j510535m43595K157077L096723J217011q28652
35372C058566r09961n42493j623008k717123j508519Q94159J400621k15745j139974
35363c303477p243J389931J280446K50289l69250m07023k59706L4503L52171L53949
35353f85410K82790O79023J035735J83861j601211k410014j232493O69503J550903
35344a527313J111182J02424p02863o12067N82941J726917J205191o89165j781947
35335e84700j033072J74046N27635N69912P90306J22339j760063k599903n32750
$$ y = [1506897, 544012, -661463, -305795, 1316210, 2334488, 1869045, 890608, 520844, 621060, 536914, 310257, 342425, 493718, 494734, 813724, 1950100, 3090229, 2837430, 1349205, 239321, 15848, -629463, -2139998, -2583593, -426516, 2670207, 3887218, 3058566, 2148605, 1606112, -16896, -2734019, -4242538, -3348379, -1947758, -2163503, -3303477, -3310720, -1920789, -640343, -390054, -759304, -1166327, -1426033, -1391530, -1039359, -685410, -402620, 276403, 1312138, 1495999, -105212, -2515226, -3747719, -3078216, -1527313, -416131, -313707, -1016570, -1628637, -1045696, 681221, 1886412, 1197247, -584700, -1617772, -1443726, -916091, -346179, 444127, 566466, -1193597, -3793500, -4326250]
35326d326250K459942K847091N00089j455266j347582o26664o81358q20180j88907
35317c639085O62352J115144J461800J662820R38631n05950j114896k85926O66082
35308I60972P69239P47819J019416M07684j560518l007498k330926q09944l81113
35299d184869l42250J079041L006683K815901L57496j672404j715379r89596p54215
35290b399592n63242p17K54191R6335N63398J648821J640649o4595j491119r91332
35280a307203J83411L2947j019031j153535j99212N00521N32178O47733R20162
35271h62029N53604n31841j462663j714989j405505n27134Q39104J847947J718806
35262a544700R47408M77295J74514m74190q20113m8570Q11804J12850j355780
$$ y = [-4326250, -1866308, 980783, 1480872, 25606, -1321976, -1948640, -2629998, -3450178, -3639085, -2976733, -1861589, -399789, 1263031, 2201662, 1695712, 580816, 294890, 960972, 1730211, 2478030, 3497446, 3905130, 2344612, -662886, -2993812, -3803756, -4184869, -4527119, -3448078, -441395, 2374506, 2732002, 1059598, -655781, -1645377, -2399592, -2962834, -2963551, -2709360, -2613025, -2049627, -400806, 1239843, 1175248, -315871, -1307203, -1123792, -1090845, -2109876, -3263411, -3462623, -2962102, -2429924, -1782191, -862029, -308425, -840266, -2302929, -4017918, -5423423, -5950557, -5111453, -3263506, -1544700, -597292, -119997, 54517, -419673, -1239786, -1288356, -476552, -363702, -1719482]
35253a719482j089274R79536J777556l04836k615875j967266P10068J824302K51785
35244b153486j434788p96865J444195K806954K151975N29849m96821o08594o91581
35235G50838j343877j900126j320037K61579J586689J813387J198044K27014q91737
35226C81774j595902j020349N88140J488159M75754j337675j818317n27007Q52801
35217b512622P26941o17934j607246j202847J69169J324493J655493J497202J197658
35208F30307M88347o69455j309182o66666K57644j24215j307847j059085J055449
35199b704703K509745J373292p79382j283169l10278j23539j148323j348453K75710
35190c539100J885131J519942j2117m08861P72077J534508K68270j986780k801874
$$ y = [-1719482, -2808756, -1829220, -51664, -356500, -2972375, -4939641, -4229573, -2405271, -2153486, -3588274, -4385139, -2940944, -133990, 2017985, 2547834, 2051013, 1442419, 750838, -593039, -2493165, -3813202, -3551623, -1964934, -151547, 1046497, 1273511, 381774, -1214128, -2234477, -1646337, -158178, 317576, -1020099, -2838416, -3365423, -2512622, -1785681, -2403615, -4010861, -5213708, -5044539, -3720046, -2064553, -567351, 630307, 1118654, 449199, -859983, -1526649, -1269005, -1393220, -2701067, -3760152, -2704703, -194958, 1178334, 398952, -884217, -1194495, -1318034, -2466357, -3814810, -3539100, -1653969, -134027, -146144, -555005, 217072, 1751580, 2019850, 33070, -2768804]
35181b768804j408624M81831J081677O81269N09499L91345p02212k056377j460623
35172e251019J228049K981878J607464r36786j303845M66468J423381L01653j031488
35163e14245q48286J72682O66954N92715N34963M90809L24466K94426L29745j65067
35153A879162j088754j331872m40419N17045O01698M07713P52310J010700J42265
35144B449848j320063j810553r71291L3833L77801M13048M89957K25549n21588
35135f33459r85493n60377J78442L40183J00642K73758P47547M75829p10958j353384
35125b127270k44491J581903J889750K00204j422984r80238R72305K194441J546541
35116C610161j8491j010505r77737l84691K44853N94202M75454L9701j58301J89595
$$ y = [-2768804, -4177428, -3695597, -2613920, -1932651, -1423152, -1031807, -1734019, -3790396, -5251019, -4022970, -1041092, 566372, -370414, -1674259, -1207791, 215590, 517243, -514245, -1362531, -1189849, -522895, 69820, 604783, 1095592, 1420058, 1714484, 2044229, 1879162, 790408, -541464, -981883, -464838, 136860, 544573, 1296883, 2307583, 2449848, 1129785, -680768, -1652059, -1618226, -1240425, -827377, -337420, -111871, -633459, -1618952, -2179329, -2000887, -1660704, -1560062, -1286304, -538757, -62928, -773886, -2127270, -2371761, -789858, 1099892, 1300096, -122888, -1103126, -130821, 2063620, 3610161, 3591670, 2581165, 1603428, 1218737, 1463590, 2057792, 2533246, 2572947, 2414646, 2604241]
35106B604241N04130j28024j596557k510466j827280m06464j05956j278051k132349
35097f876776j102716J031273K249793J815784N91951n91476j466754j512014
35089e860935k61761J407127J883314J082018N57691R32132R70322k3082p58146
35080g1320j42009P98028P29574K57566N47920R96117L42330q29514r11627k0334
35070A696731K48552m72579r47894o12832k60190l27446k75120J11503L50106
35061d89169L30604L71010K91565j48392k21734O81267J378988L77150j295306
35052A275983j167214P44188J741258O10210p54033p45951l85747r17979j476106
35043a075391q45268L32119P85335N35814J90083k13373m38681K56051J465561
$$ y = [2604241, 3108371, 2980347, 1383790, -1126676, -2953956, -3360420, -3466376, -4744427, -6876776, -7979492, -6948219, -4698426, -2882642, -2290691, -2882167, -4348921, -5860935, -6122696, -4715569, -2832255, -1750237, -1192546, -260414, 709908, 686826, -71320, -213329, 584699, 1314273, 1571839, 2119759, 3115876, 3458206, 2628692, 1717065, 1696731, 1945283, 1472704, 524810, -88022, -348212, -675658, -950778, -839275, -489169, -158565, 212445, 504010, 355618, 133884, 815151, 2194139, 2571289, 1275983, 108769, 852957, 2594215, 3204425, 2450392, 1704441, 1318694, 400715, -1075391, -1920659, -1588540, -803205, -267391, -77308, -290681, -729362, -473311, 992250]
35034I92250J432011k21346j418955p00821O30664R85761Q93301J023680K05392
35025C821937k037134l192955j162116J812827K084923J40505n64919N69941P69202
35016B242211r06032k006543j151924k21065o60228r13503N70034K425783K540893
35007A919626J135345k16449r81885j334565r14078K93709J014348L02555q21840
34998C96766q41685o816K84780l42172j035944j152789p31429J1363O83690O91380
34988b042856N0666k99241K55660J054187J157569N86610j31041q13826j252541
34979a434813r00186J60077Q35076N41573J28892K97087L03974m32026p59753
34970a260099L30840J413233N72686j087692p30835J465361J965133p61169l444845
$$ y = [992250, 2424261, 2202915, 783960, 83139, 713803, 1699564, 2592865, 3616545, 3821937, 1784803, -1408152, -2570268, -757441, 1327482, 1467987, 903068, 1473009, 2242211, 1336179, -670364, -1822288, -2043353, -2703581, -3617084, -3047050, -621267, 1919626, 3054971, 2838522, 1856637, 522072, -392006, -98297, 916051, 1218606, 396766, -444919, -451735, -166955, -509127, -1545071, -2697860, -3429289, -3417926, -2734236, -2042856, -1992190, -2291431, -2035771, -981584, 175985, 762595, 631554, -182272, -1434813, -2334999, -2174922, -1339846, -798273, -669381, -372294, -68320, -500346, -1260099, -929259, 483974, 1056660, -31032, -761867, 703494, 2668627, 1907458, -1537387]
34961a537387k535181O83181K051166L66325j531029j239864K82572R59437O32309
34952a868471M94907P74652N79239l65314j169996j063933k79611N48135J101758
34943a248634J190906N44529o61536j528388j307984l28604M73279P00010N78522
34934a587900J77437n89189j206194q09593M96526J477291J377327Q21325N33775
34925F90805J50427p44339j291698m46502J101811J614355P84684Q563L3096n5614
34915A845588r34957j639702j053324K89633R97930O71917k8068m99870m43599
34906g94452L34175J326822J196386n63383k365156k255464n30914P68822P09492
34897b173672K32909J30845p233m35584m76519J55780N80561J38567n09538m52647
$$ y = [-1537387, -4072568, -3389387, -1338221, -971896, -2502925, -3742789, -3460217, -2500780, -1868471, -1373564, -598912, -19673, -384987, -1554983, -2618916, -2898527, -2350392, -1248634, -57728, 486801, -174735, -1703123, -3011107, -3339711, -2866432, -2166422, -1587900, -1410463, -1999652, -3205846, -4015439, -3518913, -2041622, -664295, 157030, 690805, 841232, 96893, -1194805, -1641307, -539496, 1074859, 1859543, 1868106, 1901202, 1845588, 910631, -729071, -1782395, -1492762, -494832, 177085, 149017, -350853, -794452, -460277, 866545, 2062931, 1499548, -865608, -3121072, -3651986, -2883164, -2173672, -1940763, -1809918, -1817151, -2252735, -2729254, -2573474, -1992913, -1854346, -2363884, -2816531]
34887b816531K36811R95824J529039J482585M78317q59985j159681l52954n1952
34878e18527q88401j170275K81562J654513P05041j494951k039050o78418J11904
34869d036602n43269o35745R48536K251170J380620l89870o12640P00273J434750
34860D97223O02374o07609q39740k36758J63442q9399l73277O5983Q11830M60605
34850D54674j328731k665374j630159P21427J391842l28945j708761n12930J795349
34841c811608K258177M48545j401807j495052j10936J416294K003858J262095
34833E69566l01273j489912j446002m11937P13570J134708M55992q92612j438384
34824c106284j14929J819873J887585o0723j279893j16708J466917R76227q71934
$$ y = [-2816531, -2579720, -1583896, -54857, 1427728, 1906045, 1046060, -113621, -466575, -518527, -1406928, -2577203, -2295641, -641128, 63913, -1431038, -3470088, -4148506, -4036602, -4579871, -5215616, -4267080, -2015910, -635290, -1025160, -1637800, -937527, 497223, 1099597, 491988, -347752, -584510, -421068, -510467, -883744, -817761, -5931, 454674, -874057, -3539431, -5169590, -4448163, -3056321, -3385266, -5094027, -5606957, -3811608, -1553431, -1104886, -2506693, -4001745, -4112681, -2696387, -692529, 569566, 268293, -1221619, -2667621, -3079558, -2365988, -1231280, -775288, -1667900, -3106284, -3221213, -1401340, 486245, 425522, -854371, -971079, 495838, 1472065, 600131]
34815F00131j646386r89593m29645l89038J359O13682M32080j97965R9563J068294
34805h37518R32795m69642j103372j8310J071237O18061l77125l10037L41637
34796a52274J06134p45674n31815J027459K078724J161399p24926j420358m25637
34787C73032N84340J83815q44148p74371M68961J263933O91214m51550j224679
34778B70547j575768j358233j09194J366580J125235r12756k032517n33459J441364
34769b318201J127859n49979o97766Q20665J551879O60510k56694l68716n28079
34760e58522q80892m96729L39868K77883l80051L9460J297325J340657J39549
34751A118548J4529J266018J131428j365138l128074j788616M37786M47162r06236
$$ y = [600131, -1046255, -2035848, -2465493, -2854531, -2853172, -2239490, -1807410, -2005375, -1905812, -837518, 95277, -374365, -1477737, -1496047, -424810, 193251, -183874, -493911, -152274, -46140, -791814, -1323629, -296170, 1782554, 2943953, 2219027, 798669, 373032, 957372, 1141187, 297039, -477332, -8371, 1255562, 1946776, 1495226, 270547, -1305221, -2663454, -2772648, -1406068, -280833, -1193589, -3226106, -3759565, -2318201, -1190342, -1740321, -2438087, -1617422, -65543, 594967, 338273, -30443, -558522, -1439414, -1936143, -1596275, -1318392, -1698443, -1658983, -361658, 978999, 1118548, 1133077, 2399095, 3530523, 2165385, -962689, -2751305, -2313519, -1866357, -2772593]
34742b772593p87669Q32413J630032Q76734m9697k99138j41608M04243J284999
34733I77716J430252J46922j219797j048344p1883j09620r34436p97200L65459
34724a260931P39250k93599j138622m86724R65279J829980J687862R39990M2045
34715C024530p01513j200712j527340j467234o06076O66559J108667L84842j22180
34706d40457O41131J561571R96730o10483j418465r27437l20387l25284l74397
34697a217478M8578N70040O40546J65111o23207j241747j097254j34078R69878
34688a919611J635273J795705J248967k56930j818280j749692j6428J270323Q37071
34679A026398j2448N1468J01138q80014j483696n3755K076024K271789N55950
$$ y = [-2772593, -3560262, -2727849, -1097817, -221083, -270780, -569918, -711526, -307283, 977716, 2407968, 2554890, 1335093, 286749, 214866, 105246, -829190, -1626390, -1260931, -521681, -815280, -1953902, -2440626, -1475347, 354633, 2042495, 2982485, 3024530, 2323017, 1122305, -405035, -1872269, -2478345, -1811786, -703119, -318277, -440457, 200674, 1762245, 2758975, 2148492, 730027, -197410, -517797, -843081, -1217478, -1168900, -598860, 41686, 206797, -416410, -1658157, -2755411, -2889489, -1919611, -284338, 1511367, 2760334, 2503404, 685124, -1064568, -1080996, 189327, 1026398, 1013950, 1065418, 1166556, 286542, -1197154, -1250909, 825115, 3096904, 3652854]
34670C652854p98089q68512o41299n76801k65265o8995n67811q37545J53104J030551
34660B12192k08048k387393k369201P824J590364Q61234j57094K71593J114051
34651a064478J091181P67680P45044L38795n79017p97735j15965j08358j245061
34642i67914j681956m07434Q61547O85881M00245J440561K321404R13509j728744
34633A837099k542981p77641J205946J255261k54152j441821j007407P34850K166001
34624A175155J878465K26936j142882j398734j165186r52386l74871N95561J085487
34615g2455P42896L81849N50846P72271P41240P96011O78123m44700k041379k175742
34605g1040l18589J598623J885568J013028o7278j393592k616418k415240q26233
$$ y = [3652854, 2854765, 1986253, 1344954, 768153, 502888, 433893, -133918, -971463, -818359, 212192, 4144, -2383249, -4752450, -4744626, -3154262, -2293028, -2450122, -2178529, -1064478, 26703, 794383, 1539427, 1878222, 1299205, 501470, 385505, 277147, -967914, -2649870, -3057304, -2195757, -1509876, -1109631, 330930, 2652334, 3565843, 1837099, -705882, -1483523, -277577, 977684, 723532, -718289, -1725696, -990846, 1175155, 3053620, 3280556, 2137674, 738940, -426246, -1378632, -1753503, -1157942, -72455, 670441, 1052290, 1603136, 2375407, 3116647, 3912658, 4590781, 4146081, 2104702, -71040, -389629, 1208994, 3094562, 4107590, 4040312, 2646720, 30302, -2384938, -3211171]
34596c211171K6610p54160j021748Q65371K874467K243764j84907j385950o20633
34587a168357K91959K76029q2028l41066n53115k42962Q79780J698288J089707
34578A848235j13046m31963j63218m69147r91688o52235l0559m98726j534651
34569c036998j328206K82823J730200K183767J945423R32025r00133k138162j378522
34560a707783L23722R05971N85994R71052J570138N27503j421917j444110N44173
34551H54743J267526o23071k231509j029765J350169J992289Q14370l51336p71107
34542A272309q05998m49151K85384P13950N85916N89652P91746K03777j128876
34533B058709j583628p04732l03194j260620j543756M59374K701380K227674l18915
$$ y = [-3211171, -3184561, -3938721, -4960469, -4095098, -1220631, 1023133, 838226, -547724, -1168357, -876398, -600369, -682397, -1023463, -1576578, -1819540, -939760, 758528, 1848235, 1735189, 1303226, 1140008, 670861, -320827, -973062, -1003621, -1502347, -3036998, -4365204, -4082381, -2352181, -168414, 1777009, 2709034, 1808901, -329261, -1707783, -1384061, -478090, 107904, 1078956, 2649094, 3176597, 1754680, 310570, 854743, 2122269, 1499198, -732311, -1762076, -411907, 1580382, 2394752, 2043416, 1272309, 466311, 17160, 302544, 1016494, 1602410, 2192062, 2983808, 3187585, 2058709, 475081, -229651, -532845, -1793465, -3337221, -2877847, -176467, 2051207, 1732292]
34524A732292j720347p61604Q81701J733279J893169J531486M20089q38786j087043
34515C784236l89256L2384k68833n65980m82142m25134m62178j84389K26676J10687
34505A376071m54423p84762q68189j214197j541188j031191J30823Q99782J031299
34496b455975J116092J029999J02479j066530r49814K89557N85124q00011j882081
34487d031160j039124M66679P35999K83818P02413J579754J272228M0719k65635
34478b54309M62069L00690j179791j756877j14125J747976J419908l56006j084276
34469h14741k20804P33382J013528J100111Q32427m71933j839237j114023J579454
34460G98164L146980J608176j073346j886315q35879p0673k03591R448P99148
$$ y = [1732292, 11945, -749659, 132042, 1865321, 3758490, 5289976, 5710065, 4871279, 3784236, 3394980, 3427364, 3158531, 2592551, 2110409, 1685275, 1223097, 1038708, 1265384, 1376071, 921648, 136886, -731303, -1945500, -3486688, -4517879, -4387056, -3487274, -2455975, -1339883, -309884, -207405, -1273935, -2223749, -1934192, -1349068, -2149079, -4031160, -5070284, -4603605, -3867606, -3583788, -2881375, -1301621, -29393, 11326, -254309, 207760, 508450, -671341, -2428218, -2542343, -794367, 625541, 269535, -814741, -1035545, -302163, 711365, 1811476, 2643903, 2171970, 332733, -781290, 798164, 3945144, 5553320, 4479974, 2593659, 1757780, 1687107, 1483516, 1492964, 2292112]
34451B292112P59312n17908j344189m51988R25575P28591j053749k390101j796137
34442b848482K6880J247613J003265O0261m49046l89586l28240l28025N5479O64840
34432a285041P86005N31642Q53991J672917J541291Q2550r48050m42026J67j184195
34422A609251k368021j091969J580779K335863P41320l99437N7831Q0934j261026
34413A285525j726670P0798J797597R75692j136978j831504j002972k31736L68541
34404a431707J452225J983854N91809j452655j655604k69700J43589r53671j225395
34395b817255M97187K128702J521303l86467j162968k80365O09252K15926p65446
34386d40131o92557P96905K002804J146833r58113j512996L88529K130164J265991
$$ y = [2292112, 3051424, 2533516, 1189327, 737339, 1662914, 2391505, 1337756, -1052345, -2848482, -2821602, -1573989, -570724, -510463, -959509, -1349095, -1677335, -2005360, -1949881, -1285041, -499036, 32606, 886597, 2559514, 4100805, 4183355, 3235305, 2793279, 2793446, 1609251, -758770, -1850739, -269960, 2065903, 2807223, 2407786, 2465617, 2546551, 1285525, -441145, -370347, 1427250, 2402942, 1265964, -565540, -1568512, -1800248, -1431707, 20518, 2004372, 2596181, 1143526, -512078, -781778, -638189, -1591860, -2817255, -2320068, -191366, 1329937, 943470, -219498, -499863, 109389, 325315, -440131, -1132688, -335783, 1667021, 2813854, 1855741, 342745, 731274, 2861438, 4127429]
34377D127429p67647r14795P11520J237028k25859j453021j079314n22177q90064
34368B23100r18885L18113J157520k1197j806425j770133j59378Q12956N21016
34359a643313L66117R63571J167892K34478q50978r03656k14919O0286m29953
34350a250475q02791r1113J371069J939890M83504j854366k592536r25511J212011
34341b510318J717058Q82124L84652O73742P70608J67759n15808o86762m19947
34332D63108N1253N29253N78384p4284r21596j193624p85919L386J143701K327777
34322B121439K391321O45182j612744k432345j799899j243440j076355j24924
34314c131765J564474K090617P11918o24454j85292R02048O16809q13989j693533
$$ y = [4127429, 3359782, 2444987, 3156507, 4393535, 4167676, 2714655, 1635341, 1113164, 223100, -695785, -377672, 779848, 758651, -1047774, -2817907, -2977285, -2164329, -1643313, -1277196, -313625, 854267, 1088745, 237767, -665889, -880808, -820522, -1250475, -2053266, -2144379, -773310, 1166580, 1650084, -204282, -2796818, -3722329, -2510318, -793260, 88864, 473516, 1147258, 1917866, 2085625, 1569817, 883055, 463108, 514361, 1043614, 1621998, 1547714, 626118, -567506, -1353425, -1350039, -206338, 2121439, 4512760, 5157942, 3545198, 1112853, -687046, -1930486, -3006841, -3131765, -1567291, 523326, 1235244, 610790, 425498, 1327546, 1944355, 1130366, -563167]
34305e63167j641438j473987j095231J82154J555744J336793k29837r78657j16176
34296c023802O54602J14600m73027K92282J380829R79432m26685o84321P23225
34287d62865J919416J374625j31720q71304m57455j7733n07852j449404j433693
34278b037985J71401K151220K503422P20470j555343k484977j888449n81491J100104
34269a901628K852860L319485J392762j480780k360418p24399O44497k70693j710626
34260b38940r96452J154331J715754R7473j051978j55706Q91108l0931j778262
34251c93603j759327N5104J235105N57316o11973p86502k93630n7430J9431M49119
34241a586390R59337R24288L68039k53366o99818p23534P3442J353798J788879
$$ y = [-563167, -2204605, -3678592, -4773823, -4591669, -3035925, -1699132, -1928969, -2907626, -3023802, -2369200, -2254600, -2727627, -2435345, -1054516, -75084, -501769, -1186090, -462865, 1456551, 2831176, 2699456, 1828152, 1370697, 1352964, 845112, -604292, -2037985, -1866584, 284636, 2788058, 3508528, 1953185, -531792, -2420241, -3001732, -1901628, 951232, 4270717, 5663479, 4182699, 1822281, 1097882, 1742379, 1471686, -238940, -1235392, -81061, 1634693, 1732166, 680188, 524482, 1415590, 1384659, -393603, -2152930, -2097826, -862721, -305405, -917378, -1703880, -1997510, -2054940, -2035509, -1586390, -627053, 297235, 665274, 411908, -287910, -1011444, -938002, 415796, 2204675]
34232B204675P43024m59354k37572Q02058P13536o91986j425764l71844J009258
34223B286031R47504j13358n53065j21044O4046m29956p91705m77451k5697k0594
34213G64711j66127R5690O28598Q11200M29077j15060m38502o35489r09543j004426
34203e39871m58775N00742Q80971J94319o45330m40202N57500R91811M26889j32372
34193A335682k1536L6982n96373j087324l98341P55712O57765q35298j836678
34184a989409r71352O64866R43142l67364j169507J54133K362011K800659R54229
34175C381408q93189r83721m22675q75121j473397l28937J744440J940707o5171
34166B024344j392397m90431N87888j12492j313493j128045k90303k19960m1149
$$ y = [2204675, 2947699, 2488345, 2250773, 3052831, 3766367, 3074381, 1648617, 1276773, 2286031, 3233535, 3120177, 2567112, 2446068, 2510114, 2080158, 1288453, 811002, 785305, 764711, 598584, 694274, 1322872, 2134072, 2563149, 2448089, 2009587, 1374098, 464555, -539871, -998646, -497904, 383067, 577386, -67944, -508146, 49354, 1041165, 1468054, 1335682, 1314146, 1351128, 754755, -332569, -730910, 24802, 682567, -152731, -1989409, -2960761, -2295895, -1352753, -1720117, -2889624, -2735491, -373480, 2427179, 3381408, 2488219, 1504498, 1081823, 206702, -1266695, -1595632, 148808, 2089515, 2024344, 631947, 141516, 729404, 616912, -696581, -1824626, -2114929, -2334889, -2376038]
34157b376038J479902K766269J562130r27653j529391q2779O14880l71906r97308
34148A38106k89363M0812r97988j871039j409534o59415m10247M16679K210996
34139b830993L034468J613390j73091j04319Q33869K56738j507667j873778j26558
34130h77941J483927J110129k72860o79967P385K08200p53607j454744l85309
34121a614787J529558J759501k60803j953499j080526J019349J470596N6118r58142
34112c2635o11016k01823m46996l88489L03459M51117l28891p03671r452N23677
34102a444720m671o81404o13663l68935m90006m08084P8167P7153n75189o64314
34092e095666J66543N57228l2913j21251J057133J844112R27302k74260M9619
$$ y = [-2376038, -896136, 1870133, 3432263, 2504610, 975219, 892440, 1507320, 1135414, 138106, -151257, -110445, -1108433, -2979472, -4389006, -5048421, -5458668, -5041989, -2830993, 203475, 1816865, 1643774, 1539455, 2373324, 2630062, 1122395, -751383, -877941, 605986, 1716115, 1443255, 763288, 770673, 978873, 225266, -1229478, -1614787, -85229, 1674272, 1413469, -540030, -1620556, -601207, 869389, 925507, -32635, -643651, -845474, -1292470, -1680959, -1377500, -926383, -1255274, -1958945, -1968397, -1444720, -1449391, -2130795, -2744458, -3113393, -3603399, -4011483, -3933316, -3856163, -4431352, -5095666, -4929123, -4371895, -4404808, -4526059, -3468926, -1624814, -697512, -971772, -922153]
34083i22153J212994J506860R34993M83138J27604m83669p06036q5701L97142
34074B465172q6769p42225p66557q63782j566574j748785n29478R91775J532720
34065a314503J381993Q61237p03611k665261k325531J008890L711980K513259
34057B468453o53846j633408p900J286672Q34458j77783p60211r19347m43580
34048f492N06670N93921n93507j095351L77317J845627J232588l1171K28884Q13620
34038C872106m12495k001870j120641J287912J937107N97310l07269m36370j370573
34029B045217k546568j930601k12098J25235n76789O7765J582769J199124q84573
34020a130519j520873M1185J333740J259746J094223R41684l12900j601065q17896
$$ y = [-922153, 290841, 1797701, 2732694, 3215832, 3343436, 2859767, 2153731, 2068030, 2465172, 2378403, 1636178, 869621, 5839, -1560735, -3309520, -3838998, -2847223, -1314503, 67490, 928727, 225116, -2440145, -4765676, -3756786, -44806, 2468453, 1814607, 181199, 173299, 1459971, 2294429, 2116646, 1356435, 437088, -6492, 500178, 1094099, 500592, -594759, -217442, 1628185, 2860773, 2829602, 3058486, 3872106, 3459611, 1457741, 337100, 1625012, 3562119, 4159429, 3852160, 3415790, 2045217, -501351, -2431952, -2644050, -2518815, -3095604, -3027839, -1445070, -245946, -1130519, -2651392, -2610207, -1276467, -16721, 1077502, 2019186, 1706286, 105221, -712675]
34011g12675Q03269K77203j438092o09627K440291L324089Q52557j363194j296208
34002B277613q23786q04592L25136J861589O58189k781061l777651q32696K023088
33993a874171J974251R67205P57407R0079j202458q74704R49574J117617o85738
33984A219062j065959N65318P63240j043246j062938J478520K355253j2937j882987
33975A313326j396878j234931j937938m62342K329791J400530k604507k676485
33967e269434K181312M182506L84661j967858J125644L223618Q7209k228946N37171
33958B255883K477451l75136j602713K660923M878237M99280k001944K923116
33950A1715097O050174Q60122k313983M637160J0636255O274336L936438J4023091
$$ y = [-712675, 90594, 367797, -1070295, -1679922, 760369, 4084458, 4937015, 3573821, 2277613, 1453827, 649235, 974371, 2835960, 3494149, 713088, -3064563, -3897259, -1874171, 100080, 1067285, 1824692, 1914771, 712313, -162391, 787183, 1904800, 1219062, 153103, 718421, 1481661, 438415, -624523, 853997, 3209250, 3196313, 1313326, -83552, -1318483, -3256421, -3718763, -1388972, 11558, -2592949, -5269434, -3088122, 1094384, 1479045, -488813, 636831, 3860449, 3947658, 1718712, 2255883, 4733334, 4358198, 2755485, 5416408, 10294645, 10793925, 8791981, 11715097, 17765271, 18625393, 16311410, 20948570, 31584825, 37859161, 41795599, 55818690]
33942E5818690K0793083J2990607J8612402O4398140J11075685Q4894182j6941431
33935C51641358j05231022j07015670n0642236j1495725j2040676j8627276j0867280
33928C5721473l633653p149632r333947l129302J016055k531252m629272n77318
33920E753152J472476k325379m089261p6485K223691j097677l097477L98017L153062
33911B314119O70240j947946m10447J259556l52938j441654P63903K061857n00862
33902B415828k552495l64961K359801J367094r62402q23906L39607k95115j316635
33893A66816l22416J307119J201225O4059n00652q48572j243400m72738J190516
33884E41957J320356m30983j335456m71865k86917j599207j735338L16454J607126
$$ y = [55818690, 76611773, 89602380, 108214782, 172612922, 283688607, 368582789, 351641358, 246410336, 139394666, 88752430, 77256705, 65216029, 46588753, 35721473, 32087820, 24938188, 15604241, 12474939, 13490994, 10959742, 6330470, 5753152, 7225628, 4900249, 810988, 734503, 2958194, 1860517, -1236960, -838943, 2314119, 2984359, 1036413, 625966, 1885522, 1532584, 90930, 854833, 2916690, 2415828, -136667, -501628, 1858173, 3225267, 2262865, 1438959, 1778566, 1483451, 166816, -155600, 1151519, 2352744, 2416803, 1916151, 1067579, -175821, -648559, 541957, 1862313, 1431330, 95874, -375991, -662908, -2262115, -3997453, -3680999, -2073873]
33875b073873M04090q56917k10395O20767Q4261l76073K27026L14219n89227l13914
33865b770036J505268J867317k17231j367394L30296J762293L42495j393222n45379
33856d85593R48765J23481j550034r80989J066437J682026P96109L78460M14626
33847B393288n31523k052226k472285j618892m12112J012798K495110K730445
33839A544603J184411m70861p97897o28320q45678m58061R72854J453933l15381
33830A639603k206995j804109k13115J23693m71333o2633J155318J379914M91719
33821C2062J339L11398M18571o7446n10790m81190m5992O13055J010870P07980
33811A989857L35377Q32619J402747L53264j664438k012079l65298N42122l97677
$$ y = [-2073873, -1669783, -2526700, -2737095, -2116328, -2032067, -2408140, -2181114, -1866895, -2456122, -2770036, -1264768, 602549, 385318, -982076, -651780, 1110513, 1453008, 59786, -485593, 463172, 586653, -963381, -1944370, -877933, 804093, 1600202, 1978662, 2393288, 1861765, -190461, -2662746, -4281638, -4693750, -3680952, -1185842, 1544603, 2729014, 2258153, 1460256, 831936, -13742, -471803, 501051, 1954984, 1639603, -567392, -2371501, -2584616, -2460923, -2932256, -2994889, -1839571, -459657, 32062, 33401, 344799, 763370, 695924, 185134, -296056, -342048, 271007, 1281877, 1989857, 2325234, 3157853, 4560600, 4913864, 3249426, 1237347, 872049, 1414171, 1016494]
33802A016494q24288N05115J068414r26848k905949j933646N88403J529155P88101
33793a095049J68777j58723p44011n64166R97291J848387J93439k019663j968904
33784c342622m53919j18838q91208p31877M79721J247497J417953J659765J314628
33775E81100j27793q98520M87203K068221J185349j125146j931474j097318o21104
33766a479482p62411m74779k47763q24614o76668J364526K760230Q96547j770753
33757a215167j163313J425841J373101j319607k196715j57937J192038M42418
33749a619341L20018J570128J116567j699263k900853n05159J945996J436969
33741c34938J54211Q11419J806726P84155q16128o73294J23008m99083j566701
$$ y = [1016494, 192206, 697321, 1765735, 838887, -2067062, -4000708, -3412305, -1883150, -1095049, -926272, -1084995, -1829006, -2393172, -1395881, 452506, 645945, -1373718, -3342622, -3796541, -3915379, -4806587, -5538464, -5058743, -3811246, -2393293, -733528, 581100, 453307, -445213, 41990, 2110211, 3295560, 2170414, 238940, -858378, -1479482, -2241893, -2716672, -2964435, -3789049, -4465717, -3101191, -340961, 555586, -1215167, -2378480, -952639, 420462, -899145, -3095860, -3253797, -2061759, -1619341, -1299323, 270805, 1387372, -311891, -3212744, -3717903, -1771907, -334938, -180727, 630692, 2437418, 3221573, 2405445, 1732151, 1855159, 1356076, -210625]
33732b10625j112181Q6203K71092P2229P61146J194142p1571j451454o70993J082939
33722d9073R48720p98780j333745l0588Q54495J39070p74031o34730J3587M04715
33712a260360O65819Q83246O93281J69930j32033j25408j42490j27161J10726
33703G35550K07028j41061l46539J77145Q15958O22966r4050k93190L6776j28843
33693A591740j175107k168942j958988m23387J331080J844275P49822o33006p81030
33684a623543J30591P99940R30111J176839J148772k82295k271441k151594N86732
33675a555888K867011K147917j96257j435632j344079j277402j200167k50099
33667b244596R34925J026749L68231K23420L82719k07053j040200o52284O95460
$$ y = [-210625, -1322806, -1236603, -965511, -893282, -132136, 1062006, 990435, -461019, -1132012, -49073, 899647, 100867, -1232878, -1263466, -408971, -269901, -1043932, -1678662, -1665075, -1260360, -594541, 288705, 981986, 1151916, 1019883, 894475, 751985, 624824, 735550, 942578, 801517, 454978, 632123, 1448081, 2071047, 1976997, 1683807, 1720583, 1591740, 416633, -1752309, -3711297, -4134684, -2803604, -959329, -209507, -842513, -1623543, -1492952, -693012, 237099, 1413938, 2562710, 2280415, 8974, -2142620, -1555888, 1311123, 3459040, 3262783, 1827151, 483072, -794330, -1994497, -2244596, -1309671, -282922, 85309, 308729, 691448, 484395, -555805, -1208089, -512629]
33658e12629J213532M12826l37609j67684K55299K24912j30688o75243j495234
33649a212518k129118j869863r59130l36558k04541Q2790Q03744J557511J970452
33640b297231J802422P72685p46813j466006p37243K68263J77235n17736m11888
33631c156312N06032J083207R46220N91581O8980p53303j099371k15470R82942
33622a045494R19226k99762j187678j136404p09360j75657M54083M61325n52543
33613c272264j198859q903J864777K028331O05034J3882J016430J685138O88851
33604C422417r11512j709069j540335n84775Q95891J585408K53994j778038j823224
33595b189243J69256J519167J122807P21673J134466P03325j129320k142433j122249
$$ y = [-512629, 700903, 1113729, 776120, 608436, 863735, 1088647, 957959, 282716, -1212518, -3341636, -5211499, -6170629, -6507187, -6711728, -6628938, -5825194, -4267683, -2297231, -494809, 277876, -468937, -1934943, -2672186, -2403923, -2226688, -2744424, -3156312, -2650280, -1567073, -620853, -29272, 39708, -713595, -1812966, -2028436, -1045494, -126268, -426030, -1613708, -2750112, -3459472, -3635129, -3181046, -2719721, -3272264, -4471123, -4480026, -2615249, -586918, 18116, 31998, 1048428, 2733566, 3422417, 2510905, 801836, -738499, -1323274, -427383, 1158025, 1412019, -366019, -2189243, -2019987, -500820, 621987, 1343660, 2478126, 3181451, 2052131, -90302, -1212551]
33586a212551q3018n26725o93024Q45691J967439N84430j291229p14688J177895
33577E4220J234613l47763q22224J26068L77535k88603l4379R89690N30351j434160
33567C85348k119719n32824R42402O93335K43734R69549J548554O16188o14075
33558B132492n20559J56127j61637j135567j301741n03572K29846M20206L17058
33549c67347M2857k89347k96782m7704k37792r22124j116337m14356K12349J08713
33539c327870J04273R00064J609613J242687M72841M36067P49687L14056o77657
33530A823761j147043j000036j009341j174460p12273M26698J327772J384599
33522h0323P92896o2349p66063p19086J40309P46136J11684j124666j466915o60301
$$ y = [-1212551, -1295569, -1822294, -2515318, -1669627, 297812, 882242, -408987, -1123675, 54220, 1288833, 941070, 118846, 244914, 622449, 333846, 299467, 1289157, 1819508, 385348, -1734371, -2267195, -1324793, -631458, -387724, 581825, 2130379, 2746567, 2132492, 1611933, 1768060, 1606423, 470856, -830885, -1334457, -1104611, -684405, -367347, -324490, -613837, -910619, -958323, -1196115, -2118239, -3234576, -3648932, -3436583, -3327870, -3223597, -2323533, -713920, 528767, 1001608, 1437675, 2187362, 2501418, 1823761, 676718, -323318, -1332659, -2507119, -3219392, -2792694, -1464922, -80323, 712573, 650224, -115839, -834925, -694616, 51520, 163204, -961462, -2428377, -3088678]
33512c088678J42306J92674p9824j42627l6142K18346Q14962J431141J211395
33503F63553n2599j350654j496468m09606Q67993J236440N72450k27648l97581
33494e94120l50369r03093j525073o90038J490531K590118J136145q58755n74966
33485b79620J377180J794575l28485k356695j849475L09363J577288R48771n78206
33476F14696j608153j457011l81371O40380Q54114O28784P55829J029800O05771
33467A682839l85281r48355r14691r69099r40882J01637J714546K011553M63416
33458A815683j069093j008410p7477K79290j88369j118040k215037k364388j77429
33449f123270L210278M157872J261206k045281j997794L12683J137123j12787
$$ y = [-3088678, -2946372, -2753698, -2833522, -2976149, -3012291, -2793945, -1978983, -547842, 663553, 610954, -739700, -2236168, -2645774, -1777781, -541341, 31109, -196539, -594120, -944489, -1847582, -3372655, -4062693, -2572162, 17956, 1154101, 295346, -279620, 1097560, 2892135, 2563650, 206955, -1642520, -1333157, 244131, 1192902, 614696, -993457, -2450468, -2831839, -2191459, -1337345, -708561, 47268, 1077068, 1682839, 1297558, 349203, -565488, -1534587, -2475469, -2373832, -659286, 1352267, 1815683, 746590, -261820, -339297, -60007, -248376, -1366416, -3581453, -5945841, -6123270, -2912992, 1244880, 2506086, 460805, -1536989, -1224306, -87183, -199970]
33441a99970o88092N66153J637866R27259o12086j557549j817212j674898j078443
33432d496972m36362l27116j43153J088031K441740J903108k80866j531558q38406
33423b621554j51388q56305j458791l83791J187822J301958L33935J6796O23319
33414b007999J105461J084927Q51535J83386j041300j744414r50583L54383M75195
33405a689409k76663m5164J433913K100468M94295k101902l238088k061203J83549
33396e200204J752897J873434R67052n3945o57478r26123j013693p42463n704
33387d006227P74833J013658O16109N526k84328P2359Q42490J075404j6542j712069
33377a618787k154283o57381J180399J495750N56914P2874O39472J162211P16453
$$ y = [-199970, -888062, -321909, 1315957, 2243216, 1631130, 73581, -1743631, -3418529, -4496972, -4933334, -5260450, -5403603, -4315572, -1873832, 29276, -251590, -1783148, -2621554, -2772942, -3629247, -5088038, -5471829, -4284007, -2982049, -2648114, -2631318, -2007999, -902538, 182389, 1033924, 1217310, 176010, -1568404, -2518987, -2164604, -1689409, -1966072, -2011236, -577323, 1523145, 2017440, -84462, -3322550, -5383753, -5200204, -3447307, -1573873, -606821, -660766, -1318244, -2244367, -3258060, -4000523, -4006227, -3231394, -2217736, -1601627, -1596101, -1880429, -1808070, -965580, 109824, 93282, -1618787, -3773070, -4430451, -3250052, -1754302, -1197388, -1124514, -485042, 677169, 1393622]
33368A393622k31642p19887n09251m3201K21059J32411j28994j82979J24110M34953
33358D90201L31026k7178j13281J48968K14117l23548j070052j131667j20564
33349a601978J159773J318989J6574j294747r56799P00996J713042J094422q6343
33340B063929o39735q77730j395198j518741m09863J119763J507078P40244K02400
33331G92147L88569L59889l89325j029908q24351k04126J81899M66759R20720
33322F62273J124238N67372m08451r30744o24447O0363L21630l64216j716528
33313a308510k614680k053556l23554J228206J747319J569484J177560L43598
33305b34133j020758j884681j082712Q66696J999602J263234j96651o35302N7006
$$ y = [1393622, 1161980, 442093, -67158, -110359, 110700, 243111, 114117, -68862, 55248, 490201, 821227, 794049, 680768, 829736, 1043853, 720305, -349747, -1481414, -1601978, -442205, 876784, 893358, -401389, -1358188, -657192, 1055850, 2150272, 2063929, 1424194, 546464, -848734, -2367475, -2777338, -1657575, -150497, 589747, 792147, 1180716, 1540605, 1151280, 121372, -702979, -907105, -725206, -258447, 662273, 1786511, 2353883, 1945432, 1014688, 390241, 450604, 772234, 408018, -1308510, -3923190, -5976746, -6300300, -5072094, -3324775, -1755291, -577731, -234133, -1254891, -3139572, -4222284, -3355588, -1355986, -92752, -289403, -924705, -867699]
33296h67699N20791k9007r31491j316140j182698p92631N0568J246646J679457
33287a622204M94589j231031j457469J08830J579439J483911N23820J17645L91147
33278C88677N63785M32154L60402L38870R2531j91947j59671j02185o46591j669721
33268e93696k168363j319619N66315K066636J692378n24051k482126j963091O19234
33259d106383K467538J822568q9546j171268j058526n15197L00300J315902J453309
33250D18697L2085j479895j192200J99743L38834j008778j476614J68569K071845
33241a927714K053082N20407o21652o34323j77442K31064O66226J065127J045138
33232B219913M42719m35721j052513j039413o18768n35560j112272j564579r50123
$$ y = [-867699, -346908, -375915, -1307406, -2623546, -3806244, -4598875, -4548307, -3301661, -1622204, -1127615, -2358646, -3816115, -3707285, -2127846, -643935, -120115, -2470, 388677, 952462, 1384616, 1745018, 2083888, 2176419, 1984472, 1824801, 1722616, 1076025, -593696, -2762059, -4081678, -3515363, -1448727, 243651, -280400, -2762526, -4725617, -4106383, -1638845, 183723, 94177, -1077091, -2135617, -2650814, -2350514, -1034612, 418697, 450782, -1029113, -2221313, -2021570, -1682736, -2691514, -4168128, -3999559, -1927714, 125368, 645775, 24123, -610200, -787642, -556578, 109648, 1174775, 2219913, 2662632, 2226911, 1174398, 134985, -483783, -1019343, -2131615, -3696194, -4646317]
33223d646317L76062J150337R90162P66533J038990J172460M51474p32487j341945
33214g74731r04817N5932N78279K45630k49699N6884Q11488N59475q34415j384381
33204a840355M5898J445406N07348j411311j126529J147367J925199J29076j113727
33195b91628K98948J998802J236261o41837q20258K26395Q4147j048756q93863
33186A48211N24448P42199q04128j766814r17055j0555m18902q08321N3072P21963
33176b535882l17271j449746k28368K283830K671683M34101j178625l13174O79878
33167D6426n90302k301812j288189J508774K107249l26399k118555q30233J120557
33158b672484N95884j328396j406207O68935K333136K333648J775442J384834
$$ y = [-4646317, -4270255, -3119918, -2129756, -1363223, -324233, 848227, 1299701, 567214, -774731, -1679548, -1623616, -1045337, -799707, -1049406, -992522, -181034, 378441, -455974, -1840355, -1794457, -349051, 158297, -1253014, -2379543, -1232176, 693023, 822099, -291628, 7320, 2006122, 3242383, 2600546, 1780288, 2006683, 2090830, 1042074, 148211, 672659, 1414858, 610730, -1156084, -2073139, -2083694, -2502596, -3310917, -3257845, -2535882, -2853153, -4302899, -4531267, -2247437, 424246, 858347, -320278, -633452, 46426, -543876, -2845688, -4133877, -2625103, -517854, -844253, -2962808, -3793041, -2672484, -2076600, -3404996, -4811203, -4142268, -1809132, 524516, 2299958, 3684792]
33150C684792O30236l74622p15429o36546j197505j800206p12359J546060K188060
33141B612481L67737j388040j126685j15953l3150j89512M39117P89371k93812
33132A061554j533949j211563k02453m87807j720834j790964j53695J643100K320617
33123b075994J858426O15449p62451j054754K28441J710091J772930O68833l66935
33114B594036j092744j695849j405876K40370J687264J201706k74332m58827O65016
33105A460764J086369K49145l61128j21426j30962p94598r98478l52655q0935
33096d3904q47642j526801r85865L52799J356256J368057L16339j086211j337317
33087b434289J28746J491610P35814j039609r52933J073217J983713L98093j356110
$$ y = [3684792, 4315028, 3940406, 3224977, 2588431, 1390926, -409280, -1121639, 424421, 2612481, 2980218, 1592178, 465493, 349540, 316390, 126878, 565995, 1355366, 1061554, -472395, -1683958, -1886411, -2374218, -4095052, -5886016, -6039711, -4396611, -2075994, -217568, 397881, -364570, -1419324, -1190883, 519208, 2292138, 2960971, 2594036, 1501292, -194557, -1600433, -1360063, 327201, 1528907, 1254575, 795748, 1460764, 2547133, 2796278, 2435150, 2313724, 2182762, 1388164, 389686, 37031, -43904, -891546, -2418347, -3404212, -3051413, -1695157, -327100, -10761, -1096972, -2434289, -2305543, -813933, -78119, -1117728, -2070661, -997444, 986269, 1384362, 28252]
33078B8252j253480n98574j100911j573942j67899J974525K165118K84513j183196
33069a425594q36036J92001M59559L9989j68396L43934J403197K208600J756605
33060C973859j3421j749512k145697j506282j012204q92050m16710N54454J229960
33051a977603J155614P83474N38482K27041k28790k54149N21834J331584R97275
33042C094762m33626j524933j230217j88880L44170K58305K58837J95660p45839
33033B8239k070422j980816r5988J574730J523005Q80147J101809J284554K0801
33024B266059j542527j294136J24534K58424r41911j100878K87290R05338l20166
33015a357973j390554p01890N14278P13181M44900N94505N38821j65128l36388
$$ y = [28252, -1225228, -1823802, -2924713, -4498655, -4666554, -2692029, -526911, -242398, -1425594, -2261630, -2069629, -1610070, -1570081, -1738477, -1394543, 8654, 2217254, 3973859, 3960438, 2210926, 65229, -1441053, -2453257, -3345307, -3762017, -3207563, -1977603, -821989, -38515, 499967, 727008, 498218, 244069, 765903, 2097487, 3094762, 2661136, 1136203, -94014, -282894, 61276, 319581, 578418, 774078, 28239, -2042183, -4022999, -4118987, -2544257, -1021252, -141105, 960704, 2245258, 2266059, 723532, -570604, -446070, -187646, -1129557, -2230435, -1943145, -1037807, -1357973, -2748527, -3450417, -2936139, -2222958, -1778058, -1183553, -644732, -809860, -1146248]
33006a146248P56235J736749J296360K42182l08300q74763j918499k155885o99815
32997c071984Q94447R92875O18621J396994K360944J569506l16924r87937k26663
32988C229879R0973p36772j564115j682347j414907p37754M68311J178118M49455
32979g19159n80671k02326R40360R21590n8748j91075M08897j12505j563405j501207
32969b658249N22418J780116O18786j055703j052798m2576L19723J62598L71430
32960a034255N88306J30482m64238m33044j10253Q6631O42510J602760J742685
32951B751584N70851l49523J94230P98568l46766k183301k126674l8321J576912
32942H47560J216101l8512q26147j282222j789435j710315n04612R72566J408599
$$ y = [-1146248, -390013, 1346736, 2643096, 2885278, 2576978, 1702215, -216284, -2372169, -3071984, -2177537, -1184662, -566041, 830953, 3191897, 4761403, 4444479, 3456542, 3229879, 3320852, 2584080, 1019965, -662382, -2077289, -2815043, -2346732, -1168614, -719159, -1299830, -1502156, -561796, 359794, 301046, 109971, 518868, 406363, -1157042, -2658249, -2135831, -355715, 263071, -792632, -1845430, -1888006, -1568283, -1405685, -1034255, -445949, -315467, -779705, -1212749, -1323002, -1236371, -593861, 1008899, 2751584, 3322435, 2972912, 3167142, 3965710, 3618944, 1435643, -691031, -729352, 847560, 2063661, 2025149, 1199002, -83220, -1872655, -3582970, -4087582, -3115016, -1706417]
32933a706417P12918r5469l16189j22434J50058N24103R75270J005629J41540
32924A269009j197250j846089j196462K7925P06285O62933M65691K41657l50597
32915a216898j044268r88930j42889M24758J40192j71185K85921Q74124N61405
32906a277770l19597n50109M9020L67329k76762j192444j363941o47601M39958
32897d771917J480753K194714K147732J075347m94580j418910j029532R0638P07881
32888a7874L54154j50229J71060J030994J078971l91387k363044l075050j937263
32879e299668j13669Q79277Q40557P80608J237538J368872K44996j431444j873669
32870c366602m99017J306531J995414J466387M35777o81432j447316j028932O02582
$$ y = [-1706417, -993499, -1088968, -1405157, -1527591, -1377533, -853430, 121840, 1127469, 1269009, 71759, -1774330, -2970792, -2942867, -2236582, -1573649, -1107958, -866301, -1216898, -2261166, -3250096, -3392985, -2968227, -2828035, -2999220, -2713299, -1839175, -1277770, -1597367, -2147476, -2098456, -1731127, -2007889, -3200333, -4564274, -5211875, -4771917, -3291164, -1096450, 1051282, 2126629, 1632049, 213139, -816393, -725755, -17874, 336280, 186051, 357111, 1388105, 2467076, 2075689, -287355, -3362405, -5299668, -5413337, -4534060, -3693503, -2912895, -1675357, -306485, -61489, -1492933, -3366602, -3865619, -2559088, -563674, 902713, 1338490, 657058, -790258, -1819190, -1216608]
32861a216608J815910J045903r88557k056945j155127O76280J933540J833302
32853A887698L37021j556050j892644J71283K567393K427550k573j615399q48383
32844A475896M66957L74375m80376p11444o22024r70411j047652n5432Q94763
32835f75348L25015r93749j158312k31471L5792o91684q12784L86107J489959
32826b326475J225380K90492K1121M75089P65087M28496l36757j161361j566497
32817b185425j064705J85532J177175J017746o5406r48115p01756N75630J768539
32808b40785J642099J06649j475702j684938o63055J86952M8164m56073l82030
32799b918719K51263O70447M02003k51291n79999j43330P44385J212621Q03264
$$ y = [-1216608, 599302, 1645205, 656648, -1400297, -2555424, -1879144, 54396, 1887698, 2224719, 668669, -1223975, -1052692, 1514701, 3942251, 3939678, 2324279, 1475896, 1942853, 2317228, 1836852, 1125408, 503384, -467027, -1514679, -1570111, -675348, -350333, -1344082, -2502394, -2733865, -2698073, -3389757, -4202541, -3816434, -2326475, -1101095, -810603, -789482, -314393, 450694, 879190, 542433, -618928, -2185425, -3250130, -3064598, -1887423, -869677, -935083, -1883198, -2584954, -2009324, -240785, 1401314, 1507963, 32261, -1652677, -2315732, -2128780, -2080616, -2536689, -2918719, -2667456, -1997009, -1595006, -1846297, -2426296, -2569626, -1825241, -612620, 190644]
32790A90644J23930N8981M34161K00179r03731j693553j069231M06527J156820
32781a095273M93056q06871j633872j561064p68660K82535Q85549M73064n79607
32772d311143j001472n557J656775K516629K031679R01007l795l53650j86995
32763A243478J56497m1922j095840j964018j197089Q39125J949535R97896m80322
32754D07340n83515L14378O87853M83994O66056Q81864r0201j723128j950496
32745i05855l71057R72221P08247o2390l6919K35121j52082p11472p98911r94546
32735b117643j627383j437374M01009K240738K094500P72592N44973J388075J159319
32726C418806o65710k058618j663509o03544k33998j32657M75790R03034Q3256
$$ y = [190644, 314574, 373555, 807716, 1007895, 104164, -1589389, -2658620, -2252093, -1095273, -602217, -1409088, -3042960, -4604024, -5372684, -5090149, -4204600, -3731536, -4311143, -5312615, -5318172, -3661397, -1144768, 886911, 1787918, 1784123, 1430473, 1243478, 1399975, 1358053, 262213, -1701805, -2898894, -2059769, -110234, 887662, 407340, -176175, 138203, 826056, 1310050, 1976106, 2857970, 2767769, 1044641, -905855, -1276912, -304691, 403556, 341166, 304247, 539368, 387286, -324186, -1123097, -2117643, -3745026, -5182400, -4781391, -2540653, -446153, 326439, 871412, 2259487, 3418806, 2753096, 694478, -969031, -1572575, -1806573, -1939230, -1463440, -560406, -477150]
32717d77150j459911k086839j107621N41646J487095J205214K78423l07685j97619
32708b124447O4080K627R77M74258Q06512K47233m91784m1243J233170J371739
32698A543122j80409j461488q58724M32630K19754j483993k641835k013323l22254
32689f766520J139642J754491J470924O33494M1314K10649M88964j33806j231727
32680b392575j132645O21235K150530J567688l37321j074854R2436J175084M41102
32671A110680r89819q31971Q48758J609980K63502j314259j023149L10192L73141
32662C57055q84578j166655M23111J776044R11149j056608j654982o08405K23429
32653a680440m8017k85021M13830J171337Q50407j69062p44931o27048l23463
$$ y = [-477150, -1937061, -4023900, -5131521, -4589875, -3102780, -1897566, -1619143, -1926828, -2124447, -2060367, -2057740, -2056763, -1582505, -775993, -528760, -1020544, -1061787, 171383, 1543122, 1362713, -98775, -957499, -524869, -305115, -1789108, -4430943, -6444266, -6766520, -5626878, -3872387, -2401463, -1767969, -1726655, -1516006, -1027042, -1160848, -2392575, -3525220, -2903985, -753455, 814233, 476912, -597942, -505506, 669578, 1110680, 120861, -711110, 137648, 1747628, 2011130, 696871, -326278, -16086, 357055, -527523, -1694178, -1271067, 504977, 1416126, 359518, -1295464, -1903869, -1680440, -1728457, -2013478, -1599648, -428311, 422096, 253034, -491897, -1118945, -1442408]
32644a442408K1130N15082P87673N54422N33719J425738K209901J184403j121270
32635D668390k075977p82890L08805q22136k343667j372786J154171J600830o95144
32626c60404k257688p42973J737160K156611Q52257R9580L56886M07555J7734
32617B266718j8746J51814l53803j292756j535717r52424m05601j70239O4029
32608b246725P4607l31450k27825J023140J912436O99569j278846j073165J091232
32599c57027J716861n11316k472266j436192Q38742J215829J0981k08785Q67242
32590c35931J119170k14797j398082j020905K32777J059095J084482N33720k51255
32581H08274n66409J82649J374739J565149L55159j024692j360766q84695o38401
$$ y = [-1442408, -1421278, -906196, -118523, 435899, 969618, 2395356, 4605257, 5789660, 4668390, 2592413, 1809523, 2118328, 1296192, -1047475, -2420261, -1266090, 334740, -360404, -2618092, -3361065, -1623905, 532706, 1384963, 1484543, 1841429, 2248984, 2266718, 2247972, 2399786, 2045983, 753227, -782490, -1734914, -2140515, -2310754, -2246725, -2172118, -2503568, -2731393, -1708253, 204183, 903752, -375094, -1448259, -357027, 1359834, 848518, -1623748, -3059940, -2221198, -1005369, -994388, -1203173, -335931, 783239, 568442, -829640, -1850545, -1617768, -558673, 525809, 1059529, 808274, 241865, 424514, 1799253, 3364402, 3719561, 2694869, 1334103, 449408, -188993]
32572a88993j042606j557675j422963m17663R52918J910262K086863J655320Q36683
32563B812146k16039r38965o00241M53799O66781p04080k155513j730932K20666
32554b192378J467240R34959j35438l06443J78164K64173k53474p77623r13635
32545a734455o40393N4081J002971J639575J551493J028322N52984K5248q95724
32536B584102j856891j979029j096300j57265P445j76687K76976J334174J826790
32527G63315J062666j78706p29082n46865m52587p26690q81577p52757q11735
32518c254018j119814q93180L28254J764694K290278J741009P38307k61167r97491
32509C36872r61266Q7878J283407J322686J54248q30672o12647J87643L68428
$$ y = [-188993, -1231599, -2789274, -4212237, -4629900, -3676982, -1766720, 320143, 1975463, 2812146, 2596107, 1657142, 1056901, 1510700, 2177481, 1473401, -682112, -2413044, -2192378, -725138, 209821, 74383, -232060, -53896, 210277, -43197, -820820, -1734455, -2374848, -2320767, -1317796, 321779, 1873272, 2901594, 3454578, 3479826, 2584102, 727211, -1251818, -2348118, -2505383, -2497938, -2674625, -2397649, -1063475, 763315, 1825981, 1647275, 918193, 371328, -81259, -807949, -1689526, -2442283, -3254018, -4373832, -5267012, -4938758, -3174064, -883786, 857223, 1595530, 1334363, 336872, -624394, -536516, 746891, 2069577, 2223825, 1393153, 780506, 968149, 1336577]
32500A336577j34429l85124o9813o1353j064004k363184k546681j197810P31459
32491e754362K091661K411301J681471J99525j102476j156437j74722L53547j60093
32482a610585k99448J076419K514839J806483m60663j491826m85922K40113q59783
32473D29627j936491o78831J876223K613423O16092j778029k037572j17340J962172
32464I49274K238059N14913j425299j542208J30351J445663Q81910n68769r68094
32455A655800M9278J265132J545235N48539j361815k889740k437619j42605J663223
32446a04572J273832j55459n84611o6379N8881k38413j20927r810p65952j400133
32436b113543l26239J469920J450900l31744j231755m29903p034q20336q75923
$$ y = [1336577, 1202148, 817024, 747211, 685858, -378146, -2741330, -5288011, -6485821, -5754362, -3662701, -1251400, 430071, 629596, -472880, -1629317, -1804039, -1450492, -1610585, -1910033, -833614, 1681225, 3487708, 3027045, 1535219, 1049297, 1289410, 429627, -1506864, -2185695, -309472, 2303951, 2920043, 1142014, -895558, -1012898, 949274, 3187333, 3702246, 2276947, 734739, 865090, 2310753, 3192663, 2623894, 1655800, 1705078, 2970210, 4515445, 5063984, 3702169, 812429, -1625190, -1767795, -104572, 1169260, 1013801, 429190, 362811, 421692, 183279, 62352, 52542, -713410, -2113543, -2439782, -969862, 481038, 149294, -1082461, -1512364, -1519398, -2339734, -3215657]
32427c215657O59610J328871m17738k018050p63829J600142J707719O3879j85037
32418a240090J151988J106203j109278k519770j119467J109957J474974L40701
32410h04782k08476L15081P24715L45160l60842q24107q41598l50551M51697J022351
32400e31352R70845L28077p43356j800525j746186J13213K322895K176536p28149
32391C61998l305918k729945j30011J191883L00450p65728n13842K75071O44338
32382d671704R82018J516916J306062Q4151n68625M10165J460731P00416q01604
32373D18526n65332J061377J126298j174328k909025j764224N83877J277181L84424
32364a561226p7555K93789L29558N0151O55684J906562K047245O87800m75363
$$ y = [-3215657, -2556047, -1227176, -1644914, -3662964, -4426793, -2826651, -1118932, -1055053, -1240090, -88102, 1018101, -91177, -2610947, -3730414, -2620457, -1145483, -804782, -1013258, -698177, 26538, 371698, 10856, -813251, -1654849, -2005400, -1553703, -531352, 439493, 767570, 24214, -1776311, -3522497, -3409284, -1086389, 1090147, 361998, -2943920, -5673865, -5803876, -4611993, -4311543, -5077271, -5591113, -5316042, -4671704, -3689686, -2172770, -866708, -782557, -1351182, -941017, 519714, 1220130, 418526, -146806, 914571, 2040869, 866541, -2042484, -3806708, -3222831, -1945650, -1561226, -1638781, -1344992, -1015434, -965283, -309599, 1596963, 3644208, 4332008, 3856645]
32355C856645m30445l10977j194632k203270j939532n00488J000216J836411J707109
32346A821037M89429j087351j563148n72700L42452k64096j772490k513912j942118
32337g062897p57108L73992J110645J088213L88871j00658K41188Q12212P25601
32328c179941J01719m19434p17721p94545j65681J210526K210704K017594J477778
32319A740999J552443J347869l94868k523401k518694k54384J565370J086598
32311A601932o68857j996068k596750k557495j294493J015583K518267J867873
32303b110008K80172j62593N90813R59122L85612j55468j04282o4390l84456m96922
32293a262400k31059m90131j670030k327042p51266K367556M173293K953509K00414
$$ y = [3856645, 3426200, 3115223, 1920591, -282679, -2222211, -2722699, -1722483, 113928, 1821037, 2310466, 1223115, -340033, -912733, -570281, -834377, -2606867, -5120779, -7062897, -7820005, -7446013, -6335368, -5247155, -4858284, -4958942, -4717754, -3905542, -3179941, -3078222, -3497656, -4215377, -5009922, -5175603, -3965077, -1754373, 263221, 1740999, 3293442, 4641311, 4246443, 1723042, -795652, -1050036, 515334, 1601932, 933075, -1062993, -3659743, -6217238, -7511731, -6496148, -3977881, -2110008, -1829836, -1992429, -1401616, -442494, -56882, -212350, -316632, -381022, -765478, -1262400, -1493459, -1983590, -3653620, -5980662, -6731928, -4364372, -191079, 2762430, 2962844]
32284B962844j388698j126604l64405R2961P72471J574735J116136q53506k156416
32275F29518j058623R06935J111116j74093m80041O74930J180384O5211j085344
32266A769993j171025j187665j608632r77421J117347K285864Q64183j073171
32258A9473r15158K56311j99063j677480j358837P34139J593749K39072q39813
32249b147607j4592J091620Q23994J25715L09433P01158L02653k55308j70293
32240G66773r3355o73920j162374r57002p64305p59871K96593K337444K766187
32231A756170L82340j802198p81009J460406R98013j501627j845555O21956J919371
32222A207867P7356j828497j045630O39358N99523k08848L64706J522412J153295
$$ y = [2962844, 1574146, 447542, 83137, 176098, 948569, 2523304, 3639440, 2785934, 629518, -429105, 477830, 1588946, 1414853, 934812, 1609742, 2790126, 2855337, 1769993, 598968, -588697, -2197329, -3174750, -2057403, 228461, 1092644, 19473, -895685, -639374, -838437, -2515917, -3874754, -3140615, -1546866, -1307794, -2147607, -2162199, -1070579, -246585, -120870, 188563, 889721, 1192374, 937066, 766773, 673418, -502, -1162876, -2119878, -2884183, -3644054, -3347461, -1010017, 1756170, 2138510, 336312, -444697, 1015709, 2013722, 512095, -1333460, -711504, 1207867, 1285223, -543274, -1588904, -949546, -350023, -558871, -194165, 1328247, 2481542]
32213B481542k26321n11172K21180J73728o82269o67980L33155N43721o17509
32204A048075j612431j298837k31917Q56866J847922K157201R19889j156084j968707
32195E61977p86381P49951J055426M95262J23321Q627k66008o12273p85146q01934
32185b57178n00111L03113R13049L76467o16828j29905J955779L021900J118518
32176F184804k159468l668631k481878k22960J368798J672768P80660n29177q74648
32167G0268K49192J441071J101522k99606j004498n64309j31521l62242n84460
32158h4583k01727L76114M79978r2816j168336k132429j935130k30394J616549
32149c372774J851455O27161k55639R7532P66090Q26142N50222K96908l30984
$$ y = [2481542, 2255221, 1744049, 1965229, 2138957, 1456688, 788708, 1121863, 1665584, 1048075, -564356, -1863193, -2095110, -1238244, 609678, 2766879, 3686768, 2530684, 561977, -224404, 525547, 1580973, 2076235, 2199556, 2208183, 1942175, 1329902, 544756, -257178, -757289, -454176, 458873, 835340, 218512, 88607, 2044386, 5066286, 6184804, 4025336, 356705, -2125173, -2348133, -979335, 693433, 1474093, 944916, 70268, 319460, 1760531, 2862053, 2562447, 1557949, 993640, 862119, 499877, -84583, -286310, 89804, 569782, 476966, -691370, -2823799, -4758929, -4989323, -3372774, -1521319, -894158, -1149797, -1052265, -286175, 539967, 1090189, 1387097, 1056113]
32140A056113j380157j824142r90932J87020M17695j22412k73545K64045O89847
32131a976468N60232M53365R44824J609938J487346L40295q62160q94825K85678
32122A948225J322226R46837n59227j817537j997718j395679o13328k3600J9613
32113b170188n61087r85358l51198Q15600R47736j88125q66529L864J024379L93291
32103a937615j212481j570570j71914J284010J571913J339366J459883J563835
32095B326427R61292j20927j038295j640433j984613j856027j240213o40861l09951
32086e543601K02712J101905J635636J121605J25449k11208M30309J532847K503810
32077B899464K601910R54986j985615l681974k041486J446593L066862J611266
$$ y = [1056113, -324044, -2148186, -3139118, -2952098, -2534403, -2656815, -2930360, -2666315, -1976468, -1416236, -962871, -18047, 1591891, 3079237, 3419532, 2557372, 1662547, 1948225, 3270451, 4217288, 3658061, 1840524, -157194, -1552873, -2166201, -2189801, -2170188, -2731275, -3716633, -4067831, -3252231, -2304495, -2492620, -3359149, -3355285, -2330906, -1937615, -3150096, -4720666, -4892580, -3608570, -2036657, -697291, 762592, 2326427, 3287719, 3166792, 2128497, 488064, -1496549, -3352576, -4592789, -5233650, -5543601, -5340889, -4238984, -2603348, -1481743, -1356294, -1567502, -1137193, 395654, 2899464, 5501374, 6456360, 4470745, 788771, -1252715, 193878, 3260740, 4872006]
32069D872006k97378k60356P32567N45497p00358j472867j613290j938427k011569
32060b144175q47114O12738L97714j036747r78580J245875K791824J466475q96197
32051F11813j165251O11592J678956O45068j060270j593305q09715K27998O38436
32042b14678L17847j75222k43207k7325j52725m70679q633J232736J657838L66551
32032B282503j091965p84909P37316J472309J129241J063216J355751M60576j794528
32023D829510l198309k241657l83274J38247n97468p93242K15796J213570R34557
32014A17730m65318j752295j772078l64126J422401K170783J436224L2052j071639
32005b46266j599061j580085q82575L64641J442367J701838J219807M20291n17256
$$ y = [4872006, 4574628, 4314272, 5046839, 5592336, 4891978, 3419111, 1805821, -132606, -2144175, -2991289, -2378551, -1980837, -3017584, -3996164, -2750289, 41535, 1508010, 611813, -553438, 58154, 1737110, 2382178, 1321908, -271397, -1081112, -853114, -214678, 103169, -72053, -315260, -342585, -495310, -965989, -974622, 258114, 1915952, 2282503, 1190538, 405629, 1142945, 2615254, 3744495, 4807711, 6163462, 6624038, 4829510, 1631201, -610456, -993730, -855483, -1452951, -2246193, -2030397, -816827, 117730, -347588, -2099883, -3871961, -4236087, -2813686, -642903, 793321, 825373, -246266, -1845327, -3425412, -4307987, -3943346, -2500979, -799141, 420666, 840957, 323701]
31996C23701j422348j732296r52312N79983J828510K014104J287799M82264K47295
31987B656700M22504L80279j9925k54096j14277j99229q41424j232958n76855
31978B20719M31996M91551k87421o42814k97512k50745p78309q28446L9297P12472
31968a189212L84530o4437L53265R63003N43476o15584j095007l21804R44015
31959i7755J748910J611100L88767j505024k859424k525932p00467J111149J520662
31950a308014N17858n80667m35287Q21095J589224P97660n00780m99590O83461
31941A084960J126326M500j235583j140634j52480N66054Q02597Q09165M06475
31932B271380l41578o44875j99242J71085j1520j2455N09184N05169n34392j176714
$$ y = [323701, -1098647, -2830943, -3783255, -3203272, -1374762, 639342, 1927141, 2409405, 2656700, 3079204, 3459483, 3439558, 3185462, 3071185, 2871956, 2030532, 797574, 220719, 652715, 1144266, 856845, 214031, -83481, -334226, -1112535, -1940981, -1901684, -1189212, -804682, -869119, -515854, 447149, 990625, 375041, -719966, -1041770, -97755, 1651155, 3262255, 3651022, 2145998, -713426, -3239358, -3939825, -2828676, -1308014, -790156, -1370823, -1806110, -985015, 604209, 1401869, 901089, 401499, 1084960, 2211286, 2215786, 980203, -160431, -312911, 253143, 1055740, 1864905, 2271380, 1929802, 1284927, 1085685, 1256770, 1245250, 1232795, 1741979, 2247148, 1712756, 536042]
31922E36042k59570Q68186L21052j220227j582133m90912L77304K82434J43647
31913a024177N34708R41578R77286O41969l81743k007795k793695j630484J31595
31904d610758M42459o9400Q89206L101980L735007J833545j51380l59731j26938
31895D683990j014651j857224r52743P07136Q04400p84253j984677j546233l46987
31886b291242J81436k62219p69265k68090J205976K268424J812000O19343J99462
31877B695825L24651m78144j994160k181695n37525Q25335N43480M4936P20004
31868c7293J398023O56776m30621k44639M06542j19615j116467p65163M34210
31859A81753M40863o48203p12902O15633J197819q9733j611475j593836m19355
$$ y = [536042, 276472, 1144658, 1465710, 245483, -1336650, -1827562, -1450258, -1167824, -1024177, -489469, 452109, 1429395, 2071364, 1689621, -318174, -3111869, -4742353, -4610758, -4168299, -4237699, -3348493, -246513, 3488494, 5322039, 5170659, 4810928, 4683990, 3669339, 1812115, 859372, 1566508, 2370908, 1586655, -398022, -1944255, -2291242, -2109806, -2372025, -3141290, -3409380, -2203404, 65020, 1877020, 2496363, 2695825, 3020476, 2542332, 548172, -1633523, -2171048, -1345713, -802233, -757297, -37293, 1360730, 2017506, 1586885, 1342246, 1748788, 1629173, 512706, -252457, 181753, 622616, -25587, -738489, -122856, 1074963, 985230, -626245, -2220081, -2639436]
31850b639436O08788J087677J194853R26390M72878L11618M03978K29691k08085
31841B388352m83528q09030j634329k223212j284881P63989J888620J214109N9668
31832a20242k95780j67910j32247J19287O61993O56666j57926o71860j52027N10428
31822B50382L38669k18326l88327m24807p01627o85839l6239M50960K46352K29570
31812i39232J074084J731420J082007o7596l51885j27365n06790j087709p19832
31803H7102K20397M65781J46303K58440M67081j68577q47996j60150Q34008j23938
31793A178451k099072j575838J675933L289448P88763k289149j695389J135110
31785D08257J717644n21165k090377j301873j25254p3425k7341Q99780J491197
$$ y = [-2639436, -2030648, -942971, 251882, 1178272, 1651150, 1962768, 2366746, 2596437, 2388352, 1904824, 1095794, -538535, -2761747, -4046628, -3282639, -1394019, -179910, -120242, -416022, -583932, -716179, -596892, 65101, 721767, 563841, -108019, -260046, 250382, 589051, 370725, -17602, -442409, -1144036, -1829875, -1866114, -1415154, -1168802, -939232, 134852, 1866272, 2948279, 2880683, 2528798, 2401433, 1894643, 806934, 87102, 307499, 773280, 919583, 1178023, 1645104, 1476527, 628531, 468381, 1302389, 1178451, -920621, -2496459, -820526, 2468922, 3257685, 968536, -726853, 408257, 2125901, 1604736, -485641, -1787514, -1912768, -1986193, -2013534, -1113754, 377443]
31776C77443Q22389K7813J25779J31366r59557j947027j103493R26053J736163
31767A36929L13239j824678k591099j503458J39196P42156J04858l12529P82785
31758d012601K527792K677648N88310j666965j784405L8524J595668J282222m25730
31749H20463j663720r85752J062297K177323R34427j007111q26965J255457J857776
31740C624195n93298l107979k288242O34609J620294l29920k160229j566300Q6340
31731d080530N52871P3238L52075J580127K227470J392515J5913m46874J56758
31722A823563O25979M3481j022587j421687j202585j422667k018446j368341J030826
31713d932464K856649J684303j379347k795395j129427J439704K326802J424579
$$ y = [377443, 1199832, 1227645, 1353424, 1484790, 525233, -1421794, -2525287, -1599234, 136929, 450168, -1374510, -3965609, -5469067, -5329871, -4587715, -4482857, -4795386, -4012601, -1484809, 1192839, 1781149, 114184, -1670221, -1631697, -36029, 1246193, 820463, -843257, -1829009, -766712, 1410611, 2345038, 1337927, 510962, 1766419, 3624195, 3030897, -77082, -2365324, -1730715, -110421, -440341, -2600570, -4166870, -4080530, -3527659, -3454421, -3102346, -1522219, 705251, 2097766, 2113679, 1666805, 1823563, 2449542, 2493023, 1470436, 48749, -1153836, -2576503, -4594949, -5963290, -4932464, -2075815, -391512, -1770859, -4566254, -5695681, -4255977, -1929175, -504596]
31705e04596K10739m49054o62333o62662m93096j36717L90449P98727N88190r4844
31695a015197j85903P79574J512134O68646q81752j191256k00250M29970K17061
31686A33027K78059P60547M14573p26341q77808L00811O76466p78740j941265
31677a760671r55148O71373P29472J990M97477J582127J049170q12346j445397
31668d41953j78386Q28176J78017q37071o88362J80711N76102L02351k33411p85518
31658a099344q61126J12544J408079J147734j080741k924438j987746Q51190K387572
31649b046276J193573p50013r92628J39646M64065n49801r60244N18297K229421
31640g53960J845397j24703j070201j74235O41334J3504q53401n23851K60290
$$ y = [-504596, -293857, -742911, -1405244, -2067906, -2561002, -2697719, -2307270, -1508543, -920353, -1015197, -1201100, -421526, 1090608, 1759254, 877502, -313754, -514004, -84034, 133027, 411086, 1171633, 1586206, 859865, -17943, 282868, 959334, 180594, -1760671, -2715819, -2044446, -1314974, -1312984, -815507, 766620, 1815790, 1003444, -441953, -620339, 207837, 385854, -451217, -1139579, -958868, -382766, -80415, -313826, -1099344, -1960470, -1847926, -439847, 707887, -372854, -3297292, -5285038, -4433848, -2046276, -852703, -1602716, -2595344, -2455698, -1991633, -2541434, -3501678, -2983381, -753960, 1091437, 966734, -103467, -277702, 363632, 377136, -476265, -1000116, -739826]
31631g39826N7835q07637r63484k07326N77593J007285J257857J157331N35449
31622A875077p5485k32405m14501j014059j356229q52634j46895Q8799L48038
31613a780294R65423R99693P3766k28139J117486K217830J011739j022734r84271
31604B370499O84318J034031l69687j055423k64519k0916r72165j087256K71950
31595E90832P59024o93577j547397Q1654J977048J433223l08337m02627P85691
31586B675534N99133j319236k580514j811383j53854R57819J300383J037786K33650
31577I39318n72100o40071k3510O06168Q79961P11551m2394j022043j210170l09767
31567f83057N35332L72288j93383l38078n18868j223519j447027k10160J379496
$$ y = [-739826, -681991, -1489628, -2453112, -2660438, -2082845, -1075560, 182297, 1339628, 1875077, 1799592, 1567187, 1152686, 138627, -1217602, -2070236, -2217131, -2128332, -1780294, -814871, 184822, 258588, 30449, 1147935, 3365765, 4377504, 3354770, 2370499, 3054817, 4088848, 3719161, 2663738, 2399219, 2378303, 1406138, 318882, 590832, 1349856, 656279, -891118, -809464, 1167584, 2600807, 2292470, 1889843, 2675534, 3274667, 1955431, -625083, -2436466, -2590320, -1632501, -332118, 705668, 939318, 367218, -272853, -296363, 309805, 1189766, 1901317, 1858923, 836880, -373290, -683057, -147725, 224563, 31180, -306898, -825766, -2049285, -3496312, -3706472, -2326976]
31558b326976J559328O69854M13477Q90294O03512p23839j549388j009915j00898
31549a574551J32126k3526O8702L49203N41091O34094N17789L1638m48936l81902
31539a54272n0439k16737q13692j044099p70117o57777q50126o44798K77201J289052
31529c635804J706484J427973O44690k69844o55423k22071L34790K66305N94L58879
31519d3427R28952O12341l99098p13851J42692J134771J341003P86449l81840
31510C407992k001512l034950k268472k32725J149319J181547R98959J202804
31502D02962Q83602k36258p39497J56422J010634M30300o08822m64015L86374
31493A221702K09562j085506j836454j120646K56006J190760J400897J112082
$$ y = [-2326976, -767648, -97794, 315683, 1205977, 1809489, 1085650, -463738, -1473653, -1574551, -1442425, -1465951, -1397249, -1048046, -506955, 127139, 644928, 676566, 227630, -154272, -204711, -421448, -1235140, -2279239, -3049356, -3707133, -4557259, -5202057, -4924856, -3635804, -1929320, -501347, 143343, -126501, -781924, -1003995, -669205, -402900, -402306, -43427, 885525, 1497866, 1098768, 384917, 527609, 1662380, 3003383, 3789832, 3407992, 1406480, -1628470, -3896942, -4129667, -2980348, -1798801, -799842, 402962, 1286564, 1050306, 310809, 467231, 1477865, 1908165, 1299343, 835328, 1221702, 1431264, 345758, -1490696, -2611342, -2355336, -1164576, 236321, 1348403]
31485A348403O50789L33132Q4851n15188j255112j098642J97089J198687P21171
31476A665180k64210j50747O78338O20245k69621l74438N06877N79421r29825
31467B061220k234707j552146M12538J762500J902206J455076P50779j94793q65790
31458C496883p41786k59004k62162q40623j508359j982319j930351p24535J364408
31449c387848K469819J186486j124781j816585n33185N92672L80454N1960O22530
31440a558478J086995M99485j07329L45918P60445k70203j590018j002396J015443
31431h20138J815952O71046l80748j29609J59068l75542m02264R23252J932730
31422C393747J199928K25720Q01899J445807l18151l167711l217508j02819J940016
$$ y = [1348403, 1999192, 2332324, 2417175, 1901987, 646875, -451767, -254678, 944009, 1665180, 1400970, 1250223, 1928561, 2548806, 2279185, 1904747, 2411624, 2991045, 2061220, -173487, -1725633, -1313095, 449405, 2351611, 3806687, 4557466, 4362673, 3496883, 2755097, 2496093, 2233931, 1393308, -115051, -2097370, -4027721, -4752256, -3387848, -918029, 268457, -856324, -2672909, -3206094, -2613422, -2232968, -2181008, -1558478, -471483, 28002, -79327, 266591, 1027036, 756833, -833185, -1835581, -820138, 995814, 1666860, 1286112, 1156503, 1315571, 940029, 537765, 1461017, 3393747, 4593675, 4819395, 5621294, 7067101, 6748950, 3581239, 363731, 260912, 2200928]
31413B200928K65712k265860j733633J081847K261934N61143j446394j595346
31405f69669o18110K0815L40401Q08235Q86699O1177p75533m43385O04743Q90954
31395A106327K06223j40467M15229N92027p15286k326531k063901J20063J743706
31386a062610R70637r76614j524123j42254J245686J106172J82902L1972P59623
31377E91391J202657P63634o9121q33090j531948j821100j020720M44966Q29117
31368a444214n70387j766180m62986K359120L286095J168473j166316r44645P85303
31359A244263J201544q897q26878n64403o19827j475015j554130L5642J727614
31350h40087J706614L37653q48431j283022j220569o46680K81117N99759k40905
$$ y = [2200928, 2466640, 200780, -1532853, -451006, 1810928, 2372071, 925677, -669669, -1287779, -1266964, -926563, -118328, 768371, 829548, 54015, -389370, 215373, 1106327, 1312550, 1172083, 1587312, 2179339, 1464053, -862478, -2926379, -2806316, -1062610, -91973, -1068587, -2592710, -2734964, -1489278, -383106, -200204, -168232, 591391, 1794048, 2557682, 2488561, 1655471, 123523, -1697577, -2718297, -2273331, -1444214, -2014601, -3780781, -4243767, -1884647, 1401448, 2569921, 1403605, 458960, 1244263, 2445807, 2436910, 1610032, 1045629, 425802, -1049213, -2603343, -2567701, -840087, 866527, 1204180, 355749, -927273, -2147842, -2794522, -2513405, -1913646, -2154551]
31341b154551j161973p94909M09080O98844n04603j723802j147018J267180L435897
31332a675855K996751M9463k298466j416586J094835J283938j263397k373246
31324c602563M06649L534691K398671j793613l781192j725960J014028J413471
31316b135818L07393l15638k84282k00440J02190O69684P91532L01290n658Q0553
31306f89194j86194q29214q26683L8862P67783R70098J196369J161671o2733j617883
31296g7118j269981Q50130J711148m1164j747371q52024J234421J734347P32435
31287B274823J40216K22964p67k28246L92345R53069L7467j376903j088508N73069
31277A899529R56060q30141k622426k479390j010783K52827Q91005J126972Q72570
$$ y = [-2154551, -3316524, -4111433, -3702353, -3003509, -3508112, -5231914, -6378932, -5111752, -1675855, 1320896, 1370359, -928107, -2344693, -1249858, 34080, -1229317, -3602563, -3195914, 338777, 2737448, 943835, -2837357, -4563317, -3549289, -2135818, -1828425, -2144063, -2428345, -2628785, -2526595, -1856911, -1065379, -764089, -769747, -689194, -875388, -1704602, -2531285, -2492423, -1724640, -754542, 441827, 1603498, 1540765, -77118, -1347099, -496969, 1214179, 1173015, -574356, -1426380, -191959, 1542388, 2274823, 2415039, 2638003, 2637236, 2408990, 2801335, 3754404, 3791871, 2414968, 1326460, 1899529, 2855589, 2025448, -596978, -3076368, -4087151, -3834324, -2943319, -1816347, -943777]
31268i43777K08542k12285k2960K79900R0826n18157r98651q40685J24764J460276
31258a372207K272296K045187J072137j91627j517585k272312j516224M04636
31250a075699J497585N61137j022739j290832m71393j10501l48475o4173Q01699
$$ y = [-943777, -735235, -947520, -970480, -690580, -599754, -1117911, -2116562, -2957247, -2832483, -1372207, 900089, 2945276, 4017413, 3825786, 2308201, 35889, -1480335, -1075699, 421886, 983023, -39716, -1330548, -1801941, -1912442, -2260917, -2325090, -1523391]
$$ [...]
##END NTUPLES=NMR SPECTRUM
##END=
