##TITLE=31Pdec_LY-TMF-14.40
 D2O, 24 sc
 6.3.2020
##JCAMPDX= 6.0         $$ Bruker NMR JCAMP-DX V2.0
##DATA TYPE= NMR SPECTRUM
##DATA CLASS= NTUPLES
##ORIGIN= UXNMR, Bruker Analytische Messtechnik GmbH
##OWNER= root
$$ XWIN-NMR		Version 3.5
$$ Fri Mar  6 14:38:53 2020 Russian Standard Time (UT+4h)  she@DPX200
##.OBSERVE FREQUENCY= 81.013821
##.OBSERVE NUCLEUS= ^31P
##.ACQUISITION MODE= SIMULTANEOUS
##.ACQUISITION SCHEME= undefined
##.AVERAGES= 24
##.DIGITISER RES= 17
##SPECTROMETER/DATA SYSTEM= spect
##.PULSE SEQUENCE= zgpg30
##.SOLVENT NAME= CDCl3
##.SHIFT REFERENCE= (INTERNAL, CDCl3, 0, 182.463)
##AUDIT TRAIL= $$ (NUMBER, WHEN, WHO, WHERE, WHAT)
$$ ##TITLE= Audit trail, XWIN-NMR		Version 3.5
$$ ##JCAMPDX= 5.01
$$ ##ORIGIN= Bruker BioSpin GmbH
$$ ##OWNER= she
$$ F:/spectra/data/she/nmr/P31/1/pdata/1/auditp.txt
$$ ##AUDIT TRAIL=  $$ (NUMBER, WHEN, WHO, WHERE, WHAT)
(   1,<2020-03-06 14:37:55.60 +0400>,<she>,<DPX200>,
      <created by zg, POWCHK disabled, PULCHK disabled
       configuration hash MD5:
       00 E9 B6 7A A2 85 ED C7 34 08 36 98 17 FE 4E 26
       data hash MD5: 32K
       D6 D2 75 8E 29 C9 27 3D 87 27 3C 36 10 CB 4B ED>)
(   2,<2020-03-06 14:37:58.09 +0400>,<she>,<DPX200>,
      <Start of raw data processing
       efp BC_mod = 2 LB = 1 FT_mod = 6 PKNL = 1 PHC0 = -1359.445 PHC1 = 150.6017 SI = 64K 
       data hash MD5: 64K
       20 F2 1E E1 44 1D 86 F6 EB F6 30 83 4E 4C C6 A2>)
(   3,<2020-03-06 14:38:13.46 +0400>,<she>,<DPX200>,
      <pk PHC0 = -2.676109 PHC1 = 0 
       data hash MD5: 64K
       27 D6 CD 6C 3B 3D 1B 90 FC B0 D7 27 08 C6 2E F3>)
(   4,<2020-03-06 14:38:16.64 +0400>,<she>,<DPX200>,
      <abs ABSG = 5 
       data hash MD5: 64K
       2D 59 39 09 F3 D2 0A 5A 8F 25 3F FB 71 3C 04 9A>)
$$ ##END=
$$ 
$$ hash MD5
$$ 7B 20 F1 03 27 AA 0E 5F 6D FE 82 8F 2D 22 5B 82
##$RELAX= 
##$RELAX= 
##$RELAX= 
##$RELAX= 
##$RELAX= 
##$RELAX= 
##$RELAX= 
##$RELAX= 
$$ Bruker specific parameters
$$ --------------------------
##$DU= <F:/spectra>
##$EXPNO= 1
##$NAME= <P31>
##$PROCNO= 1
##$TYPE= <nmr>
##$USER= <she>
##$AMP= (0..31)
100 100 100 100 100 100 100 100 100 100 100 100 100 100 100 100 100 100 
100 100 100 100 100 100 100 100 100 100 100 100 100 100 
##$AQSEQ= 0
##$AQ_mod= 1
##$AUNM= <au_zg>
##$AUTOPOS= <>
##$BF1= 81.014009
##$BF2= 200.13
##$BF3= 200.13
##$BF4= 200.13
##$BF5= 200.13
##$BF6= 200.13
##$BF7= 200.13
##$BF8= 200.13
##$BYTORDA= 1
##$CFDGTYP= 0
##$CFRGTYP= 5
##$CHEMSTR= <none>
##$CNST= (0..31)
1 1 145 1 1 1 1 1 1 1 1 1 1 1 1 1 1 1 1 1 1 1 1 1 1 1 1 1 1 1 1 1 
##$CPDPRG= <waltz16>
##$CPDPRG1= <>
##$CPDPRG2= <waltz16>
##$CPDPRG3= <>
##$CPDPRG4= <mlev>
##$CPDPRG5= <mlev>
##$CPDPRG6= <mlev>
##$CPDPRG7= <mlev>
##$CPDPRG8= <mlev>
##$CPDPRGB= <>
##$CPDPRGT= <>
##$D= (0..31)
0 1 0 0 0 0 0 0 0 0 0 0.03 2e-05 3e-06 0 0 0 0 0 0 0 0 0 0 0 0 0 0 0 0 
0 0 
##$DATE= 1583491075
##$DBL= (0..7)
120 120 120 11 120 120 24 19 
##$DBP= (0..7)
150 150 150 150 150 150 150 150 
##$DBP07= 0
##$DBPNAM0= <>
##$DBPNAM1= <>
##$DBPNAM2= <>
$$ [...]
##$SUBNAM3= <"">
##$SUBNAM4= <"">
##$SUBNAM5= <"">
##$SUBNAM6= <"">
##$SUBNAM7= <"">
##$SUBNAM8= <"">
##$SUBNAM9= <"">
##$SW= 369.568048894756
##$SWIBOX= (0..15)
0 1 3 0 0 0 0 0 0 0 0 0 0 0 0 0 
##$SW_h= 29940.119760479
##$TD= 32768
##$TD0= 1
##$TE= 0
##$TE2= 300
##$TE3= 300
##$TEG= 300
##$TL= (0..7)
0 120 53 12 22 120 120 120 
##$TP= (0..7)
150 150 150 150 150 150 150 150 
##$TP07= 0
##$TPNAME0= <>
##$TPNAME1= <>
##$TPNAME2= <>
##$TPNAME3= <>
##$TPNAME4= <>
##$TPNAME5= <>
##$TPNAME6= <>
##$TPNAME7= <>
##$TPOAL= (0..7)
0.5 0.5 0.5 0.5 0.5 0.5 0.5 0.5 
##$TPOFFS= (0..7)
0 0 0 0 0 0 0 0 
##$TUNHIN= 0
##$TUNHOUT= 0
##$TUNXOUT= 0
##$USERA1= <user>
##$USERA2= <user>
##$USERA3= <user>
##$USERA4= <user>
##$USERA5= <user>
##$V9= 5
##$VALIST= <valist>
##$VCLIST= <CCCCCCCCCCCCCCC>
##$VD= 0
##$VDLIST= <DDDDDDDDDDDDDDD>
##$VPLIST= <PPPPPPPPPPPPPPP>
##$VTLIST= <TTTTTTTTTTTTTTT>
##$WBST= 1024
##$WBSW= 4
##$XGAIN= (0..3)
0 0 0 0 
##$XL= 0
##$YL= 0
##$YMAX_a= 12620
##$YMIN_a= -20872
##$ZGOPTNS= <>
##$ZL1= 120
##$ZL2= 120
##$ZL3= 120
##$ZL4= 120
##$ABSF1= 182.463
##$ABSF2= -187.1042
##$ABSG= 5
##$ABSL= 3
##$ALPHA= 0
##$AQORDER= 0
##$ASSFAC= 0
##$ASSFACI= 0
##$ASSFACX= 0
##$ASSWID= 0
##$AUNMP= <proc_1d>
##$AZFE= 0.1
##$AZFW= 0.5
##$BCFW= 0
##$BC_mod= 2
##$BYTORDP= 0
##$COROFFS= 0
##$CY= -3
##$DATMOD= 1
##$DC= 0
##$DFILT= <>
##$DTYPP= 0
##$F1P= 0
##$F2P= 0
##$FCOR= 1
##$FTSIZE= 65536
##$FT_mod= 6
##$GAMMA= 0
##$GB= 0
##$INTBC= 1
##$INTSCL= 5.30512e-09
##$ISEN= 30
##$LB= 1
##$LEV0= 0
##$LPBIN= 0
##$MAXI= 10000
##$MC2= 0
##$MEAN= 0
##$ME_mod= 0
##$MI= 50
##$NCOEF= 0
##$NC_proc= -4
##$NLEV= 6
##$NOISF1= 182.463
##$NOISF2= 159.3651
##$NSP= 0
##$NTH_PI= 0
##$NZP= 0
##$OFFSET= 182.463
##$PC= 4
##$PHC0= -1362.121
##$PHC1= 150.6017
##$PH_mod= 1
##$PKNL= yes
##$PPARMOD= 0
##$PSCAL= 0
##$PSIGN= 0
##$REVERSE= no
##$SF= 81.0140089999434
##$SI= 65536
##$SIGF1= 159.3651
##$SIGF2= -187.1042
##$SINO= 113.3802
##$SIOLD= 16384
##$SREGLST= <1H.CDCl3>
##$SSB= 0
##$STSI= 65536
##$STSR= 0
##$SW_p= 29940.119760479
##$SYMM= 0
##$S_DEV= 0
##$TDeff= 32768
##$TDoff= 0
##$TI= <>
##$TILT= no
##$TM1= 0
##$TM2= 0
##$TOPLEV= 0
##$USERP1= <user>
##$USERP2= <user>
##$USERP3= <user>
##$USERP4= <user>
##$USERP5= <user>
##$WDW= 1
##$XDIM= 65536
##$YMAX_p= 373844291
##$YMIN_p= -3762751
$$ End of Bruker specific parameters
$$ ---------------------------------
##NTUPLES= NMR SPECTRUM
##VAR_NAME=  FREQUENCY,     SPECTRUM/REAL,   SPECTRUM/IMAG
##SYMBOL=    X,             R,               I
##VAR_TYPE=  INDEPENDENT,   DEPENDENT,       DEPENDENT
##VAR_FORM=  AFFN,          ASDF,            ASDF
##VAR_DIM=   65536,         65536,           65536
##UNITS=     HZ,            ARBITRARY UNITS, ARBITRARY UNITS
##FACTOR=    0.456856943014862, 1,           1
##FIRST=     14782.0589164792, 0,            0
##LAST=      -15158.0608439998, 0,           0
##MIN=       -15158.0608439998, -3762751,    0
##MAX=       14782.0589164792, 373844291,    0
$$ Real data points
##PAGE= N=1
##DATA TABLE= (X++(R..R)), XYDATA
$$ [...]
##PAGE= N=2
##DATA TABLE= (X++(I..I)), XYDATA
36822e51374K26499J75341J22406K3689P6313K45686J35514l36035o19942l04409
$$ -551374 -324875 -149534 -27128 -3439 72874 318560 454074 118039 -501903 -806312
36812h06312K27207L52441O3986j80249j53059K5830K02274K43091N2816j65207
$$ -806312 -579105 -226664 -162678 -342927 -495986 -470156 -267882 -24791 28025 -137182
36802a37182k8731L64982M09296l2106k62630J11693M14238K5210m36720r3367
$$ -137182 -165913 199069 608365 576259 313629 425322 839560 864770 428050 334683
36792C34683N96024M73287l91322p78383l01076P4537k56605o16455l41579J46248
$$ 334683 930707 1403994 1012672 234289 -66787 7750 -248855 -865310 -1206889 -1060641
36782a060641K42101J72976L48963M86219J94931j73850r8043J69043M1891l48704
$$ -1060641 -818540 -645564 -296601 189618 384549 210699 112656 281699 323590 -25114
36772b5114l60655R6404M51509L63623Q2429q4656j23298r1193J071L7301j09253
$$ -25114 -385769 -289365 162144 525767 608196 523540 400242 309049 310120 347421 238168
36761B38168l03493k88591q5602N6870P9866J50918K95717L31074J98625N1830
$$ 238168 -65325 -353916 -439518 -382648 -302782 -151864 143853 474927 673552 725382
36751G25382m6673k12385m30580m52790j69895J35042J24562j27357k30352p242
$$ 725382 678709 466324 35744 -417046 -586941 -451899 -327337 -454694 -685046 -692288
36741f92288K79552L00159R8260l934J16170K16804Q0870j29778j02678J55824
$$ -692288 -412736 -112577 -14317 -18251 97919 314723 395593 265815 163137 318961
36731C18961L21618K04079l3549j46282j00697j3389N2291J21025K07478K52470
$$ 318961 640579 844658 811109 664827 564130 550741 603032 724057 931535 1184005
36721A184005J57926p4904k38407j08148J73598J43435l28244o83049l69575K81433
$$ 1184005 1341931 1267027 1028620 920472 1094070 1237505 909261 226212 -143363 138070
36711A38070M07826j69629o65832m41088J50565L68656J16358j01182l48J95081
$$ 138070 545896 376267 -289565 -730653 -580088 -211432 -95074 -196256 -196604 -1523
36701a523K35876J87141J95747K15135J24580k7779o7474M4170J16828k2886k52195
$$ -1523 234353 421494 617241 832376 956956 929177 861703 905873 1022701 999815 747620
36690G47620k70471k4732J74274Q2520j31063j77446r6834j17016k09087j56006
$$ 747620 477149 452417 626691 709211 578148 400702 303868 186852 -22235 -178241
36680a78241J0194M6059l8444K2459K36828K77237L9671j46558n7991P0993j6119
$$ -178241 -168047 -121988 -160432 -137973 98855 376092 415763 269205 211214 282207 266088
36669B66088j59648p6261J85053L75308M14820L55246J70531j32190l48014k95809
$$ 266088 106440 30179 215232 590540 1005360 1360606 1531137 1398947 1050933 755124
36659G55124j03033l8018j41428k23817j57794J770J34560J57127N7670p8421
$$ 755124 652091 614073 472645 248828 91034 92804 227364 384491 442161 363740
36649C63740j28036n9319O2672J80953K40534J35333j44356l62033k83384m4269
$$ 363740 235704 176385 239057 420010 660544 795877 651521 289488 6104 -38165
36639c8165J5516j37739k24278j45388q2406n7188J44043M66613M80443L1424
$$ -38165 -22649 -160388 -384666 -530054 -612460 -669648 -525605 -58992 421451 452875
36629D52875m09168l60156K7788K58937J52911q3301k21610j73243L6453K26613
$$ 452875 43707 -316449 -288661 -29724 123187 39886 -181724 -354967 -318514 -91901
36619i1901J64902j14329k84738j50304J28847L22827L61879K08004j37694l96282
$$ -91901 73001 -41328 -326066 -476370 -347523 -24696 337183 545187 407493 11211
36609A1211k08870K69504M35539R6587k37443j73022J0774k0499n1528J82837
$$ 11211 -197659 71845 507384 603971 366528 193506 204280 183781 132253 315090
36599C15090L92358K00471j72881k77050j51768j15635j44679n5528k5964k87659
$$ 315090 707448 907919 735038 457988 306220 190585 45906 -9622 -35586 -323245
36589c23245n09696j68700N53647Q77906M44525k91323o96386n60468q8015L11910
$$ -323245 -832941 -1001641 -447994 429912 874437 583114 -113272 -673740 -761755 -449845
36579d49845K69988j58131m35216j75852L36842N80356M70405K31824p1888l90240
$$ -449845 -179857 -337988 -773204 -949056 -612214 -31858 438547 670371 598483 208243
36569B08243m03845K0246L85929K20709j14539J1241L96158L22917j82130l70575
$$ 208243 -195602 -175356 210573 431282 316743 327984 724142 1047059 864929 494354
36559D94354o8581M0621l53538o18149k44848L07261L69241O0296l9276K01443
$$ 494354 425773 466394 112856 -505293 -750141 -442880 -73639 -13343 -52619 148824
36549A48824M16824L63578J43966o8561k08567k64538k19847n1758K03727L52991
$$ 148824 565648 929226 1073192 1004631 796064 531526 311679 259921 463648 816639
36539H16639J81259j71716k46334O7502K49194o0346l91271j64316L04890L05153
$$ 816639 997898 826182 579848 647350 896544 836198 444927 280611 585501 890654
36529H90654n5226p7113K25819J20484m73845p07328j95286L32164K36079r3246
$$ 890654 835428 758315 984134 1104618 630773 -76555 -271841 60323 296402 203156
36519B03156o9055J27722O4254j27572j12540M730J4072J01703M30102O49064
$$ 203156 134101 261823 326077 198505 85965 90695 104767 206470 636572 1285636
36509A285636L98620p7065l32186l53941l18877j47752J78939K99279K9483j76074
$$ 1285636 1684256 1607191 1275005 921064 602187 454435 633374 932653 962136 786062
36499G86062O6965L17588l3679o82642p71670j68445L76013L26186n9089l21211
$$ 786062 853027 1170615 1136936 454294 -317376 -485821 -109808 216378 157289 -163922
36489a63922l89183l98950l50949j59349J62991M67208N41608L01414k6303j08594
$$ -163922 -553105 -952055 -1303004 -1462353 -1299362 -832154 -290546 10868 -15435 -124029
36479a24029K1468J3242j70051j23671K64857M90952K29905q4217o482J13657
$$ -124029 -102561 -89319 -259370 -383041 -118184 372768 602673 518456 511974 625631
36469F25631k30220o85387n06109J95027N43690K15280j79218j21239J54292K40246
$$ 625631 395411 -289976 -796085 -601058 -57368 157912 -21306 -142545 11747 251993
36459B51993J51437M4731j32125l83784m49948j62705K40966M11318K99574J13081
$$ 251993 403430 448161 316036 -67748 -517696 -680401 -439435 -28117 271457 384538
36449C84538K9611Q1821J82685J84409K4051j71291k27167j22902N6589K46878
$$ 384538 414149 495970 678655 863064 887115 715824 488657 365755 422344 669222
36439F69222L34421J51882k20460l49830K4756N14189M95596p9140o48849p54120
$$ 669222 1003643 1155525 935065 585235 609991 1124180 1619776 1540636 891787 137667
36429A37667m36126Q943L00372K31502j59771m65728l02576J57816L91161K55001
$$ 137667 -298459 -289516 10856 242358 82587 -383141 -685717 -527901 -136740 118261
36419A18261J27413K50122L50336J14985k74533l56383K370M31354M81964J22703
$$ 118261 245674 495796 846132 961117 686584 330201 332571 763925 1245889 1368592
36409A368592k38185k38646M284J01287j9895m1348J54449K13690j17676n02437
$$ 1368592 1130407 891761 896045 997332 977437 936089 1090538 1304228 1186552 684115
36399F84115m57660m0613K89722K99150J02180j47028l14274k25016P5171K00048
$$ 684115 226455 185842 475564 774714 876894 729866 415592 190576 265747 465795
36389D65795m1062k25834Q6624N75493N50739j5397m64884m17049j52555q892
$$ 465795 424733 198899 285523 861016 1411755 1396358 931474 514425 361870 352978
36379C52978K9871M4380n283n3585N0822K18584K09650O6481L6227Q7542j1729
$$ 352978 382849 427229 421946 368361 419183 637767 847417 913898 950125 1037667 1025938
36368A025938j65995n7329K14197K07022p8290j41046J52992L16845Q3394j64993
$$ 1025938 859943 802614 1016811 1223833 1145543 1004497 1157489 1474334 1557728 1392735
36358A392735j29008j10643l71896n55318k74460J70470K31580n8182k38283j62071
$$ 1392735 1263727 1153084 781188 225870 -48590 121880 353460 295278 56995 -105076
36348a05076n7847l511J50562L71985L87662Q5683l07616m90193l43639L5035
$$ -105076 -162923 -166434 -15872 356113 743775 829458 521842 31649 -311990 -276955
36338b76955L85713M22110J04875k33819j95135K26444N82410M34121j27753n10598
$$ -276955 108758 530868 635743 401924 206789 433233 1015643 1449764 1322011 811413
36328H11413k86850K25945L23666j10909m11190j24004K89206K10605j32022j13641
$$ 811413 524563 750508 1074174 963265 552075 428071 717277 927882 795860 682219
36318F82219J62383N5219m14469n05052l990L84921J90506j38536j00207Q0882
$$ 682219 844602 899821 485352 -19700 -23690 361231 551737 413201 312994 393876
36308C93876M3001k7792J20292K14459m0263l40387k68150K271O1530l4042M547
$$ 393876 436877 409085 529377 743836 703573 363186 95036 97307 158837 124795 129342
36297A29342Q9870l2491k31102k07892m5518j1752l9311Q5883K39577J83737O5823
$$ 129342 219212 186721 -44381 -252273 -297791 -309543 -348854 -262971 -23394 160343 226166
36286B26166J63432L23641K00642j12983k40910j68001j79364k71347j85867M0935
$$ 226166 389598 713239 913881 800898 559988 391987 212623 -58724 -244591 -203656
36276b03656J16978M2688R2424K73206L20910K21034K09959K56222Q2779k48805
$$ -203656 -86678 -43990 48434 321640 642550 863584 1073543 1329765 1412544 1163739
36266A163739l24000n1312J64381P2514q4794p0077k7365j17998j74765j2957
$$ 1163739 839739 788427 952808 1025322 940528 870451 843086 725088 550323 537366
36256E37366J98708J62599j26841l94946m00073j17688K61303M46136K91104l9036
$$ 537366 736074 898673 771832 376886 -23187 -140875 120428 566564 857668 818632
36246H18632k62799k98686k35209r2585J31960K64990J18557j69851k65895j02560
$$ 818632 555833 257147 21938 -70647 61313 326303 444860 275009 9114 -93446
36236i3446Q5065J71285K41465K69908Q4514k46997l58328q5803K53968K73102
$$ -93446 -8381 162904 404369 674277 758791 511794 153466 67663 321631 594733
36226E94733j1290k73174k87537j04729P7162J22771R0352J30699K02563N3986
$$ 594733 583443 310269 22732 -81997 -4835 117936 208288 338987 541550 595536
36216E95536l36710n27531j64074M07963N39512K05619j728J58128K17062j62363
$$ 595536 258826 -268705 -432779 -24816 514696 720315 718587 876715 1093777 931414
36206I31414n46514l52758K57145N88834L47349q0391k40174j43792r8858k33295
$$ 931414 384900 32142 289287 878121 1225470 1145079 904905 761113 662255 428960
36196D28960l46875k00906J39811L44713K22365l0186r6287N5758K07570K23471
$$ 428960 82085 -118821 20990 365703 588068 557882 461595 517353 724923 948394
36186I48394J32073k4729j67934j07683J97887M05474J83209k29406l08961o1972
$$ 948394 1080467 1055738 887804 780121 978008 1383482 1566691 1337285 1028324 966352
36176I66352r71k42224k70746J40206M14635L9116n68563o35082j25720L46365
$$ 966352 965381 723157 452411 592617 1007252 1046368 477805 -157277 -282997 63368
36166F3368M70320M54699L97549J00690m02793o97420n53629k24085J1298K08947
$$ 63368 533688 988387 1385936 1486626 1083833 386413 -167216 -391301 -380003 -171056
36156a71056M53216N48547L28035J1995p7509q66o4965k87191l47905j13999J08275
$$ -171056 282160 830707 1158742 1170737 1093228 1092362 1027397 740206 392301 278302 386577
36145C86577j625l19256m52108k57761M2386K27317L06374L27159J99177j04782
$$ 386577 384952 65696 -386412 -644173 -601787 -374470 -68096 259063 458240 353458
36135C53458l34058k10467J51700L42431K07638L7535Q7118J72942p322l30980
$$ 353458 19400 -191067 -39367 303064 510702 548237 635355 808297 800975 469995
36125D69995l62987Q458L71916L30739j2378k68925k57116o9726J84885M22584
$$ 469995 107008 115466 487382 818121 805743 536818 279702 209976 394861 817445
36115H17445M45149J03250l58360m48381o4496L11135K57010l1561j30904p1792
$$ 817445 1262594 1365844 1007484 559103 494607 805742 1062752 1031191 900287 828495
36105H28495j87486m17914l18580J64658M62831J80936k94612l48262r04K00615
$$ 828495 641009 223095 -95485 69173 532004 712940 418328 70066 69162 269777
36095B69777J3275k17480j27247J66353K90814J55212N4042K27778M54946K60661
$$ 269777 283052 65572 -61675 104678 395492 550704 604746 832524 1287470 1548131
36085A548131m08920r32905o97486Q4282N98034M57681Q0091n7165l9695j37351
$$ 1548131 1139211 206306 -491180 -406898 191136 648817 728908 671743 632048 494697
36075D94697k52283j53393M9805R6483K1756K0845O3575L7692P9906L29236N15726
$$ 494697 242414 89021 138826 235309 257065 277910 341485 379177 459083 788319 1304045
36064A304045K75812k17084m23345k06545L6300K2366j03606j70015k46986l69520
$$ 1304045 1579857 1362773 939428 732883 769183 791549 687943 517928 270942 -98578
36054i8578l60672j18546J71151K56912R1516j70293k91368j02948K76119M50128
$$ -98578 -459250 -577796 -406645 -149733 -58217 -228510 -519878 -622826 -346707 103421
36044A03421K02151j71295k44541l8136J15996J28975J65585K15182J15015m6492
$$ 103421 305572 134277 -110264 -148400 -32404 96571 262156 477338 592353 545861
36034E45861j7728J31630P6105j97168l41369k07739p280J14495K10643K18090
$$ 545861 528133 659763 735868 538700 197331 -10408 -17688 96807 307450 525540
36024E25540o16k55014j76540J56124K60612Q125k01348j29485j786J9055P2939
$$ 525540 524924 269910 93370 249494 510106 518231 316883 187398 185612 204667 277606
36013B77606J36204p0903m66561n04240Q023N46937O37503M18571J52403k03495
$$ 277606 413810 342907 -123654 -627894 -619871 -72934 564569 983140 1135543 932048
36003I32048n62689n00065L5985L90068J10866l47195l82087j53545j12416j49296
$$ 932048 369359 -130706 -94721 295347 406213 59018 -323069 -476614 -589030 -738326
35993g38326O3928L20395K41591N2709K00712M58520K29985m02955p42707n33049
$$ -738326 -674398 -354003 -112412 -59703 141009 599529 829514 426559 -316148 -849197
35983h49197k01024l8432J28756L63608L86620J07863j46324j24860M9984J92755
$$ -849197 -1050221 -1088653 -959897 -596289 -209669 -101806 -248130 -372990 -323006 -130251
35973a30251K78370K79325J40157l4781q2747n0167n6205j6280J24211P9048l44733
$$ -130251 148119 427444 567601 532820 450073 399906 343701 327421 451632 530680 185947
35962A85947o83384l34937M37095P42163L51787j1415J36048L33350N3743l86195
$$ 185947 -497437 -832374 -395279 346884 698671 687256 823304 1156654 1210397 824202
35952H24202l70060K1687J86585o1354l12199k63304j03000r4805j46404j0714
$$ 824202 454142 475829 662414 601060 288861 25557 -77443 -172248 -318652 -329366
35942c29366K63107L38626P3398k21256j79017R5204J96405P4459R5335L44162
$$ -329366 -66259 272367 345765 124509 -54508 40696 237101 311560 406895 751057
35932G51057L78478j4211l18368n2133L96561L40890j11910k92774j10456j14224
$$ 751057 1129535 1115324 796956 744823 1141384 1482274 1370364 1077590 967134 852910
35922H52910m27524m93060p0812L15448K50750L5149K0813l771k69775m27306
$$ 852910 425386 -67674 -138486 176962 427712 462861 483674 479903 210128 -217178
35912b17178q5025M44663N49845K19172m0386m2499j10686m12589n89939k44881
$$ -217178 -302203 142460 692305 911477 871091 828592 717906 305317 -284622 -529503
35902e29503M58474Q90723O30829n2494m85502l72074j02927j19187k29893K7986
$$ -529503 -71029 819694 1450523 1398029 912527 540453 437526 318339 88446 116432
35892A16432N23732O23980J75860k39294k25548j11232k31176k80433R5788N43733
$$ 116432 640164 1264144 1440004 1200710 975162 863930 632754 352321 448109 991842
35882I91842M62688o0505l91657k63346J7448J78602K41182J79579j33503n30754
$$ 991842 1454530 1394025 1002368 739022 756470 935072 1176254 1355833 1222330 691576
35872F91576n55164o1973M99465O08152K70636p0461r2909Q9320J33268q5775
$$ 691576 136412 74439 573904 1182056 1452692 1382231 1289322 1378642 1511910 1426135
35862A426135k92634j63227J79680K55905r9599m44210l38429J8447J18969p4563
$$ 1426135 1133501 970274 1149954 1405859 1306260 862050 523621 542068 661037 586474
35852E86474j35573R0530K33682M848l41950l85350j13644J27369J19712k1185
$$ 586474 450901 541431 775113 779961 438011 52661 -60983 66386 186098 164913
35842A64913p3963K4966J54667J65172M6235n6672k8752M4046r343j74695k47264
$$ 164913 90950 115916 270583 435755 481990 425318 396566 440612 431269 256574 9310
35831I310j35516n859k0018p3987L0451K43579L13169J66416K5724O5312J47236
$$ 9310 -126206 -132065 -152083 -226070 -195619 47960 361129 527545 553269 618581 765817
35820G65817M8130j95396l57285l43101k33499p7083J13390J89880j2284l45208
$$ 765817 813947 618551 261266 -81835 -315334 -392417 -279027 -89147 -101431 -446639
35810d46639m40435k21032p975J6573R0201L80793N85880L88987K3266o3398J02271
$$ -446639 -887074 -1108106 -1116081 -1099508 -1009307 -628514 -42634 346353 369619 306221 408492
35799D08492J42723l590o0305R925m1641j94477j13997K13909L37650M5130k66413
$$ 408492 551215 547625 487320 497245 455604 261127 147130 361039 698689 743819 477406
35788D77406k07499L8648J05017L7372J03599K52432J81712j51700m33929l98351
$$ 477406 269907 308555 413572 450944 554543 806975 988687 836987 403058 4707
35778D707j05520J78504K47097J16576l866N0002J89959K11518R4853j5660q4563
$$ 4707 -100813 77691 324788 441364 437498 487500 677459 888977 983830 968170 883607
35767H83607j81030k35794j24359J4536o9942k39596q0646L64673N00894O8691
$$ 883607 702577 466783 342424 356960 287018 47422 -33224 331449 832343 901034
35757I01034l71783k32779K46757M06554J10765k14399k85213k06286j11991r883
$$ 901034 529251 296472 543229 949783 1060548 846149 560936 354650 242659 232776
35747B32776M0709m1084j48454r5549Q3738J88853J57408R4333O5231O9606J27551
$$ 232776 273485 232401 83947 -11602 72136 260989 418397 512730 577961 647567 775118
35736G75118J89822Q3785k31717m90762m28693j25424J82340M39009O39193N73304
$$ 775118 964940 1048725 817008 326246 -102447 -227871 -45531 393478 1032671 1605975
35726A605975R5450m77225o44103l63846n2111L4500L2441P6109O5387o1851j56774
$$ 1605975 1701425 1224200 580097 216251 164140 198640 231081 307190 372577 310726 153952
35715A53952j16508o0660r3243j00940K9800J55006N2456k00375k51585N1112
$$ 153952 37444 -23216 -116459 -217399 -187599 -32593 19863 -180512 -432097 -380985
35705c80985L82709L35780K8041J399L99723O18644J35577o08315p21839j29759
$$ -380985 1724 337504 365545 366944 766667 1385311 1520888 912573 190734 60975
35695F0975L51602K48365l877M0686J32169l9102j86814n655J70739k7343k37379
$$ 60975 412577 660942 657065 697751 829920 790818 604004 598349 769088 741745 504366
35684E04366K8433M14233K31869l34067m74887q9210J10233j36255k40842J21263
$$ 504366 532799 947032 1178901 844834 369947 280737 390970 254715 13873 135136
35674A35136M11625J54527k79985l19115l9890J26665R8897O6309M3349o3602
$$ 135136 546761 701288 421303 102188 62298 188963 287860 354169 397518 333916
35664C33916j93413k72721l69224m29897j89226L42760O42390L30925k00679k79069
$$ 333916 140503 -132218 -501442 -931339 -1120565 -777805 -135415 195510 -5169 -284238
35654b84238J21979M08061K39393p8608j24109J00727K94093K68398Q4409r5377
$$ -284238 -162259 245802 485195 406587 282478 383205 677298 945696 1030105 934728
35644I34728j64263j31133q5497q9890j01715k8524J35941K55474J66966j10636
$$ 934728 770465 639332 553835 463945 362230 333706 469647 725121 892087 781451
35634G81451l11488j75958K06185M48402L35212O5618q9706j56347k63487l00758
$$ 781451 469963 294005 500190 948592 1283804 1349422 1259716 1103369 839882 539124
35624E39124j06233J34506P2966k46456m01473j99404R9338K44922L13830M06319
$$ 539124 432891 567397 640363 393907 -7566 -206970 -107632 137290 451120 857439
35614H57439L72773R6938j80334j15498K37508M14311O7979n90378r56080o75292
$$ 857439 1230212 1327150 1146816 1031318 1268826 1683137 1751116 1160738 204658 -470634
35604d70634p7583J87769m1417k60177n4686K91041K64022p7621k29589k5898
$$ -470634 -548217 -360448 -401865 -662042 -716728 -425687 -161665 -239286 -468875 -494773
35594d94773J91945J70243M8065Q397K0640J8789J2058l7342j53965j72143N6810
$$ -494773 -302828 -132585 -84520 -76123 -55483 -36694 -24636 -61978 -215943 -388086 -331276
35583c31276L13155K39295r6455k67341j14941J06743K07558K35480J76418l3942
$$ -331276 -18121 221174 124719 -142622 -257563 -150820 56738 292218 468636 434694
35573D34694j84398k794K72149J25641l46320m47918L4547M52834L10020j2417
$$ 434694 250296 247502 519651 645292 298972 -148946 -114399 338435 648455 636038
35563F36038K0922K31309J26087k60279m79851l60186j22515J860n3843k04315
$$ 636038 656960 888269 1014356 754077 274226 -85960 -208475 -206615 -260458 -464773
35553d64773j86084K01514O71064O60767J55900j97191m7377J58319j3698k63529
$$ -464773 -650857 -449343 221721 882488 1038388 841197 793820 952139 938441 674912
35543F74912j46238J53613K17326J12656J10419P5145k22087n10487l85775o994
$$ 674912 528674 682287 899613 1012269 1122688 1197833 975746 465259 79484 72490
35533G2490J83980J83094K53782K99142O3706k48879k31979R934N5755p5171k8524
$$ 72490 256470 439564 693346 992488 1056194 807315 575336 585270 641025 565854 537330
35522E37330J52467R9884j43851j58725J01605K49726J50289L0398p0071k95317
$$ 537330 689797 789681 645830 487105 588710 838436 988725 1019123 949052 653735
35512F53735m44512j63148L11158L41271q9066l10290n2832J98617J41794J13791
$$ 653735 209223 46075 357233 698504 609438 299148 246316 444933 586727 700518
35502G00518K78651J85122l67551p47806l91400K75650M43774K5188m35108n92715
$$ 700518 979169 1164291 796740 48934 -342466 -66816 376958 402146 -32962 -625677
35492f25677m76835j36715L15182N36073L51628J20844K20804M03205K08444j87212
$$ -625677 -1102512 -1239227 -924045 -387972 -36344 84500 305304 708509 916953 729741
35482G29741j82117K63048N11499K19945j79406j95782K1466L8251j69768k80387
$$ 729741 547624 810672 1322171 1542116 1362710 1166928 1188394 1226645 1056877 776490
35472G76490j92796j29100j91901j65726J21824M69278N23049K31534j10282k45551
$$ 776490 583694 454594 262693 96967 218791 688069 1211118 1442652 1332370 1086819
35462A086819k01169j21056m7840K7260N7757K4891P742M6360O7506O2787J48035
$$ 1086819 885650 764594 716754 744014 801771 826662 834404 880764 948270 1011057 1159092
35451A159092K82696J82404k22166n00283k77194J47459K20751R762N1780L75205
$$ 1159092 1441788 1624192 1402026 901743 624549 772008 992759 1002521 1054301 1429506
35441A429506L65645k21154p65197o40517n3883L59036L57172J22271j63217l42701
$$ 1429506 1795151 1573997 808800 168283 114400 473436 830608 952879 789662 446961
35431D46961j97163K38054N11172L05008r4240k68605l11637n09266o54662l17631
$$ 446961 249798 487852 999024 1304032 1209792 941187 629550 120284 -534378 -852009
35421h52009L24038N98634L26544N3527J42553K39984m7108m43702m02101J03209
$$ -852009 -527971 70663 397207 450734 593287 833271 786163 342461 -59640 43569
35411D3569N78572O33183K80797k27258n76918n30350j76778N7559q6929l12360
$$ 43569 622141 1255324 1536121 1308863 731945 201595 24817 82376 -4553 -316913
35401c16913j77549K24209M00688K26628R5160K08548K25815r8896l77454j51383
$$ -316913 -494462 -270253 130435 357063 452223 660771 886586 787690 410236 258853
35391B58853L05580L21221j54062m67695k68105J6134n2669k14399r066M06400
$$ 258853 564433 885654 731592 263897 -4208 11926 -40743 -255142 -264208 142192
35381A42192M85775J51786j20310n0335J16914J17177N6501J05536J66893J12942
$$ 142192 627967 779753 659443 609108 726022 843199 899700 1005236 1172129 1285071
35371A285071R1485K76161M58769K37662l73949q16553o07778N6652N11808L90808
$$ 1285071 1376556 1652717 2111486 2349148 1975199 1158646 550868 607520 1119328 1510136
35361A510136j5805k25475j73191j41244k18117j76208P2742K55489J54782l4421
$$ 1510136 1494331 1268856 1095665 954421 736304 560096 632838 888327 1043109 1008688
35351A008688j8432J42065J74462K5948j37674k33588k70141j76597N8774J86894
$$ 1008688 990256 1132321 1306783 1332731 1195057 961469 691328 514731 573505 760399
35341G60399j7295l40447l68094r2202J09439Q9749R6556K57202L41458K02939
$$ 760399 743104 402657 34563 -57639 51800 141549 238105 495307 836765 1039704
35331A039704O9116J63611L44410L54570J90968R58j80825l69513m61418l36508
$$ 1039704 1108820 1272431 1616841 1971411 2162379 2163337 1982512 1612999 1151581 815073
35321H15073m1940K52792L98021L10795K6944k41573k66135o9944J17357J71839
$$ 815073 773133 1025925 1423946 1734741 1761685 1520112 1253977 1184033 1301390 1473229
35311A473229J37618Q725k54169m71972l57909K9197K72459J53096j02466k41197
$$ 1473229 1610847 1619572 1365403 893431 535522 564719 837178 990274 887808 646611
35301F46611k85641k71553q8541J87724J98059j59823m36775k21811K64002N12168
$$ 646611 360970 89417 876 188600 386659 226836 -209939 -431750 -167748 344420
35291C44420L97799J45959j06696l04435k56749J01122L81126J59535l46649m92281
$$ 344420 742219 888178 781482 477047 220298 321420 702546 862081 515432 23151
35281B3151r5337L38176L59317J25561L1015J22747J48114J5729n2193J44901
$$ 23151 -72186 265990 625307 750868 781883 904630 1052744 1068473 1016280 1161181
35271A161181M24746L43163k29148p71080o38292O2583N12393K54347k04080j99442
$$ 1161181 1585927 1929090 1699942 928862 290570 353153 865546 1119893 915813 716371
35261G16371J10732J29189j35201j24931K48514M11717R8622j97420o3332J55103
$$ 716371 827103 956292 821091 696160 944674 1356391 1455013 1257593 1194261 1349364
35251A349364j6440l50488l03132O4483J82670j05712l27856j61839R6554O7488
$$ 1349364 1332924 982436 679304 743787 926457 820745 492889 331050 427604 495092
35241D95092j26452j23574R4456K26390J23271o9621j75129j19885J30306M74077
$$ 495092 368640 245066 339522 565912 689183 619562 444433 324548 454854 928931
35231I28931N54316J08294n07100n62772P6259O46891M80928p7852k34797O8296
$$ 928931 1483247 1591541 1084441 521669 597928 1244819 1725747 1647895 1413098 1481394
35221A481394J77748j53679m03621j94082J04795M2048j86208j54335M4164J3115
$$ 1481394 1659142 1505463 1101842 907760 1012555 1054603 868395 714060 758224 771339
35211G71339k20095k56099j4159J48842M0220r8854l7376J07322J48136J51161
$$ 771339 551244 295145 280986 429828 470048 371194 333818 441140 589276 740437
35201G40437K55744L57023K11718j88686n31569n04157j16531L29321N35998M18466
$$ 740437 996181 1353204 1564922 1376236 844667 340510 223979 553300 1089298 1507764
35191A507764O4521l61240o13999m49227Q8981N55425N30533J31518j51338j00810
$$ 1507764 1572285 1211045 597046 147819 236800 792225 1322758 1454276 1302938 1202128
35181A202128M8344P8423O1666O9695m265j57303j70928q275L3088j86916l65363
$$ 1202128 1250472 1328895 1390561 1460256 1455991 1298688 1127760 1119485 1152573 965657 600294
35170F00294k59062j00312j36933j26642K23574O16881N42934J08156j15457J2808
$$ 600294 341232 240920 103987 -22655 200919 817800 1360734 1468890 1353433 1366241
35160A366241O9435j54206l45225k70874j36027j22362m6204K38527M71079L35809
$$ 1366241 1435676 1281470 936245 665371 529344 406982 360778 599305 1070384 1406193
35150A406193o6984l73539l99398k25473j3237R1447K7255p4798k0164J21725
$$ 1406193 1339209 965670 566272 340799 327562 419009 446264 371466 351302 473027
35140D73027O0520k17049k96944O8752M90188M15352q7302m16967k59983P5834
$$ 473027 533547 316498 19554 88306 578494 993846 906544 489577 229594 305428
35130C05428K00774J34664Q1437L0131j31494k97590k57937m3485J42730K80313
$$ 305428 506202 640866 722303 752434 620940 323350 65413 21928 164658 444971
35120D44971M71138N43164J70670m70552o63786j09941N03127L87204k22215m57952
$$ 444971 916109 1459273 1629943 1159391 495605 385664 888791 1275995 1053780 595828
35110E95828j28293J25669l4630j70679N2431K78243J58892j4177R6385K00348
$$ 595828 467535 593204 558574 387895 440326 718569 877461 863284 959669 1160017
35100A160017p9306m20936k61251K26647L30206j21358n33290m39327o0447J46562
$$ 1160017 1080711 659775 398524 625171 955377 834019 300729 -138598 -199045 -52483
35090e2483O5002r5088q5935J79917N02367M99388P6229l19039k16871K05124
$$ -52483 12519 -82569 -168504 11413 513780 1013168 1089397 770358 553487 758611
35080G58611L40522k1266m70746n70998l13013N5672L37333M47923M06015L10709
$$ 758611 1099133 1077867 607121 36123 -276890 -221218 116115 564038 970053 1280762
35070A280762K09643O0839p5552l0306J11822l5949n37430q12666l97313K83664
$$ 1280762 1490405 1551244 1475692 1445386 1557208 1521259 983829 171163 -226150 57514
35060E7514M60940J04419j67906j02054k3156q0225j3544K09838K07672j47095
$$ 57514 518454 622873 454967 352913 329757 249532 235988 445826 653498 506403
35050E06403m39485l53236j14743m0759o8252K191J47514K47858K89585K68721
$$ 506403 66918 -286318 -401061 -441820 -510072 -507881 -360367 -112509 177076 445797
35040D45797J47495J4728K6185J26618J10696k6594j10578j28184j86724j83583
$$ 445797 593292 608020 634205 760823 871519 844925 734347 606163 419439 235856
35030B35856N3053L29597K71669o1288k39272j35979j3988N4349K51009M58441
$$ 235856 288909 618506 890175 828887 589615 453636 439648 493997 745006 1203447
35020A203447K92185j92337m59815l08681r6482j9038J40556L62856K49111j95167
$$ 1203447 1495632 1303295 843480 534799 438317 419279 559835 922691 1171802 976635
35010I76635l90783j41086J0346k13249k62592K41653P21336N35226J2238j49009
$$ 976635 585852 444766 455112 241863 -20729 220924 942260 1477486 1489724 1340715
35000A340715L3759R9216K9230Q4654J44350k1568j51783P4832L17929O6080m25821
$$ 1340715 1374474 1473690 1502920 1587574 1731924 1710356 1558573 1633405 1951334 2017414 1591593
34989A591593n09068k33140j98748m48301m09693M3743L61677K74880J60426K35272
$$ 1591593 1082525 849385 650637 202336 -207357 -163614 198063 472943 633369 868641
34979H68641J69864j67394k95537R6336N24823L94903j01603l09349p4275J47749
$$ 868641 1038505 871111 575574 671910 1196733 1591636 1490033 1180684 1106409 1254158
34969A254158N3904j20433o5800J05706M7301k86401n24328l46739Q2046L06272
$$ 1254158 1308062 1187629 1121829 1227535 1274836 988435 464107 117368 199414 505686
34959E05686J59554n2945j1257J89735K28593L4135j34112m9209J96421K98243
$$ 505686 665240 612295 601038 790773 1019366 1053501 919389 870180 1066601 1364844
34949A364844Q4340k56098l29638M455M06962M41362J14373j85555k35669j74113
$$ 1364844 1449184 1193086 863448 867903 1274865 1716227 1830600 1645045 1409376 1235263
34939A235263j49738j09952j6817L2521J5720N1063J50094J47603l6902k83295
$$ 1235263 1085525 975573 958756 991277 1006997 1058060 1208154 1355757 1318855 1035560
34929A035560m43019m16578j32266K72457L96298Q9666j68503O7658L94579J24659
$$ 1035560 592541 175963 43697 316154 712452 802118 633615 701273 1095852 1220511
34919A220511m92660n39196P1255M04419L5427l18310j09788J69362L8866o8740
$$ 1220511 727851 188655 259910 664329 699756 381446 271658 441020 479886 411146
34909D11146K74524N80478L18642r7252j07109l8414l61042o19141k08313L87291
$$ 411146 685670 1266148 1584790 1487538 1380429 1342015 980973 361832 153519 540810
34899E40810L24612j15159k6429M87700M94769j16312m59766j53114J99464J60261
$$ 540810 865422 750263 723834 1211534 1706303 1589991 1130225 977111 1176575 1336836
34889A336836J8579M523q8725k77019k40537q40M2833j15171n6732K28898K86966
$$ 1336836 1355415 1359938 1271213 994194 753657 752817 795650 680479 623747 852645 1139611
34878A139611N9964j0017J62003J76263k2934m8560Q9603m7062l68321k28947
$$ 1139611 1199575 1189558 1351561 1527824 1504890 1456330 1545933 1498871 1130550 901603
34868I01603L90357O45121J31621m80977n43761k93282j56792j6989K81172M15466
$$ 901603 1291960 1937081 2068702 1587725 1043964 750682 593890 576901 858073 1273539
34858A273539J60596j23623j03697j6308j22503j80203M2286K53950J47259n8251
$$ 1273539 1434135 1310512 1206815 1190507 1068004 887801 930087 1184037 1331296 1273045
34848A273045n9473m925j14841j97731k9480J65974Q7605j17593j39942l1806
$$ 1273045 1213572 1208647 1093806 896075 866595 1032569 1120174 1002581 862639 830833
34838H30833m0813j59982k05920j54276j09410r8264q5147l8345R1499K62248
$$ 830833 790020 630038 424118 269842 160432 62168 -22979 -61324 30175 292423
34828B92423K46874n6349l18267j80341J61134K50129R1658K884n6960k84954
$$ 292423 539297 482948 164681 -15660 145474 395603 487261 490145 433185 148231
34818A48231l56648J50708P61496N65624k86581o59817j60131L68901L39209J89231
$$ 148231 -208417 -57709 703787 1269411 982830 323013 162882 531783 870992 1060223
34808A060223K52658J07656l57589m41159R2204L81620p5179m77348j47957K27157
$$ 1060223 1312881 1420537 1062948 621789 713993 1095613 1020434 543086 395129 622286
34798F22286j21105n79939k35564M68816N20112O7368l0585J86841N5253k71700
$$ 622286 501181 -78758 -314322 154494 674606 741974 711389 898230 953483 681783
34788F81783j01584L63988L08584j54024j32221L94858M95153m8426l64320n2013
$$ 681783 580199 944187 1252771 1098747 966526 1361384 1856537 1808111 1443791 1391778
34778A391778J74906j74352n37981l46567O5177J70119Q8286J51097K57002J77852
$$ 1391778 1566684 1392332 854351 507784 572961 743080 831366 982463 1239465 1417317
34768A417317J3483p4910j58940k57801j79061R2895K52656J33625p2674k01596
$$ 1417317 1430800 1355890 1196950 939149 760088 852983 1105639 1239264 1166590 964994
34758I64994k98247k99868j3432M30660N73206K66661j01109j92891j17628q0049
$$ 964994 666747 366879 353447 784107 1357313 1623974 1522865 1329974 1212346 1132297
34748A132297n6762r699l4944j08708l9253J53392J57180j41701m01060k66901
$$ 1132297 1075535 1065836 1030892 922184 882931 1036323 1193503 1051802 650742 383841
34738C83841J55774M56938L94827J12932j6045K26787N82253N11876j06744p04867
$$ 383841 539615 996553 1391380 1504312 1488267 1715054 2297307 2809183 2702439 1997572
34728A997572p22699l37462j07228j27527m9845K08472L39207K06768K0497q7914
$$ 1997572 1274873 937411 830183 702656 652811 861283 1200490 1407258 1427755 1339841
34718A339841j97251k67184j18092J84104L07261J06213j94710l04895j27533
$$ 1339841 1142590 875406 757314 941418 1248679 1354892 1160182 855287 727754
34709G27754K14513M03413J63265k86704l27985J72397M95722R9772m48562l01702
$$ 727754 942267 1345680 1508945 1222241 894256 1066653 1562375 1662147 1213585 911883
34699I11883K91450L71123j64277m16579L0126N01681L79367l2359j78755o9230
$$ 911883 1203333 1574456 1410179 993600 1023726 1525407 1904774 1872415 1693660 1624430
34689A624430J4555M2035N0961q6003l51083m34468j82709J61817L52775L84409
$$ 1624430 1638985 1681020 1731981 1645978 1294895 860427 677718 839535 1192310 1576719
34679A576719K39628j21954m12103k21394K44902K63266k98413o11508n6987P94485
$$ 1576719 1816347 1694393 1282290 1060896 1305798 1569064 1270651 659143 602156 1396641
34669A396641R28832K35860m63114n36166j70754Q8708M1266n7930N8321K59187
$$ 1396641 2325473 2561333 2098219 1562053 1391299 1480007 1521273 1463343 1521664 1780851
34659A780851J93473j08116j36023L20126O52833K19500o06902q53559l21277
$$ 1780851 1974324 1866208 1730185 2050311 2703144 2922644 2315742 1462183 1140906
34650A140906K08083J90666l0689j2934Q8074k0489j95763j75299m4398k3634
$$ 1140906 1348989 1539655 1508966 1496032 1584106 1563617 1367854 1192555 1148157 1124523
34640A124523j12316j99398k29129j09415K00348M38866L02068j8913p7737M0490
$$ 1124523 1012207 812809 583680 474265 674613 1113479 1415547 1396634 1318897 1359387
34630A359387j60959o04638n75807R6224O12915L92557o9135o6707K49894L07185
$$ 1359387 1198428 593790 17983 114207 727122 1119679 1050544 983837 1233731 1540916
34620A540916O6100j09570j30984j15236J4868K89009L68161K6107l38183k27283
$$ 1540916 1607016 1497446 1366462 1251226 1266094 1555103 1923264 1949371 1611188 1383905
34610A383905J65853K50956p0677l45203k72232l647J84230J48962q6013k70493
$$ 1383905 1549758 1800714 1730037 1384834 1112602 1108955 1293185 1442147 1356134 1085641
34600A085641p7749M10349O20419K08101m10955o11394l69562j22437o3845l5043
$$ 1085641 1007892 1418241 2038660 2246761 1835806 1224412 854850 732413 668568 633525
34590F33525M7868R6979R7229R6471M1855q3898j02258R2220K59381J20172k00131
$$ 633525 681393 778372 875601 972072 1013927 930029 827771 919991 1179372 1299544 1099413
34579A099413l37079j82247O0363K11742K68284K93982L36160L62497K17389j63574
$$ 1099413 762334 580087 640450 852192 1120476 1414458 1750618 2113115 2330504 2166930
34569B166930m71462l02606J87644L48786m7349m27758k71039J29904J98746k3863
$$ 2166930 1695468 1392862 1580506 1929292 1881943 1454185 1183146 1313050 1511796 1487933
34559A487933n1661K16953L84125J86623j87976m06415l16811p399K60586K62898
$$ 1487933 1436272 1653225 2037350 2223973 2035997 1629582 1312771 1305372 1565958 1828856
34549A828856P9098j6064K391j24283m15722n02061k16267Q6814J06035O9898
$$ 1828856 1907954 1891890 1894281 1769998 1354276 852215 635948 722762 828797 898695
34539H98695K56941M33003K38475j58404k91350r0559J04106R6607J066o3975
$$ 898695 1155636 1588639 1827114 1668710 1377360 1286801 1390907 1487514 1488580 1424605
34529A424605j10989j51534j55800r7012O0382K76203L24591N0370k59550j74042
$$ 1424605 1313616 1162082 1006282 909270 969652 1245855 1570446 1620816 1361266 1187224
34519A187224J77257K34727n6950j19787K13823L00137k14815o44517k88846L98555
$$ 1187224 1364481 1599208 1542258 1422471 1636294 1936431 1721616 1077099 788253 1186808
34509A186808M76089p2746m28531j98462K01816L37285K35494P4061o7085j08429
$$ 1186808 1662897 1590151 1161620 963158 1164974 1502259 1737753 1811814 1744729 1636300
34499A636300j8596O4360L5156O67K2098m4504j76995l5776M47740P37043M03103
$$ 1636300 1617704 1682064 1717220 1717887 1739985 1695481 1518486 1482710 1930450 2667493 3070596
34488C070596j98333m44399k86178q4923K0470O0434p7203l51486l29577J72918
$$ 3070596 2872263 2427864 2141686 2056763 2077233 2137667 2060464 1708978 1379401 1552319
34478A552319N79567L01280l51836o47922m79134k56664r5176J70791M24780M33324
$$ 1552319 2131886 2433166 2081330 1433408 954274 697610 602434 773225 1198005 1631329
34468A631329L36226L29719J83977k45283m41803J1222N06294K17028n01050n99823
$$ 1631329 1967555 2297274 2481251 2235968 1794165 1805387 2311681 2528709 2027659 1427836
34458A427836j7204L08043N0256r6367K16637L99989O4873k79321j51712J22222
$$ 1427836 1410632 1718675 1768931 1672564 1889201 2289190 2354063 2074742 1923030 2045252
34448B045252P2990j56841k03637p5656N8769K00331L01640J64734j68069l41881
$$ 2045252 2118242 1961401 1757764 1682108 1740877 1941208 2242848 2407582 2239513 1897632
34438A897632k24503r1416j09589r3467N5805J33229M0379j5539R1505K05548
$$ 1897632 1673129 1581713 1472124 1378657 1434462 1567691 1608070 1592531 1684036 1889584
34428A889584K02231J40087L9190j12190j33387J34258M19263L10503q1474k80329
$$ 1889584 2091815 2231902 2271092 2158902 2025515 2159773 2579036 2889539 2808065 2527736
34418B527736k11013k12638l09901j49619K61950M36023J76497j30553j74683
$$ 2527736 2316723 2104085 1794184 1644565 1906515 2342538 2519035 2388482 2213799
34409B213799j03803q8966n2229J2347m1266j45777p7433N3303q3776l80152l50897
$$ 2213799 2109996 2021030 1968801 1981148 1939882 1794105 1716672 1769975 1686199 1306047 955150
34398I55150N9927L64152L26567K28425K06133J3998l55562m90329k49663j1662
$$ 955150 1015077 1379229 1705796 1934221 2140354 2154352 1798790 1308461 1058798 1047136
34388A047136J9459J23779M10262M92933J75204j25237l7715J69565P1347k36939
$$ 1047136 1066595 1190374 1600636 2093569 2268773 2143536 2105821 2275386 2346733 2109794
34378B109794l35244p8031K93608M40070J89206k67689m41430r3417L70429M29297
$$ 2109794 1774550 1696519 1990127 2430197 2619403 2351714 1910284 1816867 2187296 2616593
34368B616593K01302J54386K56190R2553k75993l51617r2111K3659j13004q5308
$$ 2616593 2817895 2972281 3228471 3321024 3045031 2693414 2601303 2624962 2511958 2426650
34358B426650J97279L04267J12671K4326J45647O0316l20101m81286j94321Q8100
$$ 2426650 2623929 2928196 3040867 3065193 3210840 3271156 2951055 2469769 2275448 2363548
34348B363548N8455L0172K21658K87141k2959l70766l95530k10846l4495J14097
$$ 2363548 2422003 2452175 2673833 2960974 2938015 2567249 2171719 1960873 1926378 2040475
34338B040475J21322j90715n43790l97681J44661L73576J09053l7379K06180K92987
$$ 2040475 2161797 1971082 1427292 1029611 1174272 1547848 1656901 1619522 1825702 2118689
34328B118689r6760m19369j87374K43551L26602J00070j33132k75915k36802Q8753
$$ 2118689 2021929 1602560 1415186 1658737 1985339 2085409 1952277 1676362 1439560 1528313
34318A528313L73041J23343m02131m05475J29251L45082K295j20039K75176L89798
$$ 1528313 1901354 2024697 1622566 1217091 1346342 1691424 1693719 1573680 1848856 2238654
34308B238654j46110m32357J54197P64543M61785k39377l37312L7726J25727p8911
$$ 2238654 2092544 1660187 1814384 2578927 3040712 2801335 2464023 2501749 2627476 2548565
34298B548565r4067m046j62236l39470j52838J26750Q3418m0034J08824K18542
$$ 2548565 2454498 2450452 2288216 1948746 1795908 1922658 2006076 1966042 2074866 2293408
34288B293408m6592k57968O387K42857j25819n91462l34117L71039O27320L56023
$$ 2293408 2246816 1988848 1995235 2238092 2112273 1520811 1186694 1557733 2185053 2541076
34278B541076J65044J58078l2450l19071l04503j12529j35596k30540o3186Q9712
$$ 2541076 2706120 2864198 2831748 2512677 2208174 2095645 1960049 1729509 1666323 1756035
34268A756035j78285m77491j69384M74147O59977L43996J20108J08847k9846k06790
$$ 1756035 1577750 1100259 930875 1405022 2064999 2408995 2529103 2637950 2608104 2401314
34258B401314n1547K26449J17189k09325j75736J14250O4834k57634j94680L03714
$$ 2401314 2349767 2576216 2693405 2484080 2308344 2422594 2487428 2229794 2035114 2338828
34248B338828N50277K67213m4716j0225J41789J44491O4251j3381j20512j81781
$$ 2338828 2889105 3156318 3111602 3101377 3243166 3387657 3451908 3438527 3318015 3136234
34238C136234r5230K3288M4690P2976J47080N2664k05853k39993J0074L9471k55850
$$ 3136234 3041004 3064292 3108982 3181958 3329038 3381702 3175849 2935856 2945930 2985401 2729551
34227B729551j83141N07885Q89049K66379n39613m30490K29040L48649p2194k12468
$$ 2729551 2546410 3054295 3943344 4209723 3670110 3239620 3468660 3817309 3745115 3532647
34217C532647O758J7425j15388J12632M38738J57383n35950p88294n06390l16850
$$ 3532647 3539405 3556830 3441442 3554074 3992812 4150195 3614245 2825951 2319561 2002711
34207B002711l02568q418M52334N09803K23513J17846J35899r9589k75001J19883
$$ 2002711 1700143 1691725 2144059 2653862 2877375 2995221 3131120 3031531 2756530 2876413
34197B876413N93525L01783l67826l04865M12566O23246L6730m28258l02572r8134
$$ 2876413 3469938 3771721 3403895 3099030 3511596 4134842 4171572 3743314 3440742 3342608
34187C342608p5600J00532L30192P4200m50649l99112K14063M48570K0043l27153
$$ 3342608 3267008 3367540 3697732 3771932 3321283 2922171 3136234 3584804 3604847 3277694
34177C277694j80578N4243J54177L35703M34418O3367l90035j98405L24964K44529
$$ 3277694 3097116 3151359 3305536 3641239 4075657 4139024 3748989 3550584 3875548 4120077
34167D120077k90492k67657L12064M22591o7105j79890K84379L94880q8525k73220
$$ 4120077 3829585 3561928 3873992 4296583 4229478 4049588 4333967 4728847 4640322 4367102
34157D367102J13733K44596j14171j46145K92512K36474n19723q39616k12044
$$ 4367102 4480835 4725431 4611260 4465115 4757627 4994101 4474378 3634762 3422718
34148C422718L65929K05051j1552K28371K66334k90470o38755k26628K41384J42732
$$ 3422718 3788647 3993698 3982146 4210517 4476851 4186381 3547626 3320998 3562382 3705114
34138C705114l0457J74325K73596o0678k59891O092J75966j9531N140M10389M41349
$$ 3705114 3674657 3848982 4122578 4061900 3802009 3808101 3984067 3964536 3969676 4380065 4821414
34127D821414j10399l62973M9954K98835k905m1088N14175O87951P302m78267
$$ 4821414 4711015 4348042 4397996 4696831 4693926 4652838 5167013 5854964 5862266 5383999
34117E383999l8678M32817R8355l44935q7833K99951P6365k64901m6560L23067
$$ 5383999 5345321 5778138 5876493 5531558 5443725 5743676 5820041 5555140 5508580 5831647
34107E831647L00879K53482M64013L32622l51572o42931o5828L35639k32906q56516
$$ 5831647 6132526 6386008 6850021 7182643 6831071 6188140 6122312 6457951 6225045 5368529
34097E368529n13385J76112J75981k04802j69303O4645l1146j33378J27892K47793
$$ 5368529 4855144 5031256 5207237 5002435 4833132 4897777 4866631 4733253 4861145 5108938
34087E108938r5859j83982L95048P49075K18663l64009j83491J31232j04416k20137
$$ 5108938 5013079 4829097 5224145 5973220 6191883 5827874 5644383 5775615 5671199 5451062
34077E451062L73137P33558O85q26224m45134N47447P48729K28653p581P3654
$$ 5451062 5824199 6557757 6558442 5732218 5287084 5834531 6583260 6811913 6804332 6877986
34067F877986j31030l95867j44902K66480J76411j46433j44316o6977k51863k12125
$$ 6877986 6746956 6351089 6206187 6472667 6649078 6502645 6358329 6291352 6039489 5827364
34057E827364L82390P82252L81241j50849p7235J59104j2890j85907L935L4259
$$ 5827364 6209754 6992006 7373247 7222398 7145163 7304267 7291377 7105470 7109405 7143664
34047G143664k81597j60869N23099O08594k48059o41398J61677Q17943L30427
$$ 7143664 6862067 6701198 7224297 7832891 7584832 6943434 7105111 7923054 8253481
34038H253481j84011K62394O45293O6553l71893K27615O36844j35424p38166L1078
$$ 8253481 8069470 8331864 8977157 9043710 8671817 8899432 9536276 9400852 8662686 8693764
34028H693764Q26073K40187n05147O4213P94546J68481o68892r3088Q06299K94152
$$ 8693764 9519837 9760024 9254877 9319090 10113636 10282117 9613225 9520137 10326436 10620588
34018A0620588o48315k02205Q28933O43928j68546o3357L38905k20084p32472
$$ 10620588 9972273 9770068 10599001 11242929 11074383 11011026 11349931 11129847 10397375
34009A0397375J56592J110091L68362p73186k57801Q57429M89002m53557j3034
$$ 10397375 10553967 11664058 12032420 11259234 11001433 11858862 12347864 11894307 11881273
34000A1881273P98636L3003j044952j55392J453775J128561k66072j33436Q74824
$$ 11881273 12679909 12712912 11667960 11512568 12966343 14094904 13828832 13695396 14570220
33991A4570220M37927n82873J49095J529123R41976n05886M56J384145O74002
$$ 14570220 15008147 14425274 14574369 16103492 17045468 16539582 16540038 17924183 18598185
33982A8598185j023340m46252J451062J213820m52877j51555J435707R36467q29378
$$ 18598185 17574845 17128593 18579655 19793475 19340598 19189043 20624750 21561217 20731839
33973B0731839l36314J501089R69065q65218O1008K579495K062062n80283l74794
$$ 20731839 20395525 21896614 22865679 22000461 22061469 24640964 26703026 26122743 25747949
33964B5747949K085368J751016p99402k66001K748707K514247m81801q1870L402944
$$ 25747949 27833317 29584333 28784931 28518930 31267637 33781884 33300083 33218213 36621157
33955C6621157L436970J87700N25658M224504L894779J4654J016917O462348O653901
$$ 36621157 40058127 40245827 40771485 44995989 48890768 48905422 49922339 56384687 63038588
33946F3038588J718012K654997R617813R968320L307610M502627J4050477J3783787
$$ 63038588 64756600 67411597 77029410 86997730 90305340 94807967 108858444 122642231
33938A22642231M302737J2008493L5676361K3694399n4060309j39042132j42292620
$$ 122642231 126944968 138953461 174629822 198324221 144263912 5221780 -137070840
33931a37070840o0347691K0317441L6678182J4212825N161409J3748705J4035874
$$ -137070840 -197418531 -177101090 -140422908 -126210083 -121048674 -107299969 -93264095
33924i3264095M013840J942208Q645406R150450K483344J072701N896738O313915
$$ -93264095 -89250255 -87308047 -78662641 -69512191 -67028847 -65956146 -60059408 -53745493
33916e3745493J307657J22147L773623M177045M90390K5048L451663L825444K64761
$$ -53745493 -52437836 -52315689 -48542066 -44365021 -43874631 -43849583 -40397920 -36572476 -36307715
33907c6307715p61152J981376K822852N08237q2434J915038J959627m37450o60804
$$ -36307715 -37068867 -35087491 -32264639 -31756402 -31838836 -29923798 -27964171 -28401621 -29062425
33898b9062425J802731K307677O7708n03763J558960K122051R1974o95979R66895
$$ -29062425 -27259694 -24952017 -24884309 -25388072 -23829112 -21707061 -21615087 -22311066 -21344171
33889b1344171J652781K20684k58235J101729J316657l55841r24719L78138P11945
$$ -21344171 -19691390 -19470706 -19728941 -18627212 -17310555 -17666396 -18591115 -18212977 -17501032
33880a7501032n41380n15216J277279J680392q8953q78502M31467R93249l12059
$$ -17501032 -18042412 -18557628 -17280349 -15599957 -15688910 -16567412 -16135945 -15142696 -15454755
33871a5454755p28753R00515J752554K78546j005784k33615P76238M12910L4941
$$ -15454755 -16183508 -15282993 -13530439 -13251893 -14257677 -14491292 -13715054 -13302144 -13267203
33862a3267203O75261Q84233o7205m93900L08468N52262m19058o22441O90055
$$ -13267203 -12591942 -11707709 -11774914 -12268814 -11960346 -11408084 -11827142 -12449583 -11759528
33853a1759528J293878K9363r65927r2869R99040O39456p4766J55456M15773j69952
$$ -11759528 -10465650 -10436287 -11402214 -11495083 -10496043 -9856587 -9931353 -9775897 -9360124 -9530076
33843i530076m97461J96529O32145k5310m78920J32255M99017k59071p67413M989
$$ -9530076 -10027537 -9831008 -9198863 -9224173 -9703093 -9570838 -9071821 -9330892 -10098305 -10093316
33833a0093316P37439K15577m86153j43049M45193K38128j06857J84896M16612
$$ -10093316 -9355877 -9140300 -9626453 -9769502 -9324309 -9086181 -9193038 -9008142 -8591530
33824h591530L6358o5697N87775Q45528P4764m45575J86434P85903K56859m44570
$$ -8591530 -8555172 -8620869 -8033094 -7187566 -7112802 -7558377 -7371943 -6586040 -6329181 -6773751
33814f773751j79617L55106J46007k87407j66008K3278k22621k29674L76393O09615
$$ -6773751 -6953368 -6598262 -6452255 -6739662 -6905670 -6882392 -7105013 -7334687 -6958294 -6348679
33804f348679q3113o17558k17209J52088l10151o57472j9762P06404N33727R5724
$$ -6348679 -6431792 -7049350 -7266559 -7114471 -7424622 -8082094 -8101856 -7395452 -6861725 -6766001
33794f766001J59758J10970n10998o73689K66813J009605M03247m97584l00682
$$ -6766001 -6606243 -6495273 -7006271 -7679960 -7413147 -6403542 -6000295 -6497879 -6798561
33785f798561L44013J70354l42950q4162M77371K58701l25144k26008K10837L0111
$$ -6798561 -6454548 -6284194 -6627144 -6711306 -6233935 -5975234 -6300378 -6526386 -6315549 -6285438
33775f285438l95976j23929M55236L41455j43676J4921N79563N30068k8898j39566
$$ -6285438 -6681414 -6805343 -6350107 -6008652 -6152328 -6137407 -5557844 -5027776 -5056674 -5196240
33765e196240K45366L60002J15266K3884Q933l28775o28152k68888M02698N59191
$$ -5196240 -4950874 -4590872 -4475606 -4451722 -4442789 -4771564 -5399716 -5668604 -5265906 -4706715
33755d706715K22772J0516J1530l9310j1864J90119R6787m39597o06966N7210
$$ -4706715 -4483943 -4473427 -4461897 -4501207 -4513071 -4322952 -4226165 -4665762 -5272728 -5215518
33745e215518O12472J63802n74571n09446l2911j36841n03125j57770O09715P01568
$$ -5215518 -4603046 -4439244 -5013815 -5523261 -5556172 -5693013 -6196138 -6353908 -5744193 -5042625
33735e042625J40599j08372R8820R9235q3463J55697N89362L99715k46741l47503
$$ -5042625 -4902026 -5010398 -4911578 -4812343 -4895806 -4740109 -4150747 -3751032 -3997773 -4345276
33725d345276K10832M81831R5360k49745r0886J78567J96807J24041O5777j24135
$$ -4345276 -4134444 -3652613 -3557253 -3806998 -3897884 -3719317 -3522510 -3398469 -3332692 -3456827
33715c456827l51669l41131j85895j70559j83875K2103K39932J75601P4844K38692
$$ -3456827 -3808496 -4149627 -4335522 -4506081 -4689956 -4667853 -4427921 -4252320 -4177476 -3938784
33705c938784L26415l3308l85492j29141L69298L34365j21194k81016p7111j0749
$$ -3938784 -3612369 -3645677 -4031169 -4160310 -3791012 -3456647 -3577841 -3858857 -3935968 -3946717
33695c946717r5466O6025L46113K51196j15698j80661J31880L81061L86532K71483
$$ -3946717 -4042183 -3976158 -3630045 -3378849 -3494547 -3675208 -3543328 -3162267 -2775735 -2504252
33685b504252N812l52720l43456J84954N06915K3266o70178o55619j12738J52747
$$ -2504252 -2498440 -2851160 -3194616 -3009662 -2502747 -2479481 -3149659 -3805278 -3918016 -3765269
33675c765269P1073Q9539R8550k24226m44713O77O06560N10578J7422M6052M09579
$$ -3765269 -3694196 -3604657 -3506107 -3730333 -4175046 -4174369 -3567809 -3057231 -3039809 -2993757 -2584178
33664b584178J55459n86667o92500J5176M65685J55297j97131r0670L2843j16194
$$ -2584178 -2428719 -3015386 -3707886 -3692710 -3227025 -3071728 -3268859 -3359529 -3326686 -3442880
33654c442880j12087K04317K98112l5955k12771J16466M48222K81664j43080l33500
$$ -3442880 -3554967 -3350650 -3052538 -3088493 -3301264 -3184798 -2736576 -2454912 -2597992 -2931492
33644b931492j70901J76797M35475K79879k37575m55691L4240N71902L16244l69934
$$ -2931492 -3102393 -2925596 -2490121 -2210242 -2447817 -2903508 -2869268 -2297366 -1981122 -2351056
33634b351056m69029K6327K17919o9280j04714K58111K84910k11255m61162j28712
$$ -2351056 -2820085 -2793758 -2575839 -2645119 -2749833 -2491722 -2206812 -2418067 -2879229 -3007941
33624c007941J15347j39537l42719o9126K29650J22553p1679o087O7590q0286
$$ -3007941 -2892594 -3032131 -3374850 -3443976 -3214326 -3091773 -3163452 -3169539 -3101949 -3182235
33614c182235j53619O8851K98649L00948K43139J73131j43839n68898n20394R0532
$$ -3182235 -3335854 -3267003 -2968354 -2667406 -2424267 -2251136 -2394975 -2963873 -3484267 -3393735
33604c393735N66524M17886j4106k36942k45997j88431l9253J05570K5636j25982
$$ -3393735 -2827211 -2409325 -2423431 -2660373 -2906370 -3094801 -3134054 -3028484 -3002848 -3128830
33594c128830M5024M06966L87443l4557k16257Q0058L33719K28702J36534L20952
$$ -3128830 -3083806 -2676840 -2289397 -2323954 -2540211 -2460153 -2126434 -1897732 -1761198 -1440246
33584a440246M49931K56739k2533j91092l94849o15252n40066j86528J3082o3149
$$ -1440246 -990315 -733576 -756109 -947201 -1342050 -1957302 -2497368 -2683896 -2670814 -2733963
33574b733963r5263j9895r4995j96267P5394M93137L84773j47510k53278K04262
$$ -2733963 -2829226 -2849121 -2944116 -3140383 -3064989 -2571852 -2187079 -2334589 -2587867 -2383605
33564b383605L65040j02620l90988J2515M32397K18179j84489j30101J49274J23808
$$ -2383605 -2018565 -2121185 -2512173 -2499658 -2067261 -1849082 -2033571 -2163672 -2014398 -1890590
33554a890590j29117k82701l37673k76364J26714O35082N14196k84730p74029
$$ -1890590 -2019707 -2302408 -2640081 -2916445 -2789731 -2154649 -1640453 -1925183 -2699212
33545b699212l63512K54576L12175J12270J91167K67340m2216k71849J13379O47315
$$ -2699212 -3062724 -2808148 -2495973 -2383703 -2192536 -1925196 -1967412 -2239261 -2125882 -1478567
33535a478567N67585L9130k69031l12953m39699m94047j24770L67304L95277L6262
$$ -1478567 -910982 -871852 -1140883 -1453836 -1893535 -2387582 -2512352 -2145048 -1749771 -1713509
33525a713509j81183j71712k30167l38267k46934k9064O5701O5488P1039n5620
$$ -1713509 -1894692 -2066404 -2296571 -2634838 -2881772 -2910836 -2845135 -2779647 -2708608 -2764228
33515b764228k98867k38115K58353N94208L22214p0431L6521L30653J27402m19703
$$ -2764228 -3063095 -3301210 -3042857 -2448649 -2126435 -2196866 -2160345 -1829692 -1702290 -2121993
33505b121993n50673r5079L64805L88196Q3424k39992l16035k9371L20858K17053
$$ -2121993 -2672666 -2767745 -2402940 -2014744 -1931320 -2171312 -2487347 -2516718 -2195860 -1978807
33495a978807k58028l46513J96705N46604P4926n64095m49340J69300M12612J95561
$$ -1978807 -2236835 -2583348 -2386643 -1840039 -1765113 -2329208 -2778548 -2609248 -2196636 -2001075
33485b001075P0404R2711p1101k27244O6030N06874L74055k83533p31463o90790
$$ -2001075 -1930671 -1837960 -1909061 -2136305 -2070275 -1563401 -1189346 -1472879 -2204342 -2895132
33475b895132m81044j98549K78007O04520L13047k30686k28193K20318K40391
$$ -2895132 -3376176 -3574725 -3296718 -2692198 -2379151 -2609837 -2838030 -2617712 -2377321
33466b377321l07034n44426l1871N45844N31618K22429J58602K37069Q1961k35161
$$ -2377321 -2684355 -3228781 -3260652 -2714808 -2183190 -1960761 -1802159 -1565090 -1483129 -1718290
33456a718290l59434k07609J4749J34149J25234O9677Q1504J44204J06039j1246
$$ -1718290 -2077724 -2285333 -2270584 -2136435 -2011201 -1941524 -1860020 -1715816 -1609777 -1621023
33446a621023M6124K69677K27068k10801m48874n0153M31839K57243k71235k94994
$$ -1621023 -1574899 -1305222 -1078154 -1288955 -1737829 -1787982 -1356143 -1098900 -1370135 -1665129
33436a665129J68002L01375r9989l45914o4176K72801K43689M9367n9538j72761
$$ -1665129 -1497127 -1195752 -1295741 -1641655 -1705831 -1433030 -1189341 -1139974 -1199512 -1372273
33426a372273k93626k06099J1006k0708k83614l00219O3375L69141L53572K60415
$$ -1372273 -1665899 -1871998 -1860992 -1881700 -2165314 -2465533 -2402158 -2033017 -1679445 -1419030
33416a419030K46266J00883k18644l80152k31230j9701J06492K71694M24810L09702
$$ -1419030 -1172764 -1071881 -1290525 -1670677 -1901907 -1921608 -1815116 -1543422 -1118612 -808910
33406h08910M187j14023l5888j11204k99949j77180J91147J98836k49630m83622
$$ -808910 -804723 -918746 -954634 -1065838 -1365787 -1542967 -1351820 -1152984 -1402614 -1886236
33396a886236j86038P9629j02359k70663L9731M27070L14086o2615q3278K31743
$$ -1886236 -2072274 -1992645 -2095004 -2365667 -2325936 -1898866 -1584780 -1647395 -1730673 -1498930
33386a498930L31800M4916k25154j28753K22851M47224K75483j58785l73689j13369
$$ -1498930 -1167130 -1122214 -1347368 -1476121 -1253270 -806046 -530563 -689348 -1063037 -1176406
33376a176406K02222L3547l64507k51479L54602N88461J20709k95218j20200N1845
$$ -1176406 -974184 -940637 -1305144 -1556623 -1202021 -613560 -492851 -788069 -908269 -856424
33366h56424m01080r08395n60454L49489P00672K29978j81984O3655M77359L60413
$$ -856424 -1257504 -2165899 -2726353 -2376864 -1676192 -1446214 -1628198 -1564543 -1087184 -726771
33356g26771j80140m86609k56241J58117K43786o8144l39030j80995K02888K67566
$$ -726771 -906911 -1393520 -1649761 -1491644 -1247858 -1316002 -1655032 -1836027 -1633139 -1365573
33346a365573q3934l29176r8147K76388K67646j15840m53067n00456l10904J0548
$$ -1365573 -1449507 -1778683 -1876830 -1600442 -1332796 -1448636 -1901703 -2402159 -2713063 -2702515
33336b702515L16235L69746J34444n1013R5743L53200K97495r6861m71396n63944
$$ -2702515 -2386280 -2016534 -1882090 -1933103 -1837360 -1484160 -1186665 -1283526 -1754922 -2318866
33326b318866l75870l316L82952N13068K92915J0183k3688P5469j7691k78769
$$ -2318866 -2694736 -2698052 -2315100 -1802032 -1509117 -1498934 -1522622 -1447153 -1464844 -1743613
33316a743613l55584j18549J62925K35860J53822P1048O597n4400j6641J87298
$$ -1743613 -2099197 -2217746 -2054821 -1818961 -1665139 -1594091 -1587494 -1641894 -1658535 -1471237
33306a471237L92647L19201n1264l34375j49823L36387N13248J05801l96822l84528
$$ -1471237 -1078590 -759389 -810653 -1145028 -1294851 -958464 -445216 -339415 -736237 -1120765
33296a120765J3144J51403j39126l35910q9634K44836K09275q1719k28509j68268
$$ -1120765 -1107621 -956218 -1095344 -1431254 -1520888 -1276052 -1066777 -1148496 -1377005 -1545273
33286a545273j06687o6226Q2797K66328K59153N3546j26273j65563j60537j72066
$$ -1545273 -1651960 -1718186 -1635389 -1369061 -1109908 -1056362 -1182635 -1348198 -1508735 -1680801
33276a680801j10877O4963K03569J23825j28695k92748j97461J1498P0988p871
$$ -1680801 -1791678 -1726715 -1523146 -1399321 -1528016 -1820764 -2018225 -2006727 -1935739 -1943610
33266a943610L0529K14497K19242q9090l22261j31379K03062K12585K6992J32901
$$ -1943610 -1913081 -1698584 -1479342 -1568432 -1890693 -2022072 -1819010 -1606425 -1579433 -1446532
33256a446532M87706N40351J38784k41637k72666j48662n0171J34871L56854K99369
$$ -1446532 -958826 -418475 -279691 -521328 -793994 -942656 -992827 -857956 -501102 -201733
33246b01733j8539j44230K8384J9097l60925n70913k48677R5187r9434m78798
$$ -201733 -220272 -364502 -336118 -317021 -677946 -1248859 -1497536 -1402349 -1501783 -1980581
33236a980581l49229J93007M63242K72232O9876J11944J63408N1469o3702p3566
$$ -1980581 -2329810 -2136803 -1673561 -1401329 -1331453 -1219509 -1056101 -1004632 -1068334 -1141900
33226a141900j28406l20899m69843l50030J8212L53616L40182l6514l61551k24186
$$ -1141900 -1270306 -1591205 -2061048 -2411078 -2392866 -2039250 -1699068 -1735582 -2097133 -2321319
33216b321319J93685L18836N5273m7684K80729N21048K13515k14326r8148L66509
$$ -2321319 -2127634 -1808798 -1753525 -1801209 -1520480 -999432 -785917 -1000243 -1098391 -731882
33206g31882M10342j09157n26199l91666l0962O8352q6655j77806p4566Q4191
$$ -731882 -321540 -430697 -956896 -1348562 -1379524 -1311172 -1397827 -1575633 -1650199 -1566008
33196a566008J38966Q5112M2678Q1521R8568k0202j45972o2211J16107M5509k28245
$$ -1566008 -1427042 -1341930 -1299252 -1217731 -1119163 -1139365 -1285337 -1347548 -1231441 -1185932 -1414177
33185a414177k15265K27019N37139K60986k21283k67666P0529K08927p8026m46222
$$ -1414177 -1629442 -1402423 -865284 -604298 -825581 -1093247 -1022718 -813791 -891817 -1338039
33175a338039n31936k78102J64494M94505L89084p3168l35784o9485L18105K81637
$$ -1338039 -1869975 -2148077 -1983583 -1489078 -1099994 -1173162 -1508946 -1578431 -1260326 -978689
33165i78689o6445k48634k02736j88524j66125Q3300L74494L19026L3949M854
$$ -978689 -1045134 -1293768 -1496504 -1685028 -1851153 -1767853 -1393359 -1074333 -1040384 -1035530
33155a035530K60883L19615j040l19299l41900k36634k14027k08651j22416M815
$$ -1035530 -774647 -455032 -456072 -775371 -1117271 -1353905 -1567932 -1776583 -1898999 -1894184
33145a894184J58636L28602L17750j3915l28387j26982M53687O80820K14336m14116
$$ -1894184 -1735548 -1406946 -1089196 -1103111 -1431498 -1558480 -1104793 -423973 -209637 -623753
33135f23753n30754j35228K64764L27848J23781j01863j80366j15105l8425m3251
$$ -623753 -1154507 -1289735 -1024971 -697123 -573342 -675205 -855571 -970676 -1009101 -1052352
33125a052352p0950k3158R9641K43956L42124K41003j49334n24214l82294K07474
$$ -1052352 -1123302 -1146460 -1046819 -802863 -460739 -219736 -369070 -893284 -1275578 -1068104
33115a068104M76651j3167o39880n55084J06628M91538K56932j47731l07392k72128
$$ -1068104 -591453 -604620 -1244500 -1799584 -1692956 -1201418 -944486 -1092217 -1399609 -1671737
33105a671737j71232l814J26479N6848j20134j77962j19687m4662J48422M68144
$$ -1671737 -1842969 -1846783 -1720304 -1663456 -1783590 -1961552 -2081239 -2125901 -1977479 -1509335
33095a509335N12356K7281m83672l98353J8177L5439l07444k97015J91326M92606
$$ -1509335 -996979 -969698 -1453370 -1851723 -1833546 -1798107 -2105551 -2402566 -2211240 -1718634
33085a718634L01272P6477J01886M5335k49203l69636j02567J47876Q3812j0905
$$ -1718634 -1417362 -1340885 -1238999 -1193664 -1442867 -1812503 -1915070 -1767194 -1683382 -1694287
33075a694287J22503K59852J83821M6800m8965k42956m35725k58313K14826L99663
$$ -1694287 -1571784 -1311932 -1128111 -1081311 -1130276 -1373232 -1808957 -2067270 -1852444 -1452781
33065a452781J33349m1682J60892K90502L6290j92704n5336R6186o0008j64974
$$ -1452781 -1319432 -1361114 -1200222 -909720 -873430 -1066134 -1121470 -1025284 -1085292 -1250266
33055a250266J19934L91622J63183k83583l70754j05780J19602J92996J81918
$$ -1250266 -1130332 -738710 -575527 -859110 -1229864 -1335644 -1216042 -1023046 -841128
33046h41128J931k73611k26217K41570N35529K36016j73541p5387K85801K77708
$$ -841128 -839197 -1112808 -1339025 -1097455 -561926 -325910 -499451 -574838 -289037 -11329
33036a1329q7732l25252l02171j89323M1647L66731L48284k17126o75118l65179
$$ -11329 -99061 -424313 -726484 -915807 -874160 -507429 -159145 -376271 -1051389 -1416568
33026a416568K55635K54059k86891m17685J49466O70397N89357K14366L64n3193
$$ -1416568 -1160933 -906874 -1193765 -1611450 -1461984 -791587 -202230 12136 12500 -40693
33016d0693p0812k8571j2518j87389l80388k36950J34628K39608j8702k22128
$$ -40693 -111505 -140076 -152594 -339983 -720371 -957321 -822693 -583085 -601787 -823915
33006h23915j82354j78993l20342k93561K8659K95864K54509J30660J76259K54625
$$ -823915 -1006269 -1185262 -1505604 -1799165 -1770506 -1474642 -1220133 -1089473 -913214 -658589
32996f58589J41974r6342k54336k48550j06792O0594N5384j56462k48047L9821
$$ -658589 -516615 -612957 -867293 -1115843 -1222635 -1162041 -1106657 -1263119 -1511166 -1471345
32986a471345L80559K74199j06793j21257K70252L68734j33419o10416m60798
$$ -1471345 -1090786 -816587 -923380 -1044637 -774385 -405651 -539070 -1149486 -1610284
32977a610284J9725K04181P4195N2695K46631L92499L46108J69948j08402m26062
$$ -1610284 -1590559 -1386378 -1312183 -1259488 -1012857 -620358 -274250 -104302 -212704 -638766
32967f38766n21770k33400J52544K23562L2128j2445J92918K85861J4504l72684
$$ -638766 -1160536 -1393936 -1241392 -1017830 -985702 -998147 -805229 -519368 -504864 -877548
32957h77548m78037k52679M9455K45525L29193K94917J09659j23354k01938j15315
$$ -877548 -1355585 -1608264 -1558809 -1313284 -984091 -689174 -579515 -702869 -904807 -1020122
32947a020122r1902k21230k53438j1125K20016Q5387k01856j13446L21603M63937
$$ -1020122 -1112024 -1333254 -1586692 -1597817 -1377801 -1292414 -1494270 -1607716 -1286113 -822176
32937h22176K9666m53050m37764r7644J05410J24083J45340J15623m1141p4868
$$ -822176 -792510 -1245560 -1683324 -1780968 -1675558 -1551475 -1406135 -1290512 -1331653 -1406521
32927a406521J80570L54484P2899l34164k96283N5474J18768j44943j68032K24090
$$ -1406521 -1225951 -871467 -798568 -1132732 -1429015 -1373541 -1254773 -1399716 -1567748 -1343658
32917a343658N12172L27591l8614j81011j17845p3596j25935k16114j94567J41447
$$ -1343658 -831486 -503895 -542509 -723520 -841365 -914961 -1040896 -1257010 -1451577 -1310130
32907a310130O96639Q90082L27732m62288o01003r4311K31578K7290j87136p1634
$$ -1310130 -613491 276591 604323 142035 -458968 -553279 -321701 -294411 -481547 -553181
32897e53181j4195k81478m44161j45127K44785K74039J23453J29695J35302j06692
$$ -553181 -567376 -848854 -1293015 -1438142 -1193357 -919318 -795865 -666170 -530868 -637560
32887f37560l43397k30874M7845J29470P9653J17350R4839j66805l57256j19528
$$ -637560 -980957 -1211831 -1163986 -1034516 -954863 -837513 -742674 -909479 -1266735 -1386263
32877a386263K53518K09200j76098l39504j24837R9585J30497J11708O1701j55611
$$ -1386263 -1132745 -923545 -1099643 -1439147 -1563984 -1464399 -1333902 -1222194 -1160493 -1316104
32867a316104l55548j43394L80460N95329K33172k22287k46823N1643K56426K69681
$$ -1316104 -1671652 -1815046 -1434586 -839257 -606085 -828372 -1075195 -1023552 -767126 -497445
32857d97445K67936K67371R4774k71299n80541n56335j71297L00586M86164K52030
$$ -497445 -229509 37862 132636 -138663 -719204 -1275539 -1446836 -1146250 -660086 -408056
32847d08056j34001k75541r5372J04381M8629j80233k81489j04592K02183L67223
$$ -408056 -542057 -817598 -912970 -808589 -759960 -940193 -1221682 -1326274 -1124091 -756868
32837g56868K64552J5118j62063j80321j30412j11854j09509o4144K8023J30329
$$ -756868 -492316 -477198 -639261 -819582 -949994 -1061848 -1171357 -1235501 -1207478 -1077149
32827a077149J95694J55521j0504j70466j55453j9829m49j40587j77944M5712
$$ -1077149 -881455 -725934 -736438 -906904 -1062357 -1082186 -1082635 -1223222 -1401166 -1355454
32817a355454K87128K44419K6671q904J91593K95455Q1263k31802k65545M7254
$$ -1355454 -1068326 -823907 -797236 -806140 -614547 -319092 -237829 -469631 -735176 -687922
32807f87922L89573M06717N4046l92324o19124n20944j81129K52775N64915M87592
$$ -687922 -298349 108368 162414 -229910 -849034 -1369978 -1551107 -1298332 -733417 -245825
32797b45825k0718n47669n76981j30692K27309J44149p7710k136K65195K65559
$$ -245825 -266543 -814212 -1391193 -1521885 -1294576 -1150427 -1228137 -1230273 -965078 -699519
32787f99519j01969m30238l66921l5058J93567J57691K8635N1600K48706L97064
$$ -699519 -801488 -1231726 -1598647 -1633705 -1440138 -1282447 -1253812 -1202212 -953506 -556442
32777e56442L01863L9878j50830j80105j60638j71626j56930q4247n495Q5860
$$ -556442 -254579 -214701 -365531 -545636 -706274 -877900 -1034830 -1119077 -1124572 -1038712
32767a038712K41826L54039K23576o9420j64270M6625J87543m8424l93775l86492
$$ -1038712 -796886 -442847 -219271 -288691 -452961 -406336 -218793 -267217 -660992 -1047484
32757a047484n3030J75230J22009L1440O2901K1622k43177m64980k58187L12240
$$ -1047484 -1100514 -925284 -803275 -771835 -708934 -687312 -930489 -1395469 -1653656 -1341416
32747a341416P14281N52412J7552l85604m30784k74123m6838K82150N39218L02132
$$ -1341416 -627135 -74723 -57171 -442775 -873559 -1147682 -1194520 -912370 -373152 -71020
32737g1020m22349q72382m35759L83949N86200J20532r6511L36219P05517L89944
$$ -71020 -493369 -1365751 -1801510 -1417561 -831361 -710829 -807340 -471121 234396 624340
32727F24340j83640l43228k27941l38477n55350l90819Q8237L38732J91481j7637
$$ 624340 440700 97472 -130469 -468946 -1024296 -1415115 -1326878 -988146 -796665 -814302
32717h14302o6603l5684L3577J58015J87678K6650o6059J29221K98433M5809l59698
$$ -814302 -880905 -916589 -883012 -724997 -537319 -510669 -576728 -447507 -149074 -103265 -462963
32706d62963l36800M9628K02534J8484K5416L99638O09490K94602j56543k45749
$$ -462963 -799763 -750135 -547601 -529117 -503701 -104063 505427 800029 643486 397737
32696C97737n7689L3167o7733k17802l22766l25218j85985m2566r6153k45534
$$ 397737 340048 373215 305482 87680 -235086 -560304 -746289 -788855 -885008 -1130542
32686a130542j82936P2094J51485n1168k03450r6801Q1204J72949K43300K01904
$$ -1130542 -1313478 -1241384 -1089899 -1141067 -1344517 -1441318 -1360114 -1187165 -943865 -741961
32676g41961j79004o54515n72707J10181N54558K45208j96414l2167L85616K50472
$$ -741961 -920965 -1575480 -2148187 -2038006 -1483448 -1238240 -1434654 -1466821 -1081205 -830733
32666h30733l13041m58270K560L88978L20489J86284K78601K81327m6535l54177
$$ -830733 -1143774 -1602044 -1599484 -1210506 -890017 -703733 -425132 -143805 -190340 -544517
32656e44517k81992m2798K592o7930n483R6889R140j66097j68628m2821N985O5682
$$ -544517 -826509 -869307 -866715 -934645 -940128 -843239 -834099 -1000196 -1168824 -1211645 -1205660 -1139978
32644a139978L46861O29182M24187k13635n70780k42435K26449Q9712n13104p58208
$$ -1139978 -793117 -163935 260252 46617 -524163 -766598 -540149 -450437 -963541 -1721749
32634a721749l24247K03630K41012j0832j5322K47577L43653J20456j01336p6672
$$ -1721749 -2045996 -1842366 -1601354 -1612186 -1627508 -1379931 -1036278 -915822 -1017158 -1093830
32624a093830L9814L4173l4424k2987J7994k9288j01267m1436J37877K56686K05029
$$ -1093830 -1054016 -1019843 -1054267 -1077254 -1059260 -1088548 -1189815 -1231251 -1093374 -836688 -631659
32613f31659N5037n5200o0045J0752Q4721J10106R1387O9055O8819P4345L2261
$$ -631659 -576622 -631822 -691867 -681115 -596394 -486288 -394901 -325846 -257027 -182682 -150421
32602a50421j07078k97361l60020j63634J39086K27467L6643j50144j56710j79230
$$ -150421 -257499 -554860 -914880 -1078514 -939428 -711961 -675318 -825462 -982172 -1161402
32592a161402l50491l45148J48794P63504Q02563K23057k87392k91147j02041
$$ -1161402 -1511893 -1857041 -1708247 -944743 -142180 80877 -206515 -497662 -599703
32583e99703j22998k32517j59424q254J831k4340R6694K20493J35300j2314J1448
$$ -599703 -722701 -955218 -1114642 -1122896 -1121065 -1145405 -1048711 -828218 -692918 -705232 -693784
32572f93784N4152j35529l29308j02620L74910M57339J3567l13233p9514K75221
$$ -693784 -639632 -775161 -1104469 -1207089 -832179 -374840 -361273 -674506 -754020 -478799
32562d78799J21082l94838n88387k43272J47871J41874j06118j97218o7159K9030
$$ -478799 -357717 -752555 -1340942 -1584214 -1436343 -1294469 -1400587 -1597805 -1664964 -1635934
32552a635934m6938j33505j5212K88677N25189M56435R7942k80647m09633k72262
$$ -1635934 -1682872 -1816377 -1831589 -1542912 -1017723 -561288 -463346 -743993 -1153626 -1425888
32542a425888o5274O7138J47105J96121J33234l4991q9035J16926L51434K73137
$$ -1425888 -1491162 -1424024 -1276919 -1080798 -947564 -982555 -1071590 -954664 -603230 -330093
32532c30093m4467j92994o2215p551k48416m91513m00629q7538J76207L95459
$$ -330093 -374560 -567554 -629769 -637320 -885736 -1377249 -1777878 -1865416 -1689209 -1293750
32522a293750O12585N66735R8393l66669l23729P701L6584j81959n7017M18658
$$ -1293750 -681165 -114430 -16037 -382706 -706435 -698734 -662150 -844109 -901126 -482468
32512d82468N45161J15756j66193J06691K96042j70174o97036m18242L40347N06223
$$ -482468 62693 178449 12256 118947 414989 244815 -452221 -870463 -530116 -23893
32502b3893q8094n26623k80430J09333M7981k33937k21883N9572K19125J18600
$$ -23893 -111987 -638610 -919040 -809707 -761726 -995663 -1217546 -1157974 -938849 -820249
32492h20249o4758j58365j06897M9699J56520J03581N9415K49354M79874L18841
$$ -820249 -885007 -1043372 -1150269 -1100570 -944050 -840469 -781054 -531700 -51826 267015
32482B67015j51904k99268R9070M13121R9264m25998m33312j6990J26522j47077
$$ 267015 115111 -184157 -85087 328034 427298 1300 -432012 -449002 -322480 -469557
32472d69557k73821O103K32229M2105k31179j38328J91227L37544K16144J7041
$$ -469557 -743378 -737275 -505046 -462941 -694120 -832448 -641221 -303677 -87533 -70492
32462g0492j88967l71744l15763P6753M30551L18688o2978j30045K20723M91541
$$ -70492 -259459 -631203 -946966 -870213 -439662 -120974 -183952 -313997 -93274 398267
32452C98267L79715J54842P7241l0979l29613n27361l21813M1636R4783j62439
$$ 398267 777982 932824 1010065 979086 649473 122112 -199701 -158065 -63282 -225721
32442b25721l12002j41048J57651L26424K53606o4311m39770m75134k00N38809
$$ -225721 -537723 -678771 -521120 -194696 58910 -5401 -445171 -920305 -920505 -381696
32432c81696N28587R203l64910k14470J34078K11011L997j80884j53730M5359
$$ -381696 146891 156094 -208816 -423286 -289208 -78197 -74200 -255084 -408814 -363455
32422c63455K45066K36751k5373k68023j91658O3751P4678j96574k87518O3049
$$ -363455 -118389 118362 92989 -175034 -366692 -302941 -228263 -424837 -712355 -649306
32412f49306M87687M98410J13884k63651l52396j63102J12039K13748L1875j90600
$$ -649306 -161619 336791 450675 187024 -165372 -328474 -216435 -2687 29188 -161412
32402a61412j30778R4860P2509j78713j48959K84067N12910J21712m06896m32423
$$ -161412 -292190 -197330 -124821 -303534 -452493 -168426 344484 466196 59300 -373123
32392c73123j25482o0106k16351j26695K03355K93527N7617n4223J36594K41437
$$ -373123 -498605 -558711 -775062 -901757 -698402 -404875 -347258 -401481 -264887 -23450
32382b3450J691k71795k14671N3696J76734N7453j08774j10720Q9945L02617K40708
$$ -23450 -21759 -293554 -508225 -454529 -277795 -220342 -329116 -439836 -349891 -47274 193434
32371A93434j07461l26802p0254L90689M71331P7395l00047k91759l3131K02256
$$ 193434 85973 -240829 -311083 79606 550937 628332 328285 36526 3395 205651
32361B05651L20865K62755m3100m19523n02961k31714N0591J14467J18035K04852
$$ 205651 526516 789271 746171 326648 -176313 -408027 -357436 -242969 -124934 79918
32351G9918K04268k9663l01815l71310l09832k99324k87064j18536J38205K62524
$$ 79918 284186 254523 -47292 -418602 -728434 -1027758 -1314822 -1433358 -1295153 -1032629
32341a032629J96467R2818R2711J80355K23661J12773q3275j28496Q4561L17791
$$ -1032629 -836162 -743344 -650633 -470278 -246617 -133844 -217119 -345615 -261054 56737
32331E6737K67087j4757k39165l40948m54113m80609j57076L79597N94064K98517
$$ 56737 323824 309067 69902 -271046 -725159 -1205768 -1362844 -983247 -389183 -90666
32321i0666p4225j70152j95370l80124m60304j61581K05566J98142n58J08720
$$ -90666 -164891 -335043 -530413 -910537 -1370841 -1532422 -1326856 -1128714 -1129272 -1020552
32311a020552M41154M05645j11851m87528k70813J73140K41735o0659k26687Q413
$$ -1020552 -579398 -173753 -285604 -773132 -1043945 -870805 -629070 -689729 -916416 -908003
32301i08003L82024N20226L62888J12445p5039k23751l85710m57558k64774J40535
$$ -908003 -525979 -5753 357135 469580 394541 170790 -214920 -672478 -937252 -796717
32291g96717L94834J97807k57238m21870l9322N06226O41015K98168o4193j27241
$$ -796717 -401883 -204076 -461314 -883184 -922506 -416280 224735 522903 458710 331469
32281C31469r6076k63119m66766l34957O9200K90298J84921J03139K17409J86549
$$ 331469 235393 -27726 -494492 -829449 -760249 -469951 -285030 -181891 35518 222067
32271B22067j84908m46780j78999K21535R3065l86802m09805J89610O48036M17820
$$ 222067 37159 -409621 -588620 -367085 -274020 -660822 -1070627 -881017 -232981 184839
32261A84839j09206l16748j97197q7745o0003L923P2608P2736O4506L9365j53650
$$ 184839 75633 -241115 -438312 -526057 -586060 -582137 -509529 -436793 -372287 -332922 -486572
32250d86572m45986m78088j48642J56315J64008J11436K13504K16435q4024l44082
$$ -486572 -932558 -1410646 -1559288 -1402973 -1238965 -1127529 -914025 -697590 -781614 -1125696
32240a125696k13959M2113M0576j5304K18199M53434K22276j95078j66998J46233
$$ -1125696 -1339655 -1297542 -1256966 -1272270 -1054071 -600637 -378361 -573439 -740437 -594204
32230e94204J7798m99882n09779K24648P38652L13304m20853m94826k5464J64674
$$ -594204 -576406 -1076288 -1586067 -1361419 -622767 -309463 -730316 -1225142 -1250606 -1085932
32220a085932j00739k26427R7325M68031M53702J41572j30072k09775j74038j67502
$$ -1085932 -1186671 -1413098 -1315773 -847742 -394040 -252468 -382540 -592315 -766353 -933855
32210i33855k65379l49503j82443K22097M48596J85120k38264k00702L24154O48203
$$ -933855 -1199234 -1548737 -1731180 -1509083 -1060487 -875367 -1113631 -1314333 -990179 -341976
32200c41976K80569l91897o04623j77635L40775M20145J27191j10341p6913P8538
$$ -341976 -61407 -453304 -1057927 -1235562 -894787 -474642 -347451 -457792 -534705 -456167
32190d56167J51929J25993Q2170M5476O717j9720o3273k14054m42233n10028k54055
$$ -456167 -304238 -178245 -96075 -50599 -43882 -63602 -126875 -340929 -783162 -1293190 -1547245
32179a547245J18975K56879J57638J61539M03798N83315M23553P9198j45676k45469
$$ -1547245 -1428270 -1171391 -1013753 -852214 -448416 134899 558452 637650 491974 246505
32169B46505l82488m89112l59775n9750J19360J00624P3939R9428L7609o9302
$$ 246505 -135983 -625095 -984870 -1044620 -925260 -824636 -750697 -651269 -613660 -682962
32159f82962K3261K57665K14319j85062l99601j00773J95283p4045m87297k23867
$$ -682962 -659701 -402036 -187717 -372779 -772380 -873153 -677870 -751915 -1239212 -1463079
32149a463079N26623P18803Q9809l89787p8168L18823k6867o59024n94839Q1012
$$ -1463079 -936456 -217653 -127844 -517631 -595799 -276976 -303843 -962867 -1557706 -1476694
32139a476694M37300K08758J2869J39068J77305l2084p2806J53874J20506l56638
$$ -1476694 -1039394 -830636 -817767 -678699 -501394 -533478 -606284 -452410 -331904 -688542
32129f88542o64785l83993K2514N2057p059K59872N26889L05090r0527p974M06946
$$ -688542 -1353327 -1737320 -1714806 -1662749 -1669808 -1409936 -883047 -577957 -668484 -676458 -269512
32118b69512M14214j02471m55665k39447J42287K02603K0402p6951j8482P4323
$$ -269512 144702 42231 -413434 -652881 -510594 -307991 -287589 -364540 -383022 -308699
32108c08699J32487J16747j9938k12968l02980k25986l7734K08023M14897L80095
$$ -308699 -176212 -59465 -79403 -292371 -595351 -821337 -859071 -651048 -236151 143944
32098A43944M3824k89284k89678r0752q9976l10611l63447q5025J89130J40226
$$ 143944 187768 -101516 -391194 -481946 -571922 -882533 -1245980 -1331005 -1141875 -1001649
32088a001649o8084o5982J69893K82826L8298l00845k42366K62611O19649L30862
$$ -1001649 -1069733 -1135715 -965822 -682996 -644698 -945543 -1187909 -925298 -305649 25213
32078B5213k22959k42142K52322L40966l47815q82798l59099O45501Q37725O2672
$$ 25213 -197746 -439888 -187566 153400 -194415 -1077213 -1436312 -790811 46914 109586
32068A09586o00773m76210k4889J59291J64047K62974L51884K61192Q4420j06178
$$ 109586 -491187 -967397 -992286 -832995 -668948 -405974 -54090 207102 291522 185344
32058A85344l92055o39939n10142m4067K75350K52284K17724L37011K99920j5330
$$ 185344 -206711 -846650 -1356792 -1400859 -1125509 -873225 -655501 -318490 -18570 -33900
32048c3900k20104j33901j70517n26058o31579n9279N80246M39407k31550m06610
$$ -33900 -254004 -387905 -558422 -1084480 -1716059 -1775338 -1195092 -755685 -987235 -1393845
32038a393845J96430P41959N04436k20815o66509n41144j26544K36211M22042
$$ -1393845 -1197415 -455456 48980 -171835 -838344 -1379488 -1506032 -1269821 -847779
32029h47779M08638J72239k20444n18617m45976l7570L04201K67457M2553K1461
$$ -847779 -439141 -266902 -487346 -1005963 -1451939 -1489509 -1185308 -917851 -875298 -853837
32019h53837J82545J50657j42473l06016j05963J93355K74693J69034L7752o3142
$$ -853837 -671292 -520635 -663108 -969124 -1075087 -881732 -607039 -438005 -400253 -463395
32009d63395l5626K26596M83345K99414k36584m76997j82268O7771j66182m27503
$$ -463395 -499021 -272425 210920 510334 273750 -203247 -385515 -317744 -483926 -911429
31999i11429j48164L49776L64004n0405k25640M7398L31461L31750J98705O8885
$$ -911429 -1059593 -709817 -345813 -396218 -621858 -574460 -242999 88751 287456 356341
31989C56341r3819j91713o1004J54121J75616Q7748J60944K65012L6045m02506
$$ 356341 262522 70809 9805 163926 339542 427290 588234 853246 889291 486785
31979D86785n09320j77120R2702k825j67742j03688M2100P9487J30315K73100
$$ 486785 -22535 -199655 -106953 -109778 -277520 -381208 -339108 -259621 -129306 143794
31969A43794K61729m8998l38281k49625O2094J71986K254j47615j01255j3445
$$ 143794 405523 356525 18244 -231381 -169287 2699 4953 -142662 -243917 -257362
31959b57362n6086j45098r7518O1202J02471p6988k71161k43978r4900r7314j95261
$$ -257362 -313448 -458546 -556064 -494862 -392391 -469379 -740540 -984518 -1079418 -1176732 -1371993
31948a371993k2903M46153O64683K30976m65337p02606l30430J66907L51840J98551
$$ -1371993 -1394896 -948743 -284060 -53084 -518421 -1221027 -1551457 -1384550 -1032710 -834159
31938h34159r5698k86970j68382J81668L52158J26208j26490L0141L96350M38035
$$ -834159 -929857 -1216827 -1385209 -1203541 -851383 -725175 -851665 -821524 -425174 12861
31928A2861J16522j41693j96279l01037m77798m16042r1022J08354K7988j1557
$$ 12861 129383 -12310 -208589 -509626 -987424 -1403466 -1494488 -1386134 -1358146 -1369703
31918a369703J87558L66711L04385J88830K30544K82105J21943j65972l25373
$$ -1369703 -1182145 -815434 -511049 -322219 -91675 190430 312373 146401 -178972
31909a78972k34820M0441K99175K81208n1468l41835k56077R945M0373r9013j648
$$ -178972 -413792 -373351 -74176 207032 155564 -186271 -442348 -432403 -392030 -491043 -492691
31898d92691K92708K83032j54425n39586n32156k99611j1060L88018P20388N89008
$$ -492691 -199983 83049 -71376 -610962 -1143118 -1442729 -1453789 -1065771 -345383 243625
31888B43625R6835j34576N1735Q4133k72531m08506N5819M92260K57867k39862
$$ 243625 340460 205884 257619 341752 69221 -339285 -283466 208794 466661 226799
31878B26799k85343o5740k10264n57974m00223K50578O05639L03955j61715l00612
$$ 226799 -58544 -124284 -334548 -892522 -1292745 -1042167 -436528 -132573 -294288 -594900
31868e94900j93426q5203q607N0851Q2639K00833M47503N00202O5682n00045n33938
$$ -594900 -788326 -873529 -882136 -831285 -748646 -547813 -100310 399892 465574 -34471 -568409
31857e68409l0141L24178J47810j82142k28313r6532r5307k24882k76447j46586
$$ -568409 -598550 -274372 -126562 -308704 -537017 -633549 -728856 -953738 -1230185 -1376771
31847a376771J33281M35905N18855K48891j01020j08413J82995K70540p7769m73217
$$ -1376771 -1243490 -807585 -288730 -39839 -140859 -249272 -66277 204263 126494 -346723
31837c46723m60023j03011J81271J45083j15594l29622k73227K7462K67523J96735
$$ -346723 -806746 -909757 -728486 -583403 -698997 -1028619 -1301846 -1274384 -1006861 -810126
31827h10126m1322j25826n3792r1827k46084j84441K02386N36972M54704R0924
$$ -810126 -851448 -977274 -1031066 -1122893 -1368977 -1553418 -1351032 -814060 -359356 -268432
31817b68432j43217p8580J01622J43007j5582j88931j38115J07971K29716P9979
$$ -268432 -411649 -490229 -388607 -245600 -261182 -450113 -588228 -480257 -250541 -170562
31807a70562k2184K17932M80822K35092l51297n20934m5112M05344K69704j21882
$$ -170562 -192746 25186 506008 741100 389803 -131131 -176243 229101 498805 376923
31797C76923j90025j3491m7985l01209l99289k80520k21163k35349k8382L90333
$$ 376923 186898 173407 125422 -175787 -575076 -855596 -1076759 -1312108 -1340490 -950157
31787i50157N77269L21387M277K2518J87651N8696l27669m76209j77155J50817
$$ -950157 -372888 -51501 -47224 -24706 162945 221641 -106028 -582237 -759392 -608575
31777f08575M1617l52398m71691j30548K49942K56680K2165n6386R6371K22359
$$ -608575 -566958 -919356 -1391047 -1521595 -1271653 -1014973 -992808 -1049194 -952823 -730464
31767g30464J77843O6353l9698j79461k66322r8455K65793M30733J62966k42505
$$ -730464 -552621 -486268 -525966 -705427 -971749 -1070204 -804411 -373678 -210712 -453217
31757d53217l26099n2498K07390K08845R0149P0611J20134P0765o4434q3931P5144
$$ -453217 -779316 -831814 -624424 -415579 -325430 -254819 -134685 -63920 -128354 -212285 -137141
31746a37141J86666M3426k11801k72257j22458l7760j16454j31835L9712J79127
$$ -137141 49525 92951 -118850 -391107 -513565 -551325 -667779 -799614 -759902 -580775
31736e80775J18530N1918J66280K61192R8023j31436j09538M6112m551k18961
$$ -580775 -462245 -410327 -244047 17145 115168 -16268 -125806 -79694 -84245 -303206
31726c03206k88192k23913k70658l30389j06428K11647J21109k57867j97094M45158
$$ -303206 -591398 -815311 -1085969 -1416358 -1522786 -1311139 -1190030 -1447897 -1644991 -1199833
31716a199833Q24987L38579m46866o54419l10490l0584N0671K61079N52675M77023
$$ -1199833 -374846 -36267 -483133 -1137552 -1448042 -1478626 -1427955 -1166876 -614201 -137178
31706a37178m627l46617j88359J83883L02213R0921j74820k39298p4556J39792
$$ -137178 -141805 -488422 -676781 -492898 -190685 -99764 -274584 -513882 -588438 -448646
31696d48646J93952P1622n8181j11571j72233k22297p1794K59386L98891J40990
$$ -448646 -254694 -183072 -241253 -352824 -525057 -747354 -819148 -559762 -160871 -19881
31686a9881j81534j79999J5495N7028j8582L1748R8900r6368l84280l03462J31221
$$ -19881 -201415 -381414 -365919 -308891 -327473 -295725 -196825 -293193 -677473 -980935 -849714
31675h49714L91350K38575K6869O4464J77606J20089j5427m4196j923K2609P3305
$$ -849714 -458364 -219789 -192920 -128456 49150 169239 153812 109616 107693 130302 203607
31664B03607J40773P3456j24420j83021K3881K12802Q0780k40118l71973j99363
$$ 203607 344380 417836 293416 110395 134276 347078 427858 187740 -184233 -383596
31654c83596L4540N9991j49657l75680l36472K5118L87579L45402p2558l68958
$$ -383596 -349056 -289065 -438722 -814402 -1150874 -1125756 -738177 -392775 -465333 -834291
31644h34291j71394L17068N92148M23073J6990k71441k64834p1282N1464j0809
$$ -834291 -1005685 -688617 -96469 326604 343594 72153 -192681 -263963 -212499 -223308
31634b23308q4345L3615K33606K25928j1039j84910j23393K8988J14655J66839
$$ -223308 -307653 -274038 -40432 185496 174457 -10453 -133846 -104858 9797 176636
31624A76636K07873J49488L3575O3074K19112J70980j97166m85370l15433Q6576
$$ 176636 384509 533997 567572 630646 849758 1020738 823572 338202 22769 109345
31614A09345J98337r0867m31168n34799m02673j32433J50350K29237L616k64126
$$ 109345 307682 216815 -214353 -749152 -1151825 -1284258 -1133908 -904671 -901055 -1165181
31604a165181k18835Q6629K67994J71594K2474j0538k7905p5635K7489L36457
$$ -1165181 -1384016 -1297387 -1029393 -857799 -835325 -845863 -873768 -949403 -921914 -585457
31594e85457N46975L78711m284k19291j74565q8468q9859r1348n6040j01533k43605
$$ -585457 -38482 340229 335945 116654 -57911 -146379 -236238 -327586 -383626 -485159 -728764
31583g28764k76474p7091J47028J37155L162Q7088M16109N96634L67021k3895
$$ -728764 -1005238 -1082329 -935301 -798146 -794984 -707896 -291787 304847 671868 647973
31573F47973k03234k02761k91466m39090l44215K2271K97962K44098L8600p4114
$$ 647973 444739 241978 -49488 -488578 -832793 -810522 -512560 -268462 -229862 -303976
31563c03976r7120p0628J19120M54967N90412K69358k36950m46567l01052j57399
$$ -303976 -401096 -471724 -352604 102363 692775 962133 725183 278616 -22436 -179835
31553a79835k20842l17125k34809j3352J63458J69191M566j91403k26785q3437
$$ -179835 -400677 -717802 -952611 -965963 -802505 -633314 -628748 -820151 -1046936 -1130373
31543a130373K7918q121J6804K96746N94068N02508O1786k60054k07960k692R4000
$$ -1130373 -1102455 -1110576 -1093772 -797026 -202958 299550 361336 101282 -106678 -109370 -15370
31532a5370J11521J38782R4842o8950j89340j24025J4014L4903n6195j13265n8688
$$ -15370 96151 234933 329775 260825 71485 -52540 -38526 -3623 -59818 -173083 -231771
31521b31771O9111J68320J20389p6782k10168r1651R6112j5144l88582n34436
$$ -231771 -162660 5660 126049 49267 -160901 -252552 -156440 -171584 -560166 -1094602
31511a094602k11673J94757K61474J39100K02782L77413K94621k4096j60075K0847
$$ -1094602 -1306275 -1111518 -850044 -710944 -508162 -130749 163872 139776 -20299 548
31501E48J57899j0941k54230k57838j08929q6395j69795p7056K54983N03655L61810
$$ 548 158447 147506 -106724 -364562 -473491 -559886 -729681 -806737 -551754 -48099 313711
31490C13711m7770k98273j66863J18205K04211P1391j6501J7785p8350m30814
$$ 313711 265941 -32332 -199195 -80990 123221 194612 178111 195896 117546 -313268
31480c13268o99158m81206P5623M07197K67989J740j1756J29512R4327j39066
$$ -313268 -1012426 -1493632 -1418009 -1010812 -742823 -741083 -752839 -623327 -529000 -668066
31470f68066k61869q9962K01404L31712K40963R0851L4919O6301O1689p6283l12365
$$ -668066 -929935 -1019897 -818493 -486781 -245818 -154967 -120048 -53747 7942 -68341 -380706
31459c80706m81295m05692n8442L66758N80119M44558J08192j40655j51472k1058
$$ -380706 -862001 -1267693 -1326135 -959377 -379258 65300 173492 32837 -118635 -139693
31449a39693N2977k5351j84355k59369j36991J15452K82698K39417J17851J21230
$$ -139693 -86716 -112067 -296422 -555791 -692782 -577330 -294632 -55215 62636 183866
31439A83866K11548J62874p8543l08474l82313l71813l19511j28902J32926J42590
$$ 183866 395414 558288 479745 171271 -211042 -582855 -902366 -1031268 -898342 -755752
31429g55752j80047l71054l5756M49532L81153j94606m52558K7828O31611N99211
$$ -755752 -935799 -1306853 -1342609 -893077 -511924 -706530 -1159088 -1131260 -499649 99562
31419I9562Q2640j83723J2537J68789o1779l54727k54349J59557M30670L30041
$$ 99562 182202 -1521 11016 179805 118026 -236701 -491050 -331493 99177 429218
31409D29218P442l37210o12218o69943l23544L00889O67509L68910l14301o59435
$$ 429218 436660 99450 -512768 -1182711 -1506255 -1205366 -537857 -168947 -483248 -1142683
31399a142683l24701L00019O12534M37644M3657k56760l35897k22045m0089O6797
$$ -1142683 -1467384 -1167365 -554831 -117187 -73530 -330290 -666187 -888232 -928321 -861524
31389h61524O8974M8697L2006l0416p4228M9866K57015K34243m4015j34716K30298
$$ -861524 -792550 -743853 -711847 -742263 -816491 -766625 -509610 -275367 -319382 -454098 -223800
31378b23800O22309M56098j67490o24087o18147l84899j53433N4497J26924p9765
$$ -223800 398509 854607 687117 63030 -555117 -940016 -1093449 -1038952 -912028 -991793
31368i91793l40420k46448J39484L34112K02895J06471J82540J30729r4814p4155
$$ -991793 -1332213 -1578661 -1439177 -1105065 -902170 -795699 -613159 -482430 -577244 -651399
31358f51399K77185L87067m5221m45858k46899K11991L07067J41471J90831L49143
$$ -651399 -374214 12853 -32368 -478226 -725125 -513134 -206067 -64596 126235 475378
31348D75378J53723k92435m52422k80226k20565l39555k42264J06254K45625M0490
$$ 475378 629101 336666 -115756 -395982 -616547 -956102 -1198366 -1092112 -846487 -805997
31338h05997p6114J12488K29087j8279l45438l82404j82338L5448K21892L27283
$$ -805997 -882111 -769623 -540536 -558815 -904253 -1286657 -1468995 -1433547 -1211655 -884372
31328h84372K13755j3675j46K87600M05363J21224j72866q2179J57010Q0708k69351
$$ -884372 -670617 -684292 -684438 -396838 8525 129749 -43117 -125296 31714 112422 -156929
31317a56929m53708k89559q480J32814R4608j8183n9455M0657J46538O8070r3129
$$ -156929 -610637 -900196 -908676 -775862 -681254 -699437 -758892 -718235 -571697 -503627 -596756
31306e96756k7965K48582L17505m516l37556l14179q9544M5429J50966L24269
$$ -596756 -624721 -376139 -58634 -63150 -400706 -714885 -804429 -759000 -608034 -283765
31296b83765K97125j18296m99365l42149R8327J58562j69664k49994J09298L34105
$$ -283765 13360 -104936 -604301 -946450 -848123 -689561 -859225 -1109219 -999921 -665816
31286f65816O5542k33341m8922L52506L78240K9950j82518o7169M6571q4346k73919
$$ -665816 -600274 -833615 -882537 -530031 -151791 -121841 -304359 -371528 -324957 -409303 -683222
31275f83222k90324k12951j94680j25633J79213N66922O22493K06403l05745m43709
$$ -683222 -973546 -1186497 -1381177 -1506810 -1327597 -760675 -138182 68221 -237524 -681233
31265f81233j59067K16141M05589L93174K58168L8285k04720l58597l69398k74760
$$ -681233 -840300 -624159 -218570 174604 432772 471057 266337 -92260 -461658 -736418
31255g36418j18007N8256J60532J39327R7084J17387N8727k10699m35006k13884
$$ -736418 -854425 -796169 -635637 -496310 -399226 -281839 -223112 -433811 -868817 -1082701
31245a082701L39249O16650L38098q1260k06845j76951k81666l78407k04766M3014
$$ -1082701 -743452 -126802 211296 130036 -76809 -253760 -535426 -913833 -1118599 -1075585
31235a075585p186k32376j84130J60176L67267K69571J77588K68528K66285l9837
$$ -1075585 -1082771 -1315147 -1499277 -1339101 -971834 -702263 -524675 -256147 10138 -29699
31225b9699l44277k02677L36418P36853N63375n4275n36583m41556L7839K79218
$$ -29699 -373976 -576653 -240235 496618 1059993 1005718 469135 27579 65418 344636
31215C44636P452l58229l26964l0279O4850q6891j24029N6836J84609J62752J91366
$$ 344636 352088 -6141 -333105 -363384 -298534 -385425 -509454 -452618 -268009 -105257 86109
31204H6109K52698K9487m62821o86854l35687J66357K81903J13508J19538L49563
$$ 86109 338807 368294 -94527 -781381 -1117068 -950711 -668808 -555300 -435762 -86199
31194h6199M24942J63242j77083k60142j2856L66496N48217L11443j68302m03835
$$ -86199 338743 501985 324902 64760 51904 418400 966617 1278060 1109758 705923
31184G05923j80326J05461l6960m80594o37985k66430K59746N12224M76228L30739
$$ 705923 525597 631058 594098 113504 -524481 -790911 -531165 -18941 457287 788026
31174G88026J00756k21823m32254l02928L8674J93522m068k72247k69781l3367
$$ 788026 888782 666959 234705 -68223 -29549 163973 159905 -112342 -382123 -415490
31164d15490J35892J21165R6750J78660K15111O5763j00421k6053K00243K10402
$$ -415490 -279598 -158433 -61683 116977 332088 397851 297430 271377 471620 682022
31154F82022j05064l89004k99329q249J9946l11486n56135k97599K95507O75801
$$ 682022 576958 187954 -111375 -119624 -99678 -411164 -967299 -1264898 -969391 -293590
31144b93590N79534K37101o5747l09749m77255l21315K23617O37433L50686l73737
$$ -293590 285944 523045 457298 147549 -329706 -651021 -427404 210029 560715 186978
31134A86978o78438l13412L8964j05505k58250J69978P95897P98034J84032k74507
$$ 186978 -491460 -804872 -765908 -871413 -1129663 -959685 -163788 634246 818278 543771
31124E43771k34679j15965k16348k59629k6505K06861J57832k7664j12289j27974
$$ 543771 309092 193127 -23221 -282850 -309355 -102494 55338 27674 -84615 -212589
31114b12589j43656m9503J71498K85190J53998m3098j15000q6190R601K05567
$$ -212589 -356245 -405748 -234250 50940 204938 161840 46840 -39350 -29749 175818
31104A75818L30589P6984m54905o96832l55270J74854M03813L48605K36991M1406
$$ 175818 506407 583391 128486 -568346 -923616 -748762 -344949 3656 240647 282053
31094B82053k80539m44516k15389J25271J41369j12892k28495o8197J39975K17263
$$ 282053 1514 -443002 -658391 -533120 -391751 -504643 -733138 -801335 -661360 -444097
31084d44097J76562M4777j31124j88305m5690J00949L8418j32209j66830l2385
$$ -444097 -267535 -222758 -353882 -542187 -587877 -486928 -448510 -580719 -747549 -779934
31074g79934J51103L44922N10956M87323K19321p0393k00529k95534m61104m80440
$$ -779934 -628831 -283909 227047 714370 933691 863298 662769 367235 -93869 -574309
31064e74309j87460J33970J41641j8056q180Q3328n3011l00421k46127J07583
$$ -574309 -761769 -627799 -486158 -504214 -512394 -429066 -482077 -782498 -1028625 -921042
31054i21042L24964K41292J56625K53919L15270J56958o4842j48359j27669j20052
$$ -921042 -596078 -354786 -198161 55758 371028 527986 463144 314785 187116 67064
31044F7064j41143j63671j60319p1632P3400O3978k20395n23193m78752j02330
$$ 67064 -74079 -237750 -398069 -469701 -396301 -332323 -552718 -1075911 -1554663 -1656993
31034a656993K56803L61933K27477l6982k21617n6557L80649N33478Q6553m38380
$$ -1656993 -1400190 -1038257 -810780 -847762 -1069379 -1125936 -745287 -211809 -125256 -563636
$$ [...]
##END NTUPLES=NMR SPECTRUM
##END=
