##TITLE=31Pdec_LY-TMF-14.24.1.t
 D2O, 24 sc
 6.3.2020
##JCAMPDX= 6.0         $$ Bruker NMR JCAMP-DX V2.0
##DATA TYPE= NMR SPECTRUM
##DATA CLASS= NTUPLES
##ORIGIN= UXNMR, Bruker Analytische Messtechnik GmbH
##OWNER= root
$$ XWIN-NMR		Version 3.5
$$ Fri Mar  6 14:51:01 2020 Russian Standard Time (UT+4h)  she@DPX200
##.OBSERVE FREQUENCY= 81.013821
##.OBSERVE NUCLEUS= ^31P
##.ACQUISITION MODE= SIMULTANEOUS
##.ACQUISITION SCHEME= undefined
##.AVERAGES= 24
##.DIGITISER RES= 17
##SPECTROMETER/DATA SYSTEM= spect
##.PULSE SEQUENCE= zgpg30
##.SOLVENT NAME= CDCl3
##.SHIFT REFERENCE= (INTERNAL, CDCl3, 0, 182.463)
##AUDIT TRAIL= $$ (NUMBER, WHEN, WHO, WHERE, WHAT)
$$ ##TITLE= Audit trail, XWIN-NMR		Version 3.5
$$ ##JCAMPDX= 5.01
$$ ##ORIGIN= Bruker BioSpin GmbH
$$ ##OWNER= she
$$ F:/spectra/data/she/nmr/P31/1/pdata/1/auditp.txt
$$ ##AUDIT TRAIL=  $$ (NUMBER, WHEN, WHO, WHERE, WHAT)
(   1,<2020-03-06 14:49:48.23 +0400>,<she>,<DPX200>,
      <created by zg, POWCHK disabled, PULCHK disabled
       configuration hash MD5:
       00 E9 B6 7A A2 85 ED C7 34 08 36 98 17 FE 4E 26
       data hash MD5: 32K
       38 1F 28 DA 2C 73 F6 DB 79 25 7C 6D DC A9 B5 24>)
(   2,<2020-03-06 14:49:50.65 +0400>,<she>,<DPX200>,
      <Start of raw data processing
       efp BC_mod = 2 LB = 1 FT_mod = 6 PKNL = 1 PHC0 = -1356.081 PHC1 = 150.6017 SI = 64K 
       data hash MD5: 64K
       85 F5 7A A4 2F BA D2 17 3C 65 A0 76 42 AA 75 DB>)
(   3,<2020-03-06 14:50:06.34 +0400>,<she>,<DPX200>,
      <pk PHC0 = -0.9550409 PHC1 = 0 
       data hash MD5: 64K
       D6 01 5F B1 BA A0 8B 1E 71 34 C1 E5 F2 F2 2D 95>)
(   4,<2020-03-06 14:50:09.65 +0400>,<she>,<DPX200>,
      <abs ABSG = 5 
       data hash MD5: 64K
       48 F4 52 2E 76 80 C6 CF B5 84 47 45 6E 72 3A 37>)
(   5,<2020-03-06 14:50:27.51 +0400>,<she>,<DPX200>,
      <pk PHC0 = -0.2008831 PHC1 = 0 
       data hash MD5: 64K
       4D DB 2F 2E BE E7 F1 A9 ED BC EE 96 39 2B BB 33>)
$$ ##END=
$$ 
$$ hash MD5
$$ 46 C6 F4 31 A2 9F 86 38 AE E7 95 F0 53 EF CD 79
##$RELAX= 
##$RELAX= 
##$RELAX= 
##$RELAX= 
##$RELAX= 
##$RELAX= 
##$RELAX= 
##$RELAX= 
$$ Bruker specific parameters
$$ --------------------------
##$DU= <F:/spectra>
##$EXPNO= 1
##$NAME= <P31>
##$PROCNO= 1
##$TYPE= <nmr>
##$USER= <she>
##$AMP= (0..31)
100 100 100 100 100 100 100 100 100 100 100 100 100 100 100 100 100 100 
100 100 100 100 100 100 100 100 100 100 100 100 100 100 
##$AQSEQ= 0
##$AQ_mod= 1
##$AUNM= <au_zg>
##$AUTOPOS= <>
##$BF1= 81.014009
##$BF2= 200.13
##$BF3= 200.13
##$BF4= 200.13
##$BF5= 200.13
##$BF6= 200.13
##$BF7= 200.13
##$BF8= 200.13
##$BYTORDA= 1
##$CFDGTYP= 0
##$CFRGTYP= 5
##$CHEMSTR= <none>
##$CNST= (0..31)
1 1 145 1 1 1 1 1 1 1 1 1 1 1 1 1 1 1 1 1 1 1 1 1 1 1 1 1 1 1 1 1 
##$CPDPRG= <waltz16>
##$CPDPRG1= <>
##$CPDPRG2= <waltz16>
##$CPDPRG3= <>
##$CPDPRG4= <mlev>
##$CPDPRG5= <mlev>
##$CPDPRG6= <mlev>
##$CPDPRG7= <mlev>
##$CPDPRG8= <mlev>
##$CPDPRGB= <>
##$CPDPRGT= <>
##$D= (0..31)
0 1 0 0 0 0 0 0 0 0 0 0.03 2e-05 3e-06 0 0 0 0 0 0 0 0 0 0 0 0 0 0 0 0 
$$ [...]
##$SUBNAM3= <"">
##$SUBNAM4= <"">
##$SUBNAM5= <"">
##$SUBNAM6= <"">
##$SUBNAM7= <"">
##$SUBNAM8= <"">
##$SUBNAM9= <"">
##$SW= 369.568048894756
##$SWIBOX= (0..15)
0 1 3 0 0 0 0 0 0 0 0 0 0 0 0 0 
##$SW_h= 29940.119760479
##$TD= 32768
##$TD0= 1
##$TE= 0
##$TE2= 300
##$TE3= 300
##$TEG= 300
##$TL= (0..7)
0 120 53 12 22 120 120 120 
##$TP= (0..7)
150 150 150 150 150 150 150 150 
##$TP07= 0
##$TPNAME0= <>
##$TPNAME1= <>
##$TPNAME2= <>
##$TPNAME3= <>
##$TPNAME4= <>
##$TPNAME5= <>
##$TPNAME6= <>
##$TPNAME7= <>
##$TPOAL= (0..7)
0.5 0.5 0.5 0.5 0.5 0.5 0.5 0.5 
##$TPOFFS= (0..7)
0 0 0 0 0 0 0 0 
##$TUNHIN= 0
##$TUNHOUT= 0
##$TUNXOUT= 0
##$USERA1= <user>
##$USERA2= <user>
##$USERA3= <user>
##$USERA4= <user>
##$USERA5= <user>
##$V9= 5
##$VALIST= <valist>
##$VCLIST= <CCCCCCCCCCCCCCC>
##$VD= 0
##$VDLIST= <DDDDDDDDDDDDDDD>
##$VPLIST= <PPPPPPPPPPPPPPP>
##$VTLIST= <TTTTTTTTTTTTTTT>
##$WBST= 1024
##$WBSW= 4
##$XGAIN= (0..3)
0 0 0 0 
##$XL= 0
##$YL= 0
##$YMAX_a= 9047
##$YMIN_a= -16422
##$ZGOPTNS= <>
##$ZL1= 120
##$ZL2= 120
##$ZL3= 120
##$ZL4= 120
##$ABSF1= 182.463
##$ABSF2= -187.1042
##$ABSG= 5
##$ABSL= 3
##$ALPHA= 0
##$AQORDER= 0
##$ASSFAC= 0
##$ASSFACI= 0
##$ASSFACX= 0
##$ASSWID= 0
##$AUNMP= <proc_1d>
##$AZFE= 0.1
##$AZFW= 0.5
##$BCFW= 0
##$BC_mod= 2
##$BYTORDP= 0
##$COROFFS= 0
##$CY= -3
##$DATMOD= 1
##$DC= 0
##$DFILT= <>
##$DTYPP= 0
##$F1P= 0
##$F2P= 0
##$FCOR= 1
##$FTSIZE= 65536
##$FT_mod= 6
##$GAMMA= 0
##$GB= 0
##$INTBC= 1
##$INTSCL= 5.30512e-09
##$ISEN= 30
##$LB= 1
##$LEV0= 0
##$LPBIN= 0
##$MAXI= 10000
##$MC2= 0
##$MEAN= 0
##$ME_mod= 0
##$MI= 50
##$NCOEF= 0
##$NC_proc= -5
##$NLEV= 6
##$NOISF1= 182.463
##$NOISF2= 159.3651
##$NSP= 0
##$NTH_PI= 0
##$NZP= 0
##$OFFSET= 182.463
##$PC= 4
##$PHC0= -1357.237
##$PHC1= 150.6017
##$PH_mod= 1
##$PKNL= yes
##$PPARMOD= 0
##$PSCAL= 0
##$PSIGN= 0
##$REVERSE= no
##$SF= 81.0140089999434
##$SI= 65536
##$SIGF1= 159.3651
##$SIGF2= -187.1042
##$SINO= 113.3802
##$SIOLD= 16384
##$SREGLST= <1H.CDCl3>
##$SSB= 0
##$STSI= 65536
##$STSR= 0
##$SW_p= 29940.119760479
##$SYMM= 0
##$S_DEV= 0
##$TDeff= 32768
##$TDoff= 0
##$TI= <>
##$TILT= no
##$TM1= 0
##$TM2= 0
##$TOPLEV= 0
##$USERP1= <user>
##$USERP2= <user>
##$USERP3= <user>
##$USERP4= <user>
##$USERP5= <user>
##$WDW= 1
##$XDIM= 65536
##$YMAX_p= 485680566
##$YMIN_p= -8903162
$$ End of Bruker specific parameters
$$ ---------------------------------
##NTUPLES= NMR SPECTRUM
##VAR_NAME=  FREQUENCY,     SPECTRUM/REAL,   SPECTRUM/IMAG
##SYMBOL=    X,             R,               I
##VAR_TYPE=  INDEPENDENT,   DEPENDENT,       DEPENDENT
##VAR_FORM=  AFFN,          ASDF,            ASDF
##VAR_DIM=   65536,         65536,           65536
##UNITS=     HZ,            ARBITRARY UNITS, ARBITRARY UNITS
##FACTOR=    0.456856943014862, 1,           1
##FIRST=     14782.0589164792, 0,            0
##LAST=      -15158.0608439998, 0,           0
##MIN=       -15158.0608439998, -8903162,    0
##MAX=       14782.0589164792, 485680566,    0
$$ Real data points
##PAGE= N=1
##DATA TABLE= (X++(R..R)), XYDATA
$$ [...]
##PAGE= N=2
##DATA TABLE= (X++(I..I)), XYDATA
36731f6364N19242M98381k58588p33272l22770K30703J02508l94220m79555o1466
36721i65401L85273N45798L68356j08805o32566q16622o08200k97159J9878M40794
36711a668654O84572K69338n50090q34301k73787L45539L95592K93142N63473
36702g75176Q05333L78879m21511p09565k29918M36936O91773M16335j25419m49919
36692A7748j74468M54769O84709K37318k88394l72157l14322m56158l50830L98682
36682a63103J015487M22954r42058j393776k55145J194521J431256M97664m26987
36673A380813n97994j98277L12513O52685O56785L14408q9693k25131j31234j07459
36663A967416k05265j70901K9526J8347l87881p04094l81689K63576L47486k69368
$$ y = [-66364, 452878, 951259, 692671, -40601, -363371, -132668, -30160, -424380, -903935, -965401, -580128, -34330, 334026, 225221, -407345, -1223967, -1832167, -2129326, -2109448, -1668654, -984082, -714744, -1264834, -2099135, -2372922, -2027383, -1631791, -1338649, -775176, 30157, 409036, -12475, -722040, -951958, -515022, 176751, 593086, 467667, 17748, -156720, 298049, 982758, 1220076, 931682, 559525, 245203, -210955, -561785, -163103, 852384, 1275338, 333280, -1060496, -1315641, -121120, 1310136, 1807800, 1380813, 782819, 584542, 897055, 1549740, 2206525, 2520933, 2431240, 2206109, 2074875, 1967416, 1762151, 1591250, 1620776, 1639123, 1251242, 547148, 165459, 429035, 776521, 507153]
36653E07153o46400j11461O85667O92463m6097n73369l88933J99816Q49613J358631
36643B527083J222375J11009j171973j362305n39179m2180l32526l69176L51802
36634C94930P34509M4333n94668o1999P10096K72580p80308p71954J88764M33646
36624E69929m06489r02020l27723L45393L78031L17668N17267L48253l07248l93212
36614A39849N07165J126485M02312p98352j016459k52679M76380P53619P72184
36605B110504M77288j57358n86287m42886k63869n56047q22356m84167k4583r9239
36595h49000k28003L56148J155578J085131K75368j89430m4144J6954k28771l31651
36585A018180k92722n28493p44599k13100P56898R84961K31775m55503m28539
$$ y = [507153, -139247, -250708, 434959, 1127422, 1081325, 507956, 119023, 318839, 1168452, 2527083, 3749458, 3860467, 2688494, 1326189, 787010, 744830, 412304, 43128, 394930, 1129439, 1173772, 579104, 517105, 1227201, 1499781, 719473, -52481, 136283, 569929, 163440, -738580, -1066303, -720910, -342879, -25211, 492056, 840309, 533061, 139849, 647014, 1773499, 2175811, 1377459, 361000, 108321, 584701, 1338320, 2110504, 2587792, 2430434, 1844147, 1401261, 1137392, 581345, -241011, -725178, -749761, -849000, -1077003, -720855, 434723, 1519854, 1795222, 1605792, 1561648, 1578602, 1349831, 1018180, 725458, 196965, -547634, -760734, -3836, 981125, 1212900, 757397, 328858]
36576C28858j76842j14993N0310L64884L27899k192J28760O98714O13356m71556
36566A747198j326677r59110m5966L50206L58110N46123O34236J58008l96584
36557A065544l31809L2133J609k25369r2760Q9021k95495q21022n46975L61919
36547g63204Q10976M64459N9913N4502J18978O8606J86584M11200K13742m15394
36537A210362p42253l79993J57886L09399J79169Q4642R099j46531k50452j73532
36527B57796N229J47113R2409l56231j031906j188134l64122O94479Q33258J56193
36517g53916j02765N01983R51412M25991m04443m53337K34723P97794Q05415M02872
36507B405729k94814j107352j413580p29026M42714J055661Q04474L54738K88511
$$ y = [328858, 152016, 37023, 87333, 452217, 780116, 777924, 906684, 1605398, 2218754, 1747198, 420521, -538589, -584555, -234349, 123761, 669884, 1304120, 1462128, 1065544, 733735, 765868, 767477, 542108, 449348, 538369, 242874, -578148, -1125123, -763204, 47772, 512231, 572144, 626646, 745624, 814230, 1000814, 1412014, 1625756, 1210362, 468109, 88116, 246002, 555401, 734570, 819212, 828311, 681780, 431328, 257796, 263025, 410138, 502547, 146316, -885590, -2073724, -2437846, -1743367, -910109, -753916, -856681, -354698, 596714, 1022705, 618262, 164925, 399648, 1197442, 2002857, 2405729, 2110915, 1003563, -410017, -1139043, -696329, 359332, 1163806, 1518544, 1807055]
36498A807055M17289K73280k03461o76257p96038m31759K22675O67840M89965
36489A770589j25250m92539k09885L42014M93088J33093k34875k63026j92819
36480A220390l24738m18772p6215M60011M84697j27712o60413n62468j43359Q0174
36470f8405J33269J85003L600m91089o52054L0645Q60097P38137j67878o61713
36460i0388l65989j24892l84638m44205J73823P66980O29189K29599L12796N76646
36450A278921K59463m77790q07579n83068m08138m50663j76495N56412R77525
36441A68588M07494p11065j244353o51905M76785J144610R81861M32733L0229
36432A034977j70422k74771r1418M78196Q52319L39683o90385j035755l01850
$$ y = [1807055, 2224344, 2497624, 2294163, 1617906, 821868, 390109, 612784, 1280624, 1770589, 1645339, 1152800, 942915, 1284929, 1778017, 1911110, 1676235, 1413209, 1220390, 895652, 476880, 400665, 860676, 1345373, 1217661, 557248, -5220, -148579, -68405, 64864, 249867, 253467, -237622, -889676, -859031, 1066, 739203, 571325, -90388, -456377, -581269, -965907, -1410112, -1236289, -469309, 159880, 389479, 702275, 1278921, 1538384, 1060594, 253015, -330053, -738191, -1188854, -1365349, -808937, 168588, 576082, -134983, -1379336, -2031241, -1554456, -409846, 572015, 1004748, 1034977, 864555, 589784, 498366, 976562, 1828881, 2168564, 1478179, 442424, 140574]
36423A40574M86101L29718m32746q50182p36344n59837m11389M3727P08224R12217
36413c69937K80260o97518j128964o06035L91768R66131P66111L52107L34619
36404B88542M49571R5909m74611m50393J13471K96377r5813k01209K57962L92173
36394F71979j46438l30733L82298P94298r5122j172341q66552L07387O77466J07761
36384C30003j66578J36299J89612n4821J63415O21550K82111o32619o99857K85774
36374D54889Q69092L23698l88588n46279o46522q15729k18975J041488J367206
36365A440280J58338r23819n08088L76232K65443k57437J31937J006863R89450
36356B679199J32509m32932n55917q95516j211997p06461K35557M40211o9669
$$ y = [140574, 626675, 956393, 523647, -326535, -1062879, -1622716, -2034105, -1990378, -1282154, -369937, -89677, -787195, -1916159, -2522194, -2130426, -1164295, -398184, -46077, 288542, 738113, 834022, 359411, -90982, 22489, 318866, 223053, 21844, 279806, 671979, 525541, 194808, 577106, 1371404, 1276282, 103941, -762611, -455224, 222242, 330003, 163425, 299724, 489336, 434515, 597930, 1219480, 1501591, 868972, 169115, 454889, 1323981, 1647679, 1259091, 712812, 66290, -749439, -968414, 73074, 1440280, 1598618, 674799, 166711, 542943, 808386, 550949, 682886, 1689749, 2679199, 2811708, 2378776, 1822859, 927343, -284654, -991115, -755558, -315347, -385016]
36347c85016k00600J85594J17837n23563o42503J24160P04269L89770p3890J22303
36337a81639N73782N40336J43964p6919r0237j63362k65652k20502m7750J97701
36327D09722N27184P43177N13689j11300o80329q80605o62069J5010R05617J169102
36317A949198K42849j055689j325650n06112J16021p2067k82492K7698J87937
36308g18307k91121o32127r6044O55410O08551j434k62381p5445Q2532K79724
36298d50642P38757Q01761k64048j606655j453470L55482J866437J527608N9890
36289A575120q23278n96504j7717K37009J17919k32621o22613o78837k43913K07331
36279a078104J50657j17901J14492P42343Q34429P8764o08009m35321M4987j04025
$$ y = [-385016, -585616, -400022, -282185, -805748, -1448251, -1324091, -619822, -230052, -303942, -181639, 392143, 932479, 1076443, 999524, 909287, 745925, 480273, 259771, 212021, 409722, 936906, 1680083, 2193772, 2082472, 1402143, 521538, -140531, -125521, 780096, 1949198, 2192047, 1136358, -189292, -695404, -579383, -651450, -933942, -906244, -718307, -1009428, -1641555, -1737599, -1082189, -473638, -475072, -737453, -812898, -730366, -450642, 288115, 1089876, 825828, -780827, -2234297, -1878815, -12378, 1515230, 1575120, 751842, 155338, 137621, 374630, 492549, 259928, -362685, -1041522, -1285435, -1078104, -927447, -1045348, -930856, -188513, 645916, 724680, 116671, -318650, -273663, -377688]
36269c77688n84415l16662O77775J118897M43977k89560r7788M42118L42379r0029
36259A269004M0051M41030O2045r39088j207957l22353N49799N24349J63558J49121
36249G29559R8049m03108p04565j48105O29395O26329Q2098m6353K53245J59167
36239A275711m60955q57879o80376l36370l3960M83350J096309J188673O23451
36230B297954J1118k27860l02484l80498k89200r0426j22331k36788J15807P52999
36220A528291P07903k25037r19123n74636L5395j04325n60387k90695M56317N10369
36210E64072j80417l66322M20924R65498K01903j088350j351221m26129L85724
36201h74318K43248k18292m6037O02714P92824K35048l40050l12961l7983j62928
$$ y = [-377688, -962103, -1278765, -600990, 517907, 961884, 672324, 574536, 1016654, 1359033, 1269004, 1309055, 1750085, 1812130, 873042, -334915, -657268, -107469, 416880, 580438, 729559, 827608, 424500, -280065, -428170, 201225, 827554, 909652, 863299, 1116544, 1275711, 814756, -43123, -723499, -1059869, -1093829, -610479, 485830, 1674503, 2297954, 2309072, 2081212, 1778728, 1398230, 1109030, 1018604, 896273, 659485, 775292, 1528291, 2236194, 2011157, 1092034, 517398, 552793, 448468, -111919, -402614, 53703, 564072, 383655, 17333, 438257, 1403755, 1605658, 517308, -833913, -1260042, -874318, -631070, -849362, -895399, -292685, 500139, 735187, 395137, 82176, 44193, -118735]
36191a18735n47079n13839Q904L61492K37676J34942M21680O61741L72584j19068
36181I00298k03978N7277J78350J16401J85320L24269J94567j02920j35304O8527
36171A582807M5579k49643l35569n2026J78794J15464M8827J47972R8101k78688
36161A301618n94418m53259q483L33331L80646J40941k25193l06890J61835P02442
36151A432570N63223p2376k14205L13766M30488m28573j172611o52908M99796
36142F99170Q48140L05953m3711J00953k6164o32103q85389l50547L17510N26576
36132H60388N24698N42828J77766o95676j230714o57373M75461Q77661J13623
36123I88662r37847j113302j29931J154792J502455N22894q27084j286022p37874
$$ y = [-118735, -665814, -1179653, -1170749, -809257, -571581, -436639, -14959, 646782, 1019366, 900298, 696320, 753597, 931947, 1048348, 1233668, 1557937, 1752504, 1649584, 1514280, 1582807, 1628386, 1378743, 1043174, 991148, 1169942, 1285406, 1334233, 1482205, 1580306, 1301618, 707200, 253941, 245458, 578789, 959435, 1100376, 875183, 568293, 730128, 1432570, 1995793, 1923417, 1709212, 2022978, 2453466, 2024893, 852282, 199374, 699170, 1547310, 1853263, 1809552, 1910505, 1884341, 1252238, 366849, 16302, 333812, 860388, 1385086, 1927914, 2105680, 1410004, 179290, -478083, -2622, 875039, 988662, 50815, -1062487, -1192418, -37626, 1464829, 1987723, 1160639, -125383, -863257]
36114h63257j06242P8125K01339N74624Q36547O79947L45277N984m90863q59814
36104D01667l61117Q20131J254619K61615p94128m29689O12994N26629o34979
36095A657742j062706j64195N23322o9240p92873k04062J070065J282153J51327
36086B391533r11079r27272m29027k41398k35789J73739R01412J200129O54411
36077B576659k88799q54937p66629m06814k76224m59267o48456n63041k32687
36068a920195R5665K36854K24664K05884K14785J56476O3440J70557N08333O12829
36058E69292O5896p35845q92374j95313N48298O38455L58832L22997M74506L27013
36048A481757j55911n45654o07773m27450n8965M19385O69600M45594L7750j28539
$$ y = [-863257, -969499, -891374, -690035, -115411, 721136, 1401083, 1746360, 1752344, 1261481, 401667, 40550, 860681, 2115300, 2376915, 1582787, 1153098, 1766092, 2292721, 1657742, 595036, 430841, 954163, 884923, 92050, -112012, 958053, 2240206, 2391533, 1480454, 553182, 124155, -117243, -353032, -179293, 722119, 1922248, 2576659, 2287860, 1432923, 666294, 259480, -16744, -476011, -1124467, -1687508, -1920195, -1824530, -1587676, -1363012, -1157128, -942343, -785867, -722427, -551870, -43537, 569292, 635188, -100657, -993031, -1188344, -640046, -1591, 357241, 680238, 1154744, 1481757, 1325846, 780192, 172419, -255031, -313996, 105389, 774989, 1220583, 1258333, 1129794]
36038A129794j41930l18489n12988l73360q2998r6740k50514M3267P08940R66243
36028A071225N07598r9720l95561n89481q20015o66724P4800P72662P28733J58109
36018G41626j51571J13049N47799O59591L78628K6771n2072P2364j07486q32358
36008A396341j455744j076762J62451J057223Q44724J11293j56964J23394K63935
35999A269891j37728p63841j036965o94390k95M90402N19313M19564N50300O45802
35989A262053K79364k12443r8523M49637M12827m62313j103119o65329K48840
35980A10994N72393K09844k10587l68147l21547j17596J5293l35115r44958q30826
35970b220252L04493J261807R35579L835j31764M92441O78228J70670l4388M55652
$$ y = [1129794, 987864, 669375, 156387, -216973, -299971, -396711, -647225, -603958, 104982, 1071225, 1578823, 1479103, 1083542, 494061, -325954, -992678, -917878, -145216, 583517, 741626, 590055, 703104, 1250903, 1910494, 2289122, 2315893, 2263821, 2336185, 2228699, 1396341, -59403, -1136165, -973714, 83509, 928233, 1039526, 882562, 1005956, 1269891, 1132163, 368322, -668643, -1363033, -1363328, -872926, -353613, 65951, 616251, 1262053, 1541417, 1328974, 1230451, 1680088, 2092915, 1630602, 527483, -137846, 110994, 683387, 893231, 682644, 314497, -7050, -124646, -109353, -444468, -1389426, -2220252, -1915759, -653952, 281627, 285462, 153698, 646139, 1324367, 1495037, 1460649, 1916301]
35960A916301P20814R0175p68323r06933l63102K24328N65464O81873M31154l03735
35950B288016j158956j468980r04897J72464R44582Q22733Q3577l60990n6375
35941C61174M41605M39382Q6569p1976p8061l21632o48331n80162k10090K5545
35931e55977K60481Q67684J382160R57166r0962m95852k223K52234k80173o43317
35921A651221j74059K05366l93669j100476n99416O31150R46177K2391p78645
35912D10040n08101K54748O20953N72977M67666K38647l02102q76131r81373n09786
35902f12462J57010N16555L21367k00952m78407j90297K89802L31153j30573n63188
35892e59992n90975l51879p6993K14679M57968M18017P2211k17322j64855Q1446
$$ y = [1916301, 2637115, 2727290, 1958967, 1052034, 688932, 913260, 1478724, 2160597, 2591751, 2288016, 1129060, -339920, -1244817, -1072353, -127771, 694962, 778539, 417549, 361174, 802779, 1242161, 1328730, 1256754, 1178693, 857061, 208730, -371432, -581522, -555977, -295496, 572188, 1954348, 2911514, 2820552, 2324700, 2322477, 2574711, 2294538, 1651221, 1477162, 1682528, 1288859, 188383, -411033, 220117, 1166294, 1188685, 410040, -98061, 156687, 777640, 1350617, 1818283, 2056930, 1754828, 878697, -102676, -612462, -455452, 61103, 382470, 181518, -296889, -487186, -197384, 133769, 3196, -559992, -1150967, -1502846, -1579839, -1365160, -907192, -489175, -416964, -634286, -799141, -717695]
35882g17695K72415M44403O71406P22576L94486P946P3694M92886O12192J94201
35872C168510j91606m9623K33843l1801p40554j084772o91377n7694K45122K32740
35862A032788J55550K7911j40904j03773K03382L64358O8351l27571l20225m6792
35852I13075J8951j06268o0803P7120o5522k72520J17444R89866J252343L22687
35842C186373q81872j083840l05555L14396J20856l67527l95880K4057L29590
35833I40598K43454L74j45163k38859l33074k13254K31757N62467K40743m58951
35823H30092o15789K2088N45454J82166n30182n81772j9490K50901q3789m46220
35813d46541m40049k79086q9965L13509Q01301R01548N93168L53560K81333R821
$$ y = [-717695, -445280, -877, 670529, 1393105, 1787591, 1795537, 1869231, 2362117, 2974309, 3168510, 2976904, 2927281, 3161124, 3129323, 2388769, 1303997, 612620, 554926, 800048, 1032788, 1188338, 1216249, 1075345, 971572, 1174954, 1539312, 1607663, 1280092, 959867, 913075, 932026, 825758, 764955, 842075, 776553, 504033, 621477, 1611343, 2863686, 3186373, 2304501, 1220661, 915106, 1229502, 1350358, 982831, 586951, 611008, 940598, 1184052, 1184426, 1039263, 800404, 467330, 254076, 485833, 1048300, 1289043, 830092, 214303, 236391, 781845, 964011, 433829, -147943, -167433, 83468, -321, -446541, -886590, -1165676, -1255641, -942132, -140831, 760717, 1353885, 1707445, 1988778, 1998599]
35803A998599l75124l09457J15756O7313n76622p98586o9317O87683N57713N1959
35793A349917Q8549M38560L21846j31104k24306k9769j76591o10177o99838l87063
35783e9976j57711m1707K81820N24947J05249n87322m65675N01222J001517K86692
35773A389056o96710p19753L4829M67467J86356j69486j092N10988P50818L82662
35763B135135l27605p76643o43296k42182j14615l30247m65855k46591J38919
35754h72980M12932N50381O14716N29427J97035k81589o14299n28317m3624M19415
35744C83097M03095N152j68447J48131M34920J56440l61765l65316K05704O09702
35734A450713L19744l29983o04785j79849N50209Q22773K82212n10501o65566
$$ y = [1998599, 1623475, 1314018, 1429774, 1497087, 920465, 121879, 52562, 740245, 1297958, 1349917, 1438466, 1877026, 2198872, 2067768, 1843462, 1813693, 1637102, 1026925, 327087, -59976, -217687, -259394, 22426, 547373, 652622, 65300, -400375, 100847, 1102364, 1389056, 692346, -27407, 7422, 474889, 661245, 491759, 490667, 1001655, 1752473, 2135135, 1807530, 1030887, 387591, 145409, 30794, -299453, -765308, -1011899, -872980, -460048, 90333, 705049, 1234476, 1431511, 1149922, 535623, 7306, -36318, 383097, 786192, 791344, 622897, 771028, 1205948, 1362388, 1000623, 635307, 841011, 1450713, 1770457, 1440474, 835689, 655840, 1206049, 2028822, 2311034, 1800533, 1134967]
35725A134967j83602j9684o00720j004957l08703Q73416J144347K55171p02686
35716E87549q48110l21224L41953P39639N71874n6334l65373K15817J023446R40827
35706B830064N1483n42893m28540k02193j37147J10168L47831j13761r42838q37616
35696A34558L53455J097405N18519k60102j11806K70873j34301p27344m47205
35687F94052J83963j2644o53094m15904N37274P38838n4222m58421J02653M14674
35677A077169l62785j135972n57109Q53476J458339P40539k89150o18410k53480
35668I12617K33051M65596M28285K69579J27226K7277q7446k14718k62510j94433
35658A704524j08320j28484k62506l48036j56939L01053N95362L04943l00508
$$ y = [1134967, 951365, 931681, 330961, -673996, -982699, -109283, 1035064, 1290235, 587549, -260561, -581785, -239832, 499807, 1071681, 1015347, 649974, 865791, 1889237, 2830064, 2881547, 2338654, 1910114, 1707921, 1570774, 1680942, 2028773, 1915012, 972174, 134558, 488013, 1585418, 2103937, 1843835, 1732029, 2002902, 1868601, 1141257, 694052, 878015, 865371, 212277, -203627, 333647, 1072485, 1018263, 559842, 662495, 1077169, 714384, -421588, -978697, -125221, 1333118, 2073657, 1784507, 1166097, 912617, 1145668, 1611264, 2039549, 2309128, 2436354, 2463631, 2376185, 2161467, 1898957, 1704524, 1596204, 1467720, 1205214, 857178, 700239, 1001292, 1596654, 1901597, 1601089]
35649A601089m57724l681K72939j97607p98921o04194K11065O68856M45942J10446
35639A248210r087j96874m60361k68409M16061P02143j0637r85276j014291k144
35629e80665R59899R85094L31190j20961N857J99559j89855r58817j148547l10364
35619h27610P46400R66271M74406K58690O03446P69316L18509k31231m10145m94942
35609B173110o81413m92812K37790O41871M6150p53877o02660J28797J01716p61998
35599C6674j078290j96844Q27751R63054N93177M15072J36226o07868r80279l9149
35589F9524J371874J396094j52149j338161p58111O24302J018551J81259p16657
35580A696526r29097p39231m90791p7406M81227P61476N33186J25816n3953M429
$$ y = [1601089, 1143365, 1139684, 1412623, 1215016, 416095, -188099, 22966, 691822, 1137764, 1248210, 1239123, 1042249, 581888, 313479, 729540, 1431683, 1421046, 435770, -578521, -580665, 379234, 1364328, 1695518, 1574557, 1580414, 1779973, 1590118, 631301, -517246, -827610, -81210, 885061, 1359467, 1618157, 2221603, 2990919, 3309428, 3078197, 2668052, 2173110, 1491697, 998885, 1236675, 1878546, 1924696, 1170819, 568159, 696956, 798672, 36674, -1041616, -1238460, -410709, 552345, 1145522, 1560594, 1696820, 1088952, 108673, 69524, 1441398, 2837492, 2685343, 1347182, 589071, 1213373, 2231924, 2413183, 1696526, 767429, 28198, -462593, -539999, -58772, 702704, 1235890, 1361706, 1307753, 1312182]
35570A312182J17495K41436L77577L83723J00211m25888r17314j006315m94934
35561c11827L37829Q16919N47302q2618l83585k28005l4328j1000N1359K26445
35551I28491K52385J6371k53539m25446o16380p69033n88066q5964L12510M03725
35541h24946M16923M14332J12350m24079n93398j65067K81850K83265J72331L02666
35531b3773L20961q6827m24240k05478Q5540j77771n58677l00996K09108M4640
35521a117513m91672j87322R66898J509357P21796k93164l75420P9395R6911k88480
35511F20786l93967j41251L532q3120j43751p5418J05003M77116Q68104P35017
35501A972051k4338o22371m03439J55151K11137j27914j55429J17953N0513l53285
$$ y = [1312182, 1429677, 1671113, 2048690, 2432413, 2532624, 2106736, 1189422, 183107, -311827, 26002, 842921, 1390223, 1307605, 924020, 696015, 661687, 650687, 702046, 928491, 1180876, 1197247, 943708, 518262, -98118, -867151, -1455217, -1541181, -1228671, -824946, -408023, 6309, 118659, -305420, -898818, -1063885, -782035, -498770, -326439, -23773, 297188, 210361, -213879, -419357, -333817, -511588, -1070265, -1371261, -1162153, -1117513, -1609185, -1796507, -829609, 679748, 1401544, 1108380, 732960, 812355, 909266, 620786, 226819, 85568, 89100, 5980, -137771, -213189, -108186, 368930, 1237034, 1972051, 1947713, 1325342, 921903, 1077054, 1288191, 1160277, 1004848, 1122801, 1173314, 820029]
35491H20029l55419J91678M77840M7596m41959l06289R3341M2548l26987l12452
35481g0074J92938N73745M54808J28366m1997q7925j50524j75476j07996o4593
35471F51272j15563j68318k11263l48794m22627j8785Q16960J290514Q08139r5552
35461B185983m25074j23229k3180m29000o41598j51437N49098P95089O33175L29054
35451B698881k56244j064147j294836m13711P65899J003708L13146k78282l59658
35442A114756m01160n48917l95039r015J9723k49028j02864M17984M22305j35313
35432A33432r2599R10526J510857P23238l69171l38354L04212J21740p81833j067115
35422A054933m78776q0521k78427l07174J46658L83640J19608L5161L84637L94645
$$ y = [820029, 464610, 656288, 1134128, 1181724, 739765, 433476, 526817, 569365, 242378, -70074, 122864, 696609, 1151417, 1279783, 1237786, 1149861, 999337, 823861, 715865, 651272, 535709, 367391, 156128, -192666, -615293, -634078, 182882, 1473396, 2281535, 2185983, 1760909, 1637680, 1614500, 1185500, 543902, 392465, 941563, 1736652, 2369827, 2698881, 2442637, 1378490, 83654, -330057, 435842, 1439550, 1752696, 1474414, 1114756, 713596, 164679, -230360, -239375, -219652, -468680, -571544, -153560, 268745, 133432, 40833, 951359, 2462216, 3185454, 2816283, 2477929, 2782141, 2903881, 2122048, 1054933, 576157, 495636, 217209, -89965, 56693, 440333, 559941, 595102, 979739, 1374384]
35412A374384k72997o80912r2689P52110Q15719L50011K12712K71695k47719j151521
35402A330793j309147l86345N53160N43585l3814k30416N4976J46006j98548m03696
35392F6554m5012M17876L18376j70986l00918M1337J41677k81445m15960M06988
35382A78487J408375J229909j23389j194783r96581j04888M29027M17845L06142
35373A550144K52190O2835k91917n99756o70843m02395J90333Q00083R73176O35356
35363B499206J98650J2634L5201J18471J84586M7391l95857p07479l29083L79218
35353B042938L63665n17431j061564m91839K98638J59727n00254m73885K51232
35344G1227N69784Q0351m52244m66135k77200k21922j43626K4177M5535q608K47531
$$ y = [1374384, 1101387, 420475, 327786, 1079896, 1895615, 2245626, 2458338, 2730033, 2482314, 1330793, 21646, -364699, 188461, 732046, 698232, 467816, 522792, 668798, 470250, 66554, 21542, 439418, 757794, 586808, 285890, 327227, 468904, 187459, -228501, 178487, 1586862, 2816771, 2693382, 1498599, 502018, 397130, 826157, 1244002, 1550144, 1802334, 1865169, 1573252, 973496, 302653, -99742, 90591, 890674, 1863850, 2499206, 2697856, 2710490, 2745691, 2864162, 3048748, 3096139, 2700282, 1992803, 1663720, 2042938, 2406603, 1889172, 827608, 335769, 634407, 794134, 293880, -180005, 71227, 641011, 721362, 269118, -197017, -474217, -696139, -839765, -815588, -770053, -778661, -531130]
35333e31130P00363P23567K02482k35019k41310j65582j98511j5941L68621L48352
35323I55892j90908m72289j29005M0715n74007j158788o25526O24518J215287
35314c14111P17669j2246k33853n5737K03708M81006O69224N60965K27725n2800
35304B191550k44956m56846n25859k56129Q4815J21715O3359L49707P48603N98427
35294B674386q0343n41921m56915k84078l52514l88236k11877j32506k86566k68469
35284c29039J64130N88655N30986J08009k78326m32899k78084K25282P77542Q62723
35274A938979M52556Q1870k902j45063m55895m44545P8564M71947K41562j20306
35264B096767J8901L34990J00301o10753j082211r97881n79130n184N58496O83518
$$ y = [-531130, 169233, 892800, 1095282, 860263, 618953, 453371, 254860, 238919, 607540, 955892, 764984, 292695, 163690, 204405, -369602, -1528390, -2153916, -1529398, -314111, 403558, 391312, 157459, 101722, 305430, 786436, 1455660, 2016625, 2244350, 2191550, 1946594, 1489748, 963889, 707760, 792575, 914290, 977649, 1327356, 2075959, 2674386, 2594043, 2052122, 1595207, 1311129, 958615, 570379, 358502, 225996, -60570, -329039, -164909, 423746, 954732, 1062741, 784415, 351516, 73432, 298714, 1076256, 1938979, 2391535, 2473405, 2470503, 2325440, 1869545, 1425000, 1503564, 1975511, 2217073, 2096767, 2115668, 2450658, 2550959, 1940206, 857995, -139886, -719016, -724200, -165704, 517814]
35254E17814K32487j09089K92813Q90049O50480l01098p96554l65257K06177K08529
35244A426351j13956l08661l94911m13422j39552L17895L95251l444k03359J49974
35234G12166M65713K53871K3883L70742Q29206N78439j75434n43533m16478n02932
35224A595643r34135r30129j41845O48655O97348L84124M27801O12924K16797
35215B577183n61858o35074L32648J210998Q56162l53581j132937j042977p81183
35206D69381q29202p51461j35506N55104O43352K65009J04613L67432O08377M93275
35196A790374K18530J25745K41023K81593n231m72931n78842n3514M70623J03882
35186B121252q74036j067064N9291J148078P88250l89687o88431Q6503N10887
$$ y = [517814, 750301, 641212, 934025, 1824074, 2474554, 2173456, 1376902, 1011645, 1217822, 1426351, 1312395, 1003734, 608823, 195401, 55849, 373744, 768995, 765551, 562192, 712166, 1177879, 1431750, 1455633, 1826375, 2655581, 3234020, 3058586, 2515053, 2098575, 1595643, 661508, -268621, -410466, 238189, 935537, 1319661, 1747462, 2360386, 2577183, 2015325, 1380251, 1712899, 2923897, 3780059, 3426478, 2293541, 1250564, 469381, -359821, -1111282, -1246788, -691684, -48332, 216677, 321290, 688722, 1297099, 1790374, 2008904, 2134649, 2375672, 2657265, 2652034, 2179103, 1600261, 1546747, 2017370, 2121252, 1247216, 180152, 239443, 1387521, 2175771, 1786084, 1097653, 1184156, 1695043]
35177A695043j04115p70158n46692J53422N50058O46145P01879N10229l7889m14015
35167B383907k25928O5285j25598n93746p75898n88546k57007J67385N25462L34064
35157I09380m58705r76410m29782P02847J239208Q08498J23079j25271j1485j2754
35147A768605l38600o91134n50400J85023Q52238O95825j06927o54382n97323
35138E62925m44310m43720j33763N94658J012503P45997M59941O07906N44312
35129C506449j67019o21936j1319P28969K20900j046273j354573l60584N86309
35120A480923O30809L26052K51288J99960K7522J0212N3317k92691p96344o94989
35110A196059o6276J95406l7407M0537M54222J51449r80640j408848k29477J264784
$$ y = [1695043, 1590928, 820770, 274078, 427500, 977558, 1623703, 2325582, 2835811, 2797922, 2383907, 2157979, 2223264, 2097666, 1503920, 728022, 139476, -117531, 49854, 575316, 909380, 450675, -525735, -955517, -252670, 986538, 1795036, 1918115, 1792844, 1781359, 1768605, 1430005, 738871, 188471, 373494, 1225732, 1921557, 1814630, 1160248, 562925, 118615, -325105, -458868, 135790, 1148293, 1894290, 2354231, 2962137, 3506449, 3339430, 2717494, 2706175, 3435144, 3656044, 2609771, 1255198, 894614, 1480923, 2111732, 2437784, 2689072, 2889032, 2916554, 2926766, 2980083, 2687392, 1891048, 1196059, 1129783, 1325189, 1287782, 1328319, 1782541, 1933990, 953350, -455498, -684975, 579809]
35100E79809J477780P65294M61849O54909M38159k86980p83322q76949r91237
35091A439312j019303m95867K27019K90598j80139k04608L00729K68936o16042
35082A0635j117182l15571Q37930Q82383l7223n90740l20617r714j12103r8195
35072h70397L44646N85786J35151m26499l91801j23686l49147p30933l12460P40432
35062a398908J095460K30569o79489m40796N12681R22809M84280m4737j02409
35053E79460J23769K25423L1819l46203n39441k34405K65435K76028j59096j24771
35043I8018O80979J185360M98440n81796p04209N2106N28096K90865j67222n75146
35033A305491q99624o38135M55317J299651P27537m84232n67378M40451Q17036
$$ y = [579809, 2057589, 2822883, 3284732, 3939641, 4377800, 4090820, 3307498, 2430549, 1439312, 420009, -75858, 151161, 441759, 261620, 57012, 357741, 626677, 10635, -1106547, -1422118, -584188, 298195, 260972, -329768, -650385, -660099, -772202, -870397, -525751, 60035, 195186, -231313, -623114, -746800, -1095947, -1826880, -2139340, -1398908, -303448, -72879, -752368, -1193164, -680483, 242326, 726606, 681869, 579460, 703229, 928652, 960471, 614268, 74827, -159578, 105857, 381885, 222789, 98018, 778997, 1964357, 2462797, 1881001, 1176792, 1228898, 1756994, 2047859, 1880637, 1305491, 405867, -232268, 223049, 1522700, 2250237, 1766005, 1198627, 1639078, 2456114]
35024B456114R5942l05207K17143M00986m28407j032588n26915L0677l15529o50307
35014e8091o0198M43122k50643j058768l61676J121345J334255J08048p80724
35005D36670m69830J02214J67525J48124M19333N50317K07467k48051l85957k02672
34995G25140N9029L8021m98762r95465l79318J219991J962458P05803j023594
34986A813303j045077K91521Q44923P6607m75215k8592L75687K8131k84010K4704
34976A621982K49254j33376m27450p9159K50174p1449m71071j97774M40940P60465
34966A942536P48067O11092J41787o04515q05673R46R19963P63883l30796j175899
34956B211391j062083l03718M27472O61221K63073m37071q07004n52949L290M44226
$$ y = [2456114, 2552056, 2246849, 2463992, 2864978, 2436571, 1403983, 877068, 907745, 592216, -58091, -118289, 324833, 74190, -984578, -1346254, -224909, 1109346, 1217394, 436670, -33160, 69054, 236579, 384703, 804036, 1354353, 1561820, 1313769, 927812, 725140, 784169, 822190, 323428, -672037, -1051355, 168636, 2131094, 2836897, 1813303, 768226, 1059747, 1904670, 1981277, 1506062, 1477470, 1853157, 1881288, 1597278, 1621982, 1871236, 1737860, 1310410, 1231251, 1481425, 1409976, 938905, 741131, 1182071, 1942536, 2690603, 3301695, 3443482, 2838967, 2033294, 2034240, 2954203, 3718086, 3387290, 2211391, 1149308, 845590, 1273062, 1934283, 2197356, 1760285, 953281, 400332, 403622, 847848]
34946H47848O51717N47663L0949n62578n64238R6888O49494N39479J35348l1042
34936B341528q9134l61823o30535m82430j1144L57809M38094K78234o7334m06247
34926A367018m29968k03018k08254n73891p43718l21318K45464L14931j9242j73307
34916g45303L8169K49313J27113k40885m62088k15761L30287N49703J53019k23987
34906d40420J52210Q44663P13074k89648q61175k51888O27608O05444j59992p15425
34896B24451o69207k44455L59283Q75779Q19214J79752k60002k6349K06427l15762
34886A149131j077452r53869J56819J267983J602245J137724J46772r38645j387908
34877A102800p74050K93617P28317K48537m38869o25634k41833L56045P33273
$$ y = [847848, 1499565, 2047228, 2078177, 1515599, 951361, 1048249, 1697743, 2237222, 2372570, 2341528, 2252394, 1890571, 1260036, 777606, 766462, 1124271, 1562365, 1840599, 1773265, 1367018, 937050, 734032, 525778, -48113, -791831, -1113149, -867685, -552754, -571996, -745303, -707134, -457821, -330708, -571593, -1033681, -1249442, -919155, -369452, -216433, -440420, -288210, 556453, 1269527, 979879, 118704, -133184, 494424, 1099868, 939876, 224451, -444756, -689211, -329928, 545851, 1365065, 1544817, 1284815, 1258466, 1464893, 1149131, 71679, -882190, -725371, 542612, 2144857, 3282581, 3429353, 2490708, 1102800, 328750, 622367, 1350684, 1599221, 1160352, 534718, 292885, 648930, 1382203]
34868A382203O31637K55593R3843J94282O2953m07001n83359j73099J40742j29289
34858A468505l04414K59707P89822K16007q82917r45144J96210J082243P91695
34849B671714m9936n83185p20538n45536O9760Q22061R94943N26132J25109L4059
34839C344583l01431r89659j241544o73669n734J46790J61743M02964L37322m49706
34829G31659j210801j022040j77222L92984N62244Q33532J126174Q54525R1972
34820B183027l54923j10170L28732M02165P0406m73558j013334j134580m96784
34811e99019N14789R76600N39511j06854j71982K38939M31139J35889k10097j31503
34801A617412K78858M98122J56010n86421j167689j110503m36828L61792P84385
$$ y = [1382203, 2013840, 2269433, 2363276, 2557558, 2620511, 2213510, 1630151, 1457052, 1597794, 1468505, 1164091, 1423798, 2213620, 2429627, 1546710, 601566, 797776, 1880019, 2671714, 2621778, 2038593, 1318055, 772519, 842279, 1664340, 2659283, 3185415, 3310524, 3344583, 3043152, 2053493, 811949, 138280, 132546, 279336, 441079, 844043, 1181365, 731659, -479142, -1501182, -1678404, -1285420, -723176, 110356, 1236530, 2091055, 2183027, 1828104, 1717934, 2046666, 2448831, 2519237, 2045679, 1032345, -102235, -599019, -84230, 892370, 1431881, 1325027, 1153045, 1391984, 1823123, 1959012, 1748915, 1617412, 1896270, 2394392, 2550402, 1963981, 796292, -314211, -751039, -389247, 395138]
34792C95138P60666O12851N99810O05246L59066j35272n80636p59037o88450l98371
34782G71011J20679O21022O47058J77308j53957P9900L46444j03414r49656j078826
34772D77569k09330O19055N29207p628p7105K20386P9819n46597p53028m0213
34762B92135R15964J177373O60690l8463m88015o13127l65680K20931P35668O93024
34752C190500K00463j40410j07952j30210m50208n86688j23607M22074K55771
34743B529733l95892n02365J97562P19991K83493n43582p32775k51323J09779
34734A414621J8966q5703J02229K79240J21939j75516k21836J9716K38645J93733
34724A906034l5521j82521j17804J8790P7741J64085L85273M56699L9641n19140
$$ y = [395138, 1155804, 1768655, 2368465, 2973711, 3332777, 3197505, 2616869, 1857832, 1169382, 771011, 891690, 1512712, 2159770, 2337078, 2183121, 2263021, 2609465, 2506051, 1556395, 477569, 268239, 887294, 1416501, 1408873, 1331768, 1552154, 1631973, 1085376, 332348, 292135, 1208099, 2385472, 3046162, 3007699, 2519684, 1906557, 1540877, 1761808, 2497476, 3190500, 3390963, 3250553, 3142601, 3012391, 2562183, 1975495, 1851888, 2273962, 2529733, 2133841, 1631476, 1829038, 2549029, 2832522, 2288940, 1556165, 1304842, 1414621, 1433587, 1347884, 1450113, 1729353, 1851292, 1675776, 1453940, 1473656, 1712301, 1906034, 1870513, 1687992, 1570188, 1588978, 1666719, 1830804, 2216077, 2672776, 2712417, 2193277]
34714B193277m34791L10593P27196K16826n06511n40658j58459j69098m75086
34705A163289l68930M5381m5035o41736p09032K53493J407434J724630J131639
34696C961133J73821o84215j076788q19141l47424l51170o43955k61924Q82130
34687H32467J458718N96790o24807o26885L89957Q56206J85874n96864o18988
34678A852468l00460l26071m82648k07254L36132M81461Q6882l13276l28219j51571
34668F47444p8404Q45L48863Q24975R12107L52535m40296p48472k84444N18920
34658B054073R34868O30497l3280l82521j56581K15430K01295r9980j48906J50959
34648C365854K71309p8837m74295n14708m84307p18339q14469k34182O49222R60589
$$ y = [2193277, 1758486, 2069079, 2796275, 3013101, 2506590, 1965932, 1807473, 1638375, 1163289, 794359, 839740, 794705, 152969, -556063, -302570, 1104864, 2829494, 3961133, 4134954, 3450739, 2373951, 1554810, 1207386, 856216, 212261, -49663, 832467, 2291185, 2887975, 2263168, 1636283, 2026240, 2882446, 3068320, 2471456, 1852468, 1552008, 1225937, 743289, 536035, 872167, 1353628, 1440510, 1127234, 799015, 647444, 569040, 569885, 918748, 1743723, 2655830, 3008365, 2568069, 1819597, 1535153, 2054073, 2988941, 3619438, 3586158, 3203637, 3047056, 3262486, 3463781, 3363801, 3214895, 3365854, 3637163, 3558326, 3084031, 2569323, 2085016, 1366677, 552208, 318026, 967248, 1927837]
34638A927837N96917K06290K419l94871q70582o65518L18146J042797P17565j39064
34628B741936n95141n40855l87280j85288K03838N43420N68188N25930O89671
34619C564419O94464J04833o42749o85718l3676L44147j78917j086400j379703
34610G00700o60118N39155J253910R49858O5560m64075l61607k85376o82060r62290
34600I3657m49230L78113N18329N1495L5101P56751J180045N17008n67365r38506
34590A575398n17435j09804j24078k04383p505K97837L92665K41824K9082q9702
34580A483899o0424R0156K69861L78010L62529K11184l9021k58443l17887k75443
34570A844421l07175l86427k73785K4277Q9933l01050o78163m54319J55624L98815
$$ y = [1927837, 2524754, 2731044, 2733463, 2338592, 1468010, 802492, 1120638, 2163435, 2881000, 2741936, 2146795, 1605940, 1218660, 1033372, 1237210, 1780630, 2348818, 2874748, 3564419, 4258883, 4363716, 3720967, 3035249, 3001573, 3345720, 3166803, 2080403, 700700, 40582, 579737, 1833647, 2783505, 2849065, 2384990, 2023383, 1738007, 1055947, 93657, -355573, 22540, 540869, 592364, 627465, 1384216, 2564261, 3081269, 2513904, 1575398, 1057963, 948159, 824081, 619698, 612193, 910030, 1302695, 1544519, 1573601, 1483899, 1423475, 1513631, 1783492, 2161502, 2524031, 2735215, 2696194, 2437751, 2119864, 1844421, 1537246, 1150819, 877034, 901311, 991244, 690194, 12031, -442288, -286664, 112151]
34560A12151J49661Q0042M67745O67794K91914Q6709P18789J324261N62044j124793
34550C336317j779073o87565N94469N97717o8818r9566L37793K38238k46632r0529
34540B132351O76700R32034L48220j76264j65691k00324n15389l86028M27102
34531C072711Q99308L06846m95874m16624J09647j00497r93273j349111o56471
34522C76662K50451N32299L58804K87621L67169K93001J9159k12055k64601k22785
34512A785725j63012l1632J95659L68571L22054J35864K4439m0528k67906n00287
34502A828947k16800N75856R90389M04690m98622o44978j57315k9431m17871m51266
34492A383599J81859O81769N11923J91624K22559K61840l4615k88707j85373j17649
$$ y = [112151, 261812, 341854, 809599, 1477393, 1769307, 1856016, 2574805, 3899066, 4461110, 3336317, 1557244, 869679, 1464148, 2061865, 1993047, 1893481, 2231274, 2469512, 2222880, 2132351, 2809051, 3741085, 4089305, 3913041, 3747350, 3547026, 3031637, 2645609, 3072711, 3972019, 4278865, 3782991, 3366367, 3476014, 3375517, 2382244, 1033133, 376662, 627113, 1159412, 1518216, 1805837, 2173006, 2466007, 2485166, 2273111, 2008510, 1785725, 1622713, 1591081, 1786740, 2155311, 2477365, 2613229, 2637668, 2597140, 2329234, 1828947, 1612147, 2188003, 3178392, 3583082, 3084460, 2439482, 2282167, 2252736, 1834865, 1383599, 1565458, 2247227, 2759150, 2950774, 3173333, 3435173, 3400558, 3111851, 2926478, 2808829]
34482B808829l49499l62445J92219O56271L29135l76812o01486l08465n9793l987
34472A923967R6188K19875K07379J78676K39706J84615j2070K4914K92950J45106
34462C501306n70541r30251k92574N76047O55886J71775q1182j40644m50227p11383
34452A728212m07769Q2793J30327N3742M19825P43910L02352l33512j70394K89390
34442B838876j87815j186436j049866K80565R33233Q1874p42726j80653Q55270
34433A642322P93727j87637o88175k09636M38066M58525q1443n47923m05563K37351
34423A449614O21913K31108m00158l83676J66822L62445M2777l9544L59194N48566
34413B959061K07260l9785K00326L97769J07651l10910n02754o85923q86224n88164
$$ y = [2808829, 2459330, 2096885, 2289104, 2945375, 3274510, 2897698, 2296212, 1987747, 1927954, 1923967, 2020155, 2240030, 2447409, 2626085, 2865791, 3050406, 3038336, 3063250, 3356200, 3501306, 2930765, 2000514, 1707940, 2283987, 2939873, 3111648, 3030466, 2889822, 2439595, 1728212, 1320443, 1403236, 1533563, 1587305, 2007130, 2751040, 3053392, 2719880, 2549486, 2838876, 2651061, 1464625, 414759, 695324, 1628557, 1710431, 967705, 787052, 1642322, 2436049, 2248412, 1560237, 1350601, 1788667, 2247192, 2165749, 1617826, 1212263, 1449614, 2071527, 2302635, 1902477, 1518801, 1685623, 2048068, 2090845, 2051301, 2410495, 2959061, 3166321, 3126536, 3326862, 3724631, 3832282, 3521372, 3018618, 2332695, 1446471, 858307]
34403H58307K40487P30770L94435q0025j9451J48429j82037o11741m12303K40972
34393A307843O16996N41092L61564K09529P097j33065j17255j41567k86854k60294
34383B105086O2518L49347M19820N07159N60777J00694p52558j021999l11000
34374B019844M27261L55712L8224K65194N37800K0192p33560n18050M67091Q51783
34364C731491K69263k17038Q842K61167k9217l53108k10697o2477l88699o51665
34354B357862j26545P86971J030670L85036l74887p10252q32998q83943m71505
34345A160409N13051J283511J051533J69220l51458k63640k08720m45119m29451
34336B479336L6346K20072l42622q81504m71548N24501J012355P08362J96472
$$ y = [858307, 1098794, 1829564, 2223999, 2143974, 2124523, 2272952, 2090915, 1479174, 1066871, 1307843, 1924839, 2465931, 2827495, 3037024, 3044121, 2911056, 2793801, 2652234, 2365380, 2105086, 2167604, 2516951, 2936771, 3443930, 4004707, 4105401, 3352843, 2330844, 2019844, 2447105, 2802817, 2841041, 3106235, 3644035, 3664227, 2930667, 2412617, 2879708, 3731491, 4000754, 3783716, 3792558, 4053725, 4024508, 3671400, 3460703, 3398226, 3009527, 2357862, 2231317, 3018288, 4048958, 4433994, 4059107, 3348855, 2515857, 1631914, 1160409, 1673460, 2956971, 4008504, 4177724, 3826266, 3562626, 3353906, 2908787, 2479336, 2515682, 2735754, 2393132, 1511628, 1040080, 1564581, 2576936, 3285298, 3481770]
34327C481770j46650k96112l4528O37656Q79189K3752j030121q17443M24215R93676
34317D115404K88029n04311n42214m22782n56846k24803P74206J141078M4198
34308D111959j234270j073388P3528N59148P8478k59736L8480L03812J02154j48205
34298B551960r4657N1474J13599K28379L70563K77156j8406j45660j1427L2960
34288C355941k16076m35935j89823M66211R57594Q01683J91152k17385j62252
34279D551110o5683k25241k54241J35969L97410M3047k79939K34988R57027O20730
34269F115177n30247j020021n13099j42651l12222j09456O24440O62756l50585
34260D424092r54034k55702N53257L29842j17164K74612Q17697M36479l25473
$$ y = [3481770, 3335120, 3039008, 3004480, 3642136, 4521325, 4545077, 3514956, 2697513, 3121728, 4115404, 4403433, 3899122, 3356908, 2934126, 2377280, 2152477, 2926683, 4067761, 4111959, 2877689, 1804301, 1877829, 2436977, 2515455, 2255719, 2294199, 2598011, 2700165, 2551960, 2457303, 2508777, 2622376, 2850755, 3221318, 3498474, 3480068, 3334408, 3322981, 3355941, 3139865, 2703930, 2514107, 2980318, 3937912, 4739595, 4930747, 4713362, 4551110, 4485427, 4260186, 4005945, 4141914, 4539324, 4582371, 4302432, 4537420, 5494447, 6115177, 5584930, 4564909, 4051810, 3909159, 3596937, 3487481, 4111921, 4774677, 4424092, 3470058, 3214356, 3767613, 4097455, 3980291, 4254903, 5072600, 5509079, 5183606]
34251E183606l84568m9763j83121m76495k38805Q7063j36173k68713M06396R79414
34241D918841K79492r00223r04433J25717O58367K97959m7476j08387m16823p88048
34231C114986m94388J91983L28844Q217J16734O13101O51211K01548j9858Q650
34221D721028k30231n39817m35201l34629p10930p19676M29597J447800O03146
34212D231087j134915j193994N22020J429258M06065o67932k64634N38410L50984
34203D216349k37194j21307L15549J54367l83932n09577j55425K88289O92319
34194D259438R18011O51011L4605l43960l96103n39578o50874j63508O54987Q12339
34184E236368J83675l05511k66726k43883l60467q3084M13492K32105n34262o78550
$$ y = [5183606, 4799038, 4749275, 4566154, 4089659, 3850854, 3937917, 3801744, 3533031, 3939427, 4918841, 5198333, 4298110, 3393677, 3519394, 4177761, 4475720, 4428244, 4319857, 3903034, 3114986, 2620598, 2812581, 3141425, 3149642, 3266376, 3879477, 4530688, 4732236, 4712378, 4721028, 4490797, 3950980, 3515779, 3181150, 2470220, 1750544, 2180141, 3627941, 4231087, 3096172, 1902178, 2424198, 3853456, 4259521, 3591589, 3326955, 3865365, 4216349, 3979155, 3857848, 4173397, 4327764, 3943832, 3434255, 3278830, 3567119, 4259438, 5177449, 5828460, 5863065, 5519105, 5123002, 4583424, 3932550, 3769042, 4424029, 5236368, 5420043, 5114532, 4847806, 4603923, 4243456, 4160372, 4573864, 4805969, 4271707, 3593157]
34174C593157P9426N38648N9201m33455j64344K81060K39983R9174L19126N03132
34164E115108K03143l03034n77687m99259M0476R16168J262668M33351o39406
34155E951528n19863M35355N96146k30508o38691k38123j73371o94219n64824
34146C923430M79831J012059M51155M7197M03258L19936p56252j389015o06086
34137C885513L83394L53736N003K88307O43240L99681J96854N40083O29003K8119
34127G352933k29905L79142O08897l33041j144812o51953J57711P1990j85656
34118F025306L54741Q01753P7080q53214n89439K15255J30835n07452m56821J35010
34108E333054L45155L44366O67826O90712j68358q15071j28482Q35028M79742
$$ y = [3593157, 3672583, 4211231, 4270432, 3836977, 3672633, 3953693, 4193676, 4292850, 4611976, 5115108, 5318251, 5015217, 4437530, 3938271, 3978747, 4894915, 6157583, 6590934, 5951528, 5431665, 5867020, 6463166, 6232658, 5593967, 5355844, 5182473, 4488254, 3923430, 4403261, 5415320, 5866475, 5913672, 6316930, 6636866, 5880614, 4491599, 3885513, 4268907, 4622643, 4627646, 4915953, 5559193, 5958874, 6155728, 6695811, 7324814, 7352933, 7123028, 7502170, 8111067, 7778026, 6633214, 5981261, 6138972, 6210962, 6025306, 6380047, 7181800, 7258880, 6405666, 5816227, 6031482, 6162317, 5654865, 5198044, 5333054, 5678209, 6022575, 6690401, 7381113, 7212755, 6397684, 6269202, 7104230, 7583972]
34099G583972n05370l28470P27137Q21371k23449o97928R9628R57783Q71390K15135
34089I521199l67024p15340p04541k96580K2004j19670k51441O4117K94024l7795
34079G408953k20984M41215J138052P19729l58109p49125k72364J72249K01846
34070H481462J34125P6912n60J61918N09530L94392k27047l49342M07455R34721
34060A0523566M90729j8355J65020J47500q30798j663271j144143p6779J42529
34051G735998k37789k19211Q4336J50951L24328P82366O48039k89680n76318N17537
34041H920557J392644P38247j80234Q8275N27229k38905j148152o44400L83229
34032I838490L55211J303P34202J604692Q91819o15884r13188j68877K8950l36255
$$ y = [7583972, 7078602, 6750132, 7477269, 8298640, 8075191, 7377263, 7476891, 8434674, 9306064, 9521199, 9154175, 8438835, 7734294, 7437714, 7459718, 7340048, 7088607, 7152724, 7446748, 7408953, 7187969, 7629184, 8767236, 9486965, 9128856, 8379731, 8107367, 8279616, 8481462, 8615587, 8692499, 8691939, 8853857, 9363387, 9757779, 9530732, 9181390, 9588845, 10523566, 11014295, 10995940, 11160960, 11308460, 10477662, 8814391, 7670248, 7593469, 7735998, 7498209, 7278998, 7363334, 7514285, 7838613, 8620979, 9269018, 8979338, 8403020, 8920557, 10313201, 11051448, 10871214, 10959489, 11486718, 11247813, 10099661, 9455261, 9838490, 10193701, 10195004, 10929206, 12533898, 13425717, 12809833, 11896645, 11727768, 11756718, 11420463]
34022A1420463k30921P8293j60109k58328M93520R33727O4452p12640J579Q97478
34012A2527514M26783j67552O69118J562877P67280l50757R0889P92658o9100
34003A6249710r78797O2563J353134N39816o90968L18592J941599J121210q97612
33994A9019247r57669K04838l69n49658Q41203K288412Q39285j324404l19491
33985B0041394K079050J476923r26082o28304J614637J425541o27032l08737J781726
33976B5929116J438479n97548J506K325524J768714o71177p2297K513155J862828
33967C4498300p74087L71435L887585L074932j022517r54872K956713L142723
33959D5180212l08505L30844M750966M476950j37113M84260O297493O487044L53929
$$ y = [11420463, 11189542, 11267835, 11107726, 10849398, 11342918, 12276645, 12341097, 11628457, 11630036, 12527514, 12954297, 12786745, 13455863, 15018740, 15786020, 15435263, 15526152, 16318810, 16249710, 15270913, 15333476, 16686610, 17226426, 16535458, 16854050, 18795649, 19916859, 19019247, 18061578, 18266416, 18266047, 17716389, 18557592, 20846004, 21685289, 20360885, 20041394, 22120444, 23597367, 22671285, 22042981, 23657618, 25083159, 24456127, 24147390, 25929116, 27367595, 26770047, 26771553, 29097077, 30865791, 30194614, 30122317, 32635472, 34498300, 33724213, 34095648, 37983233, 41058165, 40035648, 39080776, 42037489, 45180212, 44871707, 45202551, 49953517, 54430467, 54293354, 54777614, 61075107, 67562151, 67916080]
33950F7916080k39045O346803P662919J824696K473533J1500607J2990026M492316
33942A14967935M837422J7232132J8941797P327942J4777057M4021303L2287160
33935B54392748o3624899j75504723j87468973q6106188K1350750M8085004K0639198
33928a68237083P377470J7922420J9111592O091345K507113J1132043J2398723
33921i1696377L609840J054667P132548P836406J215307N429O060368P331212
33913e7450600J365632q04629L839072N461784P61167j480927K286545M369067
33905d1652889J113658r23846J676254L289778R39864l99099J673909K383956
33897c1898415l24251j621653O98964K141753M55384m03861J401794J995420j74053
$$ y = [67916080, 67677035, 74023838, 81686757, 83511453, 85984986, 97485593, 110475619, 114967935, 119805357, 137037489, 155979286, 163307228, 178084285, 222105588, 254392748, 190767849, 15263126, -172205847, -258312035, -236961285, -188876281, -168237083, -160859613, -142937193, -123825601, -117734256, -115227143, -104095100, -91696377, -88086537, -87031870, -79899322, -72062916, -70847609, -70842180, -64781812, -57450600, -56084968, -56889597, -53050525, -47588741, -46827574, -48308501, -46021956, -41652889, -40539231, -41463077, -39786823, -36497045, -35557181, -35956280, -34282371, -31898415, -32222666, -33844319, -33145355, -31003602, -30548218, -30952079, -29550285, -27554865, -27728918]
33888b7728918j007053J202127K311014K57527j106138N20463J778459M42125
33880b3330394m91299R85733J945592L24213j158917k54263R92541P08147L96946
33871a9881701R91627P24823o20475m16232J571874J877359m47415j695872n7962
33862a7953974J182136k07816j486930l38014R63127K17607o35220L08443J117790
33853a6832851L3273q41134M77153J942111J202929k03010O4478J017720P19802
33844a2419529r0127K3166K76486k98004n47208L27158P12455l45073q78913M71557
33834a2768032J627617O79871n84666P1135J286060O92017q10592q43902L06139
33825a0344353O75177J63246J4099J46329j79914l49556L59303Q52562J3822r60331
$$ y = [-27728918, -28735971, -27533844, -25222830, -24965303, -26071441, -25550978, -23772519, -23330394, -23821693, -22835960, -20890368, -20566155, -21725072, -21979335, -20986794, -20278647, -19881701, -18890074, -18165251, -18785726, -19201958, -17630084, -15752725, -16200140, -17896012, -17953974, -16771838, -16979654, -18466584, -18804598, -17841471, -17623864, -18259084, -17950641, -16832851, -16799578, -17640712, -17163559, -15221448, -14018519, -14221529, -14157051, -13139331, -12419529, -12509656, -12486490, -12210004, -12508008, -13055216, -12728058, -12015603, -12360676, -13239589, -12768032, -11140415, -10460544, -11045210, -10974075, -9688015, -8995998, -9806590, -10650492, -10344353, -9669176, -9505930, -9491831, -9345502, -9525416, -9874972, -9515669, -8663107, -8649285, -9609616]
33815i609616m74239N78530L52948p27244q10950K50369R80954Q02659M06512
33806h250077J65442p8482j62399P7707K24362J3148j71322k21136n34934p91132
33796i728823j11126R98528Q80444l88058o78970O47003J446012L59607r33411
33787g508794o86092K03311K92391K5625J33424r0274r32827r66780L88129J314689
33777g827198O26531j01562M35145P63853l76780j250348j97400J077279M76261
33768f374219o31563P233J281446Q18231n34769l24917Q92504O78152o41301o19811
33758e449014O89390Q95865k49054n70745L05697L81489p05609q89440L76579
33749e214842R33717k42593j218556m60724P38644O79553j64858m54448r9070
$$ y = [-9609616, -10083855, -9505325, -9152377, -9879621, -10690571, -10440202, -9459248, -8656589, -8250077, -8084635, -8163117, -8325516, -8247809, -8023447, -8010299, -8181621, -8402757, -8937691, -9728823, -9839949, -8841421, -7960977, -8349035, -9028005, -8381002, -6934990, -6575383, -7508794, -8194886, -7991575, -7699184, -7673559, -7540135, -7630409, -8563236, -9530016, -9141887, -7827198, -7200667, -7302229, -6867084, -6103231, -6480011, -7730359, -7927759, -6850480, -6374219, -7005782, -6998549, -5717103, -4898872, -5433641, -5758558, -4866054, -4187902, -4829203, -5449014, -4759624, -3863759, -4112813, -4683558, -4377861, -3996372, -4701981, -5591421, -5214842, -4281125, -4523718, -5742274, -6202998, -5464354, -4784801, -4949659, -5404107, -5503177]
33740e503177K08106K20575j2076m04095m77668J18034O50275K14380n25956j65656
33730e677258R89712J207404J28394p11074m19980J44042K01821R0331p339n42725
33720d596672j239449r82211K74233J072385O05902j50059j32389L32098M27510
33711d388652O1980m35208q50723q98043l90177J94897K34399K4953K80114P46454
33701e420006O05739P4249J07469N94994M80160k67875n11746J5299K62586j59242
33691d218373k51566N31572J249242R84450J14115n54970p94504o15210j0011
33682c565255N63401M76983m6350k57170k47705o97855j261376q03455N34962
33673e303820J211330O67202J49814N07476Q23603J59076p97811r06409k80520
$$ y = [-5503177, -5295071, -5074496, -5086572, -5490667, -5968335, -5850301, -5200026, -4985646, -5511602, -5677258, -4687546, -3480142, -3351748, -4062822, -4482802, -4338760, -4136939, -4046608, -4053947, -4596672, -5836121, -6818332, -6544099, -5471714, -4865812, -5015871, -5148260, -4816162, -4388652, -4326672, -4761880, -5612603, -6510646, -6900823, -6705926, -6471527, -6446574, -6166460, -5420006, -4814267, -4740018, -4632549, -4037555, -3557395, -3825270, -4337016, -4321717, -4059131, -4218373, -4469939, -3938367, -2689125, -1704675, -1590560, -2145530, -2940034, -3555244, -3565255, -3001854, -2524871, -2571221, -2828391, -3076096, -3773951, -5035327, -5838782, -5303820, -4092490, -3425288, -3275474, -2767998, -1944395, -1785319, -2583130, -3489539, -3770059]
33664c770059K06886K50230N2578l24394p75151q87802m48505K35214P71983R40756
33654c748264N40453k88513p53318l31562K61052J25765k24646J98499P68396
33645c452138N4578j412458j493424J17076J202606N38847k96282J76375Q94751
33636c670069L78989o16815n53817K20648L05527k39566k10232N06342Q32951
33627c046042L72449j40300j43117J98569O21329R52066Q14574l451j028539j575475
33617b977937j493711r81639j37195P90407J239634R67791L60269k28754p67766
33608c228901r41637k75653P09135O69414n55322j360676o85015L76990M02564
33599d889101j59591o5911M83054L84695k49897k82868M25063P97569L52571j57877
$$ y = [-3770059, -3563173, -3312943, -3260365, -3584759, -4359910, -5247712, -5696217, -5461003, -4689020, -3748264, -3207811, -3496324, -4249642, -4581204, -4320152, -4194387, -4419033, -4220534, -3452138, -3397560, -4810018, -6303442, -6186366, -4983760, -4444913, -4741195, -4564820, -3670069, -3291080, -3907895, -4461712, -4241064, -3935537, -4175103, -4385335, -3878993, -3046042, -2673593, -2813893, -2957010, -2758441, -2137112, -1185046, -370472, -373923, -1402462, -2977937, -4471648, -5453287, -5590482, -4800075, -3560441, -2592650, -2232381, -2461135, -3228901, -4170538, -4446191, -3737056, -3067642, -3622964, -4983640, -5668655, -5291665, -4889101, -5048692, -5114603, -4631549, -4246854, -4496751, -4779619, -4354556, -3556987, -3204416, -3362293]
33589c362293p0287L52966N92725M91752Q8467m48112p10391m80856j22914K66
33579c668677J28977M70882M81371k96513j107667q12405L71962J076677P00264
33570b655129O2177J8492L87859N33986K64546j68635m51058l77567k1361K01395
33560b205295l3830n02873p15999n19304j23811K21579K88748m2494m24338k37673
33550d295290M52185P26294J24967n50039m54334p201m5762l35273j00098M36739
33540d047812L83864j70503k22609L99941O84916R0914o30758o70355k01035K53995
33530d129442O02090Q66164Q59931O02026L64040R670q85343j904060j782354
33521e397278j94727J356508J338850J86639n16580l21960j57216m77175n17813
$$ y = [-3362293, -3432580, -3079614, -2486889, -1995137, -1906670, -2354782, -3065173, -3546029, -3668943, -3668677, -3539700, -3068818, -2587447, -2883960, -3991627, -4804032, -4432070, -3355393, -2655129, -2592952, -2574460, -2186601, -1652615, -1388069, -1556704, -2007762, -2385329, -2406690, -2205295, -2239125, -2741998, -3457997, -3977301, -4101112, -3879533, -3590785, -3633279, -4057617, -4295290, -3843105, -3116811, -2991844, -3541883, -3996217, -4003418, -4049180, -4384453, -4484551, -4047812, -3663948, -3834451, -4057060, -3657119, -2972203, -2881289, -3512047, -4182402, -4383437, -4129442, -3527352, -2661188, -1801257, -1199231, -835191, -825521, -1710864, -3614924, -5397278, -5592005, -4235497, -2896647, -2710008, -3226588, -3548548, -3705764, -4182939, -4700752]
33512d700752K56746J070228R13926J7508n61669m33632j40583o5461Q1758N10157
33502c051774P96099N04835j07332m76318m93671m25182l27232o4137K45836L38448
33492c060428L04893M75520Q01938Q57811N17773J57030N9446N5079j16433m48844
33482c96215p85344r67403q26710l65257P3885J86160J69612L63272N80270M15162
33472a552568Q2297J56395M86289K85150n09703r19291l72955L77658L43436m00346
33462b023638j066344j207437q42644p4102P97698J176034P69271M0103l49756
33453b780815k76970n3918P4532P6495R2956L68896Q44690Q95941J27552o86018
33443a316659m20062N97302Q04970k54158j138885o95330K57384L85307j39273
$$ y = [-4700752, -4444006, -3373778, -2459852, -2442344, -3004013, -3437645, -3578228, -3643689, -3561931, -3051774, -2255675, -1750840, -1858172, -2334490, -2828161, -3253343, -3580575, -3644712, -3398876, -3060428, -2755535, -2280015, -1478077, -620266, -102493, 54537, 113983, 169062, 52629, -396215, -1181559, -2148962, -2975672, -3340929, -3267044, -3080884, -2911272, -2548000, -1967730, -1552568, -1470271, -1313876, -827587, -542437, -1052140, -1971431, -2344386, -1966728, -1623292, -2023638, -3089982, -4297419, -5140063, -5214165, -4416467, -3240433, -2471162, -2431059, -2780815, -3057785, -3111703, -3037171, -2960676, -2867720, -2498824, -1654134, -758193, -630641, -1316659, -1736721, -1139419, -334449, -588607, -1727492, -2422822, -2165438, -1780131, -1919404]
33434a919404k64838J30743L17787N8561k70229n15602p26161o44885j00546M38276
33424c496298M57269J41936j11524l45688n36220k04727O33345R67783K39596
33415b254528n45954k93208M32293M46575n3543p6762K25204o1560o97971n72065
33405c451519K44621N13271k6156k63057K68251O40549K51441k18916j39057J11138
33395b069434J04018R3201J97966n706m88848m72825K24200O13568M9650o70717
33385b424927n64458M4770K30717j6324J2324M34438O36780L18199j14854k47173
33375a690508j80260k11779l41954l00671L7886M19749M80930K08312o2020j27813
33365a768128j10817r2556K9388J63543R379l31402l12087J66046M98620M22934
$$ y = [-1919404, -2184242, -2053499, -1735712, -1677151, -1947380, -2462982, -3189143, -3834028, -3934574, -3496298, -3039029, -2897093, -3008617, -3354305, -3890525, -4095252, -3461907, -2494124, -2254528, -2800482, -3093690, -2661397, -2214822, -2268365, -2345127, -2119923, -2181483, -2879454, -3451519, -3206898, -2693627, -2719783, -2982840, -2714589, -2074040, -1822599, -2041515, -2180572, -2069434, -1965416, -1872215, -1674249, -1679955, -2168803, -2641628, -2417428, -1803860, -1754210, -2424927, -2989385, -2944615, -2713898, -2730222, -2717898, -2283460, -1646680, -1328481, -1443335, -1690508, -1870768, -2082547, -2424501, -2725172, -2687286, -2267537, -1786607, -1578295, -1640315, -1768128, -1878945, -1971501, -1942113, -1778570, -1769191, -2100593, -2412680, -2246634, -1748014, -1325080]
33355a325080M88692Q99216Q30282k15294j263013j173165l44147O3921p6683
33346b115271j01937L8147m8210j69326k1924p4861o03001o20962N65068J579729
33336a572548P96445p71159q07691N09951Q02544m37254j031719M5532R60554
33327a505345K93899o44634l38416L81031J06778o70811p37710l34414l53107
33318c802729n24877p6180P43372J213240J324012J198121L74784j091330j906924
33309b548511j226710m8460L31046J73843L13006M66177M8825l47849R5936Q19481
33299a923216P62667J26857k08906k88673o11463p79878j56016P27087Q81024
33290a470517M38985J54274k8551m98626p76555k85763L39258K36427r4473K09268
$$ y = [-1325080, -836388, 62828, 893110, 677816, -585197, -1758362, -2102509, -2038588, -2115271, -2217208, -2179061, -2227271, -2396597, -2418521, -2493382, -3096383, -3717345, -3152277, -1572548, -776103, -1547262, -2354953, -1845002, -1042458, -1479712, -2511431, -2465899, -1505345, -1211446, -1856080, -2194496, -1813465, -1706687, -2377498, -3115208, -3449622, -3802729, -4327606, -4403786, -3660414, -2447174, -1123162, 74959, 449743, -641587, -2548511, -3775221, -3823681, -3492635, -3318792, -3005786, -2539609, -2490784, -2838633, -2742697, -1923216, -1160549, -1033692, -1242598, -1531271, -2142734, -2922612, -3078628, -2351541, -1470517, -1031532, -877258, -905809, -1404435, -2180990, -2466753, -2127495, -1891068, -1985541, -1776273]
33280a776273N49192j13490j057161o80385P69817J423986O38393l56500o72664
33271a275085p08079p18032k85320M63295P36456M75935M20779O37298M75758
33262B23005M2012R2323L87864j00320j167409j382625m41094L34490K72921K40433
33252a498400O58553N88931l24957q50641k20768M49183N6927o19069l33322N38215
33242a555348P70716K66771j10085m8538O6433O0879L4888q9316l21096l42893
33232a267589q3631K3434j42545p2057L33456L23875l81961q16505k40982M94241
33222a830264K13800o60675p47470J34354P53959L79764k55332j87997M03663
33213a796198N59518q5047p62449n52722L18492O62408l246o59070l18580L63544
$$ y = [-1776273, -1227081, -1340571, -2397732, -3078117, -2308300, -884314, -245921, -602421, -1275085, -1983164, -2701196, -2986516, -2523221, -1786765, -1310830, -890051, -252753, 223005, 265017, 357340, 745204, 644884, -522525, -1905150, -2346244, -2011754, -1738833, -1498400, -839847, -250916, -575873, -1426514, -1647282, -1198099, -1141172, -1760241, -2093563, -1555348, -784632, -517861, -627946, -676484, -610051, -549172, -514284, -603600, -924696, -1267589, -1351220, -1327786, -1470331, -1542388, -1208932, -885057, -1267018, -2083523, -2324505, -1830264, -1616464, -2277139, -3024609, -2890255, -2136296, -1756532, -2011864, -2199861, -1796198, -1236680, -1321727, -2084176, -2636898, -2318406, -1655998, -1659244, -2318314, -2636894, -2273350]
33203b273350J79264m95949k77125P12977Q22335l54873j179439o39325J43437
33194c362048J08520K7324O67006R91578L340j130296q39351J74443K36056k97244
33184c420672K28831J590770J818748M59083p25553o44962k44448l95955m72014
33175a806172J11365O59607M91822O3532j08616l62287q49163q28158J9439O98049
33165a910582L77752k32000j03213M00523K61067m23141o84010k92318Q9406J52441
33155b364075K37481M37285L76816l3351m06333n19135m83032k57016L28526R88038
33145a694796J090866N37533m7359k14427k47763n16776p34378l39387N72982
33136a593505J164132P87668k22583q78718o28024M4595K38494k42331o87058
$$ y = [-2273350, -2094086, -2590035, -2867160, -2154183, -1331848, -1686721, -2866160, -3505485, -3362048, -3253528, -3226204, -2559198, -1567620, -1564280, -2694576, -3533927, -3359484, -3123428, -3420672, -3191841, -1601071, 217677, 676760, -48793, -693755, -938203, -1334158, -1806172, -1694807, -1035200, -543378, -479846, -588462, -950749, -1799912, -2628070, -2608631, -1910582, -1532830, -1764830, -1868043, -1467520, -1206453, -1629594, -2313604, -2605922, -2516516, -2364075, -2126594, -1689309, -1312493, -1345844, -1752177, -2271312, -2754344, -3011360, -2682834, -1694796, -603930, -66397, -113756, -328183, -575946, -1092722, -1827100, -2166487, -1593505, -429373, 358295, 135712, -743006, -1371030, -1326435, -1087941, -1330272, -2017330]
33127b017330m62744J49545L93553Q6296j79963J30468Q06079J149486P51582
33118H06972q7105o31913m19844K27951M81622o8481q72581j045619m46170K03625
33108a851543L02802Q4529J28566M76249O13674K36293l47273o42702n17294j84143
33098a700842J37220L35376L17951O8696k11422k42692j0856K07008K53914L37404
33088e08243O61452R42597O16059l91496j352901j436848o25763K88357O19934
33079a186852M51275K61171J52443j84481p55121r58285l40435N71999O99320
33070a288966k40015j241321j174497j27435Q24799J002690P31297N72717N76408
33061c64323N56147N46556N14849Q5936p99170j304863o33727N97447R11042L2622
$$ y = [-2017330, -2480074, -2330529, -1936976, -1850680, -2030643, -1900175, -1094096, 55390, 806972, 719867, 87954, -331890, -103939, 377683, 309202, -563379, -1608998, -2055168, -1851543, -1548741, -1464212, -1335646, -859397, -245723, -9430, -356703, -999405, -1516699, -1700842, -1563622, -1228246, -910295, -841599, -1053021, -1295713, -1306569, -1099561, -845647, -508243, 153209, 1095806, 1711865, 1320369, -32532, -1469380, -2095143, -1806786, -1186852, -735577, -474406, -321963, -506444, -1261565, -2219850, -2560285, -1988286, -1288966, -1528981, -2770302, -3944799, -4072234, -3247435, -2244745, -1513448, -940731, -364323, 191824, 738380, 1253229, 1339165, 539995, -764868, -1398595, -801148, 109894, 142516]
33051A42516o82533l31022J72645k91563j057004o49856P68946J485072P29960
33042B87161l49724n32187m4002K84452K76367J47156j15103m28187m34004k16359
33032a124430l90162r23026q53461J01365P70284L57119r3671N83503J511515
33023f0964J068296l49309q52795p5378M18562j29707n80925q7723N01871K94170
33013A46098j97085k49871k03667m59164m49990K25726P47959L81630j47417R7096
33003a08685N35066Q9895p69962o80604K93193O84670l1240p07781m28817K43242
32993h81023M23533J80044L9845Q0459J27854K20419L36026J75909k99718n71359
32983a68011k61622K28910K47429k05949n34375l76107r915P6188k10434m82863
$$ y = [142516, -540017, -871039, -698394, -989957, -2046961, -2696817, -1927871, -442799, 287161, -62563, -594750, -638752, -354300, -77933, 69223, -45880, -474067, -908071, -1124430, -1514592, -2437618, -3291079, -3189714, -2419430, -2062311, -2155982, -1572479, -60964, 1007332, 658023, -194772, -270150, 148412, 18705, -562220, -649943, -148072, 146098, -50987, -300858, -504525, -963689, -1413679, -1187953, -439994, -58364, -205781, -108685, 426381, 516276, -253686, -934290, -641097, 43573, 12333, -695448, -1124265, -881023, -457490, -277446, -237601, -157142, -29288, 191131, 527157, 703066, 403348, -168011, -429633, -200723, 46706, -159243, -693618, -1069725, -1079640, -1003452, -1213886, -1696749]
32973a696749l62101J3746J19863k33327n34516j86288O79154J342203J363704
32964E05689R28985L58168k65226q31963r92183n54200P8487K35582k07552o13574
32954a357787l65152L07326O07741K53335j97869k82256l07658n82866n55714
32945b480900L44159J334545R94093n63633j525460q38468M00075P34794L54844
32936a245951K63119M44436J95279l69532n36216l50790m17676n64501o6523Q43120
32926a805235J044507K75213m50341m43976j78797j37506Q394M70542O02209j31013
32916g46003j118887j289163m24239P23236J302493J020679K84209j03256K26914
32907a24017O26992K38131o50413q81373j93228L08720j47418q25817o75982J28128
$$ y = [-1696749, -2058850, -2045104, -1925241, -2158568, -2693084, -2879372, -2200218, -858015, 505689, 1434674, 1792842, 1527616, 695653, -296530, -850730, -772243, -536661, -744213, -1357787, -1722939, -1415613, -807872, -554537, -752406, -1034662, -1342320, -1925186, -2480900, -2136741, -802196, 191897, -371736, -1897196, -2735664, -2335589, -1600795, -1245951, -982832, -538396, -343117, -712649, -1248865, -1599655, -2017331, -2581832, -2648355, -1805235, -760728, -485515, -935856, -1379832, -1558629, -1696135, -1687741, -1217199, -614990, -746003, -1864890, -3154053, -3578292, -2855056, -1552563, -531884, -247675, -350931, -124017, 502975, 741106, 90693, -790680, -983908, -675188, -822606, -1648423, -2324405, -2196277]
32897b196277O41705N26568J75705q9569k18223j69852n8401k06978n67241n55195
32887b717758J8325M39859J59380k60475p1635L74339K68630j85060j00855N12542
32877a562708P04452J29230m90695o27699o08575o85871m56213K63954Q04528
32868b529597N38595j51899m19167n1440M98007Q34332Q59288N58227N2135k97085
32858a08604k51525n5015r9668l75217n57014m83603k23830J76423O51232R22187
32848d04634P25534K08213k14652l59001l25828j43331K29335N45509M05159j08079
32838E58225l84706j35387J60456J5357k83824j99292Q7473j8951l77486j84817
32828g62952N85201P71728l06168j536472j346152N9346R26357L99119m47508
$$ y = [-2196277, -1554572, -1028004, -852299, -941868, -1160091, -1329943, -1388344, -1595322, -2162563, -2717758, -2699433, -2259574, -2100194, -2360669, -2432304, -2057965, -1789335, -1974395, -2075250, -1562708, -858256, -729026, -1219721, -1847420, -2455995, -3141866, -3598079, -3334125, -2529597, -1991002, -2142901, -2562068, -2613508, -2115501, -1281169, -421881, 136346, 188481, -108604, -360129, -415144, -514812, -890029, -1447043, -1930646, -2154476, -1978053, -1326821, -404634, 320900, 529113, 314461, -44540, -370368, -513699, -284364, 261145, 666304, 558225, 173519, 38132, 198588, 213945, -69879, -269171, -181698, -200649, -578135, -762952, -177751, 593977, 287809, -1248663, -2594815, -2535469, -1609112, -1209993, -1657501]
32819a657501m07372J28893Q4325m44461l93088M63309J064901O28331k75777
32810h08440o47343l60959K6386K62334M90739O08750K77994l74344o78630k71337
32800a474850L95775O32102K85938k56781n56824l93795J37544N36768K14109
32791d80014p43568j384080r08185K90353J063604Q79617K67446n0926O1660L01196
32781g02897L37914k9559o83559j046360o02121L18903P81604M23264j54830l67035
32771a724676l89078n79721p55595n39883q403M66568O74668N47279J15617k18012
32761b411236O0870O91512P04359j34519p36015k49100N85847N83224q6050l72833
32751a363941j02623O932k33107l15471j46707j17367j42195J96525O22600M84668
$$ y = [-1657501, -2064873, -1935980, -1851655, -2296116, -2689204, -2225895, -1160994, -532663, -808440, -1455783, -1816742, -1790356, -1528022, -1037283, -428533, -150539, -524883, -1203513, -1474850, -1079075, -446973, -161035, -417816, -974640, -1368435, -1230891, -694123, -480014, -1223582, -2607662, -3515847, -3225494, -2161890, -1282273, -1014827, -1065753, -1004093, -702897, -364983, -394542, -1078101, -2124461, -2726582, -2407679, -1626075, -1202811, -1357641, -1724676, -2113754, -2693475, -3449070, -3988953, -3997356, -3530788, -2856120, -2308841, -2193224, -2411236, -2350366, -1658854, -954495, -1089014, -1825029, -2074129, -1488282, -905058, -991108, -1363941, -1466564, -1459632, -1692739, -2008210, -2154917, -2272284, -2414479, -2217954, -1595354, -1110686]
32741a110686J3486k7669J66333j90861o63554J1538J423467J441299m92473k007766
32731a436886j088635R70211J563146M24334o05567n77847k23374j46127q1311
32722a202056N0172j10801m16944k79920K02454L16653J266p9134J81219J34308
32712a202783l18147l86570K36690P17069L56399l16653l86041J44188N33467
32703f22381L96725M4675n9015K13555N86362O06402J04685n02057o35554l08844
32693a75447q2530k01920k43240J56875O40208N73440o0204n90265m66435J08623
32683c40895M54334K34545j58137j62648J35177R3684n09533j021300p47319P7313
32673a944779N97324M60813J67535K78751O64386P09245J12755o80610r35140
$$ y = [-1110686, -1097200, -1124869, -958536, -1149397, -1812951, -1801413, -377946, 1063353, 570880, -1436886, -2525521, -1555310, 7836, 432170, -173397, -751244, -974618, -1120745, -1202056, -1151884, -1262685, -1679629, -1959549, -1757095, -1440442, -1439176, -1518310, -1337091, -1202783, -1520930, -1907500, -1670810, -953741, -597342, -913995, -1300036, -1155848, -622381, -225656, -180981, -239996, -26441, 559921, 1166323, 1271008, 768951, 133397, -175447, -257977, -459897, -703137, -546262, 93946, 667386, 607182, 16917, -449518, -340895, 113439, 347984, 189847, 27199, 162376, 256060, -253473, -1274773, -2022092, -1944779, -1347455, -886642, -719107, -440356, 224030, 933275, 1046030, 365420, -569720]
32664e69720n14648r2114k28655n33373k87815K98920L06572l73233p31677k17516
32654b943259M00175L57696R3077K44585L65616k01589q61055n26279N34066R90980
32644a545987M57047j42067k22602k32220m41075l17597L90537R95348Q74861
32635a83755L31431p1552k94300m45744l37475K6290J30656k83833o45314l40031
32625b113627L32545O05047L59994J93022M54006P37357M27203n09522j393772
32616i07747j474119o94487K45241O52992M97151J74093o2960j44392L271K33273
32606a477684Q5998n27298q77116l53354M50184M76500j54234l11139L02489O44515
32596a741139M1295p01169n67680J42651M07958M3064k19915K8220L59604K96980
$$ y = [-569720, -1084368, -1176482, -1405137, -1938510, -2226325, -1927405, -1620833, -1994066, -2725743, -2943259, -2543084, -2185388, -2092311, -1847726, -1482110, -1683699, -2544754, -3071033, -2536967, -1545987, -1088940, -1231007, -1453609, -1685829, -2126904, -2444501, -2053964, -1058616, -183755, 147676, 76124, -218176, -663920, -1001395, -975105, -844449, -1128282, -1773596, -2113627, -1781082, -1176035, -816041, -623019, -169013, 568344, 995547, 486025, -907747, -2381866, -3076353, -2831112, -2178120, -1680969, -1506876, -1569836, -1714228, -1710957, -1477684, -1391686, -1918984, -2796100, -3149454, -2699270, -2222770, -2377004, -2688143, -2385654, -1741139, -1699844, -2401013, -2968693, -2826042, -2418084, -2375020, -2594935, -2566715, -2207111, -1910131]
32586a910131K3528K2990K86186K65638k62388o19992l0367J059520J254054J50091
32576B39129q73998n56861L76460L78171m96780p83233L841P32035N69745Q3788
32566c27703p220J00416L0910n7910o6746l11262p79075r13877n45858j31058
32556c009383K08545P79809J189407N21204q39188j101900L34206J668271J215235
32547I66206k24717q66024n70334l71920l61140J27690P72437N14371n91218j295811
32537a900460r34193m2654P31139J167422J009247J36622p71574q17147j83838
32528a605436Q4139l79270q49274o63478L8556P46076J034350O74014n4577l63646
32518a338546O7689M88006J86380l12156j32196M11063L71684j32486j55475L56044
$$ y = [-1910131, -1886603, -1863613, -1577427, -1311789, -1574177, -2194169, -2224536, -1165016, 89038, 239129, -634869, -1191730, -815270, -437099, -933879, -1717112, -1713271, -981236, -411491, -327703, -334923, -234507, -203597, -261507, -328253, -639515, -1418590, -2332467, -2878325, -3009383, -2800838, -2021029, -831622, -310418, -1149606, -2251506, -1917300, -249029, 966206, 741489, -124535, -694869, -1066789, -1427929, -1300239, -527802, -13431, -604649, -1900460, -2834653, -2877307, -2146168, -978746, 30501, 167123, -604451, -1421598, -1605436, -1521297, -1900567, -2749841, -3413319, -3374763, -2628687, -1594337, -920323, -974900, -1338546, -1270857, -782851, -596471, -908627, -1040823, -629760, -258076, -390562, -546037, -189993]
32508a89993M85173m9737n72671p65698r49983r71794k41870Q70496J108428K08558
32498a069091n93387m03223K27064N28642O02610O70693M22042j78484m73671
32489b66805k07725n0834l45461l50722M53063J256560J049881R8838o12552p74393
32479B49850p24722n96186l35780j49011k00542k39433o9160O6875L2088J33671
32469a832350M33282M27870k7864k69408M3691J90820l78351r08654m63075N23447
32459b260592R45518P01611M64967K70828l21589r31408o42487L79214Q59335
32450e34603K42288n79659o75212k04206K36548M85014N69855L61013m7861k27174
32440c73997j05395j79323o05047p03435M1508R82042J018354R2270o96855m83877
$$ y = [-189993, 295180, 245443, -327228, -1092926, -2042909, -3014703, -3256573, -2386077, -1277649, -1069091, -1662478, -2065701, -1838637, -1309995, -707385, -36692, 385350, 206866, -266805, -474530, -525364, -870825, -1221547, -768484, 488076, 1537957, 1636795, 1024243, 249850, -474872, -1071058, -1406838, -1555849, -1756391, -1995824, -2064984, -1998109, -1966021, -1832350, -1399068, -971198, -999062, -1268470, -1224779, -1033959, -1412310, -2320964, -2784039, -2260592, -1315074, -613463, -148496, 122332, -199257, -1130665, -1773152, -1393938, -534603, -292315, -871974, -1547186, -1751392, -1514844, -1029830, -459975, -98962, -146823, -373997, -479392, -658715, -1263762, -1967197, -1925689, -943647, 74707, 166977, -529878, -1013755]
32430a013755L73137Q62274N40730q0723k86944l4181R8729k36296o56699n90859
32420a024587p6958L37788L87568L27524L24452R8606n14957j000266o61489L63954
32410a438365J074151P64171j42470p33361p79999p44053p28330j94281R35725
32401a986812J604689Q22910p92757j570718q64883K59778O05333K73374P8522
32392a570564K22985K37966r5389m10729k93090K23838O76897N48095k06487r18248
32382a584726q10240M0043P26550O43358J15252k82915m40337m10356m5222N25435
32372a523158O13882j30504r38319p71784K65098J053354Q76012J11641m10719
32363h54497k41494M26177R05552N70935l73861r44791n93302Q243o6674o50303
$$ y = [-1013755, -640618, 221656, 762386, 681663, 394719, 360538, 459267, 222971, -433728, -1024587, -1101545, -763757, -376189, -48665, 275787, 374393, -140564, -1140830, -1802319, -1438365, -364214, 399957, 257487, -475874, -1255873, -1999926, -2728256, -2922537, -1986812, -382123, 440787, -351970, -1922688, -2787571, -2527793, -1922460, -1649086, -1570564, -1347579, -1109613, -1205002, -1615731, -1908821, -1684983, -1008086, -459991, -666478, -1584726, -2394966, -2354923, -1628373, -985015, -869763, -1152678, -1593015, -2003371, -2048593, -1523158, -909276, -1039780, -1978099, -2749883, -2484785, -1431431, -555419, -443778, -854497, -1095991, -669814, 235738, 806673, 432812, -511979, -1105281, -1097038, -1163712, -1814015]
32353a814015q06514k20700M95198P36334M62280l5372l05864R0177R44525J272015
32343H18064N60225k85572j93529L50967R6704p84756q69717J32654Q39904M39997
32333A104941j41854j0516K76882J990l49914j58230M9229l59733p70462l61743
32323g19410L28093L01643j31790k9148L16838r6135q99502o77385N52644J054983
32313H31N4502j014321p54059J67633L23518k68670m95172J0032N75833O96382
32303g03491N21090L03132J26102P1872J01433m6520l92816m93901j63258M1344
32293f35013l17577o83067l15712L97535M24820l05280q17683o16747k49980j52041
32283c270745L4924N51591Q47347M44595k05448l89029j29264J14643K86202N80918
$$ y = [-1814015, -2620529, -2841229, -2346031, -1609697, -1147417, -1182789, -1488653, -1398476, -453951, 818064, 1378289, 1092717, 899188, 1250155, 1346859, 562103, -307614, -174960, 664944, 1104941, 963087, 952571, 1229453, 1231443, 881529, 723299, 772528, 412795, -357667, -719410, -391317, -89674, -221464, -250612, 66226, -29909, -929411, -1606796, -1054152, 831, 55333, -958988, -1713047, -1545414, -1221896, -1490566, -1985738, -1975706, -1399873, -703491, -182401, 120731, 246833, 318705, 420138, 373618, -19198, -513099, -676357, -635013, -952590, -1635657, -1951369, -1553834, -1129014, -1434294, -2251977, -2868724, -3118704, -3270745, -3235821, -2684230, -1836883, -1392288, -1597736, -1986765, -2116029, -2001386, -1715184, -1134266]
32273a134266Q01513N82972P1747k70690m03242o12449p94514n24415J23326M92816
32263a667202K71275n5152P9963N80273R20174P88470K76279k97452n68401l99630
32253g1403j14140j76434n33844o28138k12574K64853L47872J91686R7942j29334
32243i63514p32865j176505n99855Q04416J654378J046783k10631o38261L911
32234h12143N85679K82042m56099q29332p75616n66373J909J095303J884800J251692
32224A661862m48109j440405q09390K74525L24660l50890l77514M31579Q71326
32215A37644L02177m48599m40074J37897N42981N28387K90918l5230l13710k85453
32205D16938K3187J50094j41864m41728l47490j49956l36438p04898n78781J68704
$$ y = [-1134266, -332753, 250219, 321966, 51276, -351966, -964415, -1758929, -2283344, -2160018, -1667202, -1395927, -1451079, -1371116, -790843, 129331, 917801, 1194080, 896628, 328227, -71403, -185543, -361977, -895821, -1523959, -1736533, -1471680, -1123808, -932122, -834180, -963514, -1696379, -2872884, -3472739, -2668323, -1013945, 32838, -177793, -816054, -812143, -226464, 55578, -400521, -1229853, -2005469, -2571842, -2569933, -1474630, 410170, 1661862, 1213753, -226652, -1036042, -761517, -436857, -787747, -1165261, -733682, 137644, 439821, -8778, -448852, -310955, 232026, 760413, 1051331, 1016101, 702391, 416938, 440125, 590219, 448355, 6627, -340863, -490819, -827257, -1532155, -2110936, -1942232]
32195a942232Q36958P62510J39283k06413K18211R39519R74509O453j094824j227659
32185e93685l86816L99426L91301j42139n62882o22499l92662J2887L82061N09982
32175a005026N41303P41214Q39467K63266p84690j259590o70740J98759M59343
32166f76694K84471L14192N56198N99562M09198K04444l9321l57356m90705l52592
32156D51397k93757m02575k11380L17007L47905m77964j134186o71712K49077
32147a826188N01123L45964O76593J109599N87404n33901q87243m40142m83052
32138i49843j166488j092059J57778J050822M97349n05054o08974o081M58904
32129b163646O95873Q01557L63840n12850o98940K19040Q78690J89126p27567
$$ y = [-1942232, -1105274, -342764, -203481, -409894, -191683, 747836, 1722345, 1728798, 633974, -593685, -980501, -581075, -189774, -331913, -894795, -1517294, -1909956, -1897069, -1515008, -1005026, -463723, 277491, 1116958, 1380224, 595534, -664056, -1334796, -1136037, -676694, -392223, -78031, 478167, 1077729, 1486927, 1691371, 1652050, 1294694, 803989, 451397, 157640, -244935, -456315, -139308, 208597, -269367, -1403553, -2075265, -1826188, -1325065, -979101, -302508, 807091, 1394495, 860594, -26649, -466791, -949843, -2116331, -3208390, -3050612, -1999790, -1502441, -2007495, -2616469, -2622550, -2163646, -1467773, -666216, -302376, -815226, -1514166, -1295126, -416436, -227310, -954877]
32120i54877k74317R31930J013473j50090q66591l83697K40072J50649j76840
32111d70288k08465k04904k89666j7272N36146M77390m18651j028128m91136M32840
32101a682134N46939J9004m1531O08736J011605M55274n54673r92269n14156K77493
32091h65712N83806K48819j75444j81968M5129l3056m49814o21180j71540N06553
32081a114407P11754K12032n82999j035285p82790l0890O10711P57597O55564
32072e98713P03390P35779K70918n62729r58232m77901L52049P54442N52668M2560
32062H14231n07292q65570p76582l10984O0628J17252K17902N68673O48665o288
32052c9365q59245r99417m47529K9910K30935O18349J101757Q97350n0601o62979
$$ y = [-954877, -1229194, -297264, 716209, 566119, -300472, -684169, -444097, -293448, -470288, -678753, -883657, -1173323, -1190595, -654449, -177059, -595710, -1623838, -2114974, -1682134, -1135195, -1116191, -1157722, -548986, 462619, 917893, 363220, -629049, -1143205, -865712, -281906, -33087, -208531, -390499, -345370, -378426, -828240, -1449420, -1620960, -1114407, -402653, -190621, -773620, -1808905, -2591695, -2622585, -2011874, -1254277, -598713, 104677, 840456, 1111374, 548645, -409587, -887488, -535439, 219003, 771671, 814231, 306939, -558631, -1335213, -1646197, -1585569, -1468317, -1250415, -681742, -33077, -39365, -898610, -1898027, -2345556, -2315646, -2084711, -1466362, -364605, 532745, 482144, -180835]
32042a80835l68088o7749n73457j093429n36404M48967L27633p69386j071109
32033c883857J17046J375575J362339N49341p410k82127o11990n49237L24223
32024a606097J207059J020856N3853n39492m77306m01383n24419m56508j92255
32015a915692r3394j7978M04156P96016N23152l2312p915L06804q8623q93202
32005a018988p27545M04076Q31238l944m96139L71455J168255M04053q87873q14818
31995g70230L61224Q89727L96050M0855K62224L31542L3740m0313L9198n09922
31985A034095j501306j639219n30189N55851N39185l8757j24172K89904M83461
31976i31147K06238j61991k62849q4448J22694M7173k99152m17135M7507O31227
$$ y = [-180835, -548923, -616672, -1190129, -2283558, -2819962, -2370995, -2043362, -2812748, -3883857, -3766811, -2391236, -1028897, -479556, -486966, -769093, -1381083, -1930320, -1606097, -399038, 621818, 675671, 136179, -341127, -742510, -1266929, -1723437, -1915692, -2009086, -2027064, -1622908, -826892, -303740, -336052, -343967, -37163, -125786, -1018988, -1746533, -1342457, -511219, -515163, -1011302, -639847, 528408, 932461, 44588, -770230, -409006, 480721, 876771, 917626, 1179850, 1511392, 1545132, 1504819, 1544017, 1034095, -467211, -2106430, -2636619, -2080768, -1541583, -1580340, -1704512, -1414608, -931147, -724909, -886900, -1149749, -1234197, -1111503, -1064330, -1363482, -1780617, -1733110, -1101883]
31966a101883N98381M8962k35290j3815J38772j40942m95161n46299m09111k93206
31956b449592j91079j15863j18036j9355L39284O62335N98593L73068L23061J47845
31946d49739m42471p37347K7042J010718O71042o69425r84079L37798J451990
31937B15529R67016J9816J58263P86198M14899p24747j181375o84644k67836l66206
31927f63087m23040k38144k39444m12770k44288K28341M43997L88164N20862O73998
31917C4589K26677n47205n73936K88743Q06596J42426r33581j199273n52336J78215
31907b129085L97951J75940p8529K8568N23157Q82547N94809o0766l33982j09740
31897a09130J7133j69577k21399l6854j74303p19321q29864p6565O73664N68856
$$ y = [-1101883, -503502, -454540, -689830, -703645, -564873, -705815, -1200976, -1747275, -2156386, -2449592, -2640671, -2756534, -2874570, -2893925, -2554641, -1892306, -1293713, -920645, -597584, -449739, -892210, -1629557, -1602515, -591797, 79245, -590180, -1574259, -1236461, 215529, 1182545, 1202361, 1360624, 2146822, 2561721, 1836974, 655599, -29045, -296881, -663087, -1086127, -1324271, -1563715, -1976485, -2220773, -1992432, -1548435, -1160271, -639409, 34589, 261266, -285939, -859875, -571132, 235464, 377890, -555691, -1754964, -2307300, -2129085, -1731134, -1555194, -1633723, -1605155, -1081998, -199451, 395358, 334592, 610, -109130, -91997, -261574, -482973, -519827, -694130, -1413451, -2243315, -2319880, -1646216, -1077360]
31887a077360J63774M46727J099752R78989K2462o11947l26891J73746J44830
31878A014082k36191n14873o63503p11853m64966m2614L3474k45791j47932N49558
31868a430609R02438J95841p45238o79483J65076N28680J23062j22453K22682
31859h40004M86615K64667R8541K91922K45251l31834o34334p2333N78249L74674
31849D61414k27825j83095L76893M68596j8822k60809k8158K6929l03606m00972
31839h9455k0952K20803o6093m26211m17103k41899j36676Q2298M68467O75171
31829D8350N85226M90345L72328j47466q22373p31319K68568J016061O50190j71711
31819A558199m47962l37464n15262p87145n08316J13822L14657R0663J02768M00637
$$ y = [-1077360, -913586, -466859, 632893, 1611882, 1634344, 1022397, 695506, 869252, 1014082, 777891, 263018, -400485, -1112338, -1577304, -1619918, -1586444, -1832235, -1980167, -1430609, -528171, -332330, -1077568, -1757051, -1591975, -1063295, -940233, -1062686, -840004, -353389, -88722, 9819, 301741, 546992, 215158, -419176, -491509, 86740, 461414, 233589, 50494, 427387, 895983, 877161, 616352, 588194, 615123, 311517, -89455, -110407, 110396, 44303, -381908, -799011, -1040910, -1177586, -1095288, -626821, 48350, 633576, 1123921, 1496249, 1348783, 526410, -204909, 63659, 1079720, 1729910, 1558199, 1110237, 772773, 257511, -529634, -1037950, -924128, -609471, -518808, -416040, -15403]
31809a5403L38730j92195m67731r4348L71221L09136r4191k48091l227K73048
31799A76949K60030M3224q7816r1207k55135o73339q70552m24382J88229J11097
31789a622902m96419n36045K90796R15559O34439K46838N55081Q36977J02197
31780I26521r87987r86260O3499P59016M82414q8240m69552q53506j072886n94396
31770b821377K65325N40692K61261M43570J154466J180148J69847n22252p285
31761F64395O30825J51767p93573q09259o869L45945j48946p04161p30327l59292
31751a759495J88842P22776P70677J32597m48751j31781O84723Q64663K50252
31742A274503k11524p1682N2200k31226l64649L0563K74074l11752j130501j055113
$$ y = [-15403, 323327, 131132, -336599, -430947, -59726, 249410, 155219, -92872, -96099, 176949, 436979, 480203, 392387, 301180, 46045, -627294, -1497846, -1922228, -1733999, -1622902, -2119321, -2655366, -2364570, -1449011, -814572, -567734, -12653, 824324, 926521, -61466, -1047726, -984227, -225211, 257203, 168963, -300589, -1154095, -2226981, -2821377, -2556052, -2015360, -1754099, -1310529, -156063, 1024085, 1193932, 671680, 664395, 1295220, 1446987, 653414, -155845, -162714, 183231, 34285, -669876, -1400203, -1759495, -1570653, -847877, -77200, 55397, -393354, -525135, 159588, 1024251, 1274503, 1062979, 991297, 1043497, 812271, 447622, 478185, 752259, 440507, -689994, -1745107]
31732a745107j25622M54712M8807n47245l22843M88806P78217J23074o74535p04003
31722b225739o3631M57410M60299K46407J82427K31626J97743P3320l4635j00246
31712e75019j21126j5100K35091L88401R5793o32458j185915q52582K64597J103576
31702a294742Q37458K0176j18571N24252P49215m8424q71365p04094j00293j22474
31692a128862n17421l14008L12288L39708j81388j78853M19351M34415m16796
31683a231566q18686p422R22061Q16252K18716J94402N45140M66757Q8848M4463
31673A238965J64993j21201n73640n22381j00603Q774k49419m02214m15131n50882
31663a522739n64811p4669N15920M93062K1809j58921k1849j46923m63140k41053
$$ y = [-1745107, -1870729, -1416017, -1367210, -1914455, -2237298, -1748492, -970275, -847201, -1521736, -2225739, -2289370, -1831960, -1371661, -1125254, -942827, -711201, -513458, -440138, -474773, -575019, -696145, -711245, -476154, -87753, 8040, -624418, -1810333, -2662915, -2398318, -1294742, -457284, -437108, -555679, -31427, 717788, 669364, -202001, -906095, -1006388, -1128862, -1646283, -1960291, -1648003, -1308295, -1489683, -1668536, -1249185, -814770, -1231566, -2050252, -2057674, -1135613, -319361, -100645, 93757, 638897, 1105654, 1194502, 1238965, 1403958, 1282757, 709117, 186736, 86133, 94907, -154512, -556726, -971857, -1522739, -2087550, -2162219, -1646299, -1153237, -1131428, -1290349, -1312198, -1459121, -1922261, -2163314]
31653b163314O03302J239444J101365M61558k35481p69384q77067m61170l3933
31644a134680p4041r0363O13066J412224R81004m73372j120615j24002J101760
31635A090981J007554p167o11830n52600m53582l98684j369N17382N02307k6477
31625A066515m11194m41428n17363o99531m54042L94792J124042R49778N7323
31616A068892o03149m49408J01812K15795l19326q69356p98644k43826J82421
31607a714789K05662N1659j8064P9410L43085N64308L17026l93865p39464o8702
31597a373734Q96290Q24269k88030j036582o64713k4576k2270k67329k9137M75711
31587a510101O97581Q13326J113175J035530L0832j094443j021503P4288O51038
$$ y = [-2163314, -1560012, -320568, 780797, 1242355, 1006874, 237490, -639577, -1100747, -1134680, -1208721, -1299084, -686018, 726206, 1707210, 1233838, 113223, -10779, 1090981, 2098535, 2091368, 1479538, 926938, 473356, 74672, 73303, 590685, 1092992, 1066515, 655321, 213893, -303470, -1003001, -1457043, -1062251, 61791, 1011569, 1068892, 465743, 16335, 118147, 333942, 14616, -854740, -1653384, -1897210, -1714789, -1509127, -1457468, -1475532, -1396122, -1053037, -488729, -171703, -565568, -1305032, -1373734, -477444, 346825, 58795, -977787, -1642500, -1667076, -1689346, -1956675, -1985812, -1510101, -812520, 806, 1113981, 2149511, 2180343, 1085900, 64397, 138685, 789723]
31578G89723J0913q16290p12299N0783M95258L17480m3112k30936k75786k74350
31568f88616k04467l2019J89556L23366K52019L9074j22369k26547m81201q17644
31558a768848p39036n9672N65852M44530q9192j28294M26428P55880M22575o6962
31548b36739k15706k37890m10737m36686o942N11203N33099P3947l85419n69005
31538a380875m89664j39323M06902P65546O18321K19422R6451L01038L68522L1713
31528G98053l90293m06650O4723N94954O29341M1797o24451o66262q6961L54498
31518C08749J69869k01191j59075Q1102n8565m22610l48017J20583K19519j97180
31508d86816l35756J39201M18177p0081n49906j45123N57946M39541k01053j08971
$$ y = [789723, 800636, -15654, -727953, -677170, -181912, 135568, 92456, -138480, -414266, -688616, -893083, -925102, -735546, -412180, -160161, -121087, -243456, -470003, -951204, -1768848, -2507884, -2567556, -2001704, -1557174, -1646366, -1774660, -1348232, -592352, -169777, -236739, -452445, -690335, -1101072, -1537758, -1544700, -1033497, -500398, -426451, -811870, -1380875, -1870539, -2009862, -1602960, -837414, -219093, 329, 96780, 397818, 766340, 798053, 407760, 1110, 65833, 660787, 1290128, 1331925, 707474, 41212, -45749, 308749, 478618, 277427, 118352, 199454, 140889, -281721, -629738, -509155, -289636, -486816, -822572, -683371, -265194, -335275, -885181, -1030304, -472358, -32817, -233870, -342841]
31498c42841O87308P41932m03885j280378p10762L98218N79122K9005m3464M25385
31488G9640L71170m65208j049678o50765K11846O94511O18152K70935j9387Q9725
31478A50941O52317J017572M62936o37715j111811o19117n8931q2096k25450o138
31468d57492J52395j97092o06338n26121k65776k82385k13641L89465R71052P24831
31458c11102j301k16430J03715J33328k38126k50192K33669L40573l46160j011684
31448a563710q00784M4052P05418P75952L52579k09818l47636K34741R02486O80718
31438G73998k55025o25718L6728O15972K06378m33751k17969M44689M45275r1897
31428H98680j27511L99686N11957j0233k54957J31374K70169l87196j033923q04766
$$ y = [-342841, 344467, 1086399, 682514, -597864, -1308626, -910408, -331286, -302281, -345745, 79640, 450810, -14398, -1064076, -1714841, -1502995, -808484, -190332, 80603, 61216, 150941, 803258, 1820830, 2283766, 1646051, 534240, -84877, -143808, -225904, -451354, -457492, -305097, -502189, -1108527, -1634648, -1900424, -2182809, -2396450, -2006985, -1035933, -311102, -312403, -528833, -425118, -291790, -529916, -780108, -546439, -205866, -552026, -1563710, -2364494, -2320442, -1615024, -839072, -486493, -696311, -1043947, -809206, 93280, 773998, 518973, -106745, -70017, 545955, 752333, 318582, 100613, 545302, 990577, 898680, 771169, 1170855, 1682812, 1672579, 1417622, 1548996, 1819165, 1431969, 398046, -406720]
31418d06720j18228J55145Q4175K56594N36260L15163k65733l85293J77058P18191
31408A066612O95297L61988R9809j86536o30467q97909o08811J3961L44348J02237
31398C60529l85203o30674n07110l17816m10583p13291p30576j39137P14762J157355
31388a601744R56859M49020k6756l81653m70137r7158M67185N37298n5573n48277
31378g70936k17041O24799J102529R09027L91343j82933p62746j099318r23264
31369i28540m88442k59715j13158L85833R19736N92694n82147j343246q53161
31360b670146J36738M78919K34282J98774M01580J66655n39701q89408m32627
31351b914934K86793N78735M11191J42269J3971J48976N64350R57165R01541M50449
$$ y = [-406720, -524948, -369803, -285628, -29034, 507226, 822389, 556656, 171363, 348421, 1066612, 1761909, 2123897, 2223706, 2037170, 1406703, 508794, -100017, -86056, 258292, 360529, -24674, -655348, -1162458, -1480274, -1890857, -2604148, -3334724, -3473861, -2759099, -1601744, -644885, -195865, -222621, -604274, -1074411, -1171569, -704384, -167086, -222659, -770936, -987977, -363178, 739351, 1648378, 2039721, 1856788, 1094042, -5276, -928540, -1416982, -1676697, -1789855, -1404022, -484286, 108408, -473739, -1816985, -2670146, -2533408, -2054489, -1820207, -1621433, -1219853, -1053198, -1592899, -2482307, -2914934, -2628141, -2049406, -1638215, -1495946, -1481975, -1332999, -768649, 188516, 1090057, 1540506]
31341A540506J14383P0105j10119o76008j158427j024883m73158q0324O1733L23793
31331a412399P80091J008772P18602J67867k07901l29296m39153o50631p22045
31322a086093l57162L15355P22842M72537q9111k27081K34131O56891M69254m7019
31312A064544k06240Q2163K56207J011l08679k40243L4354L2559l15719n99008
31302a99051n09602j88735M1160M3890j12023l14437m64578m74316l09717j5503
31292b502912K92291L98622Q4337n04899o92775N1941J178011J381695K63455
31283e0234r03857p29790M00220R08971L02270k91456l2234M08737J74534k96396
31273a09235j25846M04933L13649l97320p37363l42037O5625q649j12179J93734
$$ y = [1540506, 1654889, 1724994, 1614875, 938867, -219560, -1244443, -1717601, -1797925, -1736192, -1412399, -632308, 376464, 1095066, 1262933, 1055032, 725736, 286583, -364048, -1086093, -1443255, -1127900, -405058, 67479, -21632, -248713, -14582, 642309, 1111563, 1064544, 858304, 940467, 1196674, 1197685, 889006, 648763, 683117, 715676, 399957, -199051, -708653, -897388, -856228, -812338, -924361, -1238798, -1703376, -2177692, -2487409, -2502912, -2210621, -1811999, -1727662, -2232561, -2925336, -2873395, -1695384, -313689, -50234, -954091, -1683881, -1283661, -374690, -72420, -363876, -396110, 12627, 187161, -109235, -235081, 169852, 483501, 86181, -651182, -993219, -927594, -936243, -1048422, -854688]
31263h54688N58629N15849K07239o0741l39721n91002l37493N65166J290575R51269
31253A905082j07832o86587l33244J43987r9812q12449j064455m53197M93714
31244a014793J017547R10157N13628J71013n8775j91035j78228j34588l42163
31235F92763p22695o49894K13322J147491J104131J20701o83647n78916p945K33125
31225H68436p6435o57511j067440p77173L43541J393364J157973j87173j049216
31216e1634o00651P8367j77267p53676l99113O48281J122502P72339M15486K48637
31206A303271k94733j010132q63798K07858Q99843M53968l25564n64938n62097
31197g56322p57030o56146J57688Q66035M76692n25954p63874R3238J007612J074776
$$ y = [-854688, -296059, 219790, 427029, 366288, 26567, -564435, -901928, -336762, 953813, 1905082, 1797250, 1110663, 777419, 921406, 821594, 9145, -1055310, -1508507, -1014793, 2754, 912911, 1426539, 1597552, 1538777, 1347742, 1169514, 1034926, 692763, -29932, -679826, -466504, 680987, 1785118, 1905819, 1222172, 643256, 635311, 868436, 792001, 134490, -932950, -1710123, -1366582, 26782, 1184755, 997582, -51634, -652285, -573918, -751185, -1504861, -1903974, -1255693, -133191, 639148, 1054634, 1303271, 1008538, -1594, -865392, -657534, 242309, 696277, 370713, -194225, -756322, -1513352, -2169498, -2011810, -1145775, -669083, -1195037, -1958911, -1865673, -858061, 216715]
31187B16715M46130k46430o19661n84914k45067J02072J94597P4943o2979j31799
31177h56393o4723K15530M89415L20889k15375l94294R8447N20763J43329n60487
31167c02899o30735j18445J09057j72127l19058k3985K75264L05565L35869M39109
31157a02385K64885j82243l81752k20321k35107n72779n81278N6576O23310M49214
31147h81880m5903j37307K5130j25635m41466l22308J79421M21830K13417j9768
$$ y = [216715, 662845, 416415, -203246, -788160, -1033227, -931155, -736558, -661615, -724594, -856393, -921116, -705586, -216171, 104718, -110657, -504951, -406504, 114259, 257588, -302899, -933634, -1052079, -943022, -1115149, -1434207, -1458192, -1182928, -877363, -541494, -102385, 162500, -19743, -401495, -621816, -856923, -1429702, -2010980, -1954404, -1331094, -881880, -927783, -1065090, -1039960, -1165595, -1607061, -1929369, -1749948, -1328118, -1114701, -1134469]
$$ [...]
##END NTUPLES=NMR SPECTRUM
##END=
