##TITLE=31Pdec_LY-TMF-14.100
 D2O, 24 sc
 6.3.2020
##JCAMPDX= 6.0         $$ Bruker NMR JCAMP-DX V2.0
##DATA TYPE= NMR SPECTRUM
##DATA CLASS= NTUPLES
##ORIGIN= UXNMR, Bruker Analytische Messtechnik GmbH
##OWNER= root
$$ XWIN-NMR		Version 3.5
$$ Fri Mar  6 18:27:26 2020 Russian Standard Time (UT+4h)  she@DPX200
##.OBSERVE FREQUENCY= 81.013821
##.OBSERVE NUCLEUS= ^31P
##.ACQUISITION MODE= SIMULTANEOUS
##.ACQUISITION SCHEME= undefined
##.AVERAGES= 24
##.DIGITISER RES= 17
##SPECTROMETER/DATA SYSTEM= spect
##.PULSE SEQUENCE= zgpg30
##.SOLVENT NAME= Acetone
##.SHIFT REFERENCE= (INTERNAL, Acetone, 0, 182.463)
##AUDIT TRAIL= $$ (NUMBER, WHEN, WHO, WHERE, WHAT)
$$ ##TITLE= Audit trail, XWIN-NMR		Version 3.5
$$ ##JCAMPDX= 5.01
$$ ##ORIGIN= Bruker BioSpin GmbH
$$ ##OWNER= she
$$ F:/spectra/data/she/nmr/P31/1/pdata/1/auditp.txt
$$ ##AUDIT TRAIL=  $$ (NUMBER, WHEN, WHO, WHERE, WHAT)
(   1,<2020-03-06 18:26:05.85 +0400>,<she>,<DPX200>,
      <created by zg, POWCHK disabled, PULCHK disabled
       configuration hash MD5:
       00 E9 B6 7A A2 85 ED C7 34 08 36 98 17 FE 4E 26
       data hash MD5: 32K
       67 9F 65 41 D8 7A CF 36 DE 45 84 9B E8 8D 88 AF>)
(   2,<2020-03-06 18:26:12.81 +0400>,<she>,<DPX200>,
      <Start of raw data processing
       efp BC_mod = 2 LB = 1 FT_mod = 6 PKNL = 1 PHC0 = -1358.77 PHC1 = 150.6017 SI = 64K 
       data hash MD5: 64K
       F0 C1 B1 29 01 CE CD 22 0B 70 A0 41 EC 73 A6 63>)
(   3,<2020-03-06 18:26:27.42 +0400>,<she>,<DPX200>,
      <pk PHC0 = -5.83206 PHC1 = 0 
       data hash MD5: 64K
       DF 68 08 8B D0 2E 8E 48 C9 8A 59 C0 B8 04 D6 7F>)
(   4,<2020-03-06 18:26:43.28 +0400>,<she>,<DPX200>,
      <pk PHC0 = 2.8 PHC1 = 0 
       data hash MD5: 64K
       4B C6 5D 83 4F 8A 94 BF 40 23 EA A4 1F FB 03 6B>)
$$ ##END=
$$ 
$$ hash MD5
$$ 77 65 3B F7 4C 74 87 95 E0 18 6A 13 E3 D1 83 7A
##$RELAX= 
##$RELAX= 
##$RELAX= 
##$RELAX= 
##$RELAX= 
##$RELAX= 
##$RELAX= 
##$RELAX= 
$$ Bruker specific parameters
$$ --------------------------
##$DU= <F:/spectra>
##$EXPNO= 1
##$NAME= <P31>
##$PROCNO= 1
##$TYPE= <nmr>
##$USER= <she>
##$AMP= (0..31)
100 100 100 100 100 100 100 100 100 100 100 100 100 100 100 100 100 100 
100 100 100 100 100 100 100 100 100 100 100 100 100 100 
##$AQSEQ= 0
##$AQ_mod= 1
##$AUNM= <au_zg>
##$AUTOPOS= <>
##$BF1= 81.014009
##$BF2= 200.13
##$BF3= 200.13
##$BF4= 200.13
##$BF5= 200.13
##$BF6= 200.13
##$BF7= 200.13
##$BF8= 200.13
##$BYTORDA= 1
##$CFDGTYP= 0
##$CFRGTYP= 5
##$CHEMSTR= <none>
##$CNST= (0..31)
1 1 145 1 1 1 1 1 1 1 1 1 1 1 1 1 1 1 1 1 1 1 1 1 1 1 1 1 1 1 1 1 
##$CPDPRG= <waltz16>
##$CPDPRG1= <>
##$CPDPRG2= <waltz16>
##$CPDPRG3= <>
##$CPDPRG4= <mlev>
##$CPDPRG5= <mlev>
##$CPDPRG6= <mlev>
##$CPDPRG7= <mlev>
##$CPDPRG8= <mlev>
##$CPDPRGB= <>
##$CPDPRGT= <>
##$D= (0..31)
0 1 0 0 0 0 0 0 0 0 0 0.03 2e-05 3e-06 0 0 0 0 0 0 0 0 0 0 0 0 0 0 0 0 
0 0 
##$DATE= 1583504765
##$DBL= (0..7)
120 120 120 11 120 120 24 19 
##$DBP= (0..7)
150 150 150 150 150 150 150 150 
##$DBP07= 0
##$DBPNAM0= <>
##$DBPNAM1= <>
$$ [...]
##$SUBNAM2= <"">
##$SUBNAM3= <"">
##$SUBNAM4= <"">
##$SUBNAM5= <"">
##$SUBNAM6= <"">
##$SUBNAM7= <"">
##$SUBNAM8= <"">
##$SUBNAM9= <"">
##$SW= 369.568048894756
##$SWIBOX= (0..15)
0 1 3 0 0 0 0 0 0 0 0 0 0 0 0 0 
##$SW_h= 29940.119760479
##$TD= 32768
##$TD0= 1
##$TE= 0
##$TE2= 300
##$TE3= 300
##$TEG= 300
##$TL= (0..7)
0 120 53 12 22 120 120 120 
##$TP= (0..7)
150 150 150 150 150 150 150 150 
##$TP07= 0
##$TPNAME0= <>
##$TPNAME1= <>
##$TPNAME2= <>
##$TPNAME3= <>
##$TPNAME4= <>
##$TPNAME5= <>
##$TPNAME6= <>
##$TPNAME7= <>
##$TPOAL= (0..7)
0.5 0.5 0.5 0.5 0.5 0.5 0.5 0.5 
##$TPOFFS= (0..7)
0 0 0 0 0 0 0 0 
##$TUNHIN= 0
##$TUNHOUT= 0
##$TUNXOUT= 0
##$USERA1= <user>
##$USERA2= <user>
##$USERA3= <user>
##$USERA4= <user>
##$USERA5= <user>
##$V9= 5
##$VALIST= <valist>
##$VCLIST= <CCCCCCCCCCCCCCC>
##$VD= 0
##$VDLIST= <DDDDDDDDDDDDDDD>
##$VPLIST= <PPPPPPPPPPPPPPP>
##$VTLIST= <TTTTTTTTTTTTTTT>
##$WBST= 1024
##$WBSW= 4
##$XGAIN= (0..3)
0 0 0 0 
##$XL= 0
##$YL= 0
##$YMAX_a= 30806
##$YMIN_a= -32638
##$ZGOPTNS= <>
##$ZL1= 120
##$ZL2= 120
##$ZL3= 120
##$ZL4= 120
##$ABSF1= 0
##$ABSF2= 0
##$ABSG= 0
##$ABSL= 0
##$ALPHA= 0
##$AQORDER= 0
##$ASSFAC= 0
##$ASSFACI= 0
##$ASSFACX= 0
##$ASSWID= 0
##$AUNMP= <proc_1d>
##$AZFE= 0.1
##$AZFW= 0.5
##$BCFW= 0
##$BC_mod= 2
##$BYTORDP= 0
##$COROFFS= 0
##$CY= -3
##$DATMOD= 1
##$DC= 0
##$DFILT= <>
##$DTYPP= 0
##$F1P= 0
##$F2P= 0
##$FCOR= 1
##$FTSIZE= 65536
##$FT_mod= 6
##$GAMMA= 0
##$GB= 0
##$INTBC= 1
##$INTSCL= 5.30512e-09
##$ISEN= 30
##$LB= 1
##$LEV0= 0
##$LPBIN= 0
##$MAXI= 10000
##$MC2= 0
##$MEAN= 0
##$ME_mod= 0
##$MI= 50
##$NCOEF= 0
##$NC_proc= -3
##$NLEV= 6
##$NOISF1= 182.463
##$NOISF2= 159.3651
##$NSP= 0
##$NTH_PI= 0
##$NZP= 0
##$OFFSET= 182.463
##$PC= 4
##$PHC0= -1361.802
##$PHC1= 150.6017
##$PH_mod= 1
##$PKNL= yes
##$PPARMOD= 0
##$PSCAL= 0
##$PSIGN= 0
##$REVERSE= no
##$SF= 81.0140089999434
##$SI= 65536
##$SIGF1= 159.3651
##$SIGF2= -187.1042
##$SINO= 113.3802
##$SIOLD= 16384
##$SREGLST= <1H.CDCl3>
##$SSB= 0
##$STSI= 65536
##$STSR= 0
##$SW_p= 29940.119760479
##$SYMM= 0
##$S_DEV= 0
##$TDeff= 32768
##$TDoff= 0
##$TI= <>
##$TILT= no
##$TM1= 0
##$TM2= 0
##$TOPLEV= 0
##$USERP1= <user>
##$USERP2= <user>
##$USERP3= <user>
##$USERP4= <user>
##$USERP5= <user>
##$WDW= 1
##$XDIM= 65536
##$YMAX_p= 429655567
##$YMIN_p= -6425983
$$ End of Bruker specific parameters
$$ ---------------------------------
##NTUPLES= NMR SPECTRUM
##VAR_NAME=  FREQUENCY,     SPECTRUM/REAL,   SPECTRUM/IMAG
##SYMBOL=    X,             R,               I
##VAR_TYPE=  INDEPENDENT,   DEPENDENT,       DEPENDENT
##VAR_FORM=  AFFN,          ASDF,            ASDF
##VAR_DIM=   65536,         65536,           65536
##UNITS=     HZ,            ARBITRARY UNITS, ARBITRARY UNITS
##FACTOR=    0.456856943014862, 1,           1
##FIRST=     14782.0589164792, 0,            0
##LAST=      -15158.0608439998, 0,           0
##MIN=       -15158.0608439998, -6425983,    0
##MAX=       14782.0589164792, 429655567,    0
$$ Real data points
##PAGE= N=1
##DATA TABLE= (X++(R..R)), XYDATA
$$ [...]
$$ plain form
37030 116166 166161 91651 22336 26341 44103 26477 26363 91873 147750 74092 -119687 -277142
37018 -277142 -265551 -116656 28107 76612 43633 -31631 -143448 -256955 -268608 -126238
37008 -126238 50628 86444 -22631 -119446 -130943 -153467 -243300 -276572 -126191 129580 289530
36997 289530 249004 53664 -180555 -318151 -273384 -126243 -76441 -194367 -332369 -372580
36987 -372580 -400468 -491246 -505049 -308901 -50817 47774 58158 209621 464768 554169 416918
36976 416918 277878 257844 233210 147141 126285 176290 96060 -134784 -204557 58038 341373
36965 341373 277268 -3965 -77451 152751 378338 384309 295533 295753 373851 435411 466374
36954 466374 483924 457434 368088 265592 202972 163663 85510 -66626 -242737 -306857 -158394
$$ packed form
37030A16166M9995p4510o9315M005J7762j7626j14O5510N5877p3658j93779j57455
37018b77142J1591J48895J44763M8505l2979p5264j11817j13507j1653J42370
37008a26238J76866L5816j09075r6815j1497k2524q9833l3272J50381K55771J59950
36997B89530m0526j95340k34219j37596M4767J47141M9802j17926j38002m0211
36987c72580k7888r0778j3803J96148K58084R8591J0384J51463K55147Q9401j37251
36976D16918j39040k0034k4634q6069k0856N0005q0230k30844o9773K62595K83335
36965C41373o4105k81233p3486K30202K25587N971q8776K20P8098O1560L0963
36954D66374J7550k6490q9346j02496o2620l9309p8153j52136j76111o4120J48463
$$ plain form
36943 -158394 99865 207947 52929 -164924 -192299 -61152 -6420 -110931 -230945 -263649
36933 -263649 -285534 -380411 -500873 -568484 -574577 -518191 -374562 -195300 -110783 -143224 -133237
36922 -133237 39999 261229 321374 185191 -7306 -151449 -251806 -312873 -307183 -275048
36912 -275048 -319772 -437691 -456736 -241833 92505 276292 182474 -48945 -192378 -164675
36902 -164675 -40521 84379 167800 190301 143428 72565 66841 160811 278497 312552 234310
36891 234310 93878 -52599 -160184 -164394 -16106 229841 425094 473992 434214 426646 473250
36880 473250 479699 365702 151136 -88261 -281052 -355837 -258505 -36858 151236 199782
36870 199782 191845 283406 470288 579279 497895 301506 125049 20404 -17685 -3218 3425
$$ packed form
36943a58394K58259J08082j55018k17853k7375J31147N4732j04511j20014l2704
36933b63649k1885r4877j20462o7611o093N6386J43629J79262Q4517l2441R987
36922a33237J73236K21230O0145j36183j92497j44143j00357o1067N690L2135
36912b75048m4724j17919j9045K14903L34338J83787r3818k31419j43433K7703
36902a64675J24154J24900Q3421K2501m6873p0863n724R3970J17686L4055p8242
36891B34310j40432j46477j07585m210J48288K45947J95253M8898l9778p568M6604
36880D73250O449j13997k14566k39397j92791p4785R7332K21647J88094M8546
36870A99782p937R1561J86882J08991q1384j96389j76457j04645l8089J4467O643
$$ plain form
36859 3425 -64886 -128085 7586 339968 548835 370199 -26072 -256029 -230087 -181728 -243350
36848 -243350 -305360 -317183 -396100 -531713 -499121 -241060 -49872 -139506 -293312 -225139 -69877
36837 -69877 -152275 -410177 -467348 -258189 -160885 -410449 -739759 -781269 -542539 -271216
36827 -271216 -72302 93268 180345 94145 -101369 -224308 -213846 -170554 -175445 -216165 -282859
36816 -282859 -390733 -493802 -505628 -434056 -386506 -410579 -426997 -354944 -213044 -54279 115241
36805 115241 296539 439259 480240 407015 257928 107351 65588 211887 474743 645446
36795 645446 580396 351567 145704 63518 73065 101196 95210 45514 27314 159566 422054
36784 422054 583284 458931 196002 110448 245278 311175 125248 -127324 -209981 -198520
$$ packed form
36859C425o8311o3199J35671L32382K08867j78636l96271k29957K5942M8359o1622
36848b43350o2010j1823p8917j35613L2592K58061J91188q9634j53806O8173J55262
36837f9877q2398k57902n7171K09159R7304k49564l29310m1510K38730K71323
36827b71216J98914J65570Q7077q6200j95514j22939J0462M3292m891m0720o6694
36816b82859j07874j03069j1826P1572M7550k4073j6418P2053J41900J58765J69520
36805A15241J81298J42720M0981p3225j49087j50577m1763J46299K62856J70703
36795F45446o5050k28829k05863q2186R547K8131n986m9696j8200J32252K62488
36784D22054J61230j24353k62929q5554J34830O5897j85927k52572q2657J1461
$$ plain form
36774 -198520 -304938 -484468 -494394 -294193 -112495 -86138 -78250 54541 217568 241161 156063
36763 156063 152377 314261 506169 513899 251713 -148547 -438351 -480152 -367502 -264882
36753 -264882 -178786 -15831 167429 176471 -13696 -171747 -140310 -60363 -105901 -169976 -43883
36742 -43883 201885 282258 118830 -58524 -76212 -56816 -185159 -401332 -477556 -322794
36732 -322794 -78840 67794 75666 37159 33298 39461 -16778 -125045 -170330 -68118 123351
36721 123351 268317 288794 189310 10233 -159440 -176816 23428 294276 381498 188108
36711 188108 -137212 -376128 -426071 -317426 -146803 -13104 59811 144908 280391 341467
36701 341467 173376 -146549 -343388 -293561 -176032 -180179 -222527 -111213 123948 267113
$$ packed form
36774a98520j06418j79530r926K00201J81698K6357P888J32791J63027K3593q5098
36763A56063l686J61884J91908P730k62186m00260k89804m1801J12650J02620
36753b64882Q6096J62955J83260R042j90167j58051L1437P9947m5538o4075J26093
36742d3883K45768Q0373j63428j77354j7688J9396j28343k16173p6224J54762
36732c22794K43954J46634P872l8507l861O163n6239j08267m5285J02212J91469
36721A23351J44966K0477r9484j79077j69673j7376K00244K70848Q7222j93390
36711A88108l25320k38916m9943J08645J70623J33699P2915Q5097J35483O1076
36701C41467j68091l19925j96839M9827J17529m147m2348J11314K35161J43165
$$ plain form
36691 267113 238892 179495 183516 134459 -97758 -409063 -542816 -396245 -145350 -33379
36681 -33379 -91647 -138534 -58221 7450 -160343 -521065 -769386 -718048 -538484 -492207 -540344
36670 -540344 -422797 -89554 176352 131871 -111034 -252955 -158442 79878 318878 459334
36660 459334 430697 240851 28395 -64112 -69322 -131770 -261365 -276438 -36897 360095 671477
36649 671477 737029 587362 383763 277451 275597 231725 21983 -272707 -433811 -349289
36639 -349289 -101596 176618 410081 539328 532029 485840 556191 701711 675755 392878
36629 392878 124636 145882 332526 342900 104755 -133147 -193478 -150693 -102949 -16212 124171
36618 124171 203444 119193 -96019 -345471 -530870 -527551 -277021 47926 160647 20562
$$ packed form
36691B67113k8221n9397M021m9057k32217l11305j33753J46571K50895J11971
36681c3379n8268m6887Q0313O5671j67793l60722k48321N1338J79564M6277m8137
36670e40344J17547L33243K65906m4481k42905j41921R4513K38320K39000J40456
36660D59334k8637j89846k12456r2507n210o2448j29595j5073K39541L96992L11382
36649F71477O5552j49667k03599j06312j854m3872k09742k94690j61104Q4522
36639c49289K47693K78214K33463J29247p299m6189P0351J45520k5956k82877
36629C92878k68242K1246J86644J0374k38145k37902o0331M2785M7744Q6737J40383
36618A24171P9273q4251k15212k49452j85399L319K50530L24947J12721j40085
$$ plain form
36608 20562 -107649 -44472 53779 -26927 -208496 -234881 -23548 268571 453557 446235 267260
36597 267260 47215 -41282 25521 74609 -15627 -126992 -96470 15718 35253 -30595 -13312
36586 -13312 128614 237454 189182 41261 -85164 -150730 -192164 -252967 -334897 -372740 -294999
36575 -294999 -162925 -161567 -347163 -496196 -367134 -60829 61826 -174449 -551025 -719316
36565 -719316 -550921 -198470 87312 167439 112051 105050 214712 297067 184193 -93999
36555 -93999 -357611 -478302 -439286 -275621 -77842 15546 -35814 -95098 -42660 29342 -33822
36544 -33822 -189131 -261588 -198710 -70583 107939 331448 442308 281210 -8494 -94683
36534 -94683 89861 257480 187582 -186 -81201 -21341 67831 99425 47037 -48384 -58421
$$ packed form
36608B0562j28211O3177R8251q0706j81569k6385K11333K92119J84986p322j78975
36597B67260k20045q8497O6803M9088r0236j11365L0522J12188J9535o5848J7283
36586a3312J41926J08840m8272j47921j26425o5566m1434o0803q1930l7843P7741
36575b94999J32074J358j85596j49033J29062L06305J22655k36275l76576j68291
36565g19316J68395L52451K85782Q0127n5388p001J09662Q2355j12874k78192
36555i3999k63612j20691L9016J63665J97779R3388n1360n9284N2438P2002o3164
36544c3822j55309p2457O2878J28127J78522K23509J10860j61098k89704q6189
36534i4683J84544J67619o9898j87768q1015N9860Q9172L1594n2388r5421j0037
$$ plain form
36523 -58421 94105 257673 204133 -21769 -133035 -23224 97043 65191 -3891 17771
36513 17771 43562 -11182 -19993 130739 297103 288801 184256 202861 352997 422110 281572
36502 281572 43504 -71436 58182 328608 458389 269278 -60225 -187145 -71918 -17762
36492 -17762 -178574 -326017 -259766 -139937 -166105 -201011 -31268 206126 208710 -14308 -187520
36481 -187520 -198911 -162948 -130396 -59386 -27791 -154545 -333169 -350391 -246895 -239637 -301084
36470 -301084 -180498 111804 221455 -20029 -319702 -356972 -205290 -110649 -95729 -35588
36460 -35588 49450 45018 -7072 44818 192950 250705 121563 -65593 -139273 -103624 -106922
36449 -106922 -231654 -382911 -410371 -302774 -190371 -152378 -123456 -39958 39600 64030 127208
$$ packed form
36523e8421J52526J63568n3540k25902j11266J09811J20267l1852o9082K1662
36513A7771K5791n4744q811J50732J66364q302j04545J8605J50136O9113j40538
36502B81572k38068j14940J29618K70426J29781j89111l29503j26920J15227N4156
36492a7762j60812j47443O6251J19829k6168l4906J69743K37394K584k23018j73212
36481a87520j1391L5963L2552P1010L1595j26754j78624j7222J03496P258o1447
36470c01084J20586K92302J09651k41484k99673l7270J51682R4641J4920O0141
36460c5588Q5038m432n2090N1890J48132N7755j29142j87156p3680L5649l298
36449a06922j24732j51257k7460J07597J12403L7993K8922Q3498P9558K4430O3178
$$ plain form
36438 127208 320091 522564 525029 318450 82451 -89363 -258476 -441532 -547112 -544095
36428 -544095 -506938 -454397 -326768 -170006 -147718 -289455 -403447 -341272 -202508 -172905
36418 -172905 -279682 -400397 -415513 -287639 -91131 -1331 -128496 -332304 -356226 -183262
36408 -183262 -75181 -201627 -434545 -591158 -651425 -615194 -399060 -69471 59338 -176376
36398 -176376 -476014 -451709 -177029 -32657 -106056 -128801 -2672 23114 -181195 -349561
36388 -349561 -234321 -16050 -13999 -173481 -167399 64714 204693 25337 -297164 -457667
36378 -457667 -407868 -307721 -231253 -122117 8739 42557 -54420 -148645 -123110 -38298 -22233
36367 -22233 -72090 -64361 66047 239351 320155 243607 64263 -82947 -93683 -3219 45593
$$ packed form
36438A27208J92883K02473K465k06579k35999j71814j69113j83056j05580L017
36428e44095L7157N2541J27629J56762K2288j41737j13992O2175J38764K9603
36418a72905j06777j20715j5116J27874J96508Q9800j27165k03808k3922J72964
36408a83262J08081j26446k32918j56613o0267L6231K16134L29589J28809k35714
36398a76376k99638K4305K74680J44372p3399k2745J26129K5786k04309j68366
36388c49561J15240K18271K051j59482O082K32113J39979j79356l22501j60503
36378d57667M9799J00147P6468J09136J30856L3818r6977r4225K5535Q4812J6065
36367b2233m9857P729J30408J73304Q0804p6548j79344j47210j0736R0464M8812
$$ plain form
36356 45593 -22203 -118259 -119557 -32585 49586 106089 198328 328187 382976 255972 -19349
36345 -19349 -274679 -345984 -234749 -126490 -184000 -329040 -349829 -239957 -238608 -436714 -560252
36334 -560252 -347130 39058 242726 236970 286567 449511 479780 268263 35238 -28553
36324 -28553 -9078 -15316 35810 196759 305948 245217 166684 230646 310552 221708 79810
36313 79810 124320 282120 234311 -91216 -391526 -409930 -244139 -143299 -184797 -261472 -263623
36302 -263623 -176810 -77661 -90285 -272267 -505732 -584739 -451255 -259472 -158514 -104973
36292 -104973 23313 195316 233720 61586 -160272 -203579 -28079 201507 318254 279035
36282 279035 101846 -182812 -460255 -548371 -407494 -236835 -228141 -316327 -332049 -293953 -323813
$$ packed form
36356D5593o7796r6056j298Q6972Q2171N6503R2239J29859N4789j27004k75321
36345a9349k55330p1305J11235J08259n7510j45040k0789J09872J349j98106j23538
36334e60252K13122L86188K03668n756M9597J62944L0269k11517k33025o3791
36324b8553J9475o238N1126J60949J09189o0731p8533O3962P9906q8844j41898
36313G9810M4510J57800m7809l25527l00310j8404J65791J00840m1498p6675k151
36302b63623Q6813R9149j2624j81982k33465p9007J33484J91783J00958N3541
36292a04973J28286J72003L8404j72134k21858m3307J75500K29586J16747l9219
36282B79035j77189k84658k77443q8116J40877J70659Q694q8186j5722L8096k9860
$$ plain form
36271 -323813 -353677 -213440 4150 -254 -244367 -369127 -170644 98266 160772 136265
36261 136265 243182 349645 189203 -136103 -251665 -48474 214093 324645 328099 309327
36251 309327 263972 233457 312101 454754 491717 384695 266403 195207 92125 -35133
36241 -35133 -44818 80826 154393 66408 -50895 -55092 5432 50246 135980 301216 399410
36230 399410 276407 13528 -174710 -202009 -116454 60469 311607 494451 439703 194877
36220 194877 3730 2580 72916 49449 -46249 -63561 65781 263734 409792 429927 312276
36209 312276 119704 -21757 -34715 944 -51363 -150630 -79543 224970 477845 367031
36199 367031 -5375 -232643 -142233 34089 81777 105011 251585 404560 395435 319500 342681
$$ packed form
36271c23813k9864J40237K17590m404k44113j24760J98483K68910O2506k4507
36261A36265J06917J06463j60442l25306j15562K03191K62567J10552L454j8772
36251C09327m5355l0515P8644J42653L6963j07022j18292p1196j03082j27258
36241c5133r685J25644P3567q7985j17303m197O0524M4814Q5734J65236R8194
36230C99410j23003k62879j88238k7299Q5555J76923K51138J82844n4748k44826
36220A94877j91147j150P0336k3467r5698j7312J29342J97953J46058K0135j17651
36209C12276j92572j41461j2958L5659n2307r9267P1087L04513K52875j10814
36199C67031l72406k27268R0410J76322M7688K3234J46574J52975r125p5935K3181
$$ plain form
36188 342681 348457 127023 -165571 -132462 247316 502360 298863 -123730 -322819 -202973
36178 -202973 8847 133066 149480 75488 -39956 -73854 31474 140009 93247 -44500
36168 -44500 -73343 48897 164122 154954 77916 37393 48670 58689 14173 -115019 -304450
36157 -304450 -445415 -416657 -220990 -9482 58644 -35025 -161503 -172848 -47695 81370
36147 81370 72593 -41852 -70889 96202 320504 361569 172970 -39115 -69710 52344 140681
36136 140681 106018 37700 21236 -18561 -193896 -423385 -473500 -272228 -52511 -82912 -340073
36125 -340073 -563795 -575068 -410516 -188225 4697 97863 63959 -15873 -40575 -56396 -190851
36114 -190851 -396107 -434397 -198655 111891 252958 242236 267066 384507 473770 442129
$$ packed form
36188C42681N776k21434k92594L3109L79778K55044k03497m22593j99089J19846
36178b02973K11820J24219J6414p3992j15444l3898J05328J08535m6762j37747
36168d4500k8843J22240J15225r168p7038m0523J1277J0019m4516j29192j89431
36157c04450j40965K8758J95667K11508O8126r3669j26478j1345J25153J29065
36147H1370q777j14445k9037J67091K24302M1065j88599k12085l0595J22054Q8337
36136A40681l4663o8318j6464l9797j75335k29489n0115K01272K19717l0401k57161
36125c40073k23722j1273J64552K22291J92922R3166l3904p9832k4702j5821j34455
36114a90851k05256l8290K35742L10546J41067j0722K4830J17441Q9263l1641
$$ plain form
36104 442129 329337 207638 89752 -45818 -206996 -373000 -486570 -483213 -373833 -268393
36094 -268393 -267792 -360073 -462549 -520351 -514191 -427302 -277362 -141115 -74328 -38339 28617
36083 28617 106659 137592 136712 169380 231493 244510 175202 86401 58547 117605 237805 354726
36071 354726 381794 284994 145521 80568 99174 113635 100469 148870 303714 454540 464730
36060 464730 353917 261446 259026 286820 259312 148354 -29402 -211946 -280469 -167242 1025
36049 1025 6881 -148638 -198814 4891 225744 166256 -66796 -113585 67229 126312 -105115
36038 -105115 -324756 -231045 18317 94924 6330 -23152 -4528 -117233 -262735 -116263
36028 -116263 319253 607327 479625 212487 188684 353958 384510 214657 88397 147989
$$ packed form
36104D42129j12792j21699j17886j35570j61178j66004j13570L357J09380J05440
36094b68393O01r2281j02476n7802O160Q6889J49940J36247O6787L5989O6956
36083B8617P8042L0933q80L2668O2113J3017o9308q8801k7854N9058J20200J16921
36071C54726K7068r6800j39473o4953J8606J4461j3166M8401J54844J50826J0190
36060D64730j10813r2471k420K7794k7508j10958j77756j82544o8523J13227J68267
36049A025N856j55519n0176K03705K20853n9488k33052m6789J80814N9083k31427
36038a05115k19641R3711K49362P6607q8594k9482J8624j12705j45502J46472
36028a16263M35516K88074j27702k67138k3803J65274L0552j69853j26260N9592
$$ plain form
36018 147989 251863 236218 144969 107509 119647 62677 -106495 -287336 -373781 -381956 -373639
36007 -373639 -307695 -99777 162581 236956 52810 -138407 -91522 98960 193099 193931 265715
35996 265715 355649 242160 -34062 -140481 55510 285630 304850 213284 175965 109690
35986 109690 -103132 -314604 -311851 -178278 -183523 -387075 -580911 -586655 -425569 -221567 -79312
35975 -79312 -34077 -29486 7543 29740 -70162 -218560 -178878 84273 280445 198029 17014
35964 17014 5608 111771 124318 70445 139196 308392 357318 208658 -11860 -220361 -419455
35953 -419455 -524547 -406377 -120540 115865 177174 86801 -116831 -360983 -454544 -272802
35943 -272802 13481 133494 89669 83500 142495 131142 82712 157944 269767 140784 -191064
$$ packed form
36018A47989J03874j5645r1249l7460J2138n6970j69172j80841q6445q175Q317
36007c73639O5944K07918K62358P4375j84146j91217M6885J90482R4139Q32P1784
35996B65715Q9934j13489k76222j06419J95991K30120J9220r1566l7319o6275
35986A09690k12822k11472K753J33573n245k03552j93836n744J61086K04002J42255
35975g9312M5235M591L7029K2197r9902j48398L9682K63151J96172q2416j81015
35964A7014j1406J06163J2547n3873O8751J69196M8926j48660k20518k08501j99094
35953d19455j05092J18170K85837K36405O1309r0373k03632k44152r3561J81742
35943b72802K86283J20013m3825o169N8995j1353m8430P5232J11823j28983l31848
$$ plain form
35932 -191064 -315758 -46712 282849 311754 121607 -8372 -30668 -46782 -24824 108704
35922 108704 246731 239734 152869 154311 236975 266893 230782 221801 230433 155061 8009 -59963
35910 -59963 46930 266043 460658 525068 439671 299682 243555 285742 289038 174232 65492
35899 65492 124743 315436 437342 344537 53662 -288734 -472222 -359705 -65211 99245
35889 99245 -29248 -258212 -299351 -135607 21016 53088 35363 45580 58818 42891 20079
35878 20079 13090 29099 90580 183588 204269 83724 -49933 19689 307955 583935 653065
35867 653065 561338 461970 395065 291177 119631 -65991 -202630 -263552 -242767 -157852 -72243
35856 -72243 -59456 -114485 -127066 14532 282782 504925 533218 412189 330273 392447 493248
$$ packed form
35932a91064j24694K69046L29561K8905j90147j29979k2296j6114K1958J33528
35922A08704J38027o997q6865J442Q2664K9918l6111q981Q632p5372j47052o7972
35910e9963J06893K19113J94615O4410q5397j39989n6127M2187L296j14806j08740
35899F5492N9251J90693J21906r2805k90875l42396j83488J12517K94494J64456
35889I9245j28493k28964m1139J63744J56623L2072j7725J0217J3238j5927k2812
35878B0079o989J6009O1481R3008K0681j20545j33657O9622K88266K75980O9130
35867F53065r1727r9368o6905j03888j71546j85622j36639o0922K0785Q4915Q5609
35856g2243J2787n5029j2581J41598K68250K22143K8293j21029q1916O2174J00801
$$ plain form
35845 493248 462367 301068 193149 261805 390257 361119 148331 -34385 -13467 119316
35835 119316 162704 108653 121161 226327 233049 46720 -128544 -61904 164023 277487 197031
35824 197031 78844 27871 -16087 -85731 -81366 72000 301641 482662 557877 535180 459603
35813 459603 390882 315392 118366 -226401 -499784 -462761 -204480 -37290 -50420 -29297
35803 -29297 146942 319736 361328 381225 461944 451999 235249 -8861 -52255 39392 45960
35792 45960 -61666 -151502 -195781 -268293 -351196 -363109 -323883 -301069 -261236 -162087 -106867
35781 -106867 -194212 -291168 -190700 58054 218668 228179 233348 282124 255766 142205 103760
35770 103760 186469 203898 28190 -208231 -332148 -371972 -437219 -511924 -537571 -588339 -774576
$$ packed form
35845D93248l0881j61299j07919O8656J28452k9138k12788j82716K0918J32783
35835A19316M3388n4051J2508J05166O722j86329j75264O6640K25927J13464q0456
35824A97031j18187n0973m3958o9644M365J53366K29641J81021P5215k2697p5577
35813D59603o8721p5490j97026l44767k73383L7023K58281J67190j3130K1123
35803b9297J76239J72794M1592J9897Q0719r945k16750k44110m3394R1647O568
35792D5960j07626q9836m4279p2512q2903j1913L9226K2814L9833R9149N5220
35781a06867q7345r6956J00468K48754J60614R511N169M8776k6358j13561l8445
35770A03760Q2709J7429j75708k36421j23917l9824o5247p4705k5647n0768j86237
$$ plain form
35759 -774576 -1014792 -1071098 -831644 -454673 -198718 -161868 -217432 -195015 -102949 -124733 -357546
35748 -357546 -616503 -615885 -340483 -97278 -138827 -357204 -460481 -368226 -278243 -349014 -474052
35737 -474052 -457112 -313160 -253186 -378490 -534980 -539975 -434051 -379139 -388327 -335847 -211352
35726 -211352 -156453 -204493 -191777 -33997 95837 22756 -142985 -158580 10091 179863
35716 179863 206779 78488 -171565 -446414 -540404 -331072 -5934 103083 -77597 -301384
35706 -301384 -339715 -194424 30657 258185 392108 339287 147510 -31039 -153675 -299228
35696 -299228 -445510 -451519 -325685 -280454 -403661 -490435 -352395 -100886 52416 104073
35686 104073 169174 230839 201654 127494 105698 80108 -58684 -232821 -272399 -213944 -261612
$$ packed form
35759g74576k40216n6306K39454L76971K55955L6850n5564K2417R2066k1784k32813
35748c57546k58957O18K75402K43205m1549k18377j03277R2255Q9983p0771j25038
35737d74052J6940J43952N9974j25304j56490m995J05924N4912r188N2480J24495
35726b11352N4899m8040J2716J57780J29834p3081j65741j5595J68671J69772
35716A79863K6916j28291k50053k74849r3990K09332L25138J09017j80680k23787
35706c01384l8331J45291K25081K27528J33923n2821j91777j78549j22636j45553
35696b99228j46282o009J25834M5231j23207q6774J38040K51509J53302N1657
35686A04073O5101O1665k9185p4160k1796k5590j38792j74137l9578N8455m7668
$$ plain form
35675 -261612 -456721 -625674 -671957 -674778 -661041 -544701 -373268 -356569 -508261 -530690 -267416
35664 -267416 -21388 -131892 -425790 -450858 -156195 61153 -2901 -81812 67226 258425
35654 258425 207107 -7965 -101979 -26084 42316 37530 40664 40347 -48490 -141476 -48882 184065
35642 184065 275324 117451 -67083 -86915 -44712 -83913 -109449 11940 143611 40726
35632 40726 -255771 -441003 -356691 -165365 -81702 -115658 -157421 -173430 -204619 -244649 -234855
35621 -234855 -170824 -126861 -143210 -146848 -47774 111766 194475 165451 139913 178170 163905
35610 163905 3721 -176906 -210463 -154912 -163469 -174888 -21934 188795 155877 -105317 -197777
35599 -197777 64463 347616 303032 65781 -37361 -12087 -87976 -278443 -408916 -463003
$$ packed form
35675b61612j95109j68953m6283k821J3737J16340J71433J6699j51692k2429K63274
35664b67416K46028j10504k93898k5068K94663K17348o4054p8911J49038J91199
35654B58425n1318k15072r4014P5895O8400m786L134l17q8837r2986R2594K32947
35642A84065R1259j57873j84534j9832M2203l9201k5536J21389J31671j02885
35632D0726k96497j85232Q4312J91326Q3663l3956m1763j6009l1189m0030R794
35621b34855O4031M3963j6349l638R9074J59540Q2709k9024k5538L8257j4265
35610A63905j60184j80627l3557N5551q557j1419J52954K10729l2918k61194r2460
35599a97777K62240K83153m4584k37251j03142K5274p5889j90467j30473n4087
$$ plain form
35589 -463003 -552922 -622104 -514003 -296347 -193881 -209925 -124355 116507 300138 275439
35579 275439 116737 -77325 -291427 -451421 -427268 -253462 -128948 -129857 -126391 -41742 20372
35568 20372 -18299 -75031 -60703 -1059 62665 133979 174440 122334 34838 38388 111551 109521
35556 109521 28280 23765 126276 176237 115401 93052 174578 186686 -517 -248464 -367612
35545 -367612 -373546 -357552 -272404 -42665 232479 377808 374295 342858 350589 354491 296672 168216
35533 168216 14643 -81079 -80903 -66086 -131045 -209531 -156715 -14777 -3495 -187460 -349517
35522 -349517 -296850 -119619 -25139 -62555 -137154 -176570 -165187 -108391 -50545 -42481 -48562 -2271
35510 -2271 29008 -92793 -310586 -376674 -204590 -11589 -382 -90509 -91935 28051 177049
$$ packed form
35589d63003q9919o9182J08101K17656J02466j6044Q5570K40862J83631k4699
35579B75439j58702j94062k14102j59994K4153J73806J24514r09L466Q4649O2114
35568B0372l8671n6732J4328N9644O3724P1314M0461n2106q7496L550P3163k030
35556A09521q1241m515J02511M9961o0836k2349Q1526J2108j87203k47947j19148
35545c67612n934J5994Q5148K29739K75144J45329l513l1437P731L902n7819j28456
35533A68216j53573r5722J76J4817o4959p8486N2816J41938J1282j83965j62057
35522c49517N2667J77231R4480l7416p4599l9416J1383N6796N7846Q064o081M6291
35510b271L1279j21801k17793o6088J72084J93001J1207r0127j426J19986J48998
$$ plain form
35499 177049 276416 258070 86822 -119727 -178076 -128304 -207081 -429660 -481874 -204356 98731
35488 98731 79728 -165251 -304912 -262458 -197843 -169576 -130832 -143102 -286127 -441820 -455321
35477 -455321 -428037 -557233 -755271 -742048 -486741 -249427 -175295 -137167 -16247 131535
35467 131535 248099 364572 442831 352022 108103 -50302 52177 296308 427090 345987
35457 345987 156506 -5488 -98446 -159321 -219998 -260632 -256971 -251570 -306476 -380696 -363014
35446 -363014 -262436 -233093 -335339 -410098 -299294 -65191 132424 255005 343266 373953
35436 373953 317266 246754 240340 248272 191057 102137 49315 16679 -10054 39252 178827 272188
35424 272188 226437 150234 168487 227315 240895 256728 288327 181630 -113939 -331972 -227683
$$ packed form
35499A77049R9367j8346j71248k06549n8349M9772p8777k22579n2214K77518L03087
35488I8731j9003k44979j39661M2454O4615K8267L8744j2270j43025j55693j3501
35477d55321K7284j29196j98038J3223K55307K37314P4132L8128J20920J47782
35467A31535J16564J16473P8259r0809k43919j58405J02479K44131J30782q1103
35457C45987j89481j61994r2958o0875o0677m0634L661N401n4906p4220J7682
35446c63014J00578K9343j02246p4759J10804K34103J97615J22581Q8261L0687
35436C73953n6687p0512o414P932n7215q8920n2822l2636k6733M9306J39575R3361
35424B72188m5751p6203J8253N8828J3580J5833L1599j06697k95569k18033J04289
$$ plain form
35413 -227683 36306 147033 129412 235694 471042 603452 575024 532449 494745 368814
35403 368814 270322 423778 711273 722694 347443 -47529 -145941 -47922 31087 99128 227555
35392 227555 309282 197734 -61827 -288112 -337427 -159363 167193 410792 375957 151608
35382 151608 -6135 -37781 -101471 -236673 -295810 -255081 -282903 -401698 -388112 -153542 61934
35371 61934 55262 -33876 14400 149617 181441 88875 -14318 -90148 -157803 -175622 -122889
35360 -122889 -111059 -247772 -454815 -561985 -531112 -470555 -467615 -500757 -497145 -426909 -356906
35349 -356906 -399574 -553899 -646166 -539634 -352183 -311207 -431369 -522170 -489956 -414538 -323555
35338 -323555 -133053 134688 298633 264918 140479 38198 -49652 -129364 -146271 -111749
$$ packed form
35413b27683K63989J10727j7621J06282K35348J32410k8428m2575l7704j25931
35403C68814r8492J53456K87495J1421l75251l94972r8412R8019P9009O8041J28427
35392B27555Q1727j11548k59561k26285m9315J78064L26556K43599l4835k24349
35382A51608j57743l1646o3690j35202n9137M0729k7822j18795J3586K34570K15476
35371F1934o672q9138M8276J35217L1824r2566j03193p5830o7655j7819N2733
35360a22889J1830j36713k07043j07170L0873O0557K940l3142L612P0236P0003
35349c56906m2668j54325r2267J06532J87451M0976j20162r0801L2214P5418R0983
35338c23555J90502K67741J63945l3715j24439j02281q7850p9712j6907L4522
$$ plain form
35328 -111749 -119347 -184568 -228568 -237939 -263721 -271075 -201098 -160518 -294785 -485097 -463306 -231855
35316 -231855 -46596 34149 209492 486382 584680 426099 307575 394046 435820 237961
35306 237961 34456 89498 253067 252276 153911 186449 322010 382347 382073 431559 446942 282876
35294 282876 41298 -51786 15051 89885 148254 269849 409705 444501 384580 325515 260051
35283 260051 130411 -18151 -115379 -198692 -305231 -357233 -316053 -291698 -317634 -200157 180526
35272 180526 585584 685273 481629 234261 100859 80046 163603 296049 314910 172570
35262 172570 77872 178864 278019 148021 -39321 57333 402912 620377 514549 240542
35252 240542 -12529 -198898 -290839 -254712 -157353 -77174 48637 269843 401173 225850
$$ packed form
35328a11749p598o5221m4000r371k5782p354O9977M0580j34267j90312K1791K31451
35316b31855J85259Q0745J75343K76890R8298j58581j18524Q6471M1774j97859
35306B37961k03505N5042J63569p91r8365L2538J35561O0337k74M9486J5383j64066
35294B82876k41578r3084O6837P4834N8369J21595J39856L4796n9921n9065o5464
35283B60051j29640j48562r7228q3313j06539n2002M1180K4355k5936J17477L80683
35272A80526M05058R9689k03644k47368j33402k0813Q3557J32446J8861j42340
35262A72570r4698J00992R9155j29998j87342R6654L45579K17465j05828k74007
35252B40542k53071j86369r1941L6127R7359Q0179J25811K21206J31330j75323
$$ plain form
35242 225850 -131191 -309894 -179196 44854 123854 23218 -150718 -241109 -127157 97874
35232 97874 142455 -95328 -317464 -250273 -84611 -159824 -380896 -361959 -54244 199437
35222 199437 207318 112984 35292 -69814 -151503 -61303 123427 136878 -40791 -138310 -57114
35211 -57114 -16956 -133638 -211272 -100986 60929 133803 187369 262815 207973 -41214 -255471
35200 -255471 -214164 -42787 -45657 -310793 -632142 -749869 -581745 -286986 -126972 -180016
35190 -180016 -232556 -78388 168376 266663 250874 339143 490605 411651 41546 -307622
35180 -307622 -380598 -247539 -64528 124809 246143 160150 -90226 -261468 -257905 -241388
35170 -241388 -294878 -268191 -88060 70529 78654 43628 45656 -34353 -237870 -350335 -215521
$$ packed form
35242B25850l57041j78703J30698K24050P9000j00636j73936r0391J13952K25031
35232I7874M4581k37783k22136O7191J65662p5213k21072J8937L07715K53681
35222A99437P881r4334p7692j05106q1689R0200J84730J3451j77669r7519Q1196
35211e7114M0158j16682p7634J10286J61915P2874N3566P5446n4842k49187k14257
35200b55471M1307J71377k870k65136l21349j17727J68124K94759J60014n3044
35190a80016n2540J54168K46764R8287j5789Q8269J51462p8954l70105l49168
35180c07622p2976J33059J83011J89337J21334q5993k50376j71242L563J6517
35170b41388n3490K6687J80131J58589Q125l5026K028q0009k03517j12465J34814
$$ plain form
35159 -215521 7410 117046 178693 332681 493409 487607 351054 267419 316303 446206
35149 446206 581812 627390 507730 325699 305677 455066 484951 221457 -118068 -251824
35139 -251824 -233893 -297677 -461145 -537030 -437032 -247500 -67472 57897 109254 135240 242479
35128 242479 432267 552380 511599 406067 325513 202144 -3143 -131739 -27998 216169
35118 216169 390232 432056 411592 358348 264440 167662 90406 -15581 -145397 -170861 -19074
35107 -19074 183586 264357 202746 85659 -12163 -18538 111155 260207 211321 -44445 -239669
35096 -239669 -199898 -83776 -93707 -150050 -68037 104106 165942 86561 31133 120457 318634
35085 318634 497074 500039 251358 -95527 -242273 -89109 152567 286516 366632 471598
$$ packed form
35159b15521K22931J09636O1647J53988J60728n802j36553q3635M8884J29903
35149D46206J35606M5578j19660j82031k0022J49389K9885k63494l39525j33756
35139b51824J7931o3784j63468p5885R9998J89532J80028J25369N1357K5986J07239
35128B42479J89788J20113m0781j05532q0554j23369k05287j28596J03741K44167
35118B16169J74063M1824k0464n3244r3908r6778p7256j05987j29816k5464J51787
35107a9074K02660Q0771o1611j17087r7822o375J29693J49052m8886k55766j95224
35096b39669L9771J16122r931n6343Q2013J72143O1836p9381n5428Q9324J98177
35085C18634J78440K965k48681l46885j46746J53164K41676J33949Q0116J04966
$$ plain form
35075 471598 489441 344042 218328 281135 362187 196028 -131037 -287487 -189811 -94351
35065 -94351 -197319 -392463 -464248 -339228 -107122 87229 160928 170446 228332 301449 219863
35054 219863 -32883 -209893 -120583 105994 245586 297546 372775 421742 331592 191474
35044 191474 194912 322727 360179 215057 17641 -93500 -119684 -137173 -208011 -335362 -419839
35033 -419839 -325809 -77356 113025 109864 25366 15804 59074 76194 114153 227478 313179
35022 313179 251055 94727 -44150 -171904 -301716 -314596 -133789 89234 165249 126290
35012 126290 103338 76376 -46179 -218477 -333517 -398083 -446750 -413239 -274091 -168738
35002 -168738 -178710 -156384 12015 161144 109910 -22470 -41216 -28366 -160638 -347336 -384023
$$ packed form
35075D71598J7843j45399j25714O2807Q1052j66159l27065j56450R7676R5460
35065i4351j02968j95144p1785J25020K32106J94351P3699R518N7886P3117q1586
35054B19863k52746j77010Q9310K26577J39592N1960P5229M8967r0150j40118
35044A91474L438J27815L7452j45122j97416j11141k6184j7489p0838j27351q4477
35033d19839R4030K48453J90381l161q4498r562M3270J7120L7959J13325Q5701
35022C13179o2124j56328j38877j27754j29812j2880J80807K23023P6015l8959
35012A26290k2952k6962j22555j72298j15040o4566m8667L3511J39148J05353
35002a68738r972K2326J68399J49129n1234j32380j8746J2850j32272j86698l6687
$$ plain form
34991 -384023 -314015 -287700 -211576 71642 370081 337292 29317 -148936 -47799 74364
34981 74364 27296 -67609 -80440 -74334 -101693 -80901 25368 130785 182328 204191 176615
34970 176615 67077 -39364 -42135 -6283 -29172 -11353 188348 453781 540541 428302 276954
34959 276954 133629 -23415 -68722 105214 311254 307054 202800 259060 406054 392298
34949 392298 293460 380888 557998 463643 119548 -79951 -52973 -128350 -373522 -417747 -118660
34938 -118660 155401 138297 47877 101175 130663 -32071 -226585 -300885 -368274 -457952 -333526
34927 -333526 42130 281755 147985 -45416 33858 189042 87925 -140817 -163619 -34208
34917 -34208 -68009 -297767 -472737 -480684 -411944 -312480 -194645 -190429 -402039 -690503 -848422
$$ packed form
34991c84023P0008K6315P6124K83218K98439l2789l07975j78253J01137J22163
34981G4364m7068r4905j2831O106k7359K0792J06269J05417N1543K1863k7576
34970A76615j09538j06441k771L5852k2889J7819J99701K65433Q6760j12239j51348
34959B76954j43325j57044m5307J73936K06040m200j04254N6260J46994j3756
34949C92298r8838Q7428J77110r4355l44095j99499K6978p5377k45172m4225K99087
34938a18660K74061j7104r0420N3298K9488j62734j94514p4300o7389q9678J24426
34927c33526L75656K39625j33770j93401P9274J55184j01117k28742k2802J29411
34917c4208l3801k29758j74970p947O8740R9464J17835M216k11610k88464j57919
$$ plain form
34906 -848422 -857434 -768092 -517203 -116236 181971 198017 128034 230842 392930 342467 146101
34895 146101 117881 311021 458830 402624 265033 187009 160481 152196 181639 247781 327922
34884 327922 433580 543044 542663 373268 160398 64604 87471 144841 212642 269014 230757
34873 230757 94227 -2845 -477 -27046 -142073 -179117 -38617 90030 47803 25586 253980
34862 253980 556925 575660 325502 157401 206590 234419 41858 -265971 -487265 -551692
34852 -551692 -481890 -322085 -153301 -32928 85986 243704 331897 234608 59641 24954
34842 24954 138009 199889 132942 88749 174855 257997 146102 -131140 -322385 -224464 81491
34831 81491 291181 209878 -12060 -75688 63126 155318 42524 -126449 -147537 -41217
$$ packed form
34906h48422r012Q9342K50889M00967K98207J6046o9983J02808J62088n0463j96366
34895A46101k8220J93140J47809n6206j37591p8024k6528q285K9443O6142Q0141
34884C27922J05658J09464l81j69395k12870r5794K2867N7370O7801N6372l8257
34873B30757j36530r7072K368k6569j15027l7044J40500J28647m2227k2217K28394
34862B53980L02945J8735k50158j68101M9189K7829j92561l07829k21294o4427
34852e51692O9802J59805J68784J20373J18914J57718Q8193r7289j74967l4687
34842B4954J13055O1880o6947m4193Q6106Q3142j11895k77242j91245R7921L05955
34831H1491K09690q1303k21938o3628J38814R2192j12794j68973k1088J06320
$$ plain form
34821 -41217 31203 -28208 -222781 -460390 -515261 -220424 206449 303770 -20400 -310765
34811 -310765 -204857 55496 34870 -248685 -434000 -366482 -174969 44196 254701 307261
34801 307261 102393 -143359 -126611 106776 268615 297510 376910 527401 544630 367259
34791 367259 182009 111504 81086 47386 94225 235829 354171 390629 399268 377008 247304
34780 247304 48197 -65336 -51969 -36098 -88495 -121840 -48235 99386 233195 282130 198179
34769 198179 6653 -161034 -186006 -83190 70476 237442 352039 291298 69972 -70110
34759 -70110 42942 243753 262868 107776 -19206 -77731 -204222 -428495 -617879 -674418
34749 -674418 -592858 -379361 -99467 74250 56200 -3817 46701 116916 78546 54570 218177
$$ packed form
34821d1217P2420n9411j94573k37609n4871K94837M26873R7321l24170k90365
34811c10765J05908K60353k0626k83555j85315O7518J91513K19165K10505N2560
34801C07261k04868k45752J6748K33387J61839K8895P9400J50491J7229j77371
34791C67259j85250p0505l0418l3700M6839J41604J18342L6458Q639k2260j29704
34780B47304j99107j13533J3367J5871n2397l3345P3605J47621J33809M8935q3951
34769A98179j91526j67687k4972J02816J53666J66966J14597o0741k21326j40082
34759g0110J13052K00811J9115j55092j26982n8525j26491k24273j89384n6539
34749f74418Q1560K13497K79894J73717j8050o0017N0518P0215l8370k3976J63607
$$ plain form
34738 218177 439472 448894 254084 81858 2529 -57549 -23220 236981 570602 664083 497701
34727 497701 333217 262986 134683 -68083 -149755 -62365 10700 1243 51223 176623 162848
34716 162848 -82738 -347342 -398993 -238440 -3173 161603 115078 -149927 -378915 -316679
34706 -316679 -87485 -24348 -145919 -161339 -2910 61188 -67723 -121542 55695 205832
34696 205832 55453 -287826 -559692 -693194 -725334 -589786 -251660 115865 307376 327030
34686 327030 304690 287742 240607 141997 -10712 -193172 -309948 -288672 -225304 -262260 -325924
34675 -325924 -210001 62686 221138 146579 29249 33163 56753 -48374 -239787 -395969
34665 -395969 -480459 -482217 -364265 -169088 -13411 94583 259636 460833 506360 313991
$$ packed form
34738B18177K21295R422j94810j72226p9329o0078L4329K60201L33621R3481j66382
34727D97701j64484p0231j28303k02766q1672Q7390P3065r457M9980J25400j3775
34716A62848k45586k64604n1651J60553K35267J64776m6525k65005k28988O2236
34706c16679K29194O3137j21571j5420J58429O4098j28911n3819J77237J50137
34696B05832j50379l43279k71866j33502l2140J35548L38126L67525J91511J9654
34686C27030k2340j6948m7135r8610j52709j82460j16776K1276O3368l6956o3664
34675c25924J15923K72687J58452p4559j17330L914K3590j05127j91413j56182
34665c95969q4490j758J17952J95177J55677J07994J65053K01197M5527j92369
$$ plain form
34655 313991 57446 -60260 -29424 40424 73015 45087 -20009 -46003 1216 36277 110
34644 110 10390 185598 400576 440990 329903 256940 253232 201778 105201 66282 68717 53948
34632 53948 116515 314834 418468 213016 -78027 -103430 20937 -66000 -269973 -173084
34622 -173084 163141 203521 -159091 -391543 -211638 -31455 -208135 -457355 -398987 -171070
34612 -171070 -79462 -66358 46956 142006 34622 -158382 -231336 -213864 -203907 -157700 -97380
34601 -97380 -211602 -492240 -605746 -394848 -161643 -170386 -233441 -109686 44840 -14815
34591 -14815 -176883 -199014 -116347 -99785 -157216 -248722 -417005 -559359 -414433 -36946 111431
34580 111431 -152167 -390716 -254530 -65683 -234876 -532274 -495222 -208083 -79323 -111458
$$ packed form
34655C13991k56545j17706L0836O9848L2591k7928o5096k5994M7219L5061l6167
34644A10J0280J75208K14978M0414j11087p2963l708n1454r6577l8919K435j4769
34632E3948O2567J98319J03634k05452k91043k5403J24367q6937k03973R6889
34622a73084L36225M0380l62612k32452J79905J80183j76680k49220N8368K27917
34612a71070R1608J3104J13314R5050j07384j93004p2954J7472R957M6207O0320
34601i7380j14222k80638j13506K10898K33205q743o3055J23755J54526n9655
34591a4815j62068k2131Q2667J6562n7431r1506j68283j42354J44926L77487J48377
34580A11431k63598k38549J36186J88847j69193k97398L7052K87139J28760l2135
$$ plain form
34570 -111458 1686 239160 298407 155643 52870 24436 -75957 -173246 -67664 149916
34560 149916 221150 169613 201599 264708 147907 -70554 -124401 -39637 -73205 -221581 -222845
34549 -222845 -29447 121926 107156 27456 -45968 -107261 -55614 158600 295736 87154
34539 87154 -324889 -549625 -487378 -371731 -346368 -345427 -332976 -324538 -230176 2213 163247
34528 163247 26713 -260862 -357357 -210889 -56714 -21768 -39040 -50624 -1534 228355
34518 228355 583762 708233 398680 -15697 -123782 -37740 -114212 -299021 -271383 -75231
34508 -75231 -40408 -162114 -123675 91530 162778 26621 -16734 145673 265707 196961 95503
34497 95503 72391 46776 23955 141290 357729 443816 353826 304735 441637 687560 908372
$$ packed form
34570a11458J13144K37474N9247j42764j02773k8434j00393r7289J05582K17580
34560A49916P1234n1537L1986O3109j16801k18461n3847Q4764l3568j48376j264
34549b22845J93398J51373j4770p9700p3424o1293N1647K14214J37136k08582
34539H7154m12043k24736O2247J15647K5363R41J2451Q438R4362K32389J61034
34528A63247j36534k87575r6495J46468J54175L4946j7272j1584M9090K29889
34518B28355L55407J24471l09553m14377j08085Q6042p6472j84809K7638J96152
34508g5231L4823j21706L8439K15205P1248j36157m3355J62407J20034o8746j01458
34497I5503k3112k5615k2821J17335K16439Q6087q9990m9091J36902K45923K20812
$$ plain form
34486 908372 974309 749876 310463 29412 119747 269370 118168 -121362 -7227 367010
34476 367010 529421 428870 454339 692044 785582 579846 327899 183750 23356 -159217
34466 -159217 -193298 -131142 -199383 -309178 -144246 218253 337662 136047 19828 165571
34456 165571 262928 124468 -7988 45181 123889 130526 212003 358018 306473 31911 -146467
34445 -146467 -106360 -82830 -137552 -3806 339200 476834 201664 -139634 -196253 -54653
34435 -54653 98082 279891 439459 345594 13126 -201585 -169552 -195427 -418567 -508428
34425 -508428 -257097 7851 -46663 -245360 -280131 -215678 -262114 -376586 -423364 -435866 -441009
34414 -441009 -321319 -91595 7125 -91781 -130384 20379 141380 113794 164329 401306
$$ packed form
34486I08372O5937k24433m39413k81051R0335J49623j51202k39530J14135L74237
34476C67010J62411j00551K5469K37705R3538k05736k51947j44149j60394j82573
34466a59217l4081O2156o8241j09795J64932L62499J19409k01615j16219J45743
34456A65571R7357j38460j32456N3169P8708O637Q1477J46015n1545k74562j78378
34445a46467M0107K3530n4722J33746L43006J37634k75170l41298n6619J41600
34435e4653J52735J81809J59568r3865l32468k14711L2033k5875k23140q9861
34425e08428K51331K64948n4514j98697l4771O4453m6436j14472m6778j2502n143
34414d41009J19690K29724R8720r8906l8603J50763J21001k7586N0535K36977
$$ plain form
34404 401306 529584 337405 80069 55367 149532 123976 25721 3090 12871 -10167 17003
34393 17003 87683 10213 -227872 -338104 -192596 -50726 -102299 -158284 -34071 134137
34383 134137 196850 243421 319510 279422 141403 181387 449409 621357 550313 494391 564167
34372 564167 474602 145298 -2699 273836 581635 526620 323389 332293 450792 432465
34362 432465 384512 464422 470556 220672 -15243 63924 261340 228697 33494 -50522 -12979
34351 -12979 47095 229716 571298 775039 609601 298237 156156 147002 121935 136099 192178
34340 192178 65054 -270653 -458888 -350461 -293626 -466756 -473035 -62437 315230 240459
34330 240459 58736 241958 519032 367476 -41805 -149810 56297 153885 79986 101791
$$ packed form
34404D01306J28278j92179k57336k4702R4165k5556r8255k2631R781k3038K7170
34393A7003P0680p7470k38085j10232J45508J41870n1573n5985J24213J68208
34383A34137O2713M6571P6089m0088j38019L9984K68022J71948p1044n5922O9776
34372E64167q9565l29304j47997K76535L07799n5015k03231Q904J18499j8327
34362D32465m7953P9910O134k49884k35915P9167J97416l2643j95203q4016L7543
34351a2979O0074J82621L41582K03741j65438l11364j42081r154k5067J4164N6079
34340A92178j27124l35707j88235J08427N6835j73130o279M10598L77667p4771
34330B40459j81723J83222K77074j51556m09281j08005K06107R7588p3899K1805
$$ plain form
34320 101791 187068 80447 -137462 -172553 -49104 25306 122689 371689 506107 226149
34310 226149 -198406 -276830 -57116 39760 -52527 -71688 -424 -28114 -93461 -19646 55395
34299 55395 -80797 -228303 -69494 238116 308540 177433 161189 258739 242816 162711 214259
34288 214259 289500 177508 20213 66494 195811 176452 125050 202710 174995 -169466 -491740
34277 -491740 -378170 -10371 220564 377455 621637 637353 155025 -360808 -350877 -105942
34267 -105942 -225075 -512027 -356607 97850 179826 -131947 -266472 -145639 -202115 -412734
34257 -412734 -325015 -8040 13177 -233121 -193326 164394 303433 152503 200268 479645
34247 479645 448149 23122 -221951 -73493 30027 -88419 -44776 271017 432516 291018
$$ packed form
34320A01791Q5277j06621k17909l5091J23449P4410R7383K49000J34418k79958
34310B26149m24555p8424K19714R6876r2287j9161P1264k7690o5347P3815P5041
34299E5395j36192j47506J58809L07610P0424j31107j6244R7550j5923q0105N1548
34288B14259P5241j11992j57295M6281J29317j9359n1402P7660k7715l44461l22274
34277d91740J13570L67799K30935J56891K44182J5716m82328n15833R931K44935
34267a05942j19133k86952J55420M54457Q1976l11773j34525J20833n6476k10619
34257d12734Q7719L16975K1217k46298L9795L57720J39039j50930M7765K79377
34247D79645l1496m25027k45073J48458J03520j18446M3643L15793J61499j41498
$$ plain form
34237 291018 227924 366851 342005 72827 -31157 141184 198907 42154 62508 337519
34227 337519 427044 201628 77918 195310 160398 -137943 -261461 -42542 114739 32095
34217 32095 73422 369015 500096 286354 148401 343965 535813 443904 265907 156457
34207 156457 -57326 -368336 -441638 -223064 -73460 -103539 -17327 233726 326804 227919
34197 227919 261322 416964 348928 142491 249329 573900 531189 129163 20880 316422
34187 316422 375406 17072 -130725 191921 416669 243072 143421 345965 360916 628
34177 628 -161008 125130 256786 -86185 -284236 106603 531176 411279 73917 22824
34167 22824 100335 45724 114558 485563 768723 694897 584345 617865 426024 -85310 -338870
$$ packed form
34237B91018o3094J38927k4846k69178j03984J72341N7723j56753K0354K75011
34227C37519Q9525k25416j23710J17392l4912k98341j23518K18919J57281q2644
34217C2095M1327K95593J31081k13742j37953J95564J91848r1909j77997j09450
34207A56457k13783l11010p3302K18574J49604l0079Q6212K51053R3078r8885
34197B27919L3403J55642o8036k06437J06838L24571m2711m02026j08283K95542
34187C16422N8984l58334j47797L22646K24748j73597r9651K02544J4951l60288
34177F28j61636K86138J31656l42971j98051L90839M24573j19897l37362n1093
34167B2824P7511n4611O8834L71005K83160p3826j10552L3520j91841n11334k53560
$$ plain form
34156 -338870 -56464 223086 134678 103857 411695 586094 360173 292418 733599 1094165
34146 1094165 872272 516102 515038 528995 209619 3781 297992 587437 342982 -68275
34136 -68275 -136321 -100784 -291052 -367948 -47652 186338 -88681 -443595 -408159 -289920
34126 -289920 -422787 -433133 -46335 234603 66406 -13203 363642 572986 137621 -282042
34116 -282042 -30002 368375 236442 16720 362860 836959 720032 336679 365845 563368
34106 563368 368666 83455 248394 511035 299089 -24014 154324 493064 340454 -49886
34096 -49886 -82226 50047 -75427 -107595 355127 738515 394935 -150620 -76332 300679
34086 300679 211469 -124898 -34835 284089 258286 131483 395975 676640 448708 191371
$$ packed form
34156c38870K82406K79550q8408l0821L07838J74399k25921o7755M41181L60566
34146A094165k21893l56170j064J3957l19376k05838K94211K89445k44455m11257
34136f8275o8046L5537j90268p6896L20296K33990k75019l54914L5436J18239
34126b89920j32867j0346L86798K80938j68197p9609L76845K09344m35365m19663
34116b82042K52040L98377j31933k19722L46140M74099j16927l83353K9166J97523
34106E63368j94702k85211J64939K62641k11946l23103J78338L38740j52610l90340
34096d9886l2340J32273j25474l2168M62722L83388l43580n45555P4288L77011
34086C00679q9210l36367R0063L18924k5803j26803K64492K80665k27932k57337
$$ plain form
34076 191371 539258 998788 837703 500344 736681 1091288 757846 206358 389477 994899
34066 994899 1078093 802487 936587 1225244 908961 308896 254850 475863 196192 -224825
34056 -224825 73321 720956 722509 278219 306011 667629 588600 313448 587994 1023016
34046 1023016 757054 213479 381869 902069 732271 164933 245097 730976 622254 182797
34036 182797 400340 964184 869454 490720 881446 1548910 1208940 270986 210877 891781
34026 891781 924762 321214 307796 811866 655597 13645 145517 885346 927686 388702
34016 388702 510879 1077881 799701 15623 217389 1097544 980212 24622 -26092 808166
34006 808166 795474 -107954 -150776 785362 938287 90285 -69698 679047 711463 -65559
$$ packed form
34076A91371L47887M59530j61085l37359K36337L54607l33442n51488J83119O05422
34066I94899Q3194k75606J34100K88657l16283o00065n4046K21013k79671m21017
34056b24825K98146O47635J553m44290K7792L61618p9029k75152K74546M35022
34046A023016k65962n43575J68390N20200j69798n67338Q0164M85879j08722m39457
34036A82797K17543N63844r4730l78734L90726O67464l39970r37954o0109O80904
34026H91781L2981o03548j3418N04070j56269o41952J31872P39829M2340n38984
34016C88702J22177N67002k78180p84078K01766Q80155j17332r55590n0714Q34258
34006H08166j2692r03428m2822R36138J52925q48002j59983P48745L2416p77022
$$ plain form
33996 -65559 112756 1335220 1620665 630586 299051 1133819 1407263 701543 674794 1566707
33986 1566707 1579960 516406 334775 1298379 1357448 172115 -171553 710268 739632 -371024
33976 -371024 -365217 1076908 1514787 475539 429579 1882533 2272366 1052230 891707
33967 891707 2383929 2745332 1349191 1118939 2694909 2931945 1119406 680915 2534350
33958 2534350 3089457 1264816 820792 2978996 3756684 1752009 1194223 3742139 5000055
33949 5000055 3100763 2565885 5280686 6362789 3902225 3451902 7281006 9247646
33941 9247646 6687410 6419720 11626401 14882552 12895009 14695012 24723746 32973694
33933 32973694 34911212 43585708 65010296 83165061 96055120 143966208 257775604
$$ packed form
33996f5559J78315J222464K85445r90079l31535Q34768K73444p05720k6749Q91913
33986A566707J3253j063554j81631R63604N9069j185333l43668Q81821K9364j110656
33976c71024N807J442125M37879j039248m5960J452954L89833j220136j60523
33967H91707J492222L61403j396141k30252J575970K37036j812539m38491J853435
33958B534350N55107j824641m44024K158204P77688k004675n57786K547916J257916
33949E000055j899292n34878K714801J082103k460564m50323L829104J966640
33941I247646k560236k67690N206681L256151j987543J800003J0028734Q249948
33933C2973694J937518Q674496K1424588J8154765J2890059M7911088J13809396
$$ plain form
33926 257775604 386846751 429655567 349606707 219509040 131915611 102604098 88795349
33919 88795349 66918429 50083228 46090610 42012671 31214941 23730784 24405723 24138188
33911 24138188 18103720 13614979 14728678 15138664 11298046 8680894 10280924 11067033
33903 11067033 8285638 6452198 8025552 8884508 6823862 5631670 7295008 8379079
33895 8379079 7245015 7194366 9711654 11812174 12385976 14296778 18730025 24660205 34461137
33886 34461137 51017872 67622845 70782264 57068256 38559347 27258638 22351420
33879 22351420 17607342 12811252 10953775 10631022 8707833 6361960 6233428 6954805
33871 6954805 5879709 4129599 4056701 4586874 3586438 2131522 2205223 2729822 1862355
$$ packed form
33926B57775604J29071147M2808816q0048860j30097667q7593429k9311513j3808749
33919H8795349k1876920j6835201l992618m077939j0797730p484157O74939k67535
33911B4138188o034468m488741J113699M09986l840618k617152J600030P86109
33903A1067033k781395j833440J573354Q58956k060646j192192J663338J084071
33895H379079j134064n0649K517288K100520N73802J910802M433247N930180R800932
33886C4461137J6556735J6604973L159419j3714008j8508909j1300709m907218
33879B2351420m744078m796090j857477l22753j923189k345873j28532P21377
33871F954805j075096j750110p2898N30173j000436j454916P3701N24599q67467
$$ plain form
33862 1862355 751389 1213487 2071514 1471794 527083 1072032 2016662 1464767 370553
33853 370553 616591 1401897 943028 -37097 163128 883351 504179 -353258 -130584 606964
33843 606964 395149 -219996 112231 755998 332117 -500963 -269699 503968 409841 -87067
33833 -87067 334688 1146947 934229 101112 50121 536235 326742 -323722 -272123 211532
33823 211532 70907 -354524 -38107 573207 331235 -378623 -355236 141476 -15770 -595972
33813 -595972 -514087 27369 -532 -387208 -132469 523879 524083 4980 -41447 305155 189839
33802 189839 -200406 34730 715820 879919 524220 392809 433738 112958 -185853 258950
33792 258950 965947 928641 387517 312349 605475 466331 55319 117920 419746 235241
$$ packed form
33862A862355j110966M62098Q58027n99720r44711N44949R44630n51895j094214
33853C70553K46038P85306m58869r80125K00225P20223l79172q57437K22674P37548
33843F06964k11815o15145L32227O43767m23881q33080K31264P73667r4127m96908
33833h7067M21755Q12259k12718q33117n0991M86114k09493o50464N1599M83655
33823B11532j40625m25431L16417O11314k41972p09858K3387M96712j57246n80202
33813e95972Q1885N41456k7901l86676K54739O56348K04n19103m6427L46602j15316
33802A89839l90245K35136O81090J64099l55699j31411M0929l20780k98811M44803
33792B58950P06997l7306n41124p5168K93126j39144m11012O2601L01826j84505
$$ plain form
33782 235241 -75216 320747 1003279 922666 302428 170704 434477 233054 -201290 62092
33772 62092 710510 578683 -212019 -423792 96315 285779 -92750 -168078 214027 228133
33762 228133 -205217 -202234 351894 546965 181075 114280 594271 804331 420831 128662
33752 128662 236670 205239 -105008 -94778 318940 434531 88324 -27498 321053 523375
33742 523375 340364 275244 450607 337489 -112731 -266560 -6464 55759 -198015 -171488
33732 -171488 198869 226692 -201076 -337562 42643 213587 -151602 -402221 -132058 154235
33722 154235 63551 -62157 5157 -69414 -350399 -341079 56637 249314 -1758 -196289
33712 -196289 -101442 -153196 -495371 -626265 -393657 -338863 -634455 -678794 -201411 203814
$$ packed form
33782B35241l10457L95963O82532q0613o20238j31724K63773k01423m34344K63382
33772F2092O48418j31827p90702k11773N20107J89464l78529p5328L82105J4106
33762B28133m33350K983N54128J95071l65890o6795M79991K10060l83500k92169
33752A28662J08008l1431l10247J0230M13718J15591l46207j15822L48551K02322
33742E23375j83011o5120J75363j13118m50220j53829K60096O2223k53774K6527
33732a71488L70357K7823m27768j36486L80205J70944l65189k50619K70163K86293
33722A54235r0684j25708O7314p4571k80985R320L97716J92677k51072j94531
33712a96289R4847n1754l42175j30894K32608N4794k95592m4339M77383M05225
$$ plain form
33702 203814 132138 16119 222998 404654 261623 110463 190989 210914 39575 53658
33692 53658 351979 436967 117289 -91500 84697 159745 -200388 -554917 -489992 -279622
33682 -279622 -235693 -134499 193166 400525 260583 104972 165595 143727 -120328 -239188
33672 -239188 -8742 136996 -105314 -340116 -180411 96339 113645 42884 173140 345198
33662 345198 294994 123259 34073 22193 93061 320308 485463 225995 -274857 -389223
33652 -389223 -21395 234298 121528 103435 424910 636964 453351 267055 354226 341379
33642 341379 -32500 -356743 -276235 -95950 -146216 -205313 -64580 -18348 -266536 -444400
33632 -444400 -257657 1559 37953 42240 153274 82444 -259106 -424108 -201323 -44042
$$ packed form
33702B03814p1676j16019K06879J81656j43031j51160Q0526J9925j71339J4083
33692E3658K98321Q4988l19678k08789J76197P5048l60133l54529O4925K10370
33682b79622M3929J01194L27665K07359j39942j55611O0623k1868k64055j18860
33672b39188K30446J45738k42310k34802J59705K76750J7306p0761J30256J72058
33662C45198n0204j71735q9186j1880P0868K27247J65155k59468n00852j14366
33652c89223L67828K55693j12770j8093L21475K12054j83613j86296Q7171j2847
33642C41379l73879l24243Q0508J80285n0266n9097J40733M6232k48188j77864
33632d44400J86743K59216L6394M287J11034p0830l41550j65002K22785J57281
$$ plain form
33622 -44042 -233775 -332395 -14552 281351 145600 -62014 81692 289333 186167 67835
33612 67835 307528 591939 488244 238178 261634 386596 298580 242787 521277 771061
33602 771061 526013 75800 -6457 194832 226852 127051 223576 402863 336313 160063
33592 160063 203456 302645 94564 -249113 -279170 -42186 70892 40292 128484 266869
33582 266869 166645 -115695 -300116 -394376 -544529 -592715 -337222 -14003 33564 -54851
33572 -54851 58927 268033 218125 -64588 -280899 -382050 -475371 -449676 -212368 -44556
33562 -44556 -197612 -404573 -316682 -123690 -179014 -322348 -191141 73283 64264 -189072
33552 -189072 -372126 -486119 -681277 -753081 -461222 -112045 -151781 -398897 -360379 -93550
$$ packed form
33622d4042j89733r8620L17843K95903j35751k07614J43706K07641j03166j18332
33612F7835K39693K84411j03695k50066K3456J24962q8016n5793K78490K49784
33602G71061k45048m50213q2257K01289L2020r9801R6525J79287o6550j76250
33592A60063M3393R9189k08081l43677l0057K36984J13078l0600Q8192J38385
33582B66869j00224k82340j84421r4260j50153m8186K55493L23219M7567q8415
33572e4851J13778K09106m9908k82713k16311j01151r3321K5695K37308J67812
33562d4556j53056k06961Q7891J92992n5324j43334J31207K64424r019k53336
33552a89072j83054j13993j95158p1804K91859L49177l9736k47116L8518K66829
$$ plain form
33542 -93550 -36147 -169769 -110709 93928 27291 -299806 -449448 -340820 -334199 -518191 -583157
33531 -583157 -447906 -381424 -437566 -352514 -74587 133493 171354 196264 233800 158732 38255
33520 38255 43914 93063 24965 -5642 196538 385069 233590 -7664 135748 504392 506484
33509 506484 93084 -197684 -148806 -84183 -150049 -108207 59941 48306 -134867 -90520 239434
33498 239434 398558 171578 -79230 -47351 97613 141194 164152 226967 173627 -41214
33488 -41214 -233916 -349220 -535165 -761855 -798244 -660721 -632790 -745415 -705934 -446168
33478 -446168 -261959 -286840 -303259 -209340 -198693 -325921 -352789 -185994 -33022 17904 129649
33467 129649 290631 219129 -137795 -451214 -531285 -571581 -697545 -709890 -491461 -261019
$$ packed form
33542i3550N7403j33622N9060K04637o6637l27097j49642J08628O621j83992o4966
33531e83157J35251O6482n6142Q5052K77927K08080L7861K4910L7536p5068j20477
33520C8255N659M9149o8098l0607K02180J88531j51479k41254J43412L68644K092
33509E06484m13400k90768M8878O4623o5866M1842J68148j1635j83173M4347L29954
33498B39434J59124k26980k50808L1879J44964M3581K2958O2815n3340k14841
33488d1214j92702j15304j85945k26690l6389J37523K7931j12625L9481K59766
33478d46168J84209k4881j6419R3919J0647j27228k6868J66795J52972N0926J11745
33467A29649J60982p1502l56924l13419q0071m0296j25964j2345K18429K30442
$$ plain form
33457 -261019 -189567 -132695 24891 103484 -45523 -235229 -208029 -212 138986 43911
33447 43911 -236027 -461884 -380692 -49756 121591 -104132 -403967 -373155 -182772 -285225
33437 -285225 -631221 -754422 -556901 -399091 -411602 -340855 -145040 -130079 -362070 -506353
33427 -506353 -392784 -220981 -95574 104509 293845 189037 -128369 -236652 -88793 -95111
33417 -95111 -349410 -432094 -193232 -54809 -246672 -397485 -229874 -38208 -88079 -133883
33407 -133883 38394 142465 -71088 -307361 -233817 -52667 -98844 -270408 -317996 -324069
33397 -324069 -439581 -495896 -329839 -171022 -265953 -420440 -346047 -173844 -193267 -335937
33387 -335937 -334384 -173742 -15759 108099 200751 146786 -26537 -11956 321869 616587
$$ packed form
33457b61019P1452N6872J57586P8593j49007j89706K7200K07817J39198r5075
33447D3911k79938k25857Q1192L30936J71347k25723k99835L0812J90383j02453
33437b85225l45996j23201J97521J57810j2511P0747J95815J4961k31991j44283
33427e06353J13569J71803J25407K00083J89336j04808l17406j08283J47859o318
33417i5111k54299q2684K38862J38423j91863j50813J67611J91666m9871m5804
33407a33883J72277J04071k13553k36273P3544J81150m6177j71564m7588o073
33397c24069j15512n6315J66057J58817r4931j54487P4393J72203j9423j42670
33387c35937J553J60642J57983J23858R2652n3965j73323J4581L33825K94718
$$ plain form
33377 616587 505908 132710 -152142 -308950 -460639 -520331 -374255 -195064 -186309 -236751
33367 -236751 -181588 -153346 -299282 -413396 -262801 -43466 -77266 -257363 -237403 -10238
33357 -10238 139553 136284 145994 199457 176785 109866 147078 258713 280363 197356 122177 69845
33345 69845 8504 31637 217914 406250 351951 36610 -354541 -643277 -692964 -423131
33335 -423131 16579 280648 231768 105765 99545 73416 -105849 -237598 -120804 56241
33325 56241 15964 -142082 -137149 23070 134757 193302 321452 426338 295669 -31594
33315 -31594 -301999 -395561 -375667 -276224 -97738 53900 56185 -51663 -137425 -137541 -46494
33304 -46494 101193 150962 -47406 -340641 -381021 -150842 -35123 -214261 -379703 -276068
$$ packed form
33377F16587j10679l73198k84852j56808j51689n9692J46076J79191Q755n0442
33367b36751N5163K8242j45936j14114J50595K19335l3800j80097J9960K27165
33357a0238J49791l269R710N3463k2672o6919L7212J11635K1650q3007p5179n2332
33345F9845o1341K3133J86277J88336n4299l15341l91151k88736m9687K69833
33335d23131M39710K64069m8880j26003o220k6129j79265j31749J16794J77045
33325E6241m0277j58046M933J60219J11687N8545J28150J04886j30669l27263
33315c1594k70405r3562J9894R9443J78486J51638K285j07848q5762j16R1047
33304d6494J47687M9769j98368k93235m0380K30179J15719j79138j65442J03635
$$ plain form
33294 -276068 -105058 -99676 -121423 -32312 -46257 -291462 -418624 -125772 268865 288147 32971
33283 32971 -72343 -17818 -131680 -439739 -637995 -603296 -471072 -306722 -107190 4267
33273 4267 -28385 23729 314696 559218 441330 154966 85327 185595 158695 33439 36426
33262 36426 93528 2422 -82378 103986 373732 342624 94160 2104 44763 -77249 -274715
33251 -274715 -202449 18242 -81831 -479853 -641398 -403335 -197649 -278734 -376334 -282161
33241 -282161 -178863 -188663 -140444 13303 43395 -111424 -210991 -173081 -200035 -314016 -251729
33230 -251729 24575 189678 94053 -17775 19737 64984 66172 205135 461331 503358 225978
33219 225978 -42630 -72919 -44683 -126906 -178449 -84751 18140 69030 225005 466833 473230
$$ packed form
33294b76068J71010N382k1747Q9111j3945k45205j27162K92852L94637J9282k55176
33283C2971j05314N4525j13862l08059j98256L4699J32224J64350J99532J11457
33273D267l2652N2114K90967K44522j17888k86364o9639J00268k6900j25256K987
33262C6426N7102r1106q4800J86364K69746l1108k48464r2056M2659j22012j97466
33251b74715P2266K20691j00073l98022j61545K38063K05686q1085r7600R4173
33241b82161J03298r800M8219J53747L0092j54819r9567L7910k6954j13981O2287
33230b51729K76304J65103r5625j11828L7512M5247J188J38963K56196M2027k77380
33219B25978k68608l0289K8236q2223n1543R3698J02891N0890J55975K41828O397
$$ plain form
33208 473230 131453 -204984 -210635 1834 169312 223842 158407 -88244 -410159 -541077
33198 -541077 -453940 -400797 -427673 -278306 62377 212243 8226 -198473 -139686 -59737
33188 -59737 -231088 -483767 -577249 -638335 -842521 -1011609 -915350 -667867 -469661 -262806
33178 -262806 7764 111389 -102918 -344221 -277206 -32715 59881 12332 59007 203250
33168 203250 266135 225441 163747 42410 -153275 -223945 -40297 151946 39237 -297782
33158 -297782 -533927 -552357 -449321 -260721 -8450 129222 16904 -189015 -275972 -312051
33148 -312051 -454683 -591343 -511432 -305323 -238466 -317259 -326526 -243031 -270162 -462278 -612951
33137 -612951 -556119 -357395 -178665 -115746 -166008 -230552 -184510 -34314 81983 114593 156766
$$ packed form
33208D73230l41777l36437n651K12469J67478N4530o5435k46651l21915j30918
33198e41077Q7137N3143k6876J49367L40683J49866k04017k06699N8787P9949
33188e9737j71351k52679r3482o1086k04186j69088R6259K47483J98206K06855
33178b62806K70570J03625k14307k41303O7015K44491R2596m7549M6675J44243
33168B03250O2885m0694o1694j21337j95685p0670J83648J92243j12709l37019
33158b97782k36145j8430J03036J88600K52271J37672j12318k05919q6957l6079
33148c12051j42632j36660P9911K06109O6857p8793r267Q3495k7131j92116j50673
33137f12951N6832J98724J78730O2919n0262o4544M6042J50196J16297L2610M2173
$$ plain form
33126 156766 197543 60919 -251458 -416997 -222137 96079 201665 137755 153158 241095
33116 241095 199680 37540 -26280 73971 175761 159887 66028 -38056 -113032 -119775 -91429
33105 -91429 -147975 -290759 -313736 -93853 178455 259276 191401 164869 188030 147906 75489
33094 75489 91307 172304 205342 193966 206968 217089 187290 200632 299091 321135 121618
33083 121618 -168171 -323541 -348377 -390637 -459486 -454384 -359952 -204048 32563 254038 192982
33072 192982 -210210 -560972 -468976 -97868 91692 12829 -26469 107351 204221 125154
33062 125154 6407 -25696 -33322 -73028 -78372 -17864 41086 84943 177920 284177 245653
33051 245653 -2223 -321352 -510140 -465023 -232562 1144 30559 -152381 -330512 -338817
$$ packed form
33126A56766M0777j36624l12377j65539J94860L18216J05586o3910J5403Q7937
33116B41095m1415j62140o3820J00251J01790j5874r3859j04084p4976o743K8346
33105i1429n6546j42784k2977K19883K72308Q0821o7875k6532K3161m0124p2417
33094G5489J5818Q0997L3038j1376J3002J0121k9799J3342R8459K2044j99517
33083A21618k89789j55370k4836m2260o8849N102R4432J55904K36611K21475o1056
33072A92982m03192l50762R1996L71108J89560p8863l9298J33820R6870p9067
33062A25154j18747l2103p626l9706n344O0508N8950M3857R2977J06257l8524
33051B45653k47876l19129j88788M5117K32461K33706K9415j82940j78131q305
$$ plain form
33041 -338817 -249348 -174912 -60029 165395 387403 464089 443518 430675 377632 207071 3313
33030 3313 -119857 -195034 -260488 -233745 -131686 -187683 -488639 -727944 -627179 -380593 -334412
33019 -334412 -435937 -391037 -187837 -45691 10328 96173 120134 -65794 -272571 -197775
33009 -197775 37263 53630 -143419 -200438 -68455 -70968 -274845 -352221 -196548 -139589 -354904
32998 -354904 -536224 -425010 -224202 -191478 -193190 4564 287474 376734 275607 231197
32988 231197 355145 515228 551716 451960 339533 342512 422734 372392 94014 -204513 -284791
32977 -284791 -237198 -292014 -376832 -232326 70857 154803 -81003 -319922 -370857 -422146 -591211
32966 -591211 -643492 -410611 -131774 -85752 -166156 -122473 5823 6012 -116634 -161064 -65287
$$ packed form
33041c38817Q9469P4436J14883K25424K22008P6686k0571j2843n3043j70561k03758
33030C313j23170p5177o5454K6743J02059n5997l00956k39305J00765K46586M6181
33019c34412j01525M4900K03200J42146N6019Q5845K3961j85928k06777P4796
33009a97775K35038J6367j97049n7019J31983k513k03877p7376J55673N6959k15315
32998c54904j81320J11214K00808L2724j712J97754K82910Q9260j01127m4410
32988B31197J23948J60083L6488r9756j12427K979Q0222n0342k78378k98527q0278
32977b84791M7593n4816q4818J44506L03183Q3946k35806k38919n0935n1289j69065
32966e91211n2281K32881K78837M6022q0404M3683J28296J89j22646m4430R5777
$$ plain form
32955 -65287 18283 -45981 -224768 -371352 -351382 -157624 73580 230708 376359 592477
32945 592477 744242 626027 308208 64466 -42509 -191915 -394090 -405178 -156290 78059
32935 78059 100004 63298 143185 225778 151013 18499 10821 97263 127628 72015 -6765 -79452
32923 -79452 -110946 -41865 79874 107635 17488 -64008 -106580 -206573 -306350 -188532 126068
32912 126068 295396 151006 -32485 17396 152861 103014 -65273 -87546 82510 283464
32902 283464 426293 505963 462962 275684 83821 12903 -13011 -106162 -203851 -207339 -181639
32891 -181639 -218139 -239204 -138064 21356 134082 239714 382292 431618 260538 -19915
32881 -19915 -206053 -270126 -296914 -276438 -159090 -11268 70923 108451 145397 128909 34947
$$ packed form
32955f5287Q3570o4264j78787j46584J9970J93758K31204J57128J45651K16118
32945E92477J51765j18215l17819k43742j06975j49406k02175j1088K48888K34349
32935G8059K1945l6706P9887Q2593p4765j32514p678Q6442L0365n5613p8780p2687
32923g9452l1494O9081J21739K7761r0147q1496m2572r9993r9777J17818L14600
32912A26068J69328j44390j83491M9881J35465m9847j68287k2273J70056K00954
32902B83464J42829P9670m3001j87278j91863p0918k5914r3151r7689l488K5700
32891a81639l6500k1065J01140J59420J12726J05632J42578M9326j71080k80453
32881a9915j86138o4073k6788K0476J17348J47822Q2191L7528L6946j6488r3962
$$ plain form
32870 34947 -25988 11366 30491 -61727 -160039 -167006 -190103 -324357 -417012 -288292 -35558
32859 -35558 125222 184350 262784 346905 355999 357989 454099 542882 459587 272630 185356 206898
32847 206898 176875 76891 66449 207904 362701 381120 256298 101227 66841 215990
32837 215990 397513 370314 145178 22688 160875 328295 280574 148068 182697 322238
32827 322238 321587 168208 42821 -22205 -123819 -217012 -185682 -121214 -209455 -376033 -354768
32816 -354768 -97660 170625 299329 337844 324642 228384 113558 107352 177342 167200 58184
32805 58184 -19384 -15178 25332 137316 376318 605604 610972 428738 303062 314248 308922
32794 308922 207348 109414 63650 -6832 -99517 -97015 11826 98934 125255 184170 289755
$$ packed form
32870C4947o0935L7354J9125r2218r8312o967k3097j34254r2655J28720K52734
32859c5558J60780N9128P8434Q4121R094J990R6110Q8783q3295j86957q7274K1542
32847B06898l0023r9984j0442J41455J54797J8419j24822j55071l4386J49149
32837B15990J81523k7199k25136j22490J38187J67420m7721j32506L4629J39541
32827C22238o51j53379j25387o5026j01614r3193L1330O4468q8241j66578K1265
32816c54768K57108K68285J28704L8515j3202r6258j14826o206O9990j0142j09016
32805E8184p7568M206M0510J11984K39002K29286N368j82234j25676J1186n326
32794C08922j01574r7934m5764p0482r2685K502J08841Q7108K6321N8915J05585
$$ plain form
32783 289755 345025 340036 347848 316188 129553 -103658 -130592 22425 32233 -198134 -325098
32772 -325098 -72510 311318 351061 -69992 -637595 -992042 -994980 -720330 -375831 -187504
32762 -187504 -218603 -327059 -374762 -401717 -507078 -648583 -680458 -543585 -316841 -107145
32752 -107145 30459 81377 52126 -27618 -116869 -189012 -243816 -293194 -327012 -302897 -202379
32741 -202379 -81511 -2033 71894 207993 347715 361887 280820 278867 368891 331606 68542
32730 68542 -196279 -233237 -111277 12147 178074 439162 592580 435745 157925 128252
32720 128252 363612 539155 485620 349666 273948 235200 216492 251976 278977 208263 141235
32709 141235 246437 429813 423863 211748 54694 69631 92975 15878 -57455 -63172 -91839
$$ packed form
32783B89755N5270m989P812l1660j86635k33211k6934J53017R808k30367j26964
32772c25098K52588L83828L9743m21053n67603l54447k938K74650L44499J88327
32762a87504l1099j08456m7703k6955j05361j41505l1875J36873K26744K09696
32752a07145J37604N0918k9251p9744q9251p2143n4804m9378l3818K4115J00518
32741b02379J20868P9478P3927J36099J39722J4172q1067j953R0024l7285k63064
32730F8542k64821l6958J21960J23424J65927K61088J53418j56835k77820k9673
32720A28252K35360J75543n3535j35954p5718l8748j8708L5484K7001p0714o7028
32709A41235J05202J83376n950k12115j57054J4937K3344p7097p3333n717k8667
$$ plain form
32698 -91839 -158042 -137429 -30238 -15144 -138615 -217704 -160340 -115630 -181181 -221721 -128357
32687 -128357 -24054 -49283 -141428 -182251 -195465 -255818 -340103 -380462 -350830 -241752 -78225
32676 -78225 17004 -63261 -230844 -313797 -322937 -385458 -447606 -322806 -32381 201250 311686
32665 311686 416779 473844 280686 -105746 -333167 -257786 -123560 -109352 -73939 84348
32655 84348 195123 150177 113809 179736 168137 -2126 -97373 10384 65147 -127524 -325731
32644 -325731 -270402 -152922 -266401 -468284 -420659 -151508 51013 129119 215533 250473
32634 250473 77494 -170606 -209054 -78015 -83728 -287729 -442815 -443096 -456758 -558297 -581761
32623 -581761 -442271 -310753 -343649 -456680 -472493 -328085 -69774 212582 405357 448865
$$ packed form
32698i1839o6203K0613J07191J5094j23471p9089N7364M4710o5551m0540R3364
32687a28357J04303k5229r2145m0823j3214o0353q4285m0359K9632J09078J63527
32676g8225R5229q0265j67583q2953r140o2521o2148J24800K90425K33631J10436
32665C11686J05093N7065j93158l86432k27421P5381J34226J4208L5413J58287
32655H4348J10775m4946l6368O5927j1599j70263r5247J07757N4763j92671j98207
32644c25731N5329J17480j13479k01883M7625K69151K02521P8106Q6414L4940
32634B50473j72979k48100l8448J31039n713k04001j55086k81j3662j01539k3464
32623e81761J39490J31518l2896j13031j5813J44408K58311K82356J92775M3508
$$ plain form
32613 448865 405092 347216 237457 50319 -74495 -3929 129512 75018 -151820 -266016
32603 -266016 -112048 148718 291503 281012 211031 145408 93152 46205 -7001 -58711 -86740
32592 -86740 -126457 -263169 -469471 -550069 -381401 -123530 -42070 -182731 -372901 -484230
32582 -484230 -531646 -556319 -567549 -571368 -526364 -324854 41475 359459 399620 203676 18917
32571 18917 -11552 53822 119199 152289 145738 118655 135965 213324 252258 186402 120368 183600
32559 183600 316367 355554 272667 166618 73532 -47863 -176108 -234672 -224983 -219044 -242260
32548 -242260 -277295 -338846 -425776 -452460 -351632 -193621 -87703 -29221 36374 71323 1833
32537 1833 -138497 -239424 -241725 -158071 -46725 -17891 -131652 -232872 -86544 226327 302646
$$ packed form
32613D48865m3773n7876j09759j87138j24814P0566J33441n4494k26838j14196
32603b66016J53968K60766J42785j0491o9981o5623n2256m6947n3206n1710k8029
32592h6740l9717j36712k06302q0598J68668K57871Q1460j40661j90170j11329
32582d84230m7416k4673j1230l819M5004K01510L66329L17984M0161j95944j84759
32571A8917l0469O5374O5377L3090o551k7083J7310P7359L8934o5856o6034O3232
32559A83600J32767L9187q2887j06049r3086j21395j28245n8564R689N939k3216
32548b42260l5035o1551q6930k6684J00828J58011J05918N8482O5595L4949o9490
32537A833j40330j00927k301Q3654J11346K8834j13761j01220J46328L12871P6319
$$ plain form
32526 302646 -16777 -338484 -235203 151806 346046 199997 -21978 -116379 -142372 -188874
32516 -188874 -251646 -339207 -450400 -471328 -321508 -148965 -150903 -270479 -303164 -209959 -75759
32505 -75759 123260 414690 606880 509069 293277 288344 480603 584655 547302 566467 626687
32494 626687 466666 74919 -209139 -208659 -141262 -201958 -277122 -238073 -184736 -205210 -180773
32483 -180773 -23991 135984 179827 177488 181409 77765 -173959 -364663 -298388 -76947 48478
32472 48478 -11733 -153305 -243833 -221215 -128281 -106668 -250628 -458678 -565101 -584089 -629235
32461 -629235 -638123 -446199 -127857 43934 24401 70702 301788 489942 419198 178061
32451 178061 -42279 -189037 -250122 -160536 40326 166788 137267 80382 98537 131835 132416
$$ packed form
32526C02646l19423l21707J03281L87009J94240j46049k21975r4401k5993m6502
32516a88874o2772q7561j11193k0928J49820J72543j938j19576l2685R3205J34200
32505g5759J99019K91430J92190r7811k15792m933J92259J04052l7353J9165O0220
32494F26687j60021l91747k84058M80O7397o0696p5164L9049N3337k0474K4437
32483a80773J56782J59975M3843k339L921j03644k51724j90704O6275K21441J25425
32472D8478o0211j41572r0528K2618R2934K1613j43960k08050j06423j8988m5146
32461f29235q888J91924L18342J71791j9533M6301K31086J88154p0744k41137
32451A78061k20340j46758o1085Q9586K00862J26462k9521n6885J8155L3298N81
$$ plain form
32440 132416 142586 127777 -14785 -212525 -265683 -209832 -301935 -540575 -567787 -223910 154564
32429 154564 214712 43204 -93384 -149021 -170335 -64958 191132 350835 204272 -99765
32419 -99765 -297954 -370628 -405027 -334505 -105519 104202 134184 116243 205805 241679 9679
32408 9679 -325298 -410260 -215045 -24258 -17049 -161594 -419419 -730856 -886835 -744897
32398 -744897 -509182 -479684 -589679 -528100 -274456 -143953 -279120 -445461 -411496 -231034
32388 -231034 -43240 143337 331232 410941 318493 184139 179378 283393 315324 182869
32378 182869 17776 18303 174786 246862 90380 -99960 -54946 140208 157423 -43736 -142677
32367 -142677 685 108339 -23397 -160729 -43825 157665 144108 -16664 -60467 13574
$$ packed form
32440A32416J0170j4809j42562j97740n3158N5851r2103k38640k7212L43877L78474
32429A54564O0148j71508j36588n5637k1314J05377K56090J59703j46563l04037
32419i9765j98189p2674l4399P0522K28986K09721K9982j7941Q9562L5874k32000
32408I679l34977q4962J95215J90787P209j44545k57825l11437j55979J41938
32398g44897K35715K9498j09995O1579K53644J30503j35167j66341L3965J80462
32388b31034J87794J86577J87895P9709r2448j34354m761J04015L1931j32455
32378A82869j65093N27J56483P2076j56482j90340M5014J95154J7215k01159r8941
32367a42677J43362J07654j31736j37332J16904K01490j3557j60772m3803P4041
$$ plain form
32357 13574 34550 35191 141191 227012 90564 -130554 -127972 63159 132175 33659 33238 200193
32345 200193 272006 100324 -136367 -266849 -353481 -473319 -544363 -478607 -299836 -57826
32335 -57826 176048 233864 11974 -300018 -403720 -293545 -214977 -257397 -289064 -270326 -292280
32324 -292280 -300508 -139152 94393 106392 -114300 -238958 -112187 40024 27230 -47731
32314 -47731 -88568 -192130 -351111 -327109 -49520 178239 120407 -33739 -20925 55711 -58309
32303 -58309 -321566 -476486 -437322 -321846 -200695 -59974 64609 118957 124798 93314 -42732
32292 -42732 -263146 -373100 -265290 -135331 -231540 -492885 -634066 -508751 -205623 138824
32282 138824 438804 624331 672463 644335 584440 450876 240926 77465 47186 61223
$$ packed form
32357A3574K0976O41J06000Q5821j36448k21118K582J91131O9016r8516m21J66955
32345B00193P1813j71682k36691j30482q6632j19838p1044O5756J78771K42010
32335e7826K33874N7816k21890l11992j03702J10175P8568m2420l1667J8738k1954
32324b92280q228J61356K33545J1999k20692j24658J26771J52211j2794p4961
32314d7731m0837j03562j58981K4002K77589K27759n7832j54146J2814P6636j14020
32303e8309k63257j54920L9164J15476J21151J40721J24583N4348N841l1484j36046
32292d2732k20414j09954J07810J29959r6209k61345j41181J25315L03128L44447
32282A38824K99980J85527M8132k8128n9895j33564k09950j63461l0279J4037
$$ plain form
32272 61223 8088 -67051 -75382 -56256 -75725 -65994 57113 211660 262760 231379 212032 172755
32260 172755 34028 -133094 -202867 -227428 -345613 -501533 -502101 -348483 -250154 -271096 -227691
32249 -227691 -36777 86965 -46919 -279658 -320092 -169107 -89456 -192173 -291177 -211221
32239 -211221 -29157 103833 211582 386793 536745 461741 187196 -490 74026 250228
32229 250228 292280 202480 106971 -21630 -284566 -565205 -579577 -252108 160446 374046
32219 374046 349457 227747 160168 247120 483418 704673 732394 616595 576551 661189 664490
32208 664490 457216 193914 58099 -7378 -138291 -272140 -247902 -92423 9612 4063
32198 4063 33909 196924 386832 431719 302366 128042 43360 56554 66997 -4184 -133779
$$ packed form
32272F1223n3135p5139q331J9126j9469R731J23107J54547N1100l1381j9347l9277
32260A72755j38727j67122o9773k4561j18185j55920n68J53618R8329k0942M3405
32249b27691J90914J23742j33884k32739m0434J50985P9651j02717r9004P9956
32239b11221J82064J32990J07749J75211J49952p5004k74545j87686P4516J76202
32229B50228M2052q9800r5509j28601k62936k80639j4372L27469M12554K13600
32219C74046k4589j21710o7579Q6952K36298K21255K7721j15799m0044Q4638L301
32208F64490k07274k63302j35815o5477j30913j33849K4238J55479J02035n549
32198D063K9846J63015J89908M4887j29353j74324q4682J3194J0443p1181j29595
$$ plain form
32187 -133779 -263109 -386815 -508300 -561005 -481706 -331161 -222464 -155671 -59167 34644
32177 34644 26959 -46983 -56231 -22948 -97821 -234820 -156944 218749 560701 522916 191421
32166 191421 -70523 -86926 25553 110436 116366 42032 -81891 -178458 -219669 -287439 -423118
32155 -423118 -493140 -350846 -72558 123152 157261 144335 182077 227421 198701 98242 2495
32144 2495 -25073 -10683 -67978 -264526 -479357 -495040 -275996 -39259 21919 -38954 -71935
32133 -71935 -75809 -147554 -271343 -318064 -232119 -100695 -40240 -82445 -156181 -148885 -28764
32122 -28764 86711 67492 -28723 -30855 59478 49118 -114526 -209332 -70944 135427 157516
32111 157516 19731 -51203 46241 222298 368961 422769 327576 100830 -112838 -179895
$$ packed form
32187a33779j29330j23706j21485n2705P9299J50545J08697O6793R6504R3811
32177C4644p685p3942r248L3283p4873j36999P7876L75693L41952l7785l31495
32166A91421k61944j6403J12479Q4883N930p4334j23923r6567m1211o7770j35679
32155d23118p0022J42294K78288J95710L4109j2926L7742M5344k8720j00459r5747
32144B495k7568J4390n7295j96548k14831j5683K19044K36737O1178o0873l2981
32133g1935l874p1745j23789m6721Q5945J31424O0455m2205p3736P296J20121
32122b8764J15475j9219r6215k132R0333j0360j63644r4806J38388K06371K2089
32111A57516j37785p0934R7444J76057J46663N3808r5193k26746k13668o7057
$$ plain form
32101 -179895 -107607 46745 265012 454643 417878 111466 -210375 -309487 -284907 -369664
32091 -369664 -541555 -587170 -459712 -316612 -255496 -242436 -250084 -251804 -146782 83490 221760
32080 221760 68166 -222513 -328192 -226348 -173756 -250550 -257452 -99531 55093 88553
32070 88553 109447 190986 195314 21180 -179274 -204564 -79153 30301 67443 113083 216787
32059 216787 309626 279416 102314 -96988 -157702 -91103 -85931 -228658 -349059 -284180 -152470
32048 -152470 -160029 -263948 -284730 -243110 -276571 -296385 -86536 267243 422593 303510 210383
32037 210383 318169 434422 394985 332119 348209 266697 -28738 -295505 -271227 -89148
32027 -89148 -54555 -184792 -274971 -279828 -310999 -335590 -193806 86039 251692 146975 -115091
$$ packed form
32101a79895P2288J54352K18267J89631l6765l06412l21841r9112K4580q4757
32091c69664j71891m5615J27458J43100O1116J3060p648j720J05022K30272J38270
32080B21760j53594k90679j05679J01844N2592p6794o902J57921J54624L3460
32070H8553K0894Q1539M328j74134k00454k5290J25411J09454L7142M5640J03704
32059B16787R2839l0210j77102j99302o0714O6599N172j42727j20401O4879J31710
32048a52470p559j03919k0782M1620l3461j9814K09849L53779J55350j19083r3127
32037B10383J07786J16253l9437o2866J6090q1512k95435k66767K4278J82079
32027h9148L4593j30237r0179m857l1171k4591J41784K79845J65653j04717k62066
$$ plain form
32016 -115091 -324942 -376849 -284948 -124665 22338 132671 222831 226275 6474 -394664
32006 -394664 -647572 -461668 36877 431995 489719 334682 183200 99228 51513 36866
31996 36866 50789 34736 -58502 -191102 -284189 -304450 -273731 -219394 -148248 -63495 16484
31985 16484 73022 117592 177676 236683 230937 145584 60512 33261 -5827 -139380 -295383
31974 -295383 -331852 -261330 -231534 -286757 -323410 -297928 -282592 -271556 -151945 40030 64039
31963 64039 -165536 -369300 -265195 11267 98458 -69882 -203598 -107213 61742 60660
31953 60660 -101705 -222657 -199404 -137587 -181590 -326497 -443327 -461554 -451944 -486087 -482960
31942 -482960 -306999 -2412 202741 161868 -30385 -185574 -220969 -162041 -58175 30241
$$ packed form
32016a15091k09851n1907R1901J60283J47003J10333R0160L444k19801m01138
32006c94664k52908J85904M98545L95118N7724j55037j51482q3972m7715j4647
31996C6866J3923j6053r3238j32600r3087k0261L0719N4337P1146Q4753P9979
31985A6484N6538M4570O0084N9007n746q5353q5072k7251l9088j33553j56003
31974b95383l6469P0522K9796n5223l6653K5482J5336J1036J19611J91975K4009
31963F4039k29575k03764J04105K76462Q7191j68340j33716R6385J68955j082
31953F0660j62365j20952K3253O1817m4003j44907j16830j8227R610l4143L127
31942d82960J75961L04587K05153m0873j92253j55189l5395N8928J03866Q8416
$$ plain form
31932 30241 48248 16578 14010 54818 80562 100210 201869 367890 424853 268548 12596
31921 12596 -176304 -263157 -274835 -192664 -39103 55955 9892 -94894 -157305 -197354 -238335
31910 -238335 -204086 -83360 -43008 -196785 -403434 -493652 -550855 -720668 -869836 -741530
31900 -741530 -395747 -177924 -230118 -324303 -249186 -101324 -76773 -179101 -269655 -269673 -202312
31889 -202312 -137024 -165879 -331582 -519501 -530821 -327284 -102364 -44897 -123685 -172699 -113384
31878 -113384 -27917 -61338 -285844 -613912 -836876 -812698 -614985 -425601 -304068 -174528
31868 -174528 -25875 33006 -36098 -98605 -26175 121410 191789 153456 116580 164696 242346
31857 242346 222879 61527 -132732 -199776 -119094 -51974 -137093 -290890 -306426 -129294 75794
$$ packed form
31932C0241J8007l1670k568M0808K5744J9648J01659J66021N6963j56305k55952
31921A2596j88900q6853j1678Q2171J53561R5058m6063j04786o2411m0049m0981
31910b38335L4249J20726M0352j53777k06649r0218n7203j69813j49168J28306
31900g41530L45783K17823n2194r4185P5117J47862K4551j02328r0554j8O7361
31889b02312O5288k8855j65703j87919j1320K03537K24920N7467p8788m9014N9315
31878a13384Q5467l3421k24506l28068k22964K4178J97713J89384J21533J29540
31868a74528J48653N8881o9104o2507P2430J47585P0379l8333l6876M8116P7650
31857B42346j9467j61352j94259o7044Q0682O7120q5119j53797j5536J77132K05088
$$ plain form
31846 75794 140491 68337 -26903 -55368 13541 154529 273509 269833 165483 105520 175669
31835 175669 279346 256674 82893 -106817 -157735 -15276 257186 516829 612243 487274
31825 487274 250139 109895 192800 403360 501976 358009 95385 -73808 -125829 -220281
31815 -220281 -416063 -551255 -487302 -326607 -249254 -246844 -189854 -76374 -14093 -2465 45692
31804 45692 76870 -58317 -281858 -271150 93710 481313 510463 253567 108374 249112
31794 249112 455507 488051 390802 328788 309638 224170 70758 -28222 -22954 -7784 -52334
31783 -52334 -70128 50570 239095 285228 108854 -108637 -126319 76449 294999 344308
31773 344308 223738 37661 -149437 -319900 -428990 -418570 -303287 -166110 -45594 99148
$$ packed form
31846G5794O4697p2154r5240k8465O8909J40988J18980l676j04350n9963P0149
31835A75669J03677k2672j73781j89710n0918J42459K72462K59643R5414j24969
31825D87274k37135j40244Q2905K10560R8616j43967k62624j69193n2021r4452
31815b20281j95782j35192O3953J60695P7353K410N6990J13480O2281J1628M8157
31804D5692L1178j35187k23541J0708L64860L87603K9150k56896j45193J40738
31794B49112K06395L2544r7249o2014j9150q5468j53412r8980N268J5170m4550
31783e2334j7794J20698J88525M6133j76374k17491j7682K02768K18550M9309
31773C44308j20570j86077j87098j70463j09090J0420J15283J37177J20516J44742
$$ plain form
31763 99148 264818 329775 213561 62550 114295 351856 466289 261467 -56169 -148540
31753 -148540 6404 134264 67978 -85568 -173528 -177680 -133099 -58211 -16435 -70798 -127263
31742 -127263 -9167 249824 384735 257265 36797 -77320 -101989 -106589 -28630 154840
31732 154840 268059 179709 52845 111373 282350 325017 219651 158834 205608 227457 161556
31721 161556 105019 124493 181107 260490 391254 522829 560481 528491 530075 548890 469101
31710 469101 296963 179608 179868 197088 138415 24020 -93222 -179752 -195521 -144312 -123039
31699 -123039 -185929 -214995 -88450 95124 165157 177723 311348 511281 535492 363594
31689 363594 250207 307687 335013 172614 -44217 -129606 -112632 -105256 -100964 -54463 5193
$$ packed form
31763I9148J65670O4957j16214j51011N1745K37561J14433k04822l17636r2371
31753a48540J54944J27860o6286j53546q7960m152M4581P4888M1776n4363n6465
31742a27263J18096K58991J34911j27470k20468j14117k4669m600P7959J83470
31732A54840J13219q8350j26864N8528J70977M2667j05366o0817M6774K1849o5901
31721A61556n6537J9474N6614P9383J30764J31575L7652l1990J584J8815p9789
31710D69101j72138j17355K60J7220n8673j14395j17242q6530j5769N1209K1273
31699a23039o2890k9066J26545J83574P0033J2566J33625J99933K4211j71898
31689C63594j13387N7480K7326j62399k16831q5389J6974P376M292M6501N9656
$$ plain form
31678 5193 69368 192808 327454 296744 71936 -104129 -27547 188991 316180 346328 443542
31667 443542 648581 817065 818691 669585 485997 382763 385270 401809 334561 224060 193183
31656 193183 252311 288191 248418 183833 100271 -48252 -190178 -162474 33963 197540 210312
31645 210312 167622 158886 124398 12657 -116037 -215717 -282202 -209363 121601 535367 645173
31634 645173 372685 90698 92625 225875 240640 180640 182524 196460 193433 354302 721615
31623 721615 943429 751348 454970 525352 864912 958569 648512 290171 167448 194647
31613 194647 220904 223146 139981 -118289 -422419 -515762 -408730 -355874 -394724 -273743 63568
31602 63568 296204 200718 -7980 -17818 150795 260334 193932 -10807 -283431 -496586
$$ packed form
31678E193O4175J23440J34646l0710k24808j76065P6582K16538J27189L0148R7214
31667D43542K05039J68484J626j49106j83588j03234K507J6539o7248j10501l0877
31656A93183N9128L5880l9773o4585q3562j48523j41926K7704J96437J63577J2772
31645B10312m2690q736l4488j11741j28694r9680o6485P2839L30964M13766J09806
31634F45173k72488k81987J927J33250J4765o0000J884J3936l027J60869L67313
31623G21615K21814j92081k96378P0382L39560R3657l10057l58341j22723K7199
31613A94647K6257K242q3165k58270l04130r3343J07032N2856l8850J20981L37311
31602F3568K32636r5486k08698r838J68613J09539o6402k04739k72624k13155
$$ plain form
31592 -496586 -481532 -240511 -10404 26382 -49589 -105122 -191568 -384564 -542229 -460588 -194168
31581 -194168 -1208 3571 -51285 -40322 -4940 -23150 -60069 -37538 27098 45722 -4833
31570 -4833 -60746 -104517 -239280 -547045 -904664 -1054951 -890182 -568801 -312512 -201488
31560 -201488 -231121 -418209 -700626 -841782 -639824 -214672 77891 31098 -227086 -417501
31550 -417501 -365178 -99091 173808 205811 -61594 -410483 -578218 -535467 -440111 -396310
31540 -396310 -400861 -453082 -542937 -577414 -489309 -371324 -330686 -280488 -85121 154049 214836
31529 214836 123508 125446 276232 357149 259026 160176 209770 292281 248577 110896 -30017
31518 -30017 -193146 -384837 -482113 -404188 -263767 -198911 -177244 -103261 496 58854 85864
$$ packed form
31592d96586J5054K41021K30107L6786p5971n5533q6446j92996j57665Q1641K66420
31581a94168J92960M779n4856J0963L5382j8210l6919K2531O4636J8624n0555
31570d833n5913m3771j34763l07765l57619j50287J64769L21381K56289J11024
31560b01488k9633j87088k82417j41156K01958M25152K92563m6793k58184j90415
31550d17501N2323K66087K72899L2003k67405l48889j67735M2751R5356M3801
31540c96310m551n2221q9855l4477Q8105J17985M0638N0198J95367K39170O0787
31529B14836r1328J938J50786Q0917r8123r8850M9594Q2511m3704j37681j40913
31518c0017j63129j91691r7276P7925J40421O4856K1667P3983J03757N8358K7010
$$ plain form
31507 85864 129549 167359 177737 225985 353775 455094 385699 160992 -40342 -48487 151986
31496 151986 397691 461675 272511 12104 -103242 -103193 -173007 -321020 -358326 -226812 -104446
31485 -104446 -117602 -185437 -238221 -341384 -477853 -460238 -234296 -41951 -79847 -201407
31475 -201407 -183520 -96666 -138035 -239946 -149110 160539 428625 463479 341359 235402
31465 235402 217874 252211 251289 135699 -68895 -211854 -180051 -42132 45222 17276 -81151
31454 -81151 -173610 -171493 -17950 200290 296029 225759 161659 223695 298212 250741 149737
31443 149737 115780 112898 78629 101239 247566 356483 245464 7457 -138705 -180653 -241627
31432 -241627 -292942 -227066 -129404 -164753 -246821 -142002 122487 281072 260372 253218 334813
$$ packed form
31507H5864M3685L7810J0378M8248J27790J01319o9395k24707k01334q145K00473
31496A51986K45705O3984j89164k60407j15346M9o9814j48013l7306J31514J22366
31485a04446j3156o7835n2784j03163j36469J7615K25942J92345l7896j21560
31475b01407J7887Q6854m1369j01911R0836L09649K68086L4854j22120j05957
31465B35402j7528L4337r22j15590k04594j42959L1803J37919Q7354k7946r8427
31454h1151r2459K117J53543K18240R5739p0270o4100O2036P4517m7471j01004
31443A49737l3957k882l4269K2610J46327J08917j11019k38007j46162m1948o0974
31432b41627n1315O5876R7662l5349q2068J04819K64489J58585k0700p154Q1595
$$ plain form
31421 334813 352262 268108 265332 388550 412460 232245 76685 128378 209959 92117 -120428
31410 -120428 -184674 -121995 -135359 -237538 -245316 -98407 58748 102351 40700 -86009 -233572
31399 -233572 -284527 -133005 127481 248702 111686 -136555 -266226 -196991 -18884 132162
31389 132162 172465 100332 -23900 -140564 -239918 -333318 -397488 -392575 -325843 -247525 -182938
31378 -182938 -118898 -69213 -101647 -257536 -462117 -557893 -445594 -182362 68864 181347
31368 181347 156208 99232 127541 270449 420840 410887 200161 -29685 -55079 120032 285617
31357 285617 324677 338758 418217 464620 374607 245593 209520 177773 -18189 -297279 -395367
31346 -395367 -258586 -117706 -122406 -145480 -51705 61541 51358 -9039 54643 231939 333559
$$ packed form
31421C34813J7449q4154k776J23218K3910j80215j55560N1693Q1581j17842k12545
31410a20428o4246O2679j3364j02179p778J46909J57155M3603o1651j26709j47563
31399b33572n0955J51522K60486J21221j37016k48241j29671O9235J78107J51046
31389A32162M0303p2133j24232j16664r9354r3400o4170M913O6732P8318O4587
31378a82938O4040M9685l2434j55889k04581r5776J12299K63232K51226J12483
31368A81347k5139n6976K8309J42908J50391r953k10726k29846k5394J75111J65585
31357B85617L9060J4081P9459M6403r0013j29014l6073l1747j95962k79090r8088
31346c95367J36781J40880m700k3074R3775J13246j0183o0397O3682J77296J01620
$$ plain form
31335 333559 251080 72674 -57192 -91945 -82281 -84664 -98027 -88299 -73413 -137100 -296532
31324 -296532 -405453 -309819 -83478 41258 -5546 -50199 32413 133567 127499 92923 146081
31313 146081 192392 62456 -178968 -289574 -202069 -99096 -96939 -66579 120461 336093
31303 336093 357616 203628 120448 230956 372981 369691 315761 421927 633735 631621 277403
31292 277403 -141779 -273310 -151324 -69266 -100423 -38183 177867 284757 71731 -311436
31282 -311436 -596040 -746260 -862379 -897136 -731089 -451961 -298395 -331679 -380921 -328039
31272 -328039 -244225 -205735 -166051 -85657 -34035 -74531 -161837 -226878 -264832 -282256 -262312
31261 -262312 -240198 -298650 -415402 -431607 -269330 -76269 -36636 -123851 -174126 -137789 -100060
$$ packed form
31335C33559q2479j78406j29866l4753R664k383j3363R728J4886o3687j59432
31324b96532j08921R5634K26341J24736m6804m4653Q2612J01154o068l4576N3158
31313A46081M6311j29936k41424j10606Q7505J02973K157L0360J87040K15632
31303C36093K1523j53988q3180J10508J42025l290n3930J06166K11808k114l54218
31292B77403m19182j31531J21986Q2058l1157O2240K16050J06890k13026l83167
31282c11436k84604j50220j16119l4757J66047K79128J53566l3284m9242N2882
31272c28039Q3814L8490L9684Q0394N1622m0496q7306o5041l7954j7424J9944
31261b62312K2114n8452j16752j6205J62277J93061L9633q7215n0275L6337L7729
$$ plain form
31250 -100060 -82170 6598 189606 340557 346872 253452 173026 133907 96328 58476 50608
31239 50608 48925 -9646 -112363 -141907 -1118 270194 536840 700974 753942 712260 566640
31228 566640 329443 88886 -52350 -91581 -115597 -161624 -163971 -84474 -17309 -72109 -200044
31217 -200044 -248383 -171636 -69011 -7579 55169 129371 112646 -54547 -257390 -341133 -304327
31206 -304327 -249939 -208007 -129561 -18791 51333 47068 6100 -22237 4225 116873 264165
31195 264165 302915 174149 31007 63046 246514 405130 449468 389278 191582 -141170
31185 -141170 -400342 -354000 -105849 11164 -71330 -86204 74177 153971 -5911 -156193
31175 -156193 -50862 130399 97435 -50849 -13857 184634 247043 97678 -46415 -79071
$$ packed form
31250a00060J7890Q8768J83008J50951O315r3420q0426l9119l7579l7852p868
31239E0608j683n8571j02717k9544J40789K71312K66646J64134N2968m1682j45620
31228E66640k37197k40557j41236l9231k4016m6027k347P9497O7165n4800j27935
31217b00044m8339P6747J02625O1432O2748P4202j6725j67193k02843q3743L6806
31206c04327N4388M1932P8446J10770P0124m265m0968k8337K6462J12648J47292
31195B64165L8750j28766j43142L2039J83468J58616M4338o0190j97696l32752
31185a41170k59172M6342K48151J17013q2494j4874J60381P9794j59882j50282
31175a56193J05331J81261l2964j48284L6992J98491O2409j49365j44093l2656
$$ plain form
31165 -79071 -130691 -263662 -352538 -325168 -261011 -197206 -77834 57161 67299 -52068 -145760
31154 -145760 -150406 -150135 -151697 -51337 117347 152208 -13876 -201170 -254339 -202862 -79152
31143 -79152 169155 475112 612203 503989 351379 306756 251812 69495 -97303 -80350
31133 -80350 16347 1929 -66779 4954 201682 307435 215488 20162 -161001 -265048 -217082
31122 -217082 19072 315526 462057 399481 268627 223842 280258 332558 257039 25131
31112 25131 -228130 -301557 -150941 52758 143056 143515 163822 218342 247540 227056 154924
31101 154924 22751 -98480 -48612 216645 493829 537192 338037 93680 -31123 -10593
31091 -10593 87831 140762 39213 -169683 -296392 -266233 -249920 -408048 -624871 -663711 -494749
$$ packed form
31165g9071n1620j32971q8876K7370O4157O3805J19372J34995J0138j19367r3692
31154a45760m646K71j562J00360J68684L4861j66084j87294n3169N1477J23710
31143g9152K48307L05957J37091j08214j52610m4623n4944j82317j66798J6953
31133h0350R6697j4418o8708P1733J96728J05753r1947j95326j81163j04047M7966
31122b17082K36154K96454J46531o2576j30854m4785N6416N2300p5519k31908
31112B5131k53261p3427J50616K03699R0298M59K0307N4520K9198k0484p2132
31101A54924j32173j21231M9868K65257K77184M3363j99155k44357j24803K0530
31091a0593R8424N2931j01549k08896j26709L0159J6313j58128k16823l8840J68962
$$ plain form
31080 -494749 -290849 -167385 -104677 -78409 -91024 -95941 -34824 74114 196009 361579 563083
31069 563083 653905 511781 235949 26980 -56923 -67158 10451 191347 330035 257596
31059 257596 47752 -77296 -78864 -103270 -163616 -87917 159264 348217 290412 97040 13144
31048 13144 111707 250392 257263 96893 -102089 -170668 -87782 -4574 -30274 -93308 -115219
31037 -115219 -184985 -378584 -524805 -396172 -70210 154911 174192 145984 161609 124339
31027 124339 -7521 -119137 -141077 -124036 -70708 68396 194087 116902 -125406 -279124
31017 -279124 -270810 -298906 -437729 -476271 -307951 -161881 -231354 -358968 -341643 -288594 -385910
31006 -385910 -524427 -483753 -323217 -259687 -272294 -162033 62747 189372 173634 203782
$$ packed form
31080d94749K03900J23464O2708K6268j2615m917O1117J08938J21895J65570K01504
31069E63083R0822j42124k75832k08969q3903j0235P7609J80896J38688p2439
31059B57596k09844j25048j568k4406o0346P5699K47181J88953n7805j93372q3896
31048A3144R8563J38685O871j60370j98982o8579Q2886Q3208k5700o3034k1911
31037a15219o9766j93599j46221J28633L25962K25121J9281k8208J5625l7270
31027A24339j31860j11616k1940J7041N3328J39104J25691p7185k42308j53718
31017b79124Q314k8096j38823l8542J68320J46070o9473j27614J7325N3049r7316
31006c85910j38517M0674J60536O3530j2607J10261K24780J26625j5738L0148
$$ plain form
30996 203782 363168 497821 476143 351183 200017 4691 -230392 -412116 -485430 -489935
30986 -489935 -437622 -274217 -21372 172452 191115 60292 -140968 -359172 -511954 -495154
30976 -495154 -337001 -235704 -330004 -505114 -543970 -425005 -338081 -401294 -488800 -405976 -153572
30965 -153572 84165 185226 203807 212288 158606 -12423 -182381 -158704 71650 338363
30955 338363 533815 688729 771864 627708 240637 -109524 -139876 83057 257026 241349
30945 241349 158002 132091 127132 65800 -45091 -168218 -299126 -415551 -446292 -347891 -163361
30934 -163361 26069 166027 238165 259278 281300 338848 389000 356992 247610 153963 146292
30923 146292 208659 294439 377555 423468 375558 221889 37827 -88823 -155952 -224304 -306430
$$ packed form
30996B03782J59386J34653k1678j24960j51166j95326k35083j81724p3314m505
30986d89935N2313J63405K52845J93824J8663j30823k01260k18204j52782J6800
30976d95154J58153J01297r4300j75110l8856J18965Q6924o3213q7506Q2824K52404
30965a53572K37737J01061J8581Q481n3682j71029j69958K3677K30354K66713
30955C38363J95452J54914Q3135j44156l87071l50161l0352K22933J73969j5677
30945B41349q3347k5911m959o1332j10891j23127j30908j16425l0741R8401J84530
30934a63361J89430J39958P2138K1113K2022N7548N0152l2008j09382r3647p671
30923A46292O2367Q5780Q3116M5913m7910j53669j84062j26650o7129o8352q2126
$$ plain form
30912 -306430 -332259 -243845 -82115 59469 140322 177622 161931 52492 -117694 -220958
30902 -220958 -186125 -100818 -78358 -87857 -30256 67440 82990 16589 24615 199913 439897
30891 439897 568227 481069 167175 -267834 -571591 -522415 -214430 6151 -14208 -42154
30881 -42154 150847 399190 376733 90029 -138381 -139307 -76207 -118415 -181431 -105635 81557
30870 81557 224573 259834 246124 230274 203492 178974 208265 289637 331277 265302 166445
30859 166445 180297 324029 444574 429610 372077 413362 491255 418829 206217 93627 187402
30848 187402 262783 85094 -220048 -323962 -153207 23329 -23732 -195591 -228629 -31773
30838 -31773 229239 339514 254906 108731 35626 29413 -8056 -120569 -259074 -362335 -396081
$$ packed form
30912c06430k5829Q8414J61730J41584Q0853L7300j5691j09439j70186j03264
30902b20958L4833Q5307K2460r499N7601R7696J5550o6401Q026J75298K39984
30891D39897J28330q7158l13894m35009l03757M9176L07985K20581k0359k7946
30881d2154J93001K48343k2457k86704k28410r26O3100m2208o3016P5796J87192
30870H1557J43016L5261j3710j5850k6782k4518K9291Q1372M1640o5975r8857
30859A66445J3852J43732J20545j4964n7533M1285P7893p2426k12612j12590R3775
30848A87402P5381j77689l05142j03914J70755J76536m7061j71859l3038J96856
30838c1773K61012J10275q4608j46175p3105o213l7469j12513j38505j03261l3746
$$ plain form
30827 -396081 -327260 -156842 22287 101241 88537 64537 30171 -50481 -86459 52237 277784
30816 277784 363858 322365 405525 632916 660608 330179 11103 75875 311449 256837 -63116
$$ packed form
30827c96081O8821J70418J79129P8954j2704k4000l4366q0652l5978J38696K25547
30816B77784Q6074m1493Q3160K27391K7692l30429l19076O4772K35574n4612l19953
$$ [...]
##END NTUPLES=NMR SPECTRUM
##END=
