##TITLE=31Pdec_LY-TMF-13.70.3
 D2O, 24 sc
 4.3.2020
##JCAMPDX= 6.0         $$ Bruker NMR JCAMP-DX V2.0
##DATA TYPE= NMR SPECTRUM
##DATA CLASS= NTUPLES
##ORIGIN= UXNMR, Bruker Analytische Messtechnik GmbH
##OWNER= root
$$ XWIN-NMR		Version 3.5
$$ Wed Mar  4 14:45:52 2020 Russian Standard Time (UT+4h)  she@DPX200
##.OBSERVE FREQUENCY= 81.013821
##.OBSERVE NUCLEUS= ^31P
##.ACQUISITION MODE= SIMULTANEOUS
##.ACQUISITION SCHEME= undefined
##.AVERAGES= 24
##.DIGITISER RES= 17
##SPECTROMETER/DATA SYSTEM= spect
##.PULSE SEQUENCE= zgpg30
##.SOLVENT NAME= CDCl3
##.SHIFT REFERENCE= (INTERNAL, CDCl3, 0, 182.463)
##AUDIT TRAIL= $$ (NUMBER, WHEN, WHO, WHERE, WHAT)
$$ ##TITLE= Audit trail, XWIN-NMR		Version 3.5
$$ ##JCAMPDX= 5.01
$$ ##ORIGIN= Bruker BioSpin GmbH
$$ ##OWNER= she
$$ F:/spectra/data/she/nmr/P31/1/pdata/1/auditp.txt
$$ ##AUDIT TRAIL=  $$ (NUMBER, WHEN, WHO, WHERE, WHAT)
(   1,<2020-03-04 14:45:00.45 +0400>,<she>,<DPX200>,
      <created by zg, POWCHK disabled, PULCHK disabled
       configuration hash MD5:
       00 E9 B6 7A A2 85 ED C7 34 08 36 98 17 FE 4E 26
       data hash MD5: 32K
       B0 20 96 36 A5 B0 22 51 DA BE 12 97 28 97 2C 97>)
(   2,<2020-03-04 14:45:02.76 +0400>,<she>,<DPX200>,
      <Start of raw data processing
       efp BC_mod = 2 LB = 1 FT_mod = 6 PKNL = 1 PHC0 = -1325.082 PHC1 = 73.8017 SI = 64K 
       data hash MD5: 64K
       8F 85 3F F9 87 88 D9 AA 90 E5 54 33 26 07 2D 7F>)
(   3,<2020-03-04 14:45:21.82 +0400>,<she>,<DPX200>,
      <pk PHC0 = 3.674745 PHC1 = 0 
       data hash MD5: 64K
       52 E0 C9 6C 72 81 2A 62 A2 FE 3A 43 B4 C6 63 21>)
(   4,<2020-03-04 14:45:24.87 +0400>,<she>,<DPX200>,
      <abs ABSG = 5 
       data hash MD5: 64K
       84 34 99 FE 24 5B F9 84 2F 34 BB 8E 6D E9 5C B3>)
$$ ##END=
$$ 
$$ hash MD5
$$ 71 36 3D F9 23 57 87 CA 01 D9 0F BB D7 98 D9 0B
##$RELAX= 
##$RELAX= 
##$RELAX= 
##$RELAX= 
##$RELAX= 
##$RELAX= 
##$RELAX= 
##$RELAX= 
$$ Bruker specific parameters
$$ --------------------------
##$DU= <F:/spectra>
##$EXPNO= 1
##$NAME= <P31>
##$PROCNO= 1
##$TYPE= <nmr>
##$USER= <she>
##$AMP= (0..31)
100 100 100 100 100 100 100 100 100 100 100 100 100 100 100 100 100 100 
100 100 100 100 100 100 100 100 100 100 100 100 100 100 
##$AQSEQ= 0
##$AQ_mod= 1
##$AUNM= <au_zg>
##$AUTOPOS= <>
##$BF1= 81.014009
##$BF2= 200.13
##$BF3= 200.13
##$BF4= 200.13
##$BF5= 200.13
##$BF6= 200.13
##$BF7= 200.13
##$BF8= 200.13
##$BYTORDA= 1
##$CFDGTYP= 0
##$CFRGTYP= 5
##$CHEMSTR= <none>
##$CNST= (0..31)
1 1 145 1 1 1 1 1 1 1 1 1 1 1 1 1 1 1 1 1 1 1 1 1 1 1 1 1 1 1 1 1 
##$CPDPRG= <waltz16>
##$CPDPRG1= <>
##$CPDPRG2= <waltz16>
##$CPDPRG3= <>
##$CPDPRG4= <mlev>
##$CPDPRG5= <mlev>
##$CPDPRG6= <mlev>
##$CPDPRG7= <mlev>
##$CPDPRG8= <mlev>
##$CPDPRGB= <>
##$CPDPRGT= <>
##$D= (0..31)
0 1 0 0 0 0 0 0 0 0 0 0.03 2e-05 3e-06 0 0 0 0 0 0 0 0 0 0 0 0 0 0 0 0 
0 0 
##$DATE= 1583318700
##$DBL= (0..7)
120 120 120 11 120 120 24 19 
##$DBP= (0..7)
150 150 150 150 150 150 150 150 
##$DBP07= 0
##$DBPNAM0= <>
##$DBPNAM1= <>
##$DBPNAM2= <>
$$ [...]
##$SUBNAM3= <"">
##$SUBNAM4= <"">
##$SUBNAM5= <"">
##$SUBNAM6= <"">
##$SUBNAM7= <"">
##$SUBNAM8= <"">
##$SUBNAM9= <"">
##$SW= 369.568048894756
##$SWIBOX= (0..15)
0 1 3 0 0 0 0 0 0 0 0 0 0 0 0 0 
##$SW_h= 29940.119760479
##$TD= 32768
##$TD0= 1
##$TE= 0
##$TE2= 300
##$TE3= 300
##$TEG= 300
##$TL= (0..7)
0 120 53 12 22 120 120 120 
##$TP= (0..7)
150 150 150 150 150 150 150 150 
##$TP07= 0
##$TPNAME0= <>
##$TPNAME1= <>
##$TPNAME2= <>
##$TPNAME3= <>
##$TPNAME4= <>
##$TPNAME5= <>
##$TPNAME6= <>
##$TPNAME7= <>
##$TPOAL= (0..7)
0.5 0.5 0.5 0.5 0.5 0.5 0.5 0.5 
##$TPOFFS= (0..7)
0 0 0 0 0 0 0 0 
##$TUNHIN= 0
##$TUNHOUT= 0
##$TUNXOUT= 0
##$USERA1= <user>
##$USERA2= <user>
##$USERA3= <user>
##$USERA4= <user>
##$USERA5= <user>
##$V9= 5
##$VALIST= <valist>
##$VCLIST= <CCCCCCCCCCCCCCC>
##$VD= 0
##$VDLIST= <DDDDDDDDDDDDDDD>
##$VPLIST= <PPPPPPPPPPPPPPP>
##$VTLIST= <TTTTTTTTTTTTTTT>
##$WBST= 1024
##$WBSW= 4
##$XGAIN= (0..3)
0 0 0 0 
##$XL= 0
##$YL= 0
##$YMAX_a= 6861
##$YMIN_a= -11177
##$ZGOPTNS= <>
##$ZL1= 120
##$ZL2= 120
##$ZL3= 120
##$ZL4= 120
##$ABSF1= 182.463
##$ABSF2= -187.1042
##$ABSG= 5
##$ABSL= 3
##$ALPHA= 0
##$AQORDER= 0
##$ASSFAC= 0
##$ASSFACI= 0
##$ASSFACX= 0
##$ASSWID= 0
##$AUNMP= <proc_1d>
##$AZFE= 0.1
##$AZFW= 0.5
##$BCFW= 0
##$BC_mod= 2
##$BYTORDP= 0
##$COROFFS= 0
##$CY= -3
##$DATMOD= 1
##$DC= 0
##$DFILT= <>
##$DTYPP= 0
##$F1P= 0
##$F2P= 0
##$FCOR= 1
##$FTSIZE= 65536
##$FT_mod= 6
##$GAMMA= 0
##$GB= 0
##$INTBC= 1
##$INTSCL= 5.30512e-09
##$ISEN= 30
##$LB= 1
##$LEV0= 0
##$LPBIN= 0
##$MAXI= 10000
##$MC2= 0
##$MEAN= 0
##$ME_mod= 0
##$MI= 50
##$NCOEF= 0
##$NC_proc= -5
##$NLEV= 6
##$NOISF1= 182.463
##$NOISF2= 159.3651
##$NSP= 0
##$NTH_PI= 0
##$NZP= 0
##$OFFSET= 182.463
##$PC= 4
##$PHC0= -1321.407
##$PHC1= 73.8017
##$PH_mod= 1
##$PKNL= yes
##$PPARMOD= 0
##$PSCAL= 0
##$PSIGN= 0
##$REVERSE= no
##$SF= 81.0140089999434
##$SI= 65536
##$SIGF1= 159.3651
##$SIGF2= -187.1042
##$SINO= 113.3802
##$SIOLD= 16384
##$SREGLST= <1H.CDCl3>
##$SSB= 0
##$STSI= 65536
##$STSR= 0
##$SW_p= 29940.119760479
##$SYMM= 0
##$S_DEV= 0
##$TDeff= 32768
##$TDoff= 0
##$TI= <>
##$TILT= no
##$TM1= 0
##$TM2= 0
##$TOPLEV= 0
##$USERP1= <user>
##$USERP2= <user>
##$USERP3= <user>
##$USERP4= <user>
##$USERP5= <user>
##$WDW= 1
##$XDIM= 65536
##$YMAX_p= 326791334
##$YMIN_p= -10158582
$$ End of Bruker specific parameters
$$ ---------------------------------
##NTUPLES= NMR SPECTRUM
##VAR_NAME=  FREQUENCY,     SPECTRUM/REAL,   SPECTRUM/IMAG
##SYMBOL=    X,             R,               I
##VAR_TYPE=  INDEPENDENT,   DEPENDENT,       DEPENDENT
##VAR_FORM=  AFFN,          ASDF,            ASDF
##VAR_DIM=   65536,         65536,           65536
##UNITS=     HZ,            ARBITRARY UNITS, ARBITRARY UNITS
##FACTOR=    0.456856943014862, 1,           1
##FIRST=     14782.0589164792, 0,            0
##LAST=      -15158.0608439998, 0,           0
##MIN=       -15158.0608439998, -10158582,   0
##MAX=       14782.0589164792, 326791334,    0
$$ Real data points
##PAGE= N=1
##DATA TABLE= (X++(R..R)), XYDATA
$$ [...]
##PAGE= N=2
##DATA TABLE= (X++(I..I)), XYDATA
36754H11284M5190o40465n56697M78627J343669J004123n5924n74749l06635j07635
$$ 811284 856474 216009 -340688 137939 1481608 2485731 2429807 1855058 1548423 1440788
36744A440788l91384n67576j74777L75816N40461L89680K27808M5994k63323n69810
$$ 1440788 1049404 481828 307051 682867 1223328 1613008 1840816 1886810 1623487 1053677
36734A053677o80877n51036k05806K09976L50264J02171k864N43417J213888R30584
$$ 1053677 372800 -178236 -384042 -174066 176198 278369 275505 818922 2032810 2963394
36724B963394l15023j200660p72147L57472R42804N99003j12652n67088n57485
$$ 2963394 2648371 1447711 675564 1033036 1975840 2574843 2462191 1895103 1337618
36715A337618k49815k4209j19268l01889k12482J1737o484q7880K83828R17614
$$ 1337618 1087803 1063594 944326 642437 429955 441692 435208 347328 631156 1548770
36705A548770R68703K08351o37588j017957j079342q51368m8392R08736R01216
$$ 1548770 2517473 2725824 2088236 1070279 -9063 -860431 -908823 -87 901129
36696I01129j95572r96278n91728R8944m8806n17233j90594O75814R80478O34244
$$ 901129 705557 -290721 -882449 -783505 -832311 -1349544 -1540138 -864324 116154 750398
36686G50398M26383M55821J58504l26574k61186K31193J54509p10315j298455
$$ 750398 1176781 1632602 1791106 1464532 1203346 1434539 1589048 878733 -419722
36677d19722p41608N06967J317412J033557j04670j127554j028648J01799Q79564
$$ -419722 -1161330 -654363 663049 1696606 1591936 464382 -564266 -462467 417097
36668D17097K70320r22313j111191j15319Q07845Q79404M91816M5589n50026j012447
$$ 417097 687417 -234896 -1346087 -1461406 -653561 225843 717659 763248 213222 -799225
36658g99225o42432L99866R04631K56436o65745p74682j29559N23396P94558O81854
$$ -799225 -1441657 -1041791 -137160 119276 -546469 -1321151 -1450710 -927314 -132756 549098
36648E49098K28103l00300m24882q9006K03831J87498J88544L89112L94788p1319
$$ 549098 777201 476901 52019 -36987 166844 354342 542886 931998 1326786 1255467
36638A255467o47125q93089q04798m34232L33286J200162J347221M97743m46529
$$ 1255467 608342 -284747 -1089545 -1523777 -1190491 9671 1356892 1854635 1408106
36629A408106m60818K94853P96534M91495k20053o57304n67713k24635p4906k59438
$$ 1408106 947288 1242141 2038675 2530170 2310117 1652813 1085100 860465 785559 526121
36619E26121m58840l52732r2877n198l3068L8050M9756j71276j85217M38777J056143
$$ 526121 67281 -285451 -378328 -383526 -416594 -378544 -328788 -500064 -685281 -246504 809639
36608H09639O27363n27714r36395j88118M10045p8345q09512o48382J23065N88898
$$ 809639 1437002 909288 -27107 -215225 194820 116475 -693037 -1341419 -1218354 -629456
36598f29456O92728Q46154Q55950L83277j52255k04018p8856k67941l97233L5731
$$ -629456 63272 909426 1765376 2148653 1996398 1792380 1713524 1445583 1048350 1084081
36588A084081M40374p2303j047192j167576k28567O34019O81184L54281K09893
$$ 1084081 1524455 1452152 404960 -762616 -991183 -357164 324020 678301 888194
36579H88194J63206K9474r0404j97476m05661m47750N9796P82325R13210L62008
$$ 888194 1051400 1080874 990470 792994 387333 -60417 -621 781704 1694914 2056922
36569B056922j29515j89442k62931o37525r02798p50133n28807n52219n07094
$$ 2056922 1927407 1737965 1475034 837509 -65289 -815422 -1344229 -1896448 -2403542
36560b403542m6506N42947P40709M83549Q1380k31345l49119j97861J30794L54695
$$ -2403542 -2450048 -1907101 -1166392 -682843 -601463 -832808 -1181927 -1379788 -1248994 -894299
36550h94299K93249M2834j42694K9353O95572J408605J214204k08471j707560
$$ -894299 -601050 -558216 -700910 -671557 24015 1432620 2646824 2438353 730793
36541G30793j798433n93125L46279J82536k32745N6361O46445O41231J43458o5253
$$ 730793 -1067640 -1660765 -1314486 -1131950 -1364695 -1308334 -661889 -20658 122800 57547
36531E7547J67045L12378J71784Q2133J77589J69838o6106k45249j24568J91261
$$ 57547 224592 536970 708754 790887 968476 1138314 1072208 826959 702391 893652
36521H93652M55768M83987J69924l80097p65820o74851l20221j60253k12592o0465
$$ 893652 1349420 1833407 2003331 1623234 857414 182563 -137658 -297911 -510503 -570968
36511e70968L90437O21635K40096l39794l80690J45218M84977J53268m05691n19601
$$ -570968 -180531 441104 681200 341406 -39284 105934 590911 744179 338488 -181113
36501a81113k77630k61928m71708k80484L90497O96095J82465k77528K57703J127839
$$ -181113 -458743 -720671 -1192379 -1472863 -1082366 -386271 -203806 -481334 -223631 904208
36491I04208Q36202o30758j529665p44828O97920J162044N07305k22588n05084
$$ 904208 1740410 1109652 -420013 -1164841 -466921 695123 1202428 979840 474756
36482D74756o19787n86064k9376Q06827R72600J39544p55833p19351O854M42774
$$ 474756 -145031 -731095 -760471 46356 1018956 1158500 402667 -316684 -309830 132944
36472A32944K69987M5966J67663L36122K03170l7291n2663M3679m5488k15552
$$ 132944 402931 448897 616560 952682 1155852 1118561 1065898 1109577 1064089 848537
36462H48537j40629R5556J07252p4038j6258K53822J25822m98436p22949M6036
$$ 848537 707908 803464 910716 836678 820420 1074242 1200064 701628 -21321 24715
36452B4715R07764N32341q48600j577771p77856N62694J041054N38583m3961j06684
$$ 24715 932479 1464820 616220 -961551 -1739407 -1176713 -135659 402924 358963 252279
36442B52279K10553N20557N59798K69475j08729k06562m3374o3859m23869o57337
$$ 252279 462832 983389 1543187 1812662 1703933 1497371 1453997 1390138 966269 308932
36432C08932m03036j5634K9337o2914J93674O49028O81541J70761l37732m51222
$$ 308932 -94104 -109738 -80401 -143315 50359 699387 1380928 1551689 1213957 762735
36422G62735l48515l08899l23803l05581k85474k86848k98437l79065m79321k71302
$$ 762735 414220 105321 -218482 -524063 -809537 -1096385 -1394822 -1773887 -2253208 -2524510
36412b524510L92225R68546P95605J53397L111N24303P73842J95453m23819k16886
$$ -2524510 -2132285 -1163739 -368134 -214737 -211626 312677 1086519 1281972 858153 641267
36402F41267L26952K09385l37388k36900M89193N97026k80902q22300n9931R59081
$$ 641267 968219 1177604 840216 603316 1092509 1689535 1408633 586333 526402 1485483
36392A485483P24268l76011p02477K2012L70858l65150r97928l97356O54660O94199
$$ 1485483 2209751 1833740 1131263 1153275 1524133 1158983 161055 -236301 418359 1112558
36382A112558j57192m79661J96827P47878K48202o72677q23730j17423M52093
$$ 1112558 955366 475705 672532 1420410 1668612 995935 172205 54782 506875
36373E06875K34801k91811k63655M07897R06029N29649m07723r58081p23060k35701
$$ 506875 741676 449865 186210 594107 1500136 2029785 1622062 663981 -59079 -294780
36363b94780m6424N7641N12551J068549J052107L87289k61151l73657p8567K57351
$$ -294780 -341204 -283563 228988 1297537 2349644 2736933 2475782 2102125 2023558 2280909
36353B280909M18190K62313j97953n31201k71233K68413J98479o24633j146956
$$ 2280909 2699099 2961412 2763459 2232258 1961025 2229438 2427917 1803284 656328
36344F56328n12471O52492J062470M95344j49963l35898m41160o72301m39331
$$ 656328 143857 796349 1858819 2354163 2204200 1868302 1427142 754841 315510
36335C15510N40498J269786O00703r54051j634066p90715K29018Q4658o34591
$$ 315510 856008 2125794 2726497 1772446 138380 -652335 -423317 -338659 -973250
36326i73250m56514O47867J265531P01890j80292m94538m43406l96738m8575P04317
$$ -973250 -1429764 -781897 483634 1185524 1005232 510694 67288 -329450 -378025 326292
36316C26292J063470N18832r3883J36424N74949K2273j172956j484915n47652
$$ 326292 1389762 1908594 1814711 1951135 2526084 2548357 1375401 -109514 -657166
36307f57166L69364L64068r760j5027J62250J20697K4423P9539M8746j89301l09384
$$ -657166 -287802 76266 66506 51479 213729 334426 358849 438388 487134 297833 -11551
36296a1551j89502j83478l78638l22021J41777N03307M26560K19429J39228P200
$$ -11551 -201053 -384531 -763169 -1085190 -943413 -440106 -13546 205883 345111 352311
36286C52311j71287l8816L44670M40477K06299J34793R7524n74081j481457j164783
$$ 352311 181024 142208 486878 927355 1133654 1268447 1365971 791890 -689567 -1854350
36276a854350N58623J822118J304961J10099j85918J19202k4125l32479n7011
$$ -1854350 -1295727 526391 1831352 1941451 1755533 1874735 1850610 1518131 1461120
36267A461120K17898l29960p93485J40264J579657J492919J6366p28747q1659
$$ 1461120 1679018 1349058 555573 695837 2275494 3768413 3784779 3056032 2974373
36258B974373L52763l38114r93690o45193l3314K1674r0991j0365j92733n62373
$$ 2974373 3327136 2989022 1995332 1350139 1316825 1338499 1247508 1237143 1044410 482037
36248D82037j21800J071789J309617j33905j455951r35464M07964N29270m71366
$$ 482037 360237 1432026 2741643 2607738 1151787 216323 624287 1153557 682191
36239F82191q42303o4944O96560O66399K50998j15235m43630n40497j50661K64120
$$ 682191 -160112 -225056 471504 1137903 1388901 1273666 830036 289539 138878 402998
36229D02998L235o72710q40995k87943M17195R91838J469052J387499K66086j135134
$$ 402998 406233 -266477 -1107472 -1395415 -978220 13618 1482670 2870169 3136255 2001121
36219B001121j394600m70843J51631k88143p58908k43536O15082O39599m692k01872
$$ 2001121 606521 135678 287309 -834 -759742 -1003278 -388196 251403 246711 44839
36209D4839L11453O59952K86621k49063j94876L06921M96216Q5802l75378k86450
$$ 44839 356292 1016244 1302865 1053802 858926 1165847 1662063 1747865 1372487 1086037
36199A086037J85738L69641M3999l05109k76412j14093j49849j44027K45540O31341
$$ 1086037 1271775 1641416 1685415 1380306 1103894 989801 839952 695925 941465 1572806
36189A572806K65679p75408j474530j128947j69067N33690O93436N92735M15524
$$ 1572806 1838485 1063077 -411453 -1540400 -1709467 -1175777 -482341 110394 525918
36180E25918O9036m40167q36317q52040n00341j7779L63703N31783M44953J11519
$$ 525918 594954 154787 -681530 -1533570 -2033911 -2051690 -1687987 -1156204 -711251 -599732
36170e99732k85658l63476R9491P44225Q69553K55493m91526o41470k06496J47382
$$ -599732 -885390 -1248866 -1149375 -405150 464403 719896 228370 -413100 -619596 -472214
36160d72214n6729n84631p82708k77367N69470R25085L95661l96617n23477j8258
$$ -472214 -528943 -1113574 -1896282 -2173649 -1604179 -679094 -283433 -680050 -1203527 -1221785
36150a221785J53583m24967q67696k11539J155143J953113J559397M63115n43085
$$ -1221785 -1068202 -1493169 -2360865 -2572404 -1417261 535852 2095249 2558364 2015279
36141B015279r76526o94240j397L76476N0898m10777k34855L58171M58379r1070
$$ 2015279 1038753 344513 343116 719592 770490 359713 124858 483029 941408 850338
36131H50338m23120N85N64237M23302l15769q06275n44739J24899M79687K16833
$$ 850338 427218 427803 992040 1415342 1099573 293298 -251441 -126542 353145 569978
36121E69978k07443j30730L82100N32726k7777n49716k80224L36291M03996P4944
$$ 569978 362535 231805 613905 1146631 1118854 569138 288914 625205 1029201 1104145
36111A104145J82857O15165L77756o18137j185908o73788J05192L18851L00721
$$ 1104145 1287002 1902167 2279923 1661786 475878 -197910 -92718 226133 526854
36102E26854N36525N76101n3898p30718o17647k7929J48408j24493k10229j2359
$$ 526854 1063379 1639480 1585582 854864 237217 209288 357696 233203 22974 10615
36092A0615L8532n7141Q2727L76670L86881J37423q716j16685m65223p47922m27009
$$ 10615 49147 -7994 74733 451403 838284 975707 966991 850306 385083 -362839 -789848
36081g89848K23626M02549P3718k2571L13306M61171J76199k611J59853J40634
$$ -789848 -566222 -163673 -89955 -112526 200780 661951 838150 835539 995392 1136026
36071A136026k66297m19898K0937L27062j49930p77996m87623O28981J408897
$$ 1136026 869729 449831 470768 797830 647900 -130096 -617719 11262 1420159
36062A420159J102427R8224p09558p71293k29121J98422j33448r57194j224558
$$ 1420159 2522586 2620810 1911252 1139959 910838 1109260 975812 18618 -1205940
36053a205940m21691O64551R66508M93015M9090l3846j05592l06680l11948n3168
$$ -1205940 -1627631 -963080 3428 496443 545533 511687 406095 99415 -212533 -265701
36043b65701L2627k62013m84376j62983M84100Q18364N73503J20098q831K81521
$$ -265701 -233074 -495087 -979463 -1142446 -658346 160018 733521 853619 844788 1126309
36033A126309N51649L55488j68816m22103j16234L55899M97553L41358K06004
$$ 1126309 1677958 2033446 1864630 1442527 1326293 1682192 2179745 2521103 2727107
36024B727107J13972j28565m64531o49868o78465p13151o57162k25690N31040
$$ 2727107 2841079 2712514 2247983 1598115 919650 206499 -450663 -676353 -145313
36015a45313J112956J029818K19982q53593j375538p88454M51079J114978O34164
$$ -145313 967643 1997461 2217443 1363850 -11688 -800142 -349063 765915 1400079
36006A400079j50087k17095J82763J35658l42603m24856L5842L40244K72947L70484
$$ 1400079 1249992 1032897 1215660 1351318 1008715 583859 619701 959945 1232892 1603376
35996A603376O82103N03196k91684q32688o38066k77786j62752J04822N50623
$$ 1603376 2285479 2788675 2496991 1664303 1026237 748451 585699 690521 1241144
35987A241144L29363p05484j232611m01244O48059N20840k60662l39802J82393
$$ 1241144 1570507 865023 -367588 -768832 -120773 400067 139405 -200397 -18004
35978a8004K68284J622K22708O03399R1322r41692j016478k4995O03070L70871
$$ -18004 250280 251902 474610 1078009 1169331 227639 -788839 -813834 -210764 160107
35968A60107K95709O66647L88155p26912j137902j21862Q01721K99774o79439
$$ 160107 455816 1122463 1510618 783706 -354196 -476058 325663 625437 -54002
35959e4002p32588k98849l94328m72588M33791J492651J158635j41965n26420
$$ -54002 -786590 -1085439 -1479767 -1952355 -1518564 -25913 1132722 990757 464337
35950D64337M24638J240524J001106L46657q9884n14359r00924o69275Q2199L77138
$$ 464337 888975 2129499 3130605 3477262 3387378 2873019 1972095 1302820 1385019 1762157
35940A762157r5599m49916j14397K76539P6347l28922l04216O9832M00618N99111
$$ 1762157 1666558 1216642 1102245 1378784 1455131 1126209 821993 891825 1292443 1891554
35930A891554N91937J41463n87792r68177p94622n22895l31430J81444R76211
$$ 1891554 2483491 2624954 2037162 1068985 274363 -248532 -579962 -398518 577693
35921E77693J219413N37325k68783m23757k54575l54536n24464l92898k88712
$$ 577693 1797106 2334431 2065648 1641891 1387316 1032780 508316 115418 -173294
35912a73294n10537m47062M35226J308840R79673j91195p20466k30025J73888
$$ -173294 -683831 -1130893 -695667 613173 1592846 1401651 681185 451160 625048
35903F25048j06283k41903L84980R06203K82585r68462j455124q67506j86994
$$ 625048 518765 276862 661842 1568045 1850630 882168 -572956 -1440462 -1627456
35894a627456q8112j46672J86786O81539Q14451N58701J93774k12366n67511l88577
$$ -1627456 -1715568 -1862240 -1675454 -993915 -179464 379237 573011 360645 -206866 -595443
35884e95443N71451J502540J240905p5649r57306n55223J84190L9057o30263n92533
$$ -595443 -23992 1478548 2719453 2643804 1686498 1131275 1315465 1354522 724259 131726
35874A31726K10826O24693J80710k61424m3193K86183L9544m63433n11559r2333
$$ 131726 342552 967245 1147955 886531 843338 1129521 1169065 705632 194073 101740
35864A01740L07962M92336N33139L90613J16271N6217L17856L95884j35725q88459
$$ 101740 409702 902038 1435177 1825790 1942061 1998278 2316134 2712018 2576293 1687834
35854A687834j154801q65228n34277m66849m80431k65457K89340R27184J046101
$$ 1687834 533033 -332195 -866472 -1333321 -1813752 -2079209 -1789869 -862685 183416
35845A83416L46523m17932j01524J080842J431962R6637j491235j547826m41553
$$ 183416 529939 112007 10483 1091325 2523287 2619924 1128689 -419137 -860690
35836h60690J42668j28388j39372L68933L40596m52163o66504M07054J448639
$$ -860690 -718022 -846410 -985782 -616849 -276253 -728416 -1394920 -987866 460773
35827D60773J028007k60503q19443l39130K21871L50529L54279L31579L2790l11632
$$ 460773 1488780 1228277 408834 69704 291575 642104 996383 1327962 1360752 1049120
35817A049120j62555K56516J25692n56262q00585k45792J34577l64402q18141
$$ 1049120 886565 1143081 1268773 712511 -88074 -333866 -199289 -563691 -1381832
35808a381832O344J537378J919838O19054p65085p23308K00592M86499j17911
$$ -1381832 -1375488 161890 2081728 2700782 1935697 1212389 1412981 1899480 1781569
35799A781569n71976m00042k71288n70337o18485Q4407Q25525P51341K52379K35016
$$ 1781569 1209593 809551 538263 -32074 -650559 -566152 259373 1010714 1263093 1498109
35789A498109M88294J4713j109384j497890m36053R71476J254538L99639m81212
$$ 1498109 1986403 2001116 891732 -606158 -1042211 -70735 1183803 1583442 1102230
35780A102230p19542n48393l38993j61098k1261O3402K24388N33031P04042M41572
$$ 1102230 382688 -165705 -504698 -665796 -687057 -623655 -399267 133764 837806 1279378
35770A279378j0770j40517P7770K14166J46659J88581L47989J21884o38856j237876
$$ 1279378 1268608 1128091 1205861 1420027 1566686 1755267 2103256 2225140 1586284 348408
35760C48408j017597l15502O6604N6201K41966O97715P08100o4700q50688p39379
$$ 348408 -669189 -984691 -918087 -861886 -619920 77795 785895 721195 -129493 -868872
35750h68872P6318O30078M89300Q4203j61876l20646m42649k16440M64825J041922
$$ -868872 -792554 -162476 326824 411027 249151 -71495 -514144 -730584 -265759 776163
35740G76163Q80334J10300n45692o71538m89294l21103j21242K91740P75362Q93816
$$ 776163 1656497 1766797 1221105 549567 60273 -260830 -382072 -90332 685030 1578846
35730A578846M27706k84443o51787m76815j21389N1831J34490L11224L55831K1834
$$ 1578846 2006552 1722109 1070322 593507 472118 523949 658439 969663 1325494 1347328
35720A347328k53241J90286R93671R08103m01643j532348j085704L94774J183436
$$ 1347328 1094087 1284373 2278044 3186147 2784504 1252156 166452 561226 1744662
35711A744662O81501r6024k19581P0440J64749r255k76823o17776q20895m24822
$$ 1744662 2426163 2330139 2110558 2180998 2345747 2336492 2059669 1441893 620998 196176
35701A96176M79313J011142O71141J72622L42658O72917Q239j439537j938403
$$ 196176 675489 1686631 2357772 2530394 2873052 3545969 3554208 2114671 176268
35692A76268n30686J434031J862352N09301r27419j152882o67030m96401n33720
$$ 176268 -354418 1079613 2941965 3451266 2523847 1370965 703935 207534 -326186
35683c26186k7880Q40695J050187L76491j87672O53K66137j51477p78146p40661
$$ -326186 -354066 486629 1536816 1913307 1725635 1726288 1992425 1840948 1062802 322141
35673C22141k76489k83269p01406n79654K39989P13368K10329m96258m22473K49323
$$ 322141 45652 -237617 -939023 -1518677 -1278688 -565320 -354991 -851249 -1273722 -1024399
35663a024399O55456N23205K38073K0569k37008m60160l53986P9505M28686L86855
$$ -1024399 -368943 154262 392335 412904 175896 -284264 -638250 -558745 -130059 256796
35653B56796J08885m3599N0588J80317J12944q8029j54367j5062J08353J17561
$$ 256796 365681 322082 372670 552987 665931 577902 423535 408473 516826 634387
35643F34387K40651N43926N82858J7736o90547q09514l81147m3353O4650L61270
$$ 634387 875038 1418964 2001822 2019558 1329011 519497 138350 94997 159647 520917
35633E20917P63947N65396l25931r64142o98447j10578o989k22688j81201j0880
$$ 520917 1284864 1850260 1524329 560187 -138260 -248838 -255827 -478515 -659716 -670596
35623f70596j99156n40274l61347L62514R37722R66737P41099N87242M19108O4392
$$ -670596 -869752 -1410026 -1771373 -1408859 -471137 495600 1236699 1823941 2243049 2307441
35613B307441l88982o90219o44398k78766M7369p8555n18912n99354k9914O02541
$$ 2307441 1918459 1228240 583842 305076 352445 273890 -245022 -844376 -874290 -271749
35603b71749O85593M65917M95054O15096K69954m19292p21157l84721Q1224K43499
$$ -271749 413844 879761 1374815 1989911 2259865 1840573 1119416 734695 815919 1059418
35593A059418J80852L5120k14851m16209k70882J54197M35729L84806J59535j79872
$$ 1059418 1240270 1275390 1060539 644330 373448 527645 963374 1348180 1507715 1327843
35583A327843o50114r13099n69606N1560J62350k59145l33695L05581Q11698L97869
$$ 1327843 677729 -235370 -804976 -753416 -591066 -850211 -1183906 -878325 -66627 331242
35573C31242m16651n96942j21622J47018j10409k49299K45074R35671J009911
$$ 331242 -85409 -682351 -803973 -656955 -767364 -1016663 -771589 164082 1173993
35564A173993K95845n84650r07660n07821J69158N48654M53223J71369M9949J21488
$$ 1173993 1469838 885188 -22472 -530293 -361135 187519 640742 812111 862060 983548
35554I83548J62474m27l17026n54308m55078K8783N87436P67475M64376J08275
$$ 983548 1146022 1145595 828569 274261 -180817 -152034 435402 1202877 1667253 1775528
35544A775528J80463N52505N19196l35028j403618j525774l60801J002625J218544
$$ 1775528 1955991 2508496 3027692 2692664 1289046 -236728 -597529 405096 1623640
35535A623640L04823m79468l78731m586j33576m49784k35859K58290J65795m81190
$$ 1623640 1928463 1448995 1070264 1065678 932102 482318 246459 504749 670544 189354
35525A89354o66939L2035P66686P06190J93206L9515K83501L37146J1355k94312
$$ 189354 -477585 -445550 321136 1027326 1220532 1260047 1543548 1880694 1892049 1597737
35515A597737l10317k31565k83257l55017j98191K12351N98563O02846J32624
$$ 1597737 1287420 1055855 772598 417581 219390 431741 1030304 1633150 1765774
35506A765774m71058p17262m78295q4460J44815K58632M35622N90855M54660j5315
$$ 1765774 1294716 577454 99159 14699 159514 418146 853768 1444623 1899283 1883968
35496A883968m86635n61583j92988K25576K31984j96720n92586n46246j91351
$$ 1883968 1397333 835750 642762 868338 1100322 903602 311016 -235230 -426581
35487d26581J9529r2081k79835k44776N2379L91422M31405k4723p02181r75131
$$ -426581 -407052 -499133 -778968 -1023744 -971365 -579943 -148538 -173261 -875442 -1850573
35477a850573n81472j615K04072J63424L32341O28437N64153J32192j30122J4632
$$ -1850573 -2432045 -2433660 -2229588 -2066164 -1733823 -1105386 -541233 -409041 -539163 -524531
35467e24531K41796L10247L25949K75309k1408l52742k29433K45549L74665O110
$$ -524531 -282735 27512 353461 628770 607362 254620 25187 270736 645401 651511
35457F51511j37896L10609O38827J76084n74293o95967k27802L4471k33725o05333
$$ 651511 513615 824224 1463051 1639135 1064842 368875 141073 175544 -58181 -663514
35447f63514o42193k82658L39312R21902J028085N70783N2389q8357l8106q5788
$$ -663514 -1305707 -1588365 -1249053 -327151 700934 1271717 1324106 1235749 1197643 1111855
35437A111855r831M00292O71448K73054m26099o56818m33475l47587l89553L129
$$ 1111855 1102024 1502316 2173764 2446818 2020719 1363901 930426 582839 193286 196415
35427A96415P45866J014194N49916Q5893J19366J49464l53618r49843q41660l9689
$$ 196415 942281 1956475 2506391 2592284 2711650 2861114 2507496 1557653 715993 676304
35417F76304O62418O51201L9310n82263o90495k83052J16607R9802n7025J54470
$$ 676304 1338722 1989923 2029233 1446970 756475 473423 590030 689832 632807 787277
35407G87277N69681N22730n3034m38982k57714k9099k23561m80962l08469O0513
$$ 787277 1356958 1879688 1826654 1387672 1129958 1100859 877298 396336 87867 148380
35397A48380J36942R625M0934J33402n726j88323m4393K52849K80469J72534L53205
$$ 148380 285322 294947 335881 469283 463557 275234 230841 483690 764159 936693 1289898
35386A289898O04418K79606n15327q48177k96149M59069P12673O35799O04740
$$ 1289898 1894316 2173922 1658595 810418 514269 973338 1686011 2321810 2926550
35377B926550L63233m07648j173737j068186j75056M73970K39370m02699o16646
$$ 2926550 3289783 2882135 1708398 640212 465156 939126 1178496 775797 159151
35368A59151j87738M51804P81834N51319j18971p43191p84956k01407M30372M95764
$$ 159151 -28587 423217 1205051 1756370 1637399 894208 109252 -92155 338217 833981
35358H33981q093m99808m41924R8078M87204J88012n60752r06100m03236L79724
$$ 833981 825888 326080 -115844 -17766 469438 657450 96698 -809402 -1212638 -832914
35348h32914O35432M20643L88090N91482M15815j92047l97081J64471O10944J38456
$$ -832914 -197482 223161 611251 1202733 1618548 1426501 1029420 1193891 1804835 1943291
35338A943291o46612o63936m3643K21494q1893k97147k58325m49273p58636m09112
$$ 1943291 1296679 632743 589100 810594 728701 431554 173229 -276044 -1034680 -1443792
35328a443792N55923R89035L74820l16362j92647K31140J20958k48691j95019
$$ -1443792 -887869 101166 475986 159624 -33023 198117 319075 70384 -124635
35319a24635M3374j62479n46888l84917J73876L77144K17522L35441P02273N92225
$$ -124635 -81261 -243740 -790628 -1175545 -1001669 -624525 -407003 -71562 630711 1222936
35309A222936p3344m88725k82366l7458j83111l18987o7249K36944K01194L0418
$$ 1222936 1149592 660867 378501 341043 157932 -161055 -228304 8640 209834 240252
35299B40252L1093O3486j4805Q9286N42463Q32169L89971m89765r20471n23838
$$ 240252 271345 334831 320026 409312 951775 1783944 2173915 1684150 763679 239841
35289B39841J78684M80513K82610P5399K57213O03800N45256l6909n94933o84945
$$ 239841 418525 899038 1181648 1257047 1514260 2118060 2663316 2626407 2031474 1346529
35279A346529n58838n77108m51396K29051R90727R03010M114o27334m16600j2125
$$ 1346529 787691 210583 -240813 -11762 978965 1881975 1886089 1258755 842155 830030
35269H30030j16921m63174m78641k33342o6497J51465O63082J124867R81504L38527
$$ 830030 713109 249935 -228706 -462048 -528545 -377080 286002 1410869 2392373 2730900
35259B730900j48023j62172k2144j23538m64533p34510o53153k37355J84733L10878
$$ 2730900 2582877 2420705 2398561 2275023 1810490 1075980 422827 185472 370205 681083
35249F81083J86872J8072j82198m08218l55270J27641M77990R0679n77249n44357
$$ 681083 867955 886027 703829 295611 -59659 67982 545972 636651 59402 -484955
35239d84955P9873K22116k43754j56310Q29576J341150M68969n84281l85030M23445
$$ -484955 -405082 -182966 -426720 -583030 246546 1587696 2056665 1472384 1087354 1510799
35229A510799L33183m58733n61077J23271L81002p3886k66583J03139K36547l9492
$$ 1510799 1843982 1385249 824172 947443 1328445 1254559 987976 1091115 1327662 1288170
35219A288170P0221N63807L42836p09199j126695k24323O14296J65863o20842
$$ 1288170 1358391 1922198 2265034 1555835 429140 204817 819113 984976 364134
35210C64134k77215P42908R22668J63769k86654K6570K90211L23l51968l20642
$$ 364134 86919 829827 1752495 1916264 1629610 1656180 1946391 1946714 1594746 1274104
35200A274104j68024k67014n81899q44398p15413N8325J077206J255806J47759
$$ 1274104 1106080 839066 257167 -587231 -1302644 -1244319 -167113 1088693 1236452
35191A236452j075376r48305K66573R86699N70297p6513j93790j37186l08262
$$ 1236452 161076 -787229 -520656 466043 1036340 959827 766037 628851 320589
35182C20589l61074o6244Q6986j61019k13765L00859O68416K02050m83290l36935
$$ 320589 -40485 -106729 -19743 -180762 -394527 -93668 574748 776798 293508 -43427
35172d3427M68388Q19173L55421j64882j53550J25666K93471M21405O00833O32585
$$ -43427 424961 1244134 1599555 1434673 1281123 1406789 1700260 2121665 2722498 3355083
35162C355083M33331J88912j16800p16998j341146j182376r3861P84809L29814
$$ 3355083 3788414 3977326 3860526 3143528 1802382 620006 526145 1310954 1640768
35153A640768r73178j520050n97812Q03602J284845N48330n68637j068093n60533
$$ 1640768 667590 -852460 -1450272 -646670 638175 1186505 617868 -450225 -1010758
35144a010758N08863J136401O42809m60372q96027k07039N91238M15723l71382
$$ -1010758 -501895 634506 1277315 816943 -79084 -286123 305115 720838 349456
35135C49456o20914j69232Q4049k14529l47545R6662M46154J77706m6105N10707
$$ 349456 -271458 -440690 -356641 -571170 -918715 -822053 -375899 -198193 -244298 266409
35125B66409J241119J007640n0308o93858m19113M0646J08282J09398L08371K60192
$$ 266409 1507528 2515168 2464860 1771002 1351889 1392535 1500817 1610215 1918586 2178778
35115B178778k92058p03835l31657M10438O01842O8454n38713o92747m81395k61680
$$ 2178778 1886720 1182885 851228 1261666 1863508 1931962 1393249 700502 219107 -42573
35105d2573k27486k81236j49299K55334N74159M30948Q0722P9430L01346Q7745
$$ -42573 -270059 -551295 -700594 -445260 128899 559847 640569 719999 1021345 1109090
35095A109090m57333l54097N83112J086686L19308o27243l39840O56903P65891
$$ 1109090 651757 297660 880772 1967458 2286766 1659523 1319683 1976586 2742477
35086B742477j09497n79678j71414R9039k32001k56784M50060P75498j47268j367746
$$ 2742477 2632980 2053302 1881888 1980927 1748926 1492142 1942202 2717700 2570432 1202686
35076A202686j463995n27526K98041N12388L97648P0001m78944p92165m59450
$$ 1202686 -261309 -788835 -490794 21594 419242 489243 10299 -781866 -1241316
35067a241316L7819m8583m84042l78390L66630Q84521O39500N1215k79452k41216
$$ -1241316 -1203497 -1252080 -1736122 -2114512 -1747882 -863361 -223861 -172646 -452098 -693314
35057f93314J7135L37659M29748P7635l69340k43461N06747J077740P47834k48685
$$ -693314 -676179 -338520 91228 168863 -200477 -443938 62809 1140549 1888383 1639698
35047A639698r86773q24681j2168N97956M55379q9835k90944l8026R9763o7238
$$ 1639698 652925 -171756 -183924 414032 869411 779576 488632 450606 550369 483131
35037D83131J2640N53652P90019J33168o87989n79820K78327P73593N52507K93870
$$ 483131 495771 1049423 1839442 1972610 1284621 704801 983128 1756721 2309228 2603098
35027B603098L87729M25439J16997k53253n07257q70595j325826j382384p69747
$$ 2603098 2990827 3416266 3533263 3280010 2772753 1902158 576332 -806052 -1575799
35018a575799J77942R66245J285096R55007J21632n73902o38957l82640k73735
$$ -1575799 -1397857 -431612 853484 1808491 1930123 1356221 717264 334624 60889
35009F0889j9080P78724J442202R79647j67360n86190j00976N9832n10285p38007
$$ 60889 41809 820533 2262735 3242382 3075022 2488832 2387856 2447688 1937403 1199396
34999A199396j32278K76217j16341l09747M11472R89707L67296o29205p20260
$$ 1199396 1067118 1343335 1226994 917247 1328719 2318426 2685722 2056517 1336257
34990A336257k94550m04156o62157m9293R05287P87834k08047m79176L15558P40437
$$ 1336257 1041707 637551 -24606 -73899 831388 1619222 1411175 931999 1247557 1987994
34980A987994N9716n87607j69324N89778M76562l54549p88635m04325J37697J29478
$$ 1987994 2047710 1460103 1290779 1880557 2357119 2002570 1213935 809610 947307 1076785
34970A076785l33237n53085j06345N57947O17146L2043l29301l0391K13991j96953
$$ 1076785 743548 190463 84118 642065 1259211 1291254 961953 931562 1145553 948600
34960I48600n70137l5601Q19195P52921q4158l55927L17580Q60374N01578k87903
$$ 948600 378463 342862 1162057 1914978 1830820 1474893 1792473 2652847 3154425 2866522
34950B866522q38531j031554p70248P2783Q88619P25115k13404o56627j95113
$$ 2866522 2027991 996437 226189 298972 1187591 1912706 1699302 1042675 847562
34941H47562J72971j47573l90128N2157M99391K69862r8981Q8930M35312K82237
$$ 847562 1020533 872960 482832 534989 1034380 1304242 1205261 1294191 1729503 2011740
34931B011740j03940j94274j92297l59213k08052N29171R69013L44520n44296
$$ 2011740 1907800 1713526 1521229 1162016 953964 1483135 2452148 2796668 2252372
34922B252372n00026R7689m229p17478p76316J1397L79139k66601q62339m09304
$$ 2252372 1752346 1850035 1845806 1128328 352012 363409 742548 475947 -386392 -795696
34912g95696N60671R72224P21528M19062K77571M5315l00787m55469k79445R265
$$ -795696 -235025 737199 1458727 1877789 2155360 2200675 1899888 1444419 1164974 1174239
34902A174239J15648l8418k53445k54573l2063J25505P0334J7437P4487p3872
$$ 1174239 1289887 1251469 998024 743451 711388 836893 907227 924664 999151 925279
34892I25279n32505o37567K03459J315187J332810P7017j055383r14079k1513
$$ 925279 392774 -244793 -41334 1273853 2606663 2683680 1628297 714218 692705
34883F92705L34130j89013q19803q44305l09978K94183N57310L68463l6620k43807
$$ 692705 1026835 837822 18019 -826286 -1136264 -842081 -284771 83692 47072 -196735
34873a96735o8479K66280M70752N16433M59556K02222k69434o09808m54800M3027
$$ -196735 -265214 1066 471818 988251 1447807 1650029 1380595 770787 315987 359014
34863C59014L73143L28087J58921P6287o776j43383j74405q3777j38725l63060
$$ 359014 732157 1060244 1219165 1295452 1288676 1145293 970888 887111 748386 385326
34853C85326k60519M38011J050985O80338l90065q40497r5073Q22963P12830j92578
$$ 385326 124807 562818 1613803 2294141 1904076 1063579 968506 1791469 2504299 2311721
34843B311721p54150n72234k12003l7214J84867M64501L34970k55653n77753j17399
$$ 2311721 1557571 985337 773334 736120 920987 1385488 1720458 1464805 887052 769653
34833G69653O31052Q54805M65103k4202k98162m17897m33827l12434j66296j84564
$$ 769653 1400705 2255510 2720613 2696411 2398249 1980352 1546525 1234091 1067795 883231
34823H83231l44421m21829k65029P0828L87195M62622K17956j92908n47069p37569
$$ 883231 538810 116981 -148048 -77220 309975 772597 990553 797645 250576 -486993
34813d86993o60762j51298O33831J021368N53389k45981m68582p2360K13771J62570
$$ -486993 -1147755 -1299053 -665222 356146 909535 663554 194972 122612 336383 498953
34803D98953K86861O95545P59027K71221p7560R0142J52207l12664o02218m9312
$$ 498953 785814 1481359 2240386 2511607 2434047 2524189 2676396 2363732 1761514 1712202
34793A712202P27143P44038J60819k00196k80194n78288r23323o65895P8473N11873
$$ 1712202 2439345 3183383 3344202 3144006 2863812 2285524 1362201 696306 774779 1286652
34783A286652M29822L77025N34045M63135M9632k57673k97085m07079o23168n12833
$$ 1286652 1716474 2093499 2627544 3090679 3140311 2882638 2585553 2178474 1555306 1042473
34773A042473k6034L00560K44753K30727M60068M62180q0803o97031p77653l98244
$$ 1042473 1016439 1316999 1561752 1792479 2252547 2714727 2633924 1936893 1159240 760996
34763G60996p8122q8116l36234o18810o85955l27211L49432R19560J078304Q85037
$$ 760996 682874 594758 258524 -360286 -1046241 -1373452 -1024020 -104460 973844 1858881
34753A858881N10325J087n93374j069929j166755p61410m0976M80711L64499j81201
$$ 1858881 2369206 2370293 1776919 706990 -459765 -1221175 -1262151 -781440 -416941 -598142
34743e98142m47504j56360J82037J62138J89362P32312J348837J213273L53967
$$ -598142 -1045646 -1202006 -1019969 -857831 -668469 63843 1412680 2625953 2979920
34734B979920l62531l57943J31608N10756L42676l24499p64594k02629R30424
$$ 2979920 2617389 2259446 2391054 2901810 3244486 2919987 2155393 1952764 2883188
34725B883188J155340L0840r11765l77186O14705L84535o19417p00612K7238j41799
$$ 2883188 4038528 4069368 3157603 2780417 3395122 3779657 3160240 2459628 2486866 2345067
34715B345067j296910j476073M670J206640O06763o22348p15084P8966M95547
$$ 2345067 1048157 -427916 -423246 783394 1390157 767809 52725 131691 627238
34706F27238M00625L64147K70697j06220j26532O50290J298969Q44027r6529l95938
$$ 627238 1027863 1392010 1662707 1556487 1429955 2080245 3379214 4223241 4126712 3730774
34696C730774l00135o94253j254206j004965j70208K11779J05440K54450N03997
$$ 3730774 3430639 2736386 1482180 477215 307007 518786 624226 878676 1382673
34687A382673J05845n15751j77913Q40515R04705k94471j010594r0113J274241
$$ 1382673 1488518 972767 794854 1635369 2540074 2245603 1235009 1144896 2419137
34678B419137J391190L68489m99750o51651m77849l07490j80683k20444m31459
$$ 2419137 3810327 4178816 3679066 3027415 2549566 2242076 2061393 1840949 1409490
34669A409490m37449l6429L18178J62174j85715o7747N07782Q71218N98001m7133
$$ 1409490 972041 935612 1253790 1415964 1230249 1162502 1670284 2541502 3139503 3092370
34659C092370n41914o42512m72147k78831j41300Q9927M69525O79542L73197k31533
$$ 3092370 2550456 1907944 1435797 1156966 1015666 1105593 1575118 2254660 2627857 2396324
34649B396324m98564j97766K14615K79920Q6579r0914k88228o11772p94614m60634
$$ 2396324 1897760 1699994 1914609 2194529 2281108 2190194 1901966 1290194 495580 34946
34639C4946K44541P02079N78992K27743J44897K47516J7840o34504j044238o11576
$$ 34946 279487 981566 1560558 1788301 1933198 2180714 2198554 1564050 519812 -91764
34629i1764L07535Q00402O00608L21278L98949M68060J42988j93690J097M43863
$$ -91764 215771 1016173 1616781 1938059 2337008 2805068 2948056 2754366 2755463 3199326
34619C199326L74146k70552p28129m95629L4180J67774k51106p40095o90164K8483
$$ 3199326 3573472 3302920 2574791 2079162 2113342 2281116 2030010 1289915 599751 628234
34609F28234P98438P48246k25910j154210j073030j78165N56249O66913M87082
$$ 628234 1426672 2174918 1949008 794798 -278232 -456397 99852 766765 1253847
34600A253847K80576j21541o55349p23774r695Q61379R88285L37499k39224j27401
$$ 1253847 1534423 1412882 757533 33759 24064 885443 1873728 2211227 1972003 1844602
34590A844602L13720L51413n7440k58945K0776J68762l33266r25267p25046K4079
$$ 1844602 2158322 2509735 2452295 2193350 2214126 2382888 2049622 1124355 399309 423388
34580D23388K58740j80489k85014L94176R80095P94110M19798M18968K21543n57688
$$ 423388 682128 501639 216625 610801 1590896 2385006 2804804 3223772 3445315 2887627
34570B887627q82719Q9055J138146O01893q08535r53710K56007O99226l93139
$$ 2887627 2004908 2093963 3232109 3834002 3025467 2071757 2327764 3026990 2633851
34561B633851j159978k85151P95822L39279q51821q76029J85783O51949O9785
$$ 2633851 1473873 1188722 1984544 2323823 1472002 595973 781756 1433705 1503490
34552A503490l04947K13638O97825K20670p37921j059566l97459O33446J196995
$$ 1503490 1198543 1412181 2110006 2330676 1592755 533189 135730 769176 1966171
34543A966171Q86420p493p08639o90146k23056M3845n6902j15743J60992N36560
$$ 1966171 2852591 2845098 2136459 1446313 1223257 1267102 1210200 1094457 1255449 1792009
34533A792009N76289J76989k76795k56402K78825O49688K36099n20639n30428
$$ 1792009 2368298 2545287 2268492 2012090 2290915 2940603 3176702 2656063 2125635
34524B125635L30574Q24898J10142r08156q61967N3842M73233n3890o23629o01455
$$ 2125635 2456209 3281107 3391249 2483093 1621126 1674968 2148201 2094311 1470682 869227
34514H69227l98083l55312j05378M03511L94755l91501q27221L9330J289503J299263
$$ 869227 471144 115832 10454 413965 808720 417219 -410002 -370672 918831 2218094
34504B218094J61227m94299j0951M82551J12017l64158k4378N68094L22358n79298
$$ 2218094 2379321 1885022 1874071 2356622 2468639 2104481 2080103 2648197 2970555 2391257
34494B391257j071158r00574o90951n91056j50551M94031N94046J52769J08326
$$ 2391257 1320099 419525 -271426 -862482 -1013033 -519002 75044 227813 336139
34485C36139P71666J209042P27571n0902k79178j38056k18044m23887l52295j53020
$$ 336139 1107805 2316847 3044418 2993516 2714338 2576282 2358238 1934351 1582056 1429036
34475A429036j74893k44856n6527K04189L22772N83967J078540J101221J51750
$$ 1429036 1254143 1009287 952760 1156949 1479721 2063688 3142228 4243449 4395199
34466D395199j002980j250499o67286j56705r410J25387K51716J36021N8289L21169
$$ 4395199 3392219 2141720 1474434 1317729 1308319 1433706 1685422 1821443 1879732 2200901
34456B200901L67872l91827j237950j004992k4387L14770j77439l09661L38634
$$ 2200901 2568773 2176946 938996 -65996 -90383 224387 46948 -262713 75921
34447G5921P80873M67423J23368K25687J96327k26528k82204L45171O91836N8831
$$ 75921 856794 1324217 1447585 1673272 1869599 1643071 1360867 1706038 2397874 2456705
34437B456705p60024p13026L4709O87792R40126P58313K2931q57860r56630j96992
$$ 2456705 1696681 983655 1018364 1706156 2646282 3404595 3427526 2569666 1613036 1416044
34427A416044K88491j08815n15965j75246K41774l7469m43710j88670K43645P2555
$$ 1416044 1704535 1595720 1079755 904509 1146283 1108814 665104 476434 720079 792634
34417G92634k73991n0913K82271m7051m82203l5058P73721O23398l21770o19317
$$ 792634 518643 467730 750001 702950 220747 185689 959410 1582808 1261038 641721
34407F41721N8953M79304k6726n67133k51993N27648Q97979O24746K2286n07574
$$ 641721 700674 1179978 1153252 586119 334126 861774 1759753 2384499 2406785 1899211
34397A899211n79562j12596L71268L23679k3114o9087J43305J23014q8399l9876
$$ 1899211 1319649 1207053 1578321 1902000 1878886 1809799 1953104 2076118 1987719 1947843
34387A947843J95867J76255L3612K34740M98419Q5647q07588j127359o04618j53197
$$ 1947843 2143710 2319965 2353577 2588317 3086736 3172383 2364795 1237436 632818 479621
34377D79621l05684l91527J97318R16773R49213M47660J66578K95926L29955q2350
$$ 479621 173937 -217590 -20272 896501 1845714 2293374 2459952 2755878 3085833 3003483
34367C003483o47878q26859n18720k16373l36592n00776J2008R84762J218684
$$ 3003483 2355605 1528746 1010026 793653 457061 -43715 -31707 953055 2171739
34358B171739K51844p23695m98194L64607M84832j87491n10420p8037L90850M63984
$$ 2171739 2423583 1699888 1201694 1566301 2051133 1863642 1353222 1275185 1666035 2130019
34348B130019M36629L72022J9376k82960L2258M54358p7643j189093j251079M0196
$$ 2130019 2566648 2938670 2958046 2675086 2707344 3161702 3084059 1894966 643887 684083
34338F84083R66857M07171m90433l12728M10245L88988j72115j14008N47967O47363
$$ 684083 1650940 2058111 1567678 1254950 1665195 2054183 1882068 1768060 2316027 2963390
34328B963390j56344q05070m27134N04712R24051M67466k71651m84162K4828O73244
$$ 2963390 2807046 2001976 1574842 2079554 3003605 3471071 3199420 2715258 2740086 3413330
34318C413330P86294L63333q2757l10159m80414n85396m10246j12004r3814j98564
$$ 3413330 4199624 4562957 4480200 4170041 3689627 3104231 2693985 2581981 2488167 2289603
34308B289603J23734O64832M85733n11102j105507n07665M14630N06835L1376
$$ 2289603 2413337 3078169 3563902 3052800 1947293 1439628 1854258 2361093 2392469
34299B392469m1376K83490K70421p2207l8754M07177N13452O1344k66067p4506
$$ 2392469 2351093 2634583 2905004 2832797 2794043 3201220 3714672 3776016 3509949 3435443
34289C435443J29463r6373l46920p8448M73678O67270L90535O8127p9855k43526
$$ 3435443 3564906 3468533 3121613 3043165 3516843 4184113 4574648 4642775 4562920 4319394
34279D319394n12906o61228n70452m49796l91036j06601M90504Q10164L23391
$$ 4319394 3806488 3145260 2574808 2125012 1733976 1627375 2117879 2928043 3251434
34270C251434m31705m15064L34842O78783K09113m7458N52851R14562j37604j723119
$$ 3251434 2819729 2404665 2739507 3418290 3627403 3579945 4132796 5047358 4909754 3186635
34260C186635j967845p38401L14386K95456l1852k2257r9738m17704j91357P76614
$$ 3186635 1218790 480389 794775 1090231 1058379 1036122 936384 518680 327323 1103937
34250A103937J283843M97604n85421o07288J24769L30613j78104m39357j8680
$$ 1103937 2387780 2885384 2299963 1692675 1817444 2148057 1969953 1530596 1511916
34241A511916M83551N54809L66972J41148k34025p16478q82399m90711J12553
$$ 1511916 1995467 2550276 2917248 3058396 2824371 2107893 1225494 734783 847336
34232H47336M16660L50711K44284K72409J82346k54092o45218k77021Q19932J607165
$$ 847336 1263996 1614707 1858991 2131400 2313746 2059654 1414436 1137415 1957347 3564512
34222C564512J279571L00956l87207o66008r05171q49427n0452Q47910O67717
$$ 3564512 4844083 5145039 4757832 4091824 3186653 2337226 2286774 3134684 3802401
34213C802401l87057p83035P3463R83881Q32748N101o33104q86033p18214Q5642
$$ 3802401 3415344 2632309 2705772 3689653 4522401 4527502 3894398 3008365 2290151 2375793
34203B375793R77228P19608o30398j187847Q6941J497824R60834q41595j517606
$$ 2375793 3353021 4072629 3442231 2254384 2341325 3839149 4799983 3958388 2440782
34194B440782n04847M44782J49918n41577m99029O3942L43756K28035J45443K96837
$$ 2440782 1935935 2380717 2530635 1989058 1490029 1553971 1897727 2125762 2271205 2568042
34184B568042N28051N67667J78161n54642j044562p55578P2521O86625P44472
$$ 2568042 3096093 3663760 3841921 3287279 2242717 1487139 1559660 2246285 2990757
34175B990757M95357J38581l82923q88682q63765j33161P28662R60162M49495
$$ 2990757 3486114 3624695 3241772 2353090 1489325 1356164 2084826 3044988 3494483
34166C494483j86709l34395l6618K09861K16574L01293N95982O52794J64428m00012
$$ 3494483 3307774 2973379 2936761 3146622 3363196 3664489 4260471 4913265 5077693 4677681
34156D677681n11567m73248p56571q94355j69542Q75076R79026J83437j60338
$$ 4677681 4166114 3692866 2936295 2041940 1872398 2747474 3726500 3909937 3749599
34147C749599L99043P31883J24550n53760m09517J07276K57529K40810M53306
$$ 3749599 4148642 4880525 5005075 4451315 4041798 4149074 4406603 4647413 5100719
34138E100719N63152K24471j97908l80086n84327q06488m64773L69011O17580
$$ 5100719 5663871 5888342 5690434 5310348 4726021 3919533 3454760 3823771 4441351
34129D441351j29125p96797n16510J24347L82716N28791P29849K69810q85445
$$ 4441351 4312226 3515429 2998919 3123266 3505982 4034773 4764622 5034432 4148987
34120D148987j233199Q2796J574160J471287K68898m09265l13930k09289r3648
$$ 4148987 2915788 2998584 4572744 6044031 6312929 5903664 5589734 5380445 5286797
34111E286797L75958N85369p4986p29898k76320O28203O03232j55404m23318j39533
$$ 5286797 5662755 6248124 6173138 5443240 5166920 5795123 6398355 6242951 5819633 5680100
34101E680100k17079o84995p65467l66738M7278N09916J024498Q00341m12435
$$ 5680100 5463021 4778026 4012559 3645821 3693099 4203015 5227513 6027854 5615419
34092E615419j186712l83584P56105M47985p20673q99791o9831L69524L30188
$$ 5615419 4428707 4045123 4801228 5249213 4528540 3628749 3558918 3928442 4258630
34083D258630P94002J384954Q16593n15557r44512l90750l27432r58642r20491
$$ 4258630 5052632 6437586 7254179 6738622 5794110 5403360 5075928 4117286 3196795
34074C196795R7310Q03579N97194K52334J60576q0287k87672J04295N60915J66096
$$ 3196795 3294105 4097684 4694878 4947212 5107788 5027501 4739829 4844124 5405039 5571135
34064E571135m30720Q3258J169994J124668l3182p23174n34337l54751j89579
$$ 5571135 5140415 5223673 6393667 7518335 7485153 6761979 6227642 5872891 5683312
34055E683312N37948R75389j5328j158286l30761J544697J604324j47404q60728
$$ 5683312 6221260 7196649 7181321 6023035 5692274 7236971 8841295 8693891 7833163
34046G833163J94060O40946m35382r41267J32495Q83666J75586l90676K54265
$$ 7833163 8027223 8668169 8232787 7291520 7424015 8307681 8483267 8092591 8346856
34037H346856O97441l978n08085K9854K88409m95832r47538k47427L32880M9149
$$ 8346856 9044297 9040319 8532234 8562088 8850497 8354665 7407127 7159700 7492580 7541729
34027G541729P8687Q80930R72016k13109j004016m45409J81474N5413J68722P89006
$$ 7541729 7620416 8501346 9473362 9260253 8256237 7810828 7992302 8047715 8216437 9005443
34017I005443N98353m33913m88445O24503P95707m01686p18101N02028R91755
$$ 9005443 9603796 9169883 8681438 9305941 10101648 9699962 8981861 9483889 10475644
34008A0475644j5397k19756J136457J483008j73227j059588K27080R60473n76105
$$ 10475644 10460247 10240491 11376948 12859956 12686729 11627141 11854221 12814694 12238589
33999A2238589j749596m77479R84909M79973j99963O34513J046412l38927j025233
$$ 12238589 10488993 10011514 10996423 11476396 11276433 11910946 12957358 12618431 11593198
33990A1593198O04806J667075P585j431459J05928K008985J145097m73227J39530
$$ 11593198 12198004 13865079 13872664 12441205 12547133 14556118 15701215 15227988 15367518
33981A5367518J334212N49952n10465L17444R00645p42752j627794Q36341L178574
$$ 15367518 16701730 17251682 16741217 17058661 17959306 17216554 15588760 16425101 19603675
33972A9603675J679747p12828J84101K072357R31434j070474K5435K047640J075888
$$ 19603675 21283422 20570594 20754695 22827052 23758486 22688012 22713447 24761087 25836975
33963B5836975n58719J104677L361659J832366o27287Q60686L547491K308739
$$ 25836975 25278256 26382933 29744592 31576958 30949671 31810357 35357848 37666587
33955C7666587j10255J513175M113791K228899m49123K265889O211824M309155
$$ 37666587 37556332 39069507 43183298 45412197 44963074 47228963 53440787 57749942
33947E7749942J075090M386918Q992907N998465K079594P961702J4760716Q577931
$$ 57749942 58825032 63211950 72204857 78203322 80282916 88244618 103005334 111583265
33939A11583265K475013J7970435L4155218O53908q1653062j36955558j04590634
$$ 111583265 114058278 132028713 166183931 166837839 85184777 -51770781 -156361415
33932a56361415k0111599L2860108K7718693P341387O523545J2973552Q190178
$$ -156361415 -176473014 -143612906 -115894213 -108552826 -102029281 -89055729 -80865551
33925h0865551J071761M194865R321563N761130M31888K600302O368419L583525
$$ -80865551 -79793790 -75598925 -66277362 -60516232 -60084344 -57484042 -51115623 -47532098
33917d7532098n30537J412165M686689K384623j228590N04437L926084K677241
$$ -47532098 -48062635 -46650470 -41963781 -39579158 -40807748 -40303311 -36377227 -33699986
33909c3699986k73208Q02167L135656J380754j636554l38154K915035K367904
$$ -33699986 -33973194 -33171027 -30035371 -28654617 -30291171 -30629325 -27714290 -25346386
33901b5346386n54225n69295J526386J186986q92208n87508J478613J469751j33751
$$ -25346386 -25900611 -26469906 -24943520 -23756534 -24648742 -25236250 -23757637 -22287886 -22421637
33892b2421637J19685J659026J179826o50221l56202J696379J980816K32235m89381
$$ -22421637 -22301952 -20642926 -19463100 -20113321 -20469523 -18773144 -16792328 -16560093 -17049474
33883a7049474N16977J027308M65018L55505P25852K59389n57235k38415N76099
$$ -17049474 -16532497 -15505189 -15040171 -14684666 -13958814 -13699425 -14256660 -14495075 -13918976
33874a3918976L28746k50206L67585J153064K73351j132454o53503J079628J448459
$$ -13918976 -13590230 -13840436 -13472851 -12319787 -12046436 -13178890 -13832393 -12752765 -11304306
33865a1304306K18345o29990n09766l73317j90292N85807J015366J07327q44129
$$ -11304306 -11085961 -11715951 -12225717 -12599034 -12789326 -12203519 -11188153 -11080826 -11924955
33856a1924955k00113J045731J053139L66589M14235M89694n59241j362083k17050
$$ -11924955 -12125068 -11079337 -10026198 -9659609 -9245374 -8755680 -9314921 -10677004 -10894054
33847a0894054J374786R97946l95370k99463P09215K60627j061044o14934J326797
$$ -10894054 -9519268 -8521322 -8916692 -9216155 -8506940 -8246313 -9307357 -9922291 -8595494
33838h595494J830840L17330p42673k16730L68682J26075k5498K35261J63431
$$ -8595494 -6764654 -6447324 -7189997 -7406727 -7038045 -6911970 -6937468 -6702207 -6538776
33829f538776j2347N19058R23845j41444j576397j207486L51173O47865k19177
$$ -6538776 -6551123 -6032065 -5108220 -5249664 -6826061 -8033547 -7682374 -7034509 -7253686
33820g253686O8884J503358J550028k07794j217863m22917K46192k62031m67546
$$ -7253686 -7184802 -5681444 -4131416 -4339210 -5557073 -5979990 -5733798 -5995829 -6463375
33811f463375K91133M18956o45555j038028J05243R49733L17235k32863N42241
$$ -6463375 -6172242 -5753286 -6398841 -7436869 -7331626 -6381893 -6064658 -6297521 -5755280
33802e755280J216724L82307p66449o10624J98208K41933k17021j98593O1375
$$ -5755280 -4538556 -4156249 -4922698 -5533322 -5335114 -5093181 -5310202 -5508795 -5447420
33793e447420j10540l32483L8966O44753Q22602N93164J38529n69596j028750
$$ -5447420 -5557960 -5890443 -5851477 -5206724 -4384122 -3790958 -3652429 -4222025 -5250775
33784e250775m59417O63806Q70277r863n25888j08503P0142n43197p61073Q8230
$$ -5250775 -5710192 -5046386 -4176109 -4185972 -4711860 -4820363 -4750221 -5293418 -6054491 -5966261
33774e966261Q02948M16237k13135j87402j24531n56084n44835N40154J447327
$$ -5966261 -5163313 -4747076 -4960211 -5147613 -5272144 -5828228 -6373063 -5832909 -4385582
33765d385582Q91353l51316p84327m33767k05114j07878K99689O13140K56498
$$ -4385582 -3494229 -3845545 -4629872 -5063639 -5268753 -5376631 -5076942 -4463802 -4207304
33756d207304k66116j54209K86437K45431j64387j90940L15580Q40748R43903
$$ -4207304 -4473420 -4627629 -4341192 -4095761 -4260148 -4451088 -4135508 -3294760 -2350857
33747b350857M49872m97578j145396p24441K93320N73164q1780m06195J66657
$$ -2350857 -1900985 -2398563 -3543959 -4268400 -3975080 -3401916 -3483696 -3889891 -3723234
33738c723234N46106m3564o87452m18856J83421K03885o8860J222J59887M2800
$$ -3723234 -3177128 -3220692 -3908144 -4327000 -4143579 -3939694 -4008554 -4007332 -3847445 -3804645
33728c804645Q3307N18826O05933o8296o44542m64525k40376n64226n89221L94974
$$ -3804645 -3721338 -3202512 -2596579 -2664875 -3309417 -3773942 -4014318 -4578544 -5167765 -4772791
33718d772791J342842R93377o1602m50566j68256l9896L923M31818P34466K41190
$$ -4772791 -3429949 -2436572 -2498174 -2948740 -3116996 -3156892 -3152969 -2721151 -1986685 -1745495
33708a745495m24436l45009j5403l90575j009471q31655j86166l972J50210J172277
$$ -1745495 -2169931 -2514940 -2530343 -2920918 -3930389 -4762044 -4948210 -4952182 -4801972 -3629695
33698c629695K145231J333239p70794j769742q56857K67549K97414n9420M4621
$$ -3629695 -1484464 -151225 -922019 -2691761 -3548618 -3281069 -2983655 -3043075 -2998454
33689b998454J63474j25439k26172J75074K90458l26047q19574m71505Q1202L2968
$$ -2998454 -2834980 -2960419 -3186591 -3011517 -2721059 -3047106 -3866680 -4338185 -4256983 -4224015
33679d224015k40176k6658M29647N26382M71558Q17370J326254J257525M92505
$$ -4224015 -4464191 -4490849 -4061202 -3534820 -3063262 -2245892 -919638 337887 830392
33670H30392l82578q80963r08358n29788r888J60489j87918n28106l05716J87504
$$ 830392 447814 -433149 -1341507 -1871295 -1881183 -1720694 -1908612 -2436718 -2742434 -2554930
33660b554930J37712o12595j190651o96145O61045J686258J482357M14796l93837
$$ -2554930 -2417218 -3029813 -4220464 -4916609 -4255564 -2569306 -1086949 -672153 -1065990
33651a065990m01404r2165p2031k71252l34686k79499k86782k50945o2983K4958
$$ -1065990 -1467394 -1559559 -1631590 -1902842 -2237528 -2517027 -2803809 -3054754 -3117737 -3092779
33641c092779j37470j71338J77282M04344M9675l03554J67399J008313R50646
$$ -3092779 -3230249 -3401587 -3224305 -2819961 -2770286 -3073840 -2906441 -1898128 -947482
33632i47482j32028r33308o08617J63832M22463J93168l8322k20233m11134k94119
$$ -947482 -1079510 -2012818 -2621435 -2457603 -2035140 -1841972 -1880294 -2100527 -2511661 -2805780
33622b805780K32187N33680O8426o83406q54400m30389r9455p3941J16734O31813
$$ -2805780 -2573593 -2039913 -1971487 -2654893 -3509293 -3939682 -4039137 -4113078 -3996344 -3364531
33612c364531Q85122M07766l66525n90846o1048N62984N59828n9944o34940o15914
$$ -3364531 -2479409 -2071643 -2438168 -3029014 -3090062 -2527078 -1967250 -2027194 -2662134 -3278048
33602c278048j19727K98973L12446J11210M2564J40691J53622m0775k39735k05388
$$ -3278048 -3397775 -3098802 -2786356 -2675146 -2632582 -2491891 -2338269 -2379044 -2618779 -2824167
33592b824167m801J13531J17257J99400L36571J74922l94746q44758o04859J26905
$$ -2824167 -2828968 -2715437 -2598180 -2398780 -2062209 -1887287 -2282033 -3126791 -3731650 -3604745
33582c604745O33226O17300L50927l2449o69595j268897j078169K4322J044763
$$ -3604745 -2971519 -2354219 -2003292 -2035741 -2705336 -3974233 -5052402 -5028080 -3983317
33573c983317J035891K92237j58492J15902O74807R33234O13380k53431j192410
$$ -3983317 -2947426 -2655189 -2813681 -2697779 -2022972 -1089738 -476358 -729789 -1922199
33564a922199j362948l80408J021083J663543J202575K95565l62948o45346p01693
$$ -1922199 -3285147 -3665555 -2644472 -980929 221646 517211 154263 -491083 -1192776
33555a192776o39314n88147o47555o42715k66710M25673R35230Q52520L29307
$$ -1192776 -1832090 -2420237 -3067792 -3710507 -3977217 -3551544 -2616314 -1763794 -1434487
33546a434487m8161J76140Q20961J130411N60518m70150r60446n67619l2821j26340
$$ -1434487 -1482648 -1306508 -485547 644864 1205382 735232 -225214 -792833 -825654 -951994
33536i51994o28113p51251k10271N73479J051123R26361K26289o12844r79048
$$ -951994 -1580107 -2331358 -2541629 -1968150 -917027 9334 235623 -377221 -1356269
33527a356269p45655m09703k84589j8000O51923J177749Q93416O1367m67574m06503
$$ -1356269 -2101924 -2511627 -2796216 -2814216 -2162293 -984544 -91128 -29761 -497335 -903838
33517i03838j86507j47281k18078k69135j84392K64832J017811J371380P14701
$$ -903838 -1090345 -1237626 -1455704 -1724839 -1909231 -1644399 -626588 744792 1459493
33508A459493m68872j034767o27557l8689l1896m47210o82814n38116k49942K050
$$ 1459493 990621 -44146 -671703 -710392 -742288 -1189498 -1872312 -2410428 -2660370 -2658320
33498b658320K87943O56278Q49840M87239l36195q57354m93015K43370L16422
$$ -2658320 -2370377 -1714099 -864259 -377020 -713215 -1570569 -2063584 -1820214 -1503792
33489a503792l33381o87388k21198L77678M52361L07238K95813M4749n77916p60655
$$ -1503792 -1837173 -2524561 -2745759 -2368081 -1915720 -1608482 -1312669 -1267920 -1845836 -2606491
33479b606491o6177N11097K8873p45866n53836K82260N72911L65141N56366R13676
$$ -2606491 -2672668 -2161571 -2132698 -2878564 -3432400 -3150140 -2577229 -2212088 -1655722 -742046
33469g42046M53980m23591k72419Q34989J153532O4891r77677r16770n51295o67881
$$ -742046 -288066 -711657 -984076 -149087 1004445 1069336 91659 -825111 -1376406 -2044287
33459b044287n81317K83579R78793N83907j45120j02584L02518R7286l58747l8266
$$ -2044287 -2625604 -2342025 -1363232 -779325 -924445 -1027029 -724511 -627225 -985972 -1024238
33449a024238P83951Q36963q9796q26396n99833N1187L26412J83750J4167l6886
$$ -1024238 -240287 596676 506880 -319516 -919349 -868162 -541750 -358000 -343833 -380719
33439c80719j00566k78238m82284m74891j46491J83180M1508m83261p03595k19519
$$ -380719 -481285 -759523 -1241807 -1716698 -1863189 -1680009 -1638501 -2121762 -2825357 -3044876
33429c044876N77050J098243J169643Q10769K4089p98885q70420K0687R63466
$$ -3044876 -2467826 -1369583 -199940 610829 634918 -163967 -1034387 -1013700 -50234
33420e0234R25673P46q32337r28860n06263j55316k12644n13133n65420j17754
$$ -50234 875439 876185 43848 -885012 -1391275 -1546591 -1759235 -2272368 -2837788 -2955542
33410b955542M29622M81944P6049k17103j72665q2088m1786J85635M99493M60696
$$ -2955542 -2525920 -2043976 -1967927 -2185030 -2357695 -2439783 -2481569 -2295934 -1796441 -1335745
33400a335745J47834J56949M96342M19932k57620o60190k16294L98761L67129
$$ -1335745 -1187911 -1030962 -534620 -114688 -372308 -1032498 -1248792 -850031 -482902
33391d82902n3903j81955n9644j35913l60211l80523k17748p9619R8486L69286
$$ -482902 -536805 -718760 -778404 -914317 -1274528 -1655051 -1872799 -1952418 -1853932 -1484646
33381a484646M56604K13800m8562r6969j20824k22728k09814j80500m97258q50278
$$ -1484646 -1028042 -814242 -862804 -959773 -1080597 -1303325 -1513139 -1693639 -2190897 -3041175
33371c041175l75173Q08242J326645N25948m54128m48461Q2093K37799L16887
$$ -3041175 -3416348 -2608106 -1281461 -755513 -1209641 -1658102 -1576009 -1338210 -1021323
33362a021323Q86446J238166L94537j010339j458326p35979O5273L69261M93446
$$ -1021323 -134877 1103289 1497826 487487 -970839 -1706818 -1641545 -1272284 -778838
33353g78838M95004Q5325m32217m53149j93808l12926n99822l04365L92101N61017
$$ -778838 -283834 -198509 -630726 -1083875 -1277683 -1590609 -2190431 -2494796 -2102695 -1541678
33343a541678J09577j27871J21085K61081O4954j5341J29157R3585r9980j0653
$$ -1541678 -1432101 -1559972 -1438887 -1177806 -1112852 -1128193 -999036 -905451 -1005431 -1016084
33333a016084K17133j5838n81279p02834k57062J30541K66106M61716M94999j34882
$$ -1016084 -798951 -814789 -1396068 -2098902 -2355964 -2225423 -1959317 -1497601 -1002602 -1137484
33323a137484q87873o21427M60242Q43448N3536n90056j22888O56482O75457J44393
$$ -1137484 -2025357 -2646784 -2186542 -1343094 -1289558 -1879614 -2002502 -1346020 -670563 -526170
33313e26170k34033m61172p66445q99923o95410m73669k43132N28811J684910
$$ -526170 -760203 -1221375 -1987820 -2887743 -3583153 -4056822 -4299954 -3771143 -2086233
33304b086233J998774Q86821m69015o65138P1055N18231K23869l33423p36299
$$ -2086233 -87459 799362 330347 -334791 -263736 254495 478364 144941 -591358
33295e91358q40688m77164K03499M99593K8726n78331n38546k9929K43207J64210
$$ -591358 -1432046 -1909210 -1705711 -1206118 -1177392 -1755723 -2294269 -2324198 -2080991 -1916781
33285a916781J62925L89873N82276N19089J49260m28234p94006n06942J13511
$$ -1916781 -1753856 -1363983 -781707 -262618 -113358 -541592 -1335598 -1842540 -1729029
33276a729029J66585m67963p54158o8709P21350N81129p5564j42252L87944N65083
$$ -1729029 -1562444 -2030407 -2784565 -2853274 -2131924 -1550795 -1626359 -1768611 -1380667 -815584
33266h15584J15185k45179j01046J03424j6081j64734K64K30599P8460l93759
$$ -815584 -700399 -945578 -1046624 -943200 -959281 -1124015 -1123751 -893152 -814692 -1208451
33256a208451o38365k98729L14661N34252J48358k91341k01924K13964K97948
$$ -1208451 -1846816 -2145545 -1830884 -1296632 -1148274 -1439615 -1641539 -1427575 -1129627
33247a129627j13005o17093r46934j048507o49164L50209J150096Q11764k06526
$$ -1129627 -1242632 -1859725 -2806659 -3855166 -4504330 -4154121 -3004025 -2192261 -2398787
33238b398787m91872J70312M86826j09856m94945J21065P72040M73594l7545K93274
$$ -2398787 -2890659 -2720347 -2233521 -2343377 -2838322 -2717257 -1945217 -1471623 -1509168 -1215894
33228a215894Q98544O49986r4102k04998J79959R6311l04558q1681N22606L00637
$$ -1215894 -317350 332636 238534 33536 213495 309806 5248 -76433 446173 746810
33218G46810p39350j198632n32370J69313M8753l51402l14872k8888J78884N26412
$$ 746810 7460 -1191172 -1723542 -1554229 -1505476 -1856878 -2171750 -2200638 -2021754 -1495342
33208a495342J021408R92419R4949r40163j177298n42884L69689R70681Q59629
$$ -1495342 -473934 518485 613434 -326729 -1504027 -2046911 -1677222 -706541 153088
33199A53088K3352q29258q08282l1472M32867J30147q4043N69201J445284J269261
$$ 153088 176440 -652818 -1461100 -1492572 -1059705 -929558 -1013601 -444400 1000884 2270145
33189B270145j06624j427567j453762k68739Q40413P21374l68370r90188k77456
$$ 2270145 2163521 735954 -717808 -986547 -146134 575240 206870 -783318 -1060774
33180a060774Q74354R35343k36131j324069j380432p40558l6879O20717J099985
$$ -1060774 -186420 748923 512792 -811277 -2191709 -2932267 -2969146 -2348429 -1248444
33171a248444Q89722n6967q53705p37217n5180M04275N43087P22354Q17901L30662
$$ -1248444 -358722 -415689 -1269394 -2006611 -2061791 -1657516 -1114429 -392075 425826 756488
33161G56488o43249j252764q90919L0086N34453J93799m04242l99413K35103O70477
$$ 756488 113239 -1139525 -2030444 -2000358 -1465905 -1272106 -1676348 -2075761 -1840658 -1170181
33151a170181L96816r8949k13870k05548n56626q46985l11498O89291R55707K71878
$$ -1170181 -773365 -872314 -1086184 -1291732 -1848358 -2695343 -3006841 -2317550 -1361843 -1089965
33141a089965k87802j55628r5513o62282j068108m86561M98206Q00178M48133
$$ -1089965 -1377767 -1533395 -1628908 -2291190 -3359298 -3845859 -3347653 -2547475 -2099342
33132b099342K01737J45454j41418l94689P2097R76966J148155K11697q10109
$$ -2099342 -1897605 -1752151 -1893569 -2288258 -2216161 -1239195 -91040 120657 -689452
33123f89452r45896m63630j33485l1096K48683O32751N96208O8292l48756k51156
$$ -689452 -1635348 -2098978 -2232463 -2263559 -2014876 -1382125 -785917 -717625 -1066381 -1317537
33113a317537l2372k36059o18148m16820M48361J058571O90593j62737m77270
$$ -1317537 -1349909 -1585968 -2204116 -2620936 -2172575 -1114004 -423411 -586148 -1063418
33104a063418m6303M95127P48049Q48980P36467L1461j077473j632843j073127
$$ -1063418 -1109721 -614594 133455 982435 1718902 1750363 672890 -959953 -2033080
33095b033080k3975N42187M54621K07861J45288K75169N12941O20070K50016m75514
$$ -2033080 -2057055 -1514868 -1060247 -852386 -707098 -431929 81012 701082 951098 475584
33085D75584p96948k39470O18853Q45250L28772l10242p05834r66686j069196
$$ 475584 -321364 -560834 58019 903269 1232041 921799 215965 -750721 -1819917
33076a819917p59171j17156L67164M10212J86798p4977k96145l05062R1739O46834
$$ -1819917 -2579088 -2696244 -2329080 -1918868 -1732070 -1807047 -2103192 -2408254 -2316515 -1669681
33066a669681P64154L06633r8373J00763N51084M49743l04049q93164o36298J19925
$$ -1669681 -905527 -598894 -697267 -596504 -45420 404323 100274 -792890 -1429188 -1309263
33056a309263M71973J24812l39446l72133j51578q3444l0296M05949J011007J028740
$$ -1309263 -837290 -712478 -1051924 -1424057 -1575635 -1659079 -1689375 -1283426 -272419 756321
33046G56321K24346o69134q35546l21886J78958J99027j25570l43997j35807L98969
$$ 756321 980667 311533 -524013 -845899 -666941 -467914 -593484 -937481 -1073288 -674319
33036f74319P83465O52113K09138m1626R590K3388j51628k65416j96561j90513
$$ -674319 109146 761259 970397 928771 938361 961749 810121 544705 348144 157631
33026A57631l64992m56997l18737k10884l11883l72846j85983J2580m4061k04205
$$ 157631 -207361 -664358 -983095 -1193979 -1505862 -1878708 -2064691 -2052111 -2096172 -2300377
33016b300377j92921p105K76873O86327J017859P66015j78762j117331j274694
$$ -2300377 -2493298 -2500403 -2223530 -1537203 -519344 246671 67909 -1049422 -2324116
33007b324116o93919n1274J59474k2478j95203R7960Q73233J401028R38894r4808
$$ -2324116 -3018035 -3069309 -2909835 -2932313 -3127516 -3029556 -2156323 -755295 183599 88791
32997H8791m42833K00918O42663j0373r46572r09477o7416M32026K16942j02690
$$ 88791 -354042 -153124 489539 479166 -467406 -1376883 -1444299 -1012273 -795331 -898021
32987h98021j31348m2536M8811J44921L365m44171o06484m9440N47807K50569
$$ -898021 -1029369 -1071905 -1023094 -878173 -874808 -1318979 -1925463 -1974903 -1427096 -1176527
32977a176527o20297r10211l29125L75069P21026P95734M59654m21159j035272
$$ -1176527 -1796824 -2707035 -3036160 -2661091 -1940065 -1144331 -684677 -1105836 -2141108
32968b141108l64115J033734J434486L93220o86074p73549m59869m20094k22944
$$ -2141108 -2505223 -1471489 -37003 356217 -329857 -1103406 -1563275 -1983369 -2206313
32959b206313M34172P32773J05379n67316l20196L22961L56695m847N6080L61210
$$ -2206313 -1772141 -1039368 -933989 -1501305 -1821501 -1498540 -1141845 -1146692 -1090612 -729402
32949g29402J53318l63499k94528L71565P43374M88519J37519o5817m81843j092631
$$ -729402 -576084 -939583 -1234111 -862546 -119172 369347 506866 441049 -40794 -1133425
32939a133425j218722n22197M68221J085963J161938P99809J68443l11416j94849
$$ -1133425 -2352147 -2874344 -2406123 -1320160 -158222 641587 810030 498614 303765
32930C03765L34320N40539Q4298n30721o44614k06030L20910N17644L37356O5042
$$ 303765 638085 1178624 1262922 732201 87587 -118443 202467 720111 1057467 1122509
32920A122509n758L2212k09435p42289r47266l95185L95232N96619K55061J45092
$$ 1122509 1116751 1148963 939528 197239 -750027 -1145212 -749980 -153361 101700 246792
32910B46792N15907P37497L39664k82388n10235l24032j12409l9972l117m731
$$ 246792 762699 1500196 1839860 1557472 1047237 723205 610796 570824 567707 562976
32900E62976j95946n60540p94426o06231j05343K23553P3749k28439j18635L48098
$$ 562976 367030 -193510 -987936 -1594167 -1699510 -1475957 -1402208 -1630647 -1749282 -1401184
32890a401184M91788L5819m06862k67844R9625P7145j51603J9047M68366M83509
$$ -1401184 -909396 -873577 -1280439 -1548283 -1448658 -1371513 -1523116 -1504069 -1035703 -552194
32880e52194m2401m39411l56750j81700j96169j39146J12814K05412J5156j9220
$$ -552194 -594595 -1034006 -1390756 -1572456 -1768625 -1907771 -1794957 -1589545 -1574389 -1593609
32870a593609K87764L98486o1187n44599l60862K53617N42921L96530L74411O96497
$$ -1593609 -1305845 -907359 -968546 -1513145 -1874007 -1620390 -1077469 -680939 -306528 389969
32860C89969Q95286N44100j79636p76172r08353n30639J45423P10756Q22161N18828
$$ 389969 1285255 1829355 1649719 873547 -34806 -565445 -420022 290734 1112895 1631723
32850A631723J57402J2581M6103L2268k13002o74909j079271j057525n28909J30801
$$ 1631723 1789125 1801706 1847809 1880077 1667075 992166 -87105 -1144630 -1673539 -1542738
32840a542738M60741M20324L55355M67811N24119K06660l72305p21937n83018
$$ -1542738 -1081997 -661673 -306318 161493 685612 892272 519967 -201970 -784988
32831g84988k89219l14732n74936n13732P2788O84252P81387M47900J06442p7336
$$ -784988 -1074207 -1388939 -1963875 -2477607 -2404819 -1720567 -939180 -491280 -384838 -462174
32821d62174j41562l7024J38523k7903o00219q18064q1003Q65601P42288l30291
$$ -462174 -603736 -640760 -502237 -530140 -1130359 -1948423 -2029426 -1163825 -421537 -751828
32811g51828q57124j30299Q23692R23637M91262K89917J86166k05756m18225R1520
$$ -751828 -1608952 -1739251 -915559 8078 499340 789257 975423 769667 351442 442962
32801D42962O45674J72864r48929j225204k39990P37962O20450j14399l79832
$$ 442962 1088636 1261500 312571 -912633 -1152623 -414661 205789 91390 -288442
32792b88442J1224L83024K39551k26509m40411n0373N93963O51834j65767r88316
$$ -288442 -277218 105806 345357 118848 -321563 -371936 222027 873861 708094 -280222
32782b80222q21773K1188L64724m2913k30753L26972Q64006O44757J10544n6790
$$ -280222 -1101995 -1080807 -716083 -758996 -989749 -662777 201229 845986 956530 899740
32772H99740j81070r33935j952014k114859j029693N37914J617949J809747J263683
$$ 899740 718670 -215265 -2167279 -4282138 -5311831 -4773917 -3155968 -1346221 -82538
32763h2538N16657K39092N55526O99577p9670j335694j771330q35709N69734J141869
$$ -82538 434119 673211 1228737 1928314 1848644 512950 -1258380 -2094089 -1524355 -382486
32753c82486N36749m57748q10256k09509O56461P96664N7018o23255l80099M24805
$$ -382486 154263 -303485 -1113741 -1323250 -666789 129875 186893 -436362 -816461 -391656
32743c91656P17602J84064m22652m42609r1486J20003J33220J33687O1225j90233
$$ -391656 325946 510010 87358 -355251 -446737 -326734 -193514 -59827 1398 -188835
32733a88835l49082n2006M94518N94113k8952p01465n26274M21090J043805O12056
$$ -188835 -537917 -589923 -95405 498708 469756 -231709 -757983 -336893 706912 1318968
32723A318968j98428k31458M11126M60848n18199j276288p09962L76475M68070
$$ 1318968 1120540 889082 1300208 1761056 1242857 -33431 -743393 -366918 101152
32714A01152k99266l99367N96756J306200O76062m96948r07141n42613k38708
$$ 101152 -198114 -597481 -725 1305475 1981537 1484589 577448 34835 -203873
32705b03873k06778l1063L12400M05697J76860l9786j20553j95570k22090j16309
$$ -203873 -410651 -441714 -129314 276383 453243 413457 292904 97334 -124756 -241065
32695b41065j26749m33047n71519k4334P41347P25039m8662m02716K23529Q44674
$$ -241065 -367814 -800861 -1372380 -1396714 -655367 69672 21010 -381706 -158177 686497
32685F86497M40149m04697l67109N38388R25346J09725q98195r23431k30181J60965
$$ 686497 1126646 721949 354840 893228 1818574 1928299 1030104 106673 -123508 37457
32675C7457R8941K25229N66753L74414m65487r41668l76378M77971N30142r7323
$$ 37457 136398 361627 928380 1302794 837307 -104361 -480739 -2768 527374 430051
32665D30051m38975j57067K48107M07892L68376Q6518m57994p70593l93219J41790
$$ 430051 -8924 -165991 82116 490008 858384 944902 486908 -283685 -676904 -535114
32655e35114o4001p23586o23348M10064J091469O39397j16700k18580N1067R5322
$$ -535114 -599115 -1322701 -1946049 -1535985 -444516 194881 78181 -140399 -89332 5990
32645E990J50824N03372N73119p5284o78928m38193O2737r7349m50715K9309R23095
$$ 5990 156814 660186 1233305 1158021 479093 40900 103637 6288 -444427 -415118 507977
32634E07977Q56208k51019j067376r40078n04563j28592N94674J456570J345582
$$ 507977 1364185 1113166 45790 -894288 -1398851 -1527443 -932769 523801 1869383
32625A869383O336j242729j283131n81541j19749J239J27507J58071q8019l18552
$$ 1869383 1875719 632990 -650141 -1231682 -1351431 -1350192 -1222685 -1064614 -1152633 -1471185
32615a471185k84565k23305k33024Q0778P66231J088648N92282q5804j44081K50053
$$ -1471185 -1755750 -1979055 -2212079 -2131301 -1365070 -276422 315860 230056 85975 336028
32605C36028M13097J71768j89756m92991o17502m01540n3273p5866l98623l51198
$$ 336028 749125 920893 731137 238146 -379356 -780896 -834169 -910035 -1308658 -1659856
32595a659856P7820l6318r15215j277510j97401J221151J311681K53976l86560
$$ -1659856 -1582036 -1618354 -2533569 -3811079 -4008480 -2787329 -1475648 -1221672 -1608232
32586a608232l9307M19901L90199K76232L94060L93487P7291j58443k5068K27399
$$ -1608232 -1647539 -1227638 -837439 -561207 -167147 226340 303631 145188 120120 347519
32576C47519L01081K00218r548k78862m07677k74415j34407k27942l06451o3419
$$ 347519 648600 848818 839270 560408 152731 -121684 -256091 -484033 -790484 -853903
32566h53903K55932K60916R7249Q3783N7062j91901k53715K59318P92979N41123
$$ -853903 -597971 -337055 -239806 -156023 -98961 -290862 -544577 -285259 507720 1048843
32556A048843k38424n98695l54869j36363j83097j36641R6944K72509M33465O49500
$$ 1048843 810419 211724 -143145 -279508 -462605 -599246 -502302 -229793 203672 853172
32546H53172M29186n09325j264029q59674K8448K378o86519n11175O29895J117221
$$ 853172 1282358 773033 -490996 -1350670 -1322222 -1319844 -2006363 -2517538 -1887643 -770422
32536g70422L47726k87634J59050P32667M87898M5477J05063O9280n63904r41862
$$ -770422 -422696 -710330 -551280 181387 669285 714762 819825 889105 325201 -616661
32526f16661l68025L00439J86570j0497N05009Q75287J25106p21408j51580J051498
$$ -616661 -984686 -684247 -497677 -508174 -3165 872122 997228 275820 124240 1175738
32516A175738Q09206q71175j791971q84777M61468P66219L06062j9339j21468
$$ 1175738 1984944 1113769 -678202 -1562979 -1101511 -335292 -29230 -48569 -170037
32507a70037k31608j37148L00990O58914N68341K21663r3707l62752n03611k91284
$$ -170037 -401645 -538793 -237803 421111 989452 1211115 1117408 754656 251045 -40239
32497d0239J40294K81168o5374n20484o29659k47694M59955R92935P76878o0019
$$ -40239 100055 381223 315849 -204635 -834294 -1081988 -622033 370902 1147780 1087761
32487A087761n91965l57270j03571m86174q07174k25066N31966K22227o82757
$$ 1087761 495796 138526 34955 -451219 -1258393 -1483459 -951493 -729266 -1412023
32478a412023o67062K00301L60770m30866o05369L96742R99946J80381p29816
$$ -1412023 -2079085 -1878784 -1518014 -1948880 -2554249 -2157507 -1157561 -977180 -1706996
32469a706996k86646P14187P31405j9551k75680M8338N8354l53421n19926l30452
$$ -1706996 -1993642 -1279455 -548050 -567601 -843281 -794943 -736589 -1090010 -1609936 -1940388
32459a940388j71961M8316N54943Q28704L45621k72412j57786K34556r1131p48624
$$ -1940388 -2112349 -2064033 -1509090 -680386 -334765 -607177 -764963 -530407 -621538 -1370162
32449a370162m78969O27504J162618O86127K18683K20617r0470q70884r42279
$$ -1370162 -1849131 -1221627 -59009 627118 845801 1066418 975948 105064 -837215
32440h37215J07264P72584j20038j350688j032041N44151J428734Q37088j72098
$$ -837215 -729951 42633 -77405 -1428093 -2460134 -1915983 -487249 349839 177741
32431A77741o26020o77568n94818j47596N49946P48115K20797j95322J21165N37490
$$ 177741 -448279 -1125847 -1720665 -1868261 -1318315 -570200 -349403 -544725 -423560 113930
32421A13930J93901n32859n47268K67962Q56710N47943o1177j11706K98090M25462
$$ 113930 307831 -225028 -772296 -504334 352376 900319 839142 727436 1025526 1450988
32411A450988J5701m65743n96265m52053k47036K2081L36877L76837j52407r68076
$$ 1450988 1466689 1000946 404681 -47372 -294408 -272327 64550 441387 288980 -679096
32401f79096j321032q03317J44889P52160Q22418P80835Q00473M23429n40715
$$ -679096 -2000128 -2803445 -2658556 -1906396 -1083978 -303143 497330 920759 380044
32392C80044j223324o43641O66261J021137j00638j132288n65745Q59594J261420
$$ 380044 -843280 -1486921 -820660 200477 99839 -1032449 -1598194 -738600 522820
32383E22820L40842m15362j28812L79945K27450j96227k30248j38319l80424n71757
$$ 522820 863662 448300 319488 699433 926883 730656 500408 362089 -18335 -590092
32373e90092k00882K57340K6398o04277o65159l045O30888Q30828Q46346O97406
$$ -590092 -790974 -533634 -507236 -1111513 -1776672 -1779717 -1148829 -318001 528345 1225751
32363A225751P3005p09899p02632K68482J029631M93497q86428j676682j149314
$$ 1225751 1298756 588857 -113775 154707 1184338 1677835 791407 -885275 -2034589
32354b034589O9836Q41098O32973j02776m66859p1211N39672N92833R2363k57198
$$ -2034589 -1964753 -1123655 -490682 -593458 -1060317 -1131528 -591856 977 93340 -163858
32344a63858p7160K50994K79155R1045m5908j70126l96136n01668j59940N10344
$$ -163858 -241018 9976 289131 380176 334268 164142 -231994 -733662 -893602 -383258
32334c83258R37696O95200j336m64314k77342J72074J62597l11409m47315J12276
$$ -383258 554438 1249638 1248302 783988 506646 678720 841317 529908 82593 194869
32324A94869N45858L1410q72500r82643k92802J41143L889P5039N90124O57143
$$ 194869 740727 772137 -100363 -1083006 -1375808 -1234665 -1230776 -1155737 -565613 91530
32314I1530j38337q58939p43157m04122n09092l97806O88338J903029J833720
$$ 91530 -46807 -905746 -1648903 -2053025 -2562117 -2959923 -2271585 -368556 1465164
32305A465164O83182j13642j13493j48124n16567n17727J3274K23487k43653n75146
$$ 1465164 2148346 2034704 1921211 1773087 1256520 738793 752067 975554 731901 156755
32295A56755k10586K35399J40171r6352M5233J97124j39845n86034n19334j42853
$$ 156755 -53831 181568 321739 225387 270620 467744 327899 -258135 -777469 -920322
32285i20322o5010k79384l68677l22760l64204l02311J48366O68806P22204M44789
$$ -920322 -985332 -1264716 -1633393 -1956153 -2320357 -2622668 -2474302 -1805496 -1083292 -638503
32275f38503M14493O68212O64652J76704m08982o71943n30100j12863K77695K48236
$$ -638503 -224010 444202 1108854 1285558 876576 204633 -325467 -438330 -160635 87601
32265H7601j71865l57065M2964M15817O0089o26131p14519k14906P4234K5483
$$ 87601 -84264 -441329 -398365 17452 77541 -548590 -1263109 -1478015 -1403781 -1378298
32255a378298K79003Q08783P05247k16401q29729l68027L94668M32703K444n6818
$$ -1378298 -1099295 -290512 414735 198334 -631395 -999422 -604754 -172051 -169607 -226425
32245b26425K03215J28771k74474m19989k00875l6714l1537R1613L41907M67469
$$ -226425 -23210 105561 -168913 -588902 -789777 -826491 -858028 -766415 -424508 42961
32235D2961M61138M11539J06441n13070q43726m23680R0100k01578q22754m49884
$$ 42961 504099 915638 1022079 509009 -334717 -758397 -668297 -869875 -1692629 -2142513
32225b142513R16639J674953Q88592m31664r18760n98033k60737o7223K47251
$$ -2142513 -1225874 449079 1337671 906007 -12753 -610786 -871523 -938746 -691495
32216f91495M79150K92222J151J00797L50554J84803k48394l17727J6521J99823
$$ -691495 -212345 79877 81028 181825 532379 717182 468788 151061 167582 367405
32206C67405N6203l9856N1081K6832k13603l75225k96795j16127J12928M17219
$$ 367405 423608 383752 434833 461665 248062 -127163 -423958 -540085 -427157 -9938
32196i938N53287K65781j41611j59200L4087k05406q22106r80941l48294M13245
$$ -9938 543349 809130 667519 508319 542406 337000 -485106 -1466047 -1814341 -1401096
32186a401096P39681Q60094R44286N03850o05319j384512q96508K23721N13972
$$ -1401096 -661415 198679 1142965 1646815 1041496 -343016 -1239524 -1015803 -501831
32177e01831k83476r53019n71373L91846R43310P57210J71287l94261o15190k96192
$$ -501831 -785307 -1738326 -2309699 -1917853 -974543 -217333 -46046 -440307 -1055497 -1351689
32167a351689L60992P66130N33900p5579m94590m53397r9623K73965M17535K08277
$$ -1351689 -990697 -224567 309333 233754 -260836 -714233 -813856 -539891 -122356 85921
32157H5921k09895m30054j29319N57009J112323J128159O67915R9609l84604r08521
$$ 85921 -123974 -554028 -683347 -126338 985985 2114144 2782059 2881668 2497064 1588543
32147A588543j456305j520049o55831O04956J008712J08770r59301q24780L28319
$$ 1588543 132238 -1387811 -2043642 -1438686 -429974 -321204 -1280505 -2105285 -1776966
32138a776966J066157O73258m3558r3169L74738N52523J88821k91546n57394o63033
$$ -1776966 -710809 -37551 -81109 -174278 200460 752983 941804 650258 92864 -570169
32128e70169o74230m87275o7103M16336P24308O99685L73006J4980j00436q4905
$$ -570169 -1244399 -1731674 -1798777 -1382441 -658133 41552 414558 429538 329102 244197
32118B44197l02361p02604p02635m9630O30217O47027K56960K16509N73166O68448
$$ 244197 -58164 -760768 -1463403 -1513033 -882816 -235789 21171 237680 810846 1479294
32108A479294K68841j48151l37554o21364r65135o52996M68406J219721N16711
$$ 1479294 1748135 1599984 1262430 641066 -324069 -977065 -508659 711062 1227773
32099A227773r25209j409091n82155K34076J53056q9196L65018R15774M88956
$$ 1227773 302564 -1106527 -1688682 -1454606 -1301550 -1390746 -1025728 -109954 379002
32090C79002n61446q18705O1451Q10934M27602m54382o57488j26657K82412J82616
$$ 379002 -182444 -1001149 -939698 -128764 298838 -155544 -813032 -939689 -657277 -474661
32080d74661l5287p0836q8144j99356k34196j46354j23766j74337o8712K09286
$$ -474661 -509948 -580784 -668928 -868284 -1102480 -1248834 -1372600 -1546937 -1615649 -1406363
32070a406363M19963N37021P19978P38524J07592r51109j407209p48168K24157
$$ -1406363 -986400 -449379 270599 1009123 1116715 165606 -1241603 -1989771 -1765614
32061a765614N09234K57129K76932O43698O73133J00563n47920p64872n74448
$$ -1765614 -1256380 -999251 -722319 -78621 594512 695075 147155 -617717 -1192165
32052a192165k30581J9267p5207m43379m98656R1625O56981L69531l57988l80883
$$ -1192165 -1422746 -1403479 -1478686 -1922065 -2420721 -2329096 -1672115 -1302584 -1660572 -2041455
32042b041455L17011N48888n0339l24493M54748J282223J043973K92469J45588
$$ -2041455 -1724444 -1175556 -1225895 -1550388 -1095640 186583 1230556 1523025 1668613
32033A668613L24597k23854j304609j636766q55679Q7376N26259P19753P75906
$$ 1668613 1993210 1769356 464747 -1172019 -2027698 -1940322 -1414063 -694310 81596
32024H1596L17611m40681n87310k054K50084l42560p64353r6573R15697J009459
$$ 81596 399207 -41474 -628784 -630838 -380754 -723314 -1487667 -1584240 -668543 340916
32014C40916L29420k0042J65423R6696m19666n98879p4369M29138K62243j52085
$$ 340916 670336 650294 815717 912413 492747 -106132 -180501 248637 510880 358795
32004C58795o9236M03827N38368J15140k80353j08870L99183N58903Q8196n67583
$$ 358795 289559 693386 1231754 1346894 1066541 957671 1356854 1915757 2003953 1436370
31994A436370p84642m60948j5773J93182J74849M1542j93474m14062l49494K0695
$$ 1436370 651728 190780 175007 368189 543038 584580 391106 -22956 -372450 -351755
31984c51755K99870K03431j4245P267J44621M8547k27883l37323k29324j28508
$$ -351755 -51885 151546 137301 144568 289189 337736 109853 -227470 -456794 -585302
31974e85302j3931L30616P53194P85029L38542j77220n34807q91681j151505q25817
$$ -585302 -599233 -268617 484577 1269606 1608148 1430928 896121 4440 -1147065 -1972882
31964a972882O6106O28302K62467l03001R595R17808J047403l0789j045726p71769
$$ -1972882 -1906776 -1278474 -1016007 -1319008 -1309413 -391605 655798 625009 -420717 -1192486
31954a192486K86845P24956K45239j21072K92988Q46021O69461n4600m93314l97182
$$ -1192486 -905641 -180685 64554 -56518 236470 1082491 1751952 1697352 1204038 806856
31944H06856k46108l28147l52936p0865K79305L72696K49906J11741k8032k17887
$$ 806856 560748 232601 -120335 -191200 88105 460801 710707 822448 794416 576529
31934E76529l41599k89522j73711j26192n7152J34608K80582J57848j42736l49209
$$ 576529 234930 -54592 -228303 -354495 -411647 -277039 3543 161391 18655 -330554
31924c30554l98652m00139l18569m9534K40155K34128l3927j78001o1752k9566
$$ -330554 -729206 -1129345 -1447914 -1497448 -1257293 -1023165 -1057092 -1235093 -1296845 -1326411
31914a326411l26790o14461l96209K46052P03941O02648J93947p0297o1088J04638
$$ -1326411 -1653201 -2267662 -2663871 -2417819 -1713878 -1111230 -917283 -987580 -1048668 -944030
31904i44030M00886P99407R37238L53456p55902j430697j002066j9350L74853
$$ -944030 -543144 256263 1193501 1546957 791055 -639642 -1641708 -1661058 -1286205
31895a286205r4096n52740k25315O16224J183342J131903O36852m2292o08261
$$ -1286205 -1380301 -1933041 -2158356 -1542132 -358790 773113 1409965 1367673 759412
31886G59412o77796j99770K90064K98904O7748J59420N54529P19371M67649J59646
$$ 759412 81616 -118154 171910 470814 538562 697982 1252511 1971882 2439531 2599177
31876B599177M6922j290n1274M2542J91633K9840m50420p17313m63851j17454
$$ 2599177 2646099 2644809 2593535 2636077 2827710 2857550 2407130 1689817 1225966 1108512
31866A108512j97563n03210m10355J82109O65290N16365n0472l90081k30010L9307
$$ 1108512 910949 407739 -2616 179493 844783 1361148 1310676 920595 690585 729892
31856G29892p2108m66704n88725k36845J11052q764l70324m49578k27222j06775
$$ 729892 657784 191080 -397645 -634490 -523438 -532202 -902526 -1352104 -1579326 -1686101
31846a686101j78206j21106J66968L91915M03119M13045N32894N46930L32261
$$ -1686101 -1864307 -1985413 -1818445 -1426530 -1023411 -610366 -77472 469458 801719
31837H01719Q9266m5065k27505n32249o91329m54460M7955M70822N50529J82455
$$ 801719 890985 845920 618415 86166 -605163 -1059623 -1011668 -540846 9683 192138
31827A92138m49165p57462k29732P93637J256459N77625o44103j367349j211862
$$ 192138 -257027 -1014489 -1244221 -450584 805875 1383500 739397 -627952 -1839814
31818a839814n68143M7268L95166M79248M20544L19310J67151J2305J08474N62472
$$ -1839814 -2407957 -2360689 -1965523 -1486275 -1065731 -746421 -579270 -566965 -458491 103981
31808A03981R19938N99049k41854q09060p21524l82007j98497q0947J01292K27918
$$ 103981 1023919 1622968 1381114 572054 -149470 -531477 -729974 -810921 -709629 -481711
31798d81711L25822N68946O56455L0534r37500r64654L06774J436766J044202
$$ -481711 -155889 413057 1069512 1100046 162546 -802108 -495334 941432 1985634
31789A985634k57871q53197m31670n9509k58792l50825J57212O51985L34711o06450
$$ 1985634 1727763 874566 442896 383387 124595 -226230 -69018 582967 917678 311228
31779C11228j192957p47461M17740J290752J162263L75987j62217k02538l13992
$$ 311228 -881729 -1629190 -1211450 79302 1241565 1617552 1455335 1252797 938805
31770I38805p27764q63443m10251L6548N2879J54417O54092P49687j12987q95297
$$ 938805 211041 -652402 -1062653 -1026105 -973226 -818809 -164717 584970 471983 -423314
31760d23314m11890O22102O20586l31385p54245k94067n6982m39791n68328j62625
$$ -423314 -835204 -213102 407484 76099 -678146 -972213 -1029195 -1468986 -2037314 -2199939
31750b199939o7697m55531l49623M06232N44182l79037r06867l274J171248J157091
$$ -2199939 -2267636 -2723167 -3072790 -2666558 -2122376 -2501413 -3408280 -3411554 -2240306 -1083215
31740a083215M35471K52673M48666J58829k86424J9999O76401N02014l81458o91002
$$ -1083215 -647744 -395071 53595 212424 -74000 -54001 622400 1124414 742956 51954
31730E1954r3753L94230J87384j38805j29975j66915n00032o43676k27292L36776
$$ 51954 -41799 352431 539815 401010 271035 104120 -395912 -1039588 -1266880 -930104
31720i30104M73789J71370k04526l65438k24522M8500J08700n5987P6255P31017
$$ -930104 -456315 -284945 -489471 -854909 -1079431 -1030931 -922231 -978218 -901963 -170946
31710a70946J149672N20747o37290r79253j90444O22979N33523j35644n96094
$$ -170946 978726 1499473 862183 -117070 -307514 315465 848988 713344 117250
31701A17250o01905k99198J97844O35106O03612J21887k40186j68700m9353k36695
$$ 117250 -484655 -783853 -586009 49097 652709 774596 534410 365710 316357 79662
31691G9662l91643o3664M45083M22030j66830n06552K013Q84877J114781L87579
$$ 79662 -311981 -375645 69438 491468 324638 -181914 -179901 704976 1819757 2207336
31681B207336m71257n53587l3465J54023l21616p81311o39665k07119J1326J40477
$$ 2207336 1736079 1182492 1149027 1303050 981434 200123 -439542 -646661 -635335 -494858
31671d94858M35764N53600J34543l31943j65032K75430M5221q05371j190362o27413
$$ -494858 -59094 494506 629049 297106 132074 407504 452725 -352646 -1543008 -2170421
31661b170421J32973L96484M39343O58238P02104J53234n39446n66293J07807
$$ -2170421 -2037448 -1640964 -1201621 -543383 158721 311955 -227491 -793784 -685977
31652f85977P30191P30712K34576l03206n79298n42462k88840J6795J74559L1993
$$ -685977 44214 774926 1009502 706296 126998 -415464 -704304 -687509 -512950 -480957
31642d80957l18893m82187k04523J01787k08527q91345q55279J91930R66273L64922
$$ -480957 -799850 -1282037 -1486560 -1384773 -1593300 -2484645 -3339924 -3147994 -2181721 -1816799
31632a816799p22168o12021O20324J299742P57846J49927L50508O15099P1865
$$ -1816799 -2538967 -3150988 -2530664 -1230922 -473076 -323149 27359 642458 714323
31623G14323p62294r11661m24129K3779K68713N22365O66898M79846J22670j83296
$$ 714323 -47971 -959632 -1383761 -1359982 -1091269 -568904 97994 577840 700510 517214
31613E17214m88289o96513m85394o2587j44305o56638n01451O30531J361266O29705
$$ 517214 28925 -667588 -1152982 -1215569 -1359874 -2016512 -2517963 -1887432 -526166 103539
31603A03539m87224l78905N48559O24693l15398p65004n7207P33669O68172J61856
$$ 103539 -383685 -762590 -214031 410662 95264 -669740 -726947 6722 674894 836750
31593H36750j27741k81192m15013j74142M21357O00921k2904p50094q11868l60117
$$ 836750 709009 427817 12804 -161338 260019 860940 838036 87942 -723926 -1084043
31583a084043Q7608M37621O86580N34625k3555l70657j84949o5114n28928r90357
$$ -1084043 -996435 -558814 127766 662391 638836 268179 83230 18116 -510812 -1501169
31573a501169n96748L56431P91484M08545l5466J7950K30500Q5075l60518o97405
$$ -1501169 -2097917 -1741486 -950002 -541457 -576923 -558973 -328473 -243398 -603916 -1301321
31563a301321o94668l83033P1718M25964N33227N22612N59074M58248q0211q02018
$$ -1301321 -1995989 -2379022 -2307304 -1881340 -1348113 -825501 -266427 191821 111610 -690408
31553f90408r20127q6298R68807J151480K77017o97007p65353K6260P33982O57006
$$ -690408 -1610535 -1696833 -728026 423454 700471 3464 -761889 -735629 -1647 655359
31543F55359P9009k41428j14028q2000m74955p33085j31068J000105J413120N18050
$$ 655359 734368 492940 378912 296912 -178043 -911128 -1042196 -42091 1371029 1889079
31533A889079p29306j004468l26149J03866l10866p63918l58144N17937Q04250
$$ 1889079 1159773 155305 -170844 -66978 -377844 -1141762 -1499906 -981969 -177719
31524a77719L26421r1073N3922L49641L40417K04873J91493K9396n31928j029837
$$ -177719 148702 57629 111551 461192 801609 1006482 1197975 1227371 695443 -334394
31514c34394p89601O0894O72509N65114J44449K8199K53120L73589J25622k73208
$$ -334394 -1123995 -1063101 -390592 174522 318971 347170 600290 973879 1099501 826293
31504H26293m74137m45559m08285l97210j91020K01287L57763R8486l2392M81896
$$ 826293 352156 -93403 -501688 -898898 -1089918 -888631 -530868 -432382 -464774 17122
31494A7122J158459J074442K99281j62957M2236J36305l59217q03199o53946m49438
$$ 17122 1175581 2250023 2549304 2386347 2428583 2564888 2205671 1402472 748526 299088
31484B99088p13137q37760j42579P44035P88533K21060j8032R003m32220j013653
$$ 299088 -414049 -1251809 -1394388 -650353 138180 359240 341208 350211 -82009 -1095662
31474a095662o03795O81949J316911O15177l20033m33524j44372k18191m20579
$$ -1095662 -1699457 -1017508 299403 914580 594547 161023 16651 -201540 -622119
31465f22119k01135K02500K67737J19675J44137K14077K0619k82928l76377k98113
$$ -622119 -823254 -620754 -353017 -233342 -89205 124872 145491 -137437 -513814 -811927
31455h11927k01433l4074J64103J68461P8714K73974N86197L52045l50532n16641
$$ -811927 -1013360 -1047434 -883331 -714870 -636156 -362182 224015 576060 225528 -291113
31445b91113J85479P01900K50505l78583j81204L84405K91189k89847m48987j63223
$$ -291113 -105634 596266 846771 468188 286984 671389 962578 672731 223744 60521
31435F0521j04150k68049j46773Q1526j13719l73249N7475P79166O51582k84742
$$ 60521 -43629 -311678 -458451 -376925 -490644 -863893 -806418 -27252 624330 339588
31425C39588p85211m01992k4663j87315l28873j43702j95022n88289m33435N89843
$$ 339588 -445623 -847615 -872278 -1059593 -1388466 -1532168 -1727190 -2315479 -2748914 -2159071
31415b159071J387518J070538L11576J19123K67569L4287l63393k78284M6948
$$ -2159071 -771553 298985 610561 729684 997253 1031540 668147 389863 436811
31406D36811r9299n45629m74405J83734O45865N09267J71823J5078j9201J8758
$$ 436811 337512 -208117 -682522 -498788 147077 656344 828167 843245 824044 842802
31396H42802K29977M51340L11939j62869n00672m38584k10928j11433j37020j29237
$$ 842802 1072779 1524119 1836058 1673189 1172517 733933 523005 411572 274552 145315
31386A45315P662K25190K66612j60126q90881j227860p14421K29175Q19939Q15200
$$ 145315 152977 378167 644779 484653 -406228 -1634088 -2348509 -2119334 -1299395 -484195
31376d84195M93420N8578l65645m20486R7401O51365N07599j46203l73766J22655
$$ -484195 9225 67803 -297842 -718328 -620927 30438 538037 391834 18068 140723
31366A40723N64769L11761k20395k97473O5049L28088L02341J82934m0301n51226
$$ 140723 705492 1017253 796858 499385 564434 892522 1194863 1377797 1337496 786270
31356G86270j101476j045860k27446N81329N10661k92797p93481l56967M81481
$$ 786270 -315206 -1361066 -1588512 -1007183 -496522 -789319 -1582800 -1939767 -1458286
31347a458286P95258M80031K01252K88449L46293Q7832j37721l4674K5621l47620
$$ -1458286 -663028 -182997 18255 306704 652997 740829 603108 568434 594055 246435
31337B46435p73102o35697p8232K80705L62115N37040O84011K85837m80802p17342
$$ 246435 -526667 -1162364 -1240596 -959891 -597776 -60736 623275 909112 428310 -289032
31327b89032j25984N14721N57708L30914L00008K15064k34830o09691l82950O8462
$$ -289032 -415016 99705 657413 988327 1288335 1503399 1268569 658878 275928 344390
31317C44390q35m81568n76237o3093M01508K82784j79616m26385k06179L14562
$$ 344390 343555 -138013 -714250 -777343 -375835 -93051 -272667 -699052 -905231 -590669
31307e90669O98836N41316l3376l50916p2176K05069j78406p95184p04333K0894
$$ -590669 108167 649483 616107 265191 193015 398084 219678 -575506 -1279839 -1258945
31297a258945L82647J14973Q2524O72462R68850K48002p08213p67452j59058Q4749
$$ -1258945 -876298 -761325 -678801 -6339 962511 1210513 502300 -265152 -424210 -339461
31287c39461j28099j9087M68823M52490l61299j067685q76278j18949N01300Q59506
$$ -339461 -467560 -486647 -17824 434666 73367 -994318 -1870596 -1989545 -1488245 -628739
31277f28739J076038R54564M03919j23545k68385l73432p81043r76384k89134
$$ -628739 447299 1401863 1805782 1682237 1413852 1040420 259377 -717007 -1006141
31268a006141Q15826J114217L14529n18654m67463R0542K36972k00160o35373
$$ -1006141 -190315 923902 1238431 719777 252314 342856 579828 379668 -255705
31259b55705o20842k52742J24885K49223R3427p6349L4656K90116K36808j43345
$$ -255705 -876547 -1129289 -1004404 -755181 -661754 -738103 -703447 -413331 -176523 -319868
31249c19868k45073K41361O97984M31307k27823m10662n8067R0942j80752k39559
$$ -319868 -564941 -323580 374404 805711 577888 167226 109159 200101 19349 -220210
31239b20210J60474K90291l37503r97297q00636r3528J59932l4850J27885O36479
$$ -220210 -59736 230555 -106948 -1104245 -1904881 -1998409 -1838477 -1873327 -1745442 -1108963
31229a108963M97657n04310j090354k56035J158634J621942J000854M03185K99264
$$ -1108963 -611306 -1115616 -2205970 -2462005 -1303371 318571 1319425 1722610 2021874
31220B021874O0632n88238r12308m25854K06896K18049j13301j62211j36857n46467
$$ 2021874 2082506 1494268 581960 156106 363002 581051 467750 305539 168682 -377785
31210c77785r50680m51128O77256J101469M02424k74820o2382K78459k78519j228615
$$ -377785 -1328465 -1779593 -1102337 -868 401556 126736 64354 342813 64294 -1164321
31200a164321j286763l99258K79245K52645K61911Q28238J348152J086522K23650
$$ -1164321 -2451084 -2850342 -2571097 -2318452 -2056541 -1228303 119849 1206371 1430021
31191A430021n62965q89681o48817J03858Q17082P24004l5908l29722L03944P28671
$$ 1430021 867056 -22625 -671442 -567584 249498 973502 937594 607872 911816 1640487
31181A640487j33407j455344j556778l75368N06914K33282l43073k96170R4515
$$ 1640487 1507080 51736 -1505042 -1880410 -1373496 -1140214 -1483287 -1779457 -1684942
31172a684942K70031M27824Q20829R36421L16077m58100n51240j74367j27818
$$ -1684942 -1414911 -987087 -166258 770163 1086240 628140 76900 -97467 -225285
31163b25285l85149j82883N59816R45646M38947l34620n07915r0649K61974K02460
$$ -225285 -610434 -793317 -233501 712145 1151092 816472 308557 217908 479882 682342
31153F82342k1388n7981J00733J63296q9604m94097o32445l63946q0636k12046
$$ 682342 660954 602973 703706 867002 777398 283301 -349144 -713090 -793726 -1005772
31143a005772n97478o63570j94613L86809N50827K24677k22245l61557m0532N12931
$$ -1005772 -1603250 -2266820 -2461433 -2074624 -1523797 -1299120 -1521365 -1882922 -1923454 -1410523
31133a410523R01405R41009P47094M12561j20686p16936r39013o06305j35466
$$ -1410523 -509118 431891 1178985 1591546 1470860 753924 -185089 -791394 -926860
31124i26860N5551J38083M06539O17794M32825J67373L03935N12177J03751o54243
$$ -926860 -871309 -733226 -326687 291107 723932 891305 1195240 1707417 1811168 1156925
31114A156925p66489j43657J47574l85750q33067l94130L22260L68749j7121J7353
$$ 1156925 390436 246779 394353 8603 -824464 -1218594 -896334 -527585 -544706 -527353
31104e27353M32324M49084p9451m65888k88451J45686M47629N46034M00187m9171
$$ -527353 -95029 354055 274604 -191284 -479735 -334049 113580 659614 1059801 1010630
$$ [...]
##END NTUPLES=NMR SPECTRUM
##END=
