##TITLE=31Pdec_LY-TMF-13.5.R.t
 D2O, 24 sc
 3.3.2020
##JCAMPDX= 6.0         $$ Bruker NMR JCAMP-DX V2.0
##DATA TYPE= NMR SPECTRUM
##DATA CLASS= NTUPLES
##ORIGIN= UXNMR, Bruker Analytische Messtechnik GmbH
##OWNER= root
$$ XWIN-NMR		Version 3.5
$$ Tue Mar  3 13:59:20 2020 Russian Standard Time (UT+4h)  she@DPX200
##.OBSERVE FREQUENCY= 81.013821
##.OBSERVE NUCLEUS= ^31P
##.ACQUISITION MODE= SIMULTANEOUS
##.ACQUISITION SCHEME= undefined
##.AVERAGES= 24
##.DIGITISER RES= 17
##SPECTROMETER/DATA SYSTEM= spect
##.PULSE SEQUENCE= zgpg30
##.SOLVENT NAME= CDCl3
##.SHIFT REFERENCE= (INTERNAL, CDCl3, 0, 182.463)
##AUDIT TRAIL= $$ (NUMBER, WHEN, WHO, WHERE, WHAT)
$$ ##TITLE= Audit trail, XWIN-NMR		Version 3.5
$$ ##JCAMPDX= 5.01
$$ ##ORIGIN= Bruker BioSpin GmbH
$$ ##OWNER= she
$$ F:/spectra/data/she/nmr/P31/1/pdata/1/auditp.txt
$$ ##AUDIT TRAIL=  $$ (NUMBER, WHEN, WHO, WHERE, WHAT)
(   1,<2020-03-03 13:49:34.26 +0400>,<she>,<DPX200>,
      <created by zg, POWCHK disabled, PULCHK disabled
       configuration hash MD5:
       00 E9 B6 7A A2 85 ED C7 34 08 36 98 17 FE 4E 26
       data hash MD5: 32K
       83 1D 9F 49 86 35 54 EC A1 53 07 A3 8E A1 C5 51>)
(   2,<2020-03-03 13:58:05.32 +0400>,<she>,<DPX200>,
      <Start of raw data processing
       efp BC_mod = 2 LB = 1 FT_mod = 6 PKNL = 1 PHC0 = -1454 PHC1 = 359.6017 SI = 64K 
       data hash MD5: 64K
       06 D9 E8 CC 2B 46 E3 D9 D9 51 CB C4 51 63 0B 29>)
(   3,<2020-03-03 13:58:36.40 +0400>,<she>,<DPX200>,
      <pk PHC0 = 115.0897 PHC1 = -233.2 
       data hash MD5: 64K
       6F EB 43 EF AD 8B 6C 27 84 20 13 0B A2 C1 4D 9C>)
(   4,<2020-03-03 13:58:50.98 +0400>,<she>,<DPX200>,
      <pk PHC0 = 2.399984 PHC1 = 0 
       data hash MD5: 64K
       F3 11 84 08 5A E9 11 4D A1 F2 29 AF FD E1 2D BF>)
$$ ##END=
$$ 
$$ hash MD5
$$ 0D 3F 65 26 B2 E0 B7 07 A2 E2 C7 0B 44 DE 32 D4
##$RELAX= 
##$RELAX= 
##$RELAX= 
##$RELAX= 
##$RELAX= 
##$RELAX= 
##$RELAX= 
##$RELAX= 
$$ Bruker specific parameters
$$ --------------------------
##$DU= <F:/spectra>
##$EXPNO= 1
##$NAME= <P31>
##$PROCNO= 1
##$TYPE= <nmr>
##$USER= <she>
##$AMP= (0..31)
100 100 100 100 100 100 100 100 100 100 100 100 100 100 100 100 100 100 
100 100 100 100 100 100 100 100 100 100 100 100 100 100 
##$AQSEQ= 0
##$AQ_mod= 1
##$AUNM= <au_zg>
##$AUTOPOS= <>
##$BF1= 81.014009
##$BF2= 200.13
##$BF3= 200.13
##$BF4= 200.13
##$BF5= 200.13
##$BF6= 200.13
##$BF7= 200.13
##$BF8= 200.13
##$BYTORDA= 1
##$CFDGTYP= 0
##$CFRGTYP= 5
##$CHEMSTR= <none>
##$CNST= (0..31)
1 1 145 1 1 1 1 1 1 1 1 1 1 1 1 1 1 1 1 1 1 1 1 1 1 1 1 1 1 1 1 1 
##$CPDPRG= <waltz16>
##$CPDPRG1= <>
##$CPDPRG2= <waltz16>
##$CPDPRG3= <>
##$CPDPRG4= <mlev>
##$CPDPRG5= <mlev>
##$CPDPRG6= <mlev>
##$CPDPRG7= <mlev>
##$CPDPRG8= <mlev>
##$CPDPRGB= <>
##$CPDPRGT= <>
##$D= (0..31)
0 1 0 0 0 0 0 0 0 0 0 0.03 2e-05 3e-06 0 0 0 0 0 0 0 0 0 0 0 0 0 0 0 0 
0 0 
##$DATE= 1583228973
##$DBL= (0..7)
120 120 120 11 120 120 24 19 
##$DBP= (0..7)
150 150 150 150 150 150 150 150 
##$DBP07= 0
##$DBPNAM0= <>
##$DBPNAM1= <>
$$ [...]
##$SUBNAM2= <"">
##$SUBNAM3= <"">
##$SUBNAM4= <"">
##$SUBNAM5= <"">
##$SUBNAM6= <"">
##$SUBNAM7= <"">
##$SUBNAM8= <"">
##$SUBNAM9= <"">
##$SW= 369.568048894756
##$SWIBOX= (0..15)
0 1 3 0 0 0 0 0 0 0 0 0 0 0 0 0 
##$SW_h= 29940.119760479
##$TD= 32768
##$TD0= 1
##$TE= 0
##$TE2= 300
##$TE3= 300
##$TEG= 300
##$TL= (0..7)
0 120 53 12 22 120 120 120 
##$TP= (0..7)
150 150 150 150 150 150 150 150 
##$TP07= 0
##$TPNAME0= <>
##$TPNAME1= <>
##$TPNAME2= <>
##$TPNAME3= <>
##$TPNAME4= <>
##$TPNAME5= <>
##$TPNAME6= <>
##$TPNAME7= <>
##$TPOAL= (0..7)
0.5 0.5 0.5 0.5 0.5 0.5 0.5 0.5 
##$TPOFFS= (0..7)
0 0 0 0 0 0 0 0 
##$TUNHIN= 0
##$TUNHOUT= 0
##$TUNXOUT= 0
##$USERA1= <user>
##$USERA2= <user>
##$USERA3= <user>
##$USERA4= <user>
##$USERA5= <user>
##$V9= 5
##$VALIST= <valist>
##$VCLIST= <CCCCCCCCCCCCCCC>
##$VD= 0
##$VDLIST= <DDDDDDDDDDDDDDD>
##$VPLIST= <PPPPPPPPPPPPPPP>
##$VTLIST= <TTTTTTTTTTTTTTT>
##$WBST= 1024
##$WBSW= 4
##$XGAIN= (0..3)
0 0 0 0 
##$XL= 0
##$YL= 0
##$YMAX_a= 27222
##$YMIN_a= -28409
##$ZGOPTNS= <>
##$ZL1= 120
##$ZL2= 120
##$ZL3= 120
##$ZL4= 120
##$ABSF1= 0
##$ABSF2= 0
##$ABSG= 0
##$ABSL= 0
##$ALPHA= 0
##$AQORDER= 0
##$ASSFAC= 0
##$ASSFACI= 0
##$ASSFACX= 0
##$ASSWID= 0
##$AUNMP= <proc_1d>
##$AZFE= 0.1
##$AZFW= 0.5
##$BCFW= 0
##$BC_mod= 2
##$BYTORDP= 0
##$COROFFS= 0
##$CY= -3
##$DATMOD= 1
##$DC= 0
##$DFILT= <>
##$DTYPP= 0
##$F1P= 0
##$F2P= 0
##$FCOR= 1
##$FTSIZE= 65536
##$FT_mod= 6
##$GAMMA= 0
##$GB= 0
##$INTBC= 1
##$INTSCL= 5.30512e-09
##$ISEN= 30
##$LB= 1
##$LEV0= 0
##$LPBIN= 0
##$MAXI= 10000
##$MC2= 0
##$MEAN= 0
##$ME_mod= 0
##$MI= 50
##$NCOEF= 0
##$NC_proc= -5
##$NLEV= 6
##$NOISF1= 182.463
##$NOISF2= 159.3651
##$NSP= 0
##$NTH_PI= 0
##$NZP= 0
##$OFFSET= 182.463
##$PC= 4
##$PHC0= -1336.51
##$PHC1= 126.4017
##$PH_mod= 1
##$PKNL= yes
##$PPARMOD= 0
##$PSCAL= 0
##$PSIGN= 0
##$REVERSE= no
##$SF= 81.0140089999434
##$SI= 65536
##$SIGF1= 159.3651
##$SIGF2= -187.1042
##$SINO= 113.3802
##$SIOLD= 16384
##$SREGLST= <1H.CDCl3>
##$SSB= 0
##$STSI= 65536
##$STSR= 0
##$SW_p= 29940.119760479
##$SYMM= 0
##$S_DEV= 0
##$TDeff= 32768
##$TDoff= 0
##$TI= <>
##$TILT= no
##$TM1= 0
##$TM2= 0
##$TOPLEV= 0
##$USERP1= <user>
##$USERP2= <user>
##$USERP3= <user>
##$USERP4= <user>
##$USERP5= <user>
##$WDW= 1
##$XDIM= 65536
##$YMAX_p= 389745276
##$YMIN_p= -5094424
$$ End of Bruker specific parameters
$$ ---------------------------------
##NTUPLES= NMR SPECTRUM
##VAR_NAME=  FREQUENCY,     SPECTRUM/REAL,   SPECTRUM/IMAG
##SYMBOL=    X,             R,               I
##VAR_TYPE=  INDEPENDENT,   DEPENDENT,       DEPENDENT
##VAR_FORM=  AFFN,          ASDF,            ASDF
##VAR_DIM=   65536,         65536,           65536
##UNITS=     HZ,            ARBITRARY UNITS, ARBITRARY UNITS
##FACTOR=    0.456856943014862, 1,           1
##FIRST=     14782.0589164792, 0,            0
##LAST=      -15158.0608439998, 0,           0
##MIN=       -15158.0608439998, -5094424,    0
##MAX=       14782.0589164792, 389745276,    0
$$ Real data points
##PAGE= N=1
##DATA TABLE= (X++(R..R)), XYDATA
$$ [...]
$$ plain form
36774 1079451 545720 202740 218915 381414 432114 316349 181725 148470 120632 -23807
36764 -23807 -96484 237085 900219 1392721 1476768 1442452 1481352 1343758 1007464 1066573 1762306
36753 1762306 2140048 1150427 -636933 -1516392 -906707 -9214 114029 -48219 313049
36744 313049 718900 174462 -1061621 -1791393 -1771934 -1971931 -2744088 -3016141 -1946855
36735 -1946855 -406566 127035 -422119 -817165 -370025 271809 317749 -26477 -40937 395532
36725 395532 699841 430166 -175960 -562382 -525717 -378117 -473418 -730441 -794979 -614797
36715 -614797 -546209 -779226 -1002877 -918416 -766183 -918251 -1192525 -1125104 -811014 -845337
36705 -845337 -1369963 -1778360 -1538731 -783021 94724 857054 1208137 804189 -98830 -572074
$$ packed form
36774A079451n33731l42980J6175J62499N0700j15765j34624l3255k7838j44439
36764b3807p2677L33569O63134M92502Q4047l4316L8900j37594l36294N9109O95733
36753A762306L77742r89621j787360q79459O09685Q97493J23243j62248L61268
36744C13049M05851n44438j236083p29772J9459j99997p72157k72053J069286
36735a946855J540289N33601n49154l95046M47140O41834M5940l44226j4460M36469
36725C95532L04309k69675o06126l86422L6665J47600r5301k57023o4538J80182
36715f14797O8588k33017k23651Q4461J52233j52068k74274O7421L14090l4323
36705h45337n24626m08397K39629P55710Q77745P62330L51083m03948r03019m73244
$$ plain form
36695 -572074 -123806 570580 615697 162081 71991 631912 1299695 1537089 1202307 270262
36685 270262 -1073056 -2073459 -1914152 -751945 328972 526972 -16193 -756844 -1286785
36676 -1286785 -1253146 -512994 345231 331348 -681380 -1578758 -1314615 -115562 1020120
36667 1020120 1539736 1594769 1517838 1552075 1797486 2011202 1770428 1167896 900938 1253144
36657 1253144 1514006 1001303 178824 30581 700269 1535895 2154097 2564376 2496210 1680320
36647 1680320 767264 820050 1668420 1891163 894092 -62310 366288 1705056 2458468
36638 2458468 2159426 1563987 1193255 829543 416302 368847 715758 806168 303497 -206493
36628 -206493 -105580 306118 368205 190208 468985 1256983 1675207 1115986 152349 -224302
$$ packed form
36695e72074M48268O94386M5117m53616r0090N59921O67783K37394l34782r32045
36685B70262j343318j000403J59307J162207J080917J98000n43165p40651n29941
36676a286785L3639P40152Q58225j3883j012728q97378K64143J199053J135682
36667A020120N19616N5033p6931L4237K45411K13716k40774o02532k66958L52206
36657A253144K60862n12703q22479j48243O69688Q35626O18202M10279o8166q15890
36647A680320r13056N2786Q48370K22743r97071r56402M28598J338768P53412
36638B458468k99042n95439l70732l63712m13241m7455L46911R0410n02671n09990
36628b06493J00913M11698O2087j77997K78777P87998M18224n59221r63637l76651
$$ plain form
36618 -224302 85913 345717 202759 117015 363697 361823 -366590 -1083563 -648617 643121
36608 643121 1104703 -92164 -1661432 -1915647 -983657 -305062 -378456 -294615 467737 1083197
36598 1083197 740054 -72423 -441614 -466074 -850257 -1491588 -1526525 -738526 22505 44702
36588 44702 -356593 -483001 -223256 16728 -15621 -176871 -142267 321816 1032446 1238661
36578 1238661 247388 -1543102 -2698779 -2245382 -749824 495963 956666 973206 825470
36569 825470 506546 272128 494342 850111 529694 -434269 -875169 -53916 1187569
36560 1187569 1505784 721600 -373273 -1378323 -2412485 -3090379 -2585306 -1002919 323801
36551 323801 467512 63368 181177 697843 662696 -89779 -656721 -377506 392658 969682
$$ packed form
36618b24302L10215K59804j42958q5744K46682j874p28413p16973M34946J291738
36608F43121M61582j196867j569268k54215R31990O78595p3394Q3841P62352O15460
36598A083197l43143q12477l69191k4460l84183o41331l4937P87999P61031K2197
36588D4702m01295j26408K59745K39984l2349j61250L4604M64083P10630K06215
36578A238661r91273j790490j155677M53397J495558J245787M60703J6540j47736
36569H25470l18924k34418K22214L55769l20417r63963m40900Q21253J241485
36560A187569L18215p84184j094873j005050j034162o77894N05073J582387J326720
36551C23801J43711m04144J17809N16666l5147p52475n66942K79215P70164N77024
$$ plain form
36541 969682 1106230 833981 181708 -569153 -858306 -537661 -223556 -495567 -1039838 -1097698
36531 -1097698 -558435 -46852 1098 -207450 -342490 -406751 -495450 -519295 -413906 -341205
36521 -341205 -463620 -720876 -965636 -1091992 -933435 -349803 414355 786194 516457 -25195
36511 -25195 -449060 -867579 -1446938 -1817230 -1513946 -805091 -421473 -494295 -437321 -16713
36501 -16713 154142 -431117 -1263510 -1421304 -809375 -246957 -372987 -909873 -1101532 -600178
36491 -600178 186794 476882 -205338 -1585956 -2809071 -3091355 -2264648 -793511 543078
36482 543078 1015365 372320 -829938 -1583218 -1460895 -1149356 -1574131 -2609284 -3154546
36473 -3154546 -2564524 -1481451 -948089 -1085474 -1124785 -609600 -66535 -322593 -1421911
$$ packed form
36541I69682J36548k72249o52273p50861k89153L20645L14105k72011n44271n7860
36531a097698N39263N11583M7950k08548j35040o4261q8699k3845J05389P2701
36521c41205j22415k57256k44760j26356J58557N83632P64158L71839k69737n41652
36511b5195m23865m18519n79359l70292L03284P08855L83618p2822N6974M20608
36501a6713J70855n85259q32393j57794O11929N62418j26030n36886j91659N01354
36491f00178P86972K90088o82220j380618j223115k82284Q26707J471137J336589
36482E43078M72287o43045j202258p53280J22323L11539m24775j035153n45262
36473c154546N90022J083073N33362j37385l9311N15185N43065k56058j099318
$$ plain form
36464 -1421911 -2445670 -2378530 -1072564 634922 1712912 1802969 1276994 558025 -329510
36455 -329510 -1413365 -2295976 -2442744 -1896859 -1274798 -934570 -565591 124961 707124
36446 707124 505435 -395338 -1195587 -1474410 -1673233 -2239304 -2780816 -2542925 -1460391
36437 -1460391 -230709 570886 965265 1140746 1062572 742546 504647 591999 686413 233231
36427 233231 -725826 -1388355 -1064847 -50571 628814 338199 -523503 -1089757 -1007966 -610486
36417 -610486 -263122 35436 332064 431477 227205 28400 181449 533340 641780 388310
36407 388310 -22821 -562623 -1345431 -2060850 -2005723 -942482 484323 1468108 1826754
36398 1826754 1785521 1372705 521427 -431423 -902373 -775331 -560105 -691378 -944200 -752207
$$ packed form
36464a421911j023759O7140J305966J707486J077990R0057n25975p18969q87535
36455c29510j083855q82611j46768N45885O22061L40228L68979O90552N82163
36446G07124k01689r00773q00249k78823j98823n66071n41512K37891J082534
36437a460391J229682Q01595L94379J75481p8174l20026k37899Q7352R4414m53182
36427B33231r59057o62529L23508J014276O79385k90615q61702n66254Q1791L97480
36417f10486L47364K98558K96628R9413k04272j98805J53049L51891J08440k53470
36407C88310m11131n39802p82808p15419N5127J063241J426805R83785L58646
36398A826754m1233m12816q51278r52850m70950J27042K15226j31273k52822J91993
$$ plain form
36388 -752207 27256 888335 1252356 1125291 1025593 1285895 1666222 1782998 1645775 1465587
36378 1465587 1179285 671237 359254 896680 2137008 3011624 2746188 1675959 535904
36369 535904 -442806 -1217934 -1340210 -498888 653623 1085625 718393 406894 595080
36360 595080 784447 500991 30212 -171980 -212407 -455718 -876207 -1146887 -1153050 -1075131
36350 -1075131 -1085873 -1195643 -1320874 -1407070 -1570613 -2053463 -2795969 -3168700 -2579735 -1368651
36340 -1368651 -570155 -626106 -863543 -535921 145230 476848 350689 272510 460792 504177
36330 504177 -5846 -871289 -1445483 -1227885 -285103 786975 1349855 1289400 1052290 1047065
36320 1047065 1140802 892165 176963 -602478 -932702 -719269 -362647 -281102 -398871 -304601
$$ packed form
36388g52207P79463Q61079L64021j27065r9698K60302L80327J16776j37223j80188
36378A465587k86302n08048l11983N37426J240328Q74616k65436j070229j140055
36369E35904r78710p75128j22276Q41322J152511M32002l67232l11499J88186
36360E95080J89367k83456m70779k02192m0427k43311m20489k70680o163P7919
36350a075131j0742j09770j25231q6196j63543m82850p42506l72731N88965J211084
36340a368651P98496n5951k37437L27622O81151L31618j26159p8179J88282M3385
36330E04177n10023q65443n74194K17598R42782J072078N62880o0455k37110n225
36320A047065R3737k48637p15202p79441l30224K13433L56622Q1545j17769R4270
$$ plain form
36310 -304601 30814 89419 -319450 -469360 327542 1469783 1706657 997296 630094 1187030
36300 1187030 1559067 711650 -591466 -890161 -129343 568492 787462 1112945 1621342
36291 1621342 1453196 270674 -942591 -1125615 -454144 126740 114884 -316907 -842382
36282 -842382 -1196560 -1136855 -647117 -76571 183221 58760 -263590 -540178 -538941 -196166
36272 -196166 174156 101270 -489208 -1173539 -1524693 -1437336 -967871 -220222 559786 1127301
36262 1127301 1495776 1707631 1467809 557176 -460108 -671701 -63016 422974 256119
36253 256119 -78818 -156166 -349872 -928974 -1293629 -922899 -378516 -449991 -875704 -917291
36243 -917291 -729100 -997353 -1493445 -1270197 -341189 81591 -633061 -1588021 -1706734 -1148427
$$ packed form
36310c04601L35415N8605m08869j49910P96902J142241K36874p09361l67202N56936
36300A187030L72037q47417j303116k98695P60818O97835K18970L25483N08397
36291A621342j68146j182522j213265j83024O71471N80884j1856m31791n25475
36282h42382l54178N9705M89738N70546K59792j24461l22350k76588J237L42775
36272a96166L70322p2886n90478o84331l51154Q7357M69465P47649P80008N67515
36262A127301L68475K11855k39822r10633j017284k11593O08685M85990j66855
36253B56119l34937p7348j93706n79102l64655L70730N44383p1475m25713m1587
36243i17291J88191k68253m96092K23248R29008M22780p14652r54960j18713N58307
$$ plain form
36233 -1148427 -738798 -679327 -564686 -251539 28161 232642 549626 870984 733661 -37171
36223 -37171 -894970 -1032462 -296683 514981 501059 -213645 -579357 -38472 667368 589347
36213 589347 -39386 -333019 -327208 -869290 -1883058 -2017572 -589596 1160622 1581737
36204 1581737 658099 -296353 -403705 220411 1194993 2116635 2312546 1432856 339741
36195 339741 440444 1888534 3231116 3148765 1872708 531917 -258530 -635812 -772851
36186 -772851 -566219 27542 748746 1200923 1156535 756135 421078 401069 412422 -4379
36176 -4379 -746829 -1157655 -924664 -559344 -656794 -1031286 -1074890 -783652 -813611 -1424239
36166 -1424239 -1947339 -1689969 -974506 -700466 -1004538 -1059711 -406791 230737 50902 -451325
$$ packed form
36233a148427M09629N9471J14641L13147K79700K04481L16984L21358j37323p70832
36223c7171q57799j37492P35779Q11664j3922p14704l65712N40885P05840p8021
36213E89347o28733k93633N811n42082j013768j34514J427976J750218M21115
36204A581737r23638r54452j07352O24116R74582R21642J95911q79690j093115
36195C39741J00703J448090J342582q2351j276057j340791p90447l77282j37039
36186g72851K06632N93761P21204M52177m4388m00400l35057k0009J1353m16801
36176d379p42450m10826K32991L65320r7450l74492m3604K91238k9959o10628
36166a424239n23100K57370P15463K74040l04072n5173O52920O37528j79835n02227
$$ plain form
36156 -451325 -148520 862523 1182005 152266 -1062606 -1050776 51872 1116350 1606666
36147 1606666 1623985 1011971 -298615 -1358847 -997329 409549 1248363 945593 644733
36138 644733 1232702 2020305 2076144 1675177 1505371 1443166 1154095 1039696 1427718 1565579
36128 1565579 741178 -159519 282167 1653806 2005141 649322 -810871 -730539 564021
36119 564021 1697783 2159340 2402527 2679238 2675947 2113804 1140170 222735 -84651 464603
36109 464603 1410751 1878544 1473237 589072 -260866 -940080 -1346460 -1174210 -417957 330145
36099 330145 512716 223419 -117587 -327864 -369644 -98476 467870 930809 956899 699257
36089 699257 466633 267020 -14617 -300478 -483719 -589238 -541349 -211252 65221 -363187
$$ packed form
36156d51325L02805J011043L19482j029739j214872J1830J102648J064478M90316
36147A606666J7319o12014j310586j060232L61518J406878Q38814l02770l00860
36138F44733N87969P87603N5839m00967j69806o2205k89071j14399L88022J37861
36128A565579q24401r00697M41686J371639L51335j355819j460193Q0332J294560
36119E64021J133762M61557K43187K76711l291n62143r73634r17435l07386N49254
36109D64603R46148M67793m05307q84165q49938o79214m06380J72250P56253P48102
36099C30145J82571k89297l41006k10277m1780K71168N66346M62939K6090k57642
36089F99257k32624j99613k81637k85861j83241j05519M7889L30097K76473m28408
$$ plain form
36079 -363187 -1391095 -1929202 -1357812 -513145 -398651 -551461 207281 1787578 2835218
36070 2835218 2649966 1932430 1495492 1316665 1146778 1084976 1162183 1155232 1139914 1442710
36060 1442710 1764810 1267299 -49027 -987797 -783570 -215082 -345838 -935572 -1023978
36051 -1023978 -497830 -62893 -27171 -114497 -299521 -865422 -1626145 -1911606 -1452292 -698547
36041 -698547 -238698 -383719 -1171067 -2181037 -2540443 -1826905 -815139 -532531 -745782
36032 -745782 -387284 566201 883960 47137 -839271 -751019 -234420 -280085 -661159 -554075
36022 -554075 -131289 -205848 -627811 -384941 721673 1750156 2115846 2214285 2226914 1535073
36012 1535073 -347 -1197635 -916029 404792 1445074 1708788 1616558 1347526 668972
$$ packed form
36079c63187j027908n38107N71390Q44667J14494j52810P58742J580297J047640
36070B835218j85252p17536m36938j78827j69887o1802P7207o951j5318L02796
36060A442710L22100m97511j316326r38770K04227N68488j30756n89734q8406
36051a023978N26148M34937L5722q7326j85024n65901p60723k85461M59314P53745
36041f98547M59849j45021p87348j009970l59406P13538J011766K82608k13251
36032g45782L58498R53485L17759q36823q86408Q8252N16599m5665l81074J07084
36022e54075M22786p4559m21963K42870J106614J028483L65690R8439J2629o91841
36012A535073j535420j197288K81606J320821J040282K63714r2230k69032o78554
$$ plain form
36003 668972 -226869 -752081 -860340 -1054478 -1334525 -1053619 -105271 615915 395009 -377550
35993 -377550 -937454 -1122494 -1079860 -703903 -102962 -26769 -906311 -1855767 -1628055 -375070
35983 -375070 561957 571587 377919 531831 454961 -401608 -1374316 -1450387 -764729 -316113
35973 -316113 -447060 -491792 52455 779602 1042037 808096 500635 302138 -10556 -629615
35963 -629615 -1374877 -1829995 -1718616 -1119265 -374064 146704 217111 -143215 -608835 -714578
35953 -714578 -323517 98124 -66778 -828066 -1534918 -1622927 -1135172 -441952 206796 689200
35943 689200 906085 904385 857654 741505 313700 -406872 -1006402 -1265114 -1468979 -1801689
35933 -1801689 -1886303 -1428095 -889117 -857026 -1038154 -652011 301972 987835 983087 789288
$$ packed form
36003F68972q95841n25212j08259j94138k80047K80906R48348P21186k20906p72559
35993c77550n59904j85040M2634L75957O00941P6193q79542r49456K27712J252985
35983c75070R37027R630j93668J53912p6870q56569r72708p6071O85658M48616
35973c16113j30947m4732N44247P27147K62435k33941l07461j98497l12694o19059
35963f29615p45262m55118J11379N99351P45201N20768P0407l60326m65620j05743
35953g14578L91061M21641j64902p61288p06852q8009M87755O93220O48748M82404
35943F89200K16885j700m6731j16149m27805p20572n99530k58712k03865l32710
35933a801689q4614M58208N38978L2091j81128L86143R53983O85863m748j93799
$$ plain form
35923 789288 905183 1137208 1160020 1105124 1155969 1087587 688770 230769 44198 -29504
35913 -29504 -302311 -668812 -874486 -1097595 -1680582 -2377958 -2447094 -1587026 -376624 369738
35903 369738 418187 170640 94641 223887 190117 -253874 -788598 -806452 -191131 482225
35893 482225 706521 648590 654301 509206 -206452 -1168797 -1442768 -758368 -60117 -364761
35883 -364761 -1411796 -1913731 -1045210 683439 2042563 2285503 1649199 868226 402760
35874 402760 167200 -112911 -460654 -662228 -628613 -550541 -626979 -763241 -676829 -296144
35864 -296144 65005 27732 -379006 -696107 -570582 -207418 -110130 -417641 -750912 -788951
35854 -788951 -737327 -1008502 -1569205 -1849230 -1327770 -121423 1014044 1280950 552722
$$ packed form
35923G89288J15895K32025K2812n4896N0845o8382l98817m58001j86571p3702
35913b9504k72807l66501k05674k23109n82987o97376o9136Q60068J210402P46362
35903C69738M8449k47547p5999J29246l3770m43991n34724j7854O15321O73356
35893D82225K24296n7931N711j45095p15658r62345k73971O84400O98251l04644
35883c64761j047035n01935Q68521J728649J359124K42940o36304p80973m65466
35874D02760k35560k80111l47743k01574L3615P8072p6438j36262Q6412L80685
35864b96144L61149l7273m06738l17101J25525L63164R7288l07511l33271l8039
35854g88951N1624k71175n60703k80025N21460J206347J135467K66906p28228
$$ plain form
35845 552722 -487553 -1040938 -993490 -827402 -825423 -777231 -525284 -279474 -151929 99347
35835 99347 494606 526840 -47755 -605101 -504142 -101798 -93854 -215565 338192 1331428
35825 1331428 1523065 485336 -725933 -1117408 -968369 -991205 -1237871 -1467432 -1712726
35816 -1712726 -1770414 -1001278 518923 1495108 1068111 211880 323117 1111126 1260271
35807 1260271 644873 279894 337688 -32392 -833979 -953269 -160941 330060 -18255 -55965
35797 -55965 953357 1745674 936370 -686864 -1281849 -553221 285661 566731 632234 583669
35787 583669 106180 -507180 -519932 -5564 264441 202798 436160 894739 725616 -125874
35777 -125874 -603610 -272958 -72340 -684863 -1364126 -1233034 -710210 -632304 -781633 -400054
$$ packed form
35845E52722j040275n53385M7448J66088J979M8192K51947K45810J27545K51276
35835I9347L95259L2234n74595n57346J00959M02344P944j21711N53757R93236
35825A331428J91637j037729j211269l91475J49039k2836k46666k29561k45294
35816a712726n7688P69136J520201R76185m26997q56231J11237P88009J49145
35807A260271o15398l64979N7794l70080q01587j19290P92328M91001l48315l7710
35797e5965J009322P92317q09304j623234n94985P28628Q38882K81070O5503m8565
35787E83669m77489o13360j2752N14368K70005o1643K33362M58579j69123q51490
35777a25874m77736L30652K00618o12523o79263J31092N22824P7906j49329L81579
$$ plain form
35767 -400054 393830 816971 746785 815986 1276626 1618985 1379731 732537 216703 235700
35757 235700 731678 1111428 772303 -59238 -451303 -5725 632178 882785 1053049 1411793
35747 1411793 1325822 319523 -735922 -739222 -156034 -320496 -1240316 -1589651 -850279 54592
35737 54592 444081 678821 889601 461875 -486093 -551146 965962 2646350 2725892 1446499
35727 1446499 418362 286651 343699 90522 -152375 -177769 -289539 -562581 -587696 -217767
35717 -217767 120648 124331 56295 202387 319876 -28544 -784780 -1296262 -940450 154272
35707 154272 1082619 1064338 339149 -212011 -346892 -748082 -1788261 -2724544 -2685802 -1903712
35697 -1903712 -1289816 -1224530 -1454466 -1765289 -1962032 -1545313 -315280 927507 1205536
$$ packed form
35767d00054P93884M23141p0186O9201M60640L42359k39254o47194n15834J8997
35757B35700M95978L79750l39125q31541l92065M45578O37903K50607J70264L58744
35747A411793q5971j006299j055445l300N83188j64462r19820l49335P39372R04871
35737E4592L89489K34740K10780m27726r47968o5053J517108J680388P9542j279393
35727A446499j028137j31711N7048k53177k42897k5394j11770k73042k5115L69929
35717b17767L38415L683o8036J46092J17489l48420p56236n11482L55812J094722
35707A54272R28347j8281p25189n51160j34881m01190j040179r36283L8742P82090
35697a903712O13896O5286k29936l10823j96743M16719J230033J242787K78029
$$ plain form
35688 1205536 737140 540784 792162 671042 -88940 -667443 -522383 -237863 -476751
35679 -476751 -958829 -1097796 -949953 -889532 -901466 -820615 -833299 -1158523 -1559235 -1652204
35669 -1652204 -1421779 -1067762 -682217 -395170 -444844 -780504 -1013143 -1045670 -1226422 -1535813
35659 -1535813 -1259061 -12899 1446968 2068273 1729569 1058585 482921 99607 68424
35650 68424 428562 823930 1014824 1294039 1803988 1973403 1426291 904703 1258540 1947978
35640 1947978 1770273 831432 421625 901661 1144528 427998 -455038 -567165 -138068
35631 -138068 210526 495286 771726 447978 -750783 -1814794 -1546410 -193917 1006997
35622 1006997 1536010 1780635 1830420 1301950 403968 28152 456234 892375 680236 196233
$$ packed form
35688A205536m68396j96356K51378j21120p59982n78503J45060K84520k38888
35679d76751m82078j38967J47843O0421j1934Q0851j2684l25224m00712r2969
35669a652204K30425L54017L85545K87047m9674l35660k32639l2527j80752l09391
35659a535813K76752J246162J459867O21305l38704o70984n75664l83314l1183
35650F8424L60138L95368J90894K79215N09949J69415n47112n21588L53837O89438
35640A947978j77705r38841m09807M80036K42867p16530q83036j12127M29097
35631a38068L48594K84760K76440l23748j198761j064011K68384J352493J200914
35622A006997N29013K44625M9785n28470q97982l75816M28082M36141k12139m84003
$$ plain form
35612 196233 55296 122857 -64599 -392703 -371451 -1162 177388 -167574 -831054 -1470266
35602 -1470266 -1921419 -2095161 -1939190 -1628682 -1512672 -1705351 -1900746 -1734508 -1217417
35593 -1217417 -697771 -483905 -605324 -869005 -1039732 -1007963 -870305 -807365 -826600 -737200
35583 -737200 -503406 -468881 -950939 -1674422 -1991915 -1761085 -1600587 -2025711 -2700761 -2941925
35573 -2941925 -2663429 -2297494 -1952737 -1297569 -315324 459129 674034 607825 601781 509389
35563 509389 56115 -634776 -1232848 -1583114 -1570404 -997616 -34546 584360 364496 -207939
35553 -207939 -306297 66643 195591 -179099 -532240 -460833 -246966 -296377 -552669 -726545
35543 -726545 -684971 -397359 108861 538119 458749 -151756 -844465 -1308271 -1600059 -1643563
$$ packed form
35612A96233j40937O7561j87456l28104K1252L70289J78550l44962o63480o39212
35602a470266m51153j73742J55971L10508J16010j92679j95395J66238N17091
35593a217417N19646K13866j21419k63681j70727L1769J37658O2940j9235Q9400
35583g37200K33794L4525m82058p23483l17493K30830J60498m25124o75050k41164
35573b941925K78496L65935L44757O55168R82245P74453K14905o6209o044r2392
35563E09389m53274o90891n98072l50266J2710N72788R63070O18906k19864n72435
35553b07939r8358L72940J28948l74690l53141P1407K13867m9411k56292j73876
35543g26545M1574K87612N06220M29258p9370o10505o92709m63806k91788m3504
$$ plain form
35533 -1643563 -1113505 -144274 470002 301522 -28144 152249 359224 -351905 -1693935
35524 -1693935 -2165849 -982448 822704 1652487 1155796 315631 107716 582910 1132698
35515 1132698 1227028 850151 430204 359020 502275 317802 -392127 -1028363 -784605 371731
35505 371731 1617200 2200599 2136873 1855608 1528632 1115226 849935 1115773 1730246 1882318
35495 1882318 1132771 113091 -247170 34046 96850 -446404 -932078 -608410 306665
35486 306665 892349 583406 -333669 -1099409 -1135206 -480844 263715 586649 679629 1105851
35476 1105851 1856597 2257499 1973000 1488180 1240320 906532 113251 -705562 -877870
35467 -877870 -505832 -152995 119840 573338 958839 838001 556336 854777 1546533 1664132
$$ packed form
35533a643563N30058R69231O14276j68480l29666J80393K06975p11129j342030
35524a693935m71914J183401J805152Q29783m96691q40165k07915M75194N49788
35515A132698R4330l76877m19947p1184J43255j84473p09929o36236K43758J156336
35505C71731J245469N83399o3726k81265l26976m13406k65291K65838O14473J52072
35495A882318p49547j019680l60261K81216O2804n43254m85674L23668R15075
35486C06665N85684l08943r17075p65740l5797O54362P44559L22934R2980M26222
35476A105851P50746M00902k84499m84820k47860l33788p93281q18813j72308
35467h77870L72038L52837K72835M53498L85501j20838k81665K98441O91756J17599
$$ plain form
35457 1664132 999568 353961 68551 -417053 -1127243 -1048471 134129 1046691 494684
35448 494684 -665240 -818886 -23331 297953 -347617 -1041270 -1187892 -1283134 -1681847 -1813632
35438 -1813632 -1105380 175496 1397681 2179831 2264445 1537496 494642 -32994 28449
35429 28449 -142165 -954305 -1693242 -1605498 -1032770 -847537 -1265823 -1856139 -2328936 -2646125
35419 -2646125 -2592266 -1894178 -727114 358315 992345 1170397 1016916 689571 409799
35410 409799 309770 341897 496877 868552 1298759 1296592 650302 -170926 -602856 -699634
35400 -699634 -842087 -1003184 -834256 -343031 40935 48153 -215062 -588170 -980659 -1226480
35390 -1226480 -1229077 -1197578 -1318753 -1283399 -644245 405249 1181236 1442410 1527247 1482340
$$ packed form
35457A664132o64564o45607k85410m85604p10190P8772J182600R12562n52007
35448D94684j159924j53646P95555L21284o45570o93653j46622r5242l98713j31785
35438a813632P08252J280876J222185P82150Q4614p26949j042854n27636O1443
35429B8449j70614q12140p38937Q7744N72728J85233m18286n90316m72797l17189
35419b646125N3859O98088J167064J085429O34030J78052j53481l27345k79772
35410D09799j00029L2127J54980L71675M30207k167o46290q21228m31930r6778
35400f99634j42453j61097J68928M91225L83966P218k63215l73108l92489k45821
35390a226480k597L1499j21175L5354O39154J049494P75987K61174Q4837m4907
$$ plain form
35380 1482340 846771 -351652 -1152246 -828360 63154 505449 451008 586706 960322
35371 960322 873993 202991 -230288 -23132 -30385 -1108431 -2648598 -3260497 -2599382 -1586878
35361 -1586878 -916310 -342620 331404 550257 -107842 -1027074 -1287443 -897065 -548599
35352 -548599 -409803 22324 876575 1489780 1262846 396388 -465910 -918839 -925470 -639444
35342 -639444 -315695 -141514 -36680 159346 345637 356745 409080 834166 1400134 1531859
35332 1531859 1256132 1192098 1441968 1329260 573154 -155834 -359508 -493075 -917420 -970591
35322 -970591 -88960 872627 662204 -487687 -1275114 -1340248 -1489376 -1960592 -1913952 -957457
35312 -957457 114840 620260 908277 1382211 1602928 1101438 283449 -207811 -359845
$$ packed form
35380A482340o35569j198423q00594L23886Q91514M42295n4441J35698L73616
35371I60322q6329o71002m33279K07156p253j078046j540167o11899O61115J012504
35361a586878O70568N73690O74024K18853o58099r19232k60369L90378L48466
35352e48599J38796M32127Q54251O13205k26934q66458q62298m52929o631K86026
35342f39444L23749J74181J04834J96026J86291J1108N2335M25086N65968J31725
35332A531859k75727o4034K49870j12708p56106p28988k03674j33567m24345n3171
35322i70591Q81631R61587k10423j149891p87427o5134j49128m71216M6640R56495
35312i57457J072297N05420K88017M73934K20717n01490q17989m91260j52034
$$ plain form
35303 -359845 -359287 9526 791205 1337292 1189755 918779 1184387 1476445 834397 -512664
35293 -512664 -1362783 -1318133 -1233469 -1714451 -2161745 -1736067 -574748 430660 675636 353443
35283 353443 199742 836433 2055994 2773425 2133386 655474 -260955 -5169 701162
35274 701162 1036514 1088662 1257494 1367816 1045528 560146 567125 1124632 1552264 1312564
35264 1312564 626343 125769 152708 466973 517287 14735 -700360 -994032 -711904 -372938
35254 -372938 -429751 -641120 -494125 5891 405963 549896 786911 1392711 2149317 2597025
35244 2597025 2441125 1667865 536583 -485070 -1047384 -1251655 -1428653 -1593899 -1462297
35235 -1462297 -1039843 -760228 -846885 -962249 -790006 -585240 -739214 -1094390 -1178145 -933531
$$ packed form
35303c59845N58L68813P81679N46087j47537k70976K65608K92058o42048j347061
35293e12664q50119M4650Q4664m80982m47294M25678J161319J005408K44976l22193
35283C53443j53701O36691J219561P17431o40039j477912r16429K55786P06331
35274G01162L35352N2148J68832J10322l22288m85382O979N57507M27632k39700
35264A312564o86221n00574K6939L14265N0314n02552p15095k93672K82128L38966
35254c72938n6813k11369J46995N00016M00072J43933K37015O05800P56606M47708
35244B597025j55900p73260j131282j021653n62314k04271j76998j65246J31602
35235a462297M22454K79615q6657j15364J72243K04766j53974l55176q3755K44614
$$ plain form
35225 -933531 -705930 -596776 -365799 13780 231176 173190 95520 107723 -26689 -356117
35215 -356117 -500791 -280035 -125955 -410993 -706494 -265352 910157 1986505 2246824
35206 2246824 1727207 952004 412778 304964 453267 475021 222118 -53933 -194907 -508346
35196 -508346 -1222062 -1845661 -1720959 -1098170 -925236 -1485984 -1990001 -1757822 -1104168 -656573
35186 -656573 -455978 -291001 -389526 -1055882 -1889428 -2066993 -1363660 -360943 347033 676471
35176 676471 764309 643522 385518 222759 281346 351993 140534 -282817 -449193 -24180
35166 -24180 660449 826162 159562 -690622 -830458 -193629 501717 756739 707258 547552
35156 547552 221900 -119771 -54310 371596 475106 -43644 -546717 -455583 -164529 -288183
$$ packed form
35225i33531K27601J09154K30977L79579K17396n7986p7670J2203j34412l29428
35215c56117j44674K20756J54080k85038k95501M41142J175509J076348K60319
35206B246824n19617p75203n39226j07814J48303K1754k52903k76051j40974l13439
35196e08346p13716o23599J24702O22789J72934n60748n04017K32179O53654M47595
35186f56573K00595J64977r8525o66356q33546j77565P03333J002717P07976L29438
35176F76471Q7838j20787k58004j62759N8587P0647k11459m23351j66376M25013
35166b4180O84629J65713o66600q50184j39836O36829O95346K55022m9481j59706
35156E47552l25652l41671O5461M25906J03510n18750n03073R1134K91054j23654
$$ plain form
35146 -288183 -607150 -588737 -426850 -596396 -790477 -393051 260717 278999 -247852 -361961
35136 -361961 51285 17520 -739161 -1128050 -468862 270611 -67012 -1073427 -1517519 -1166518
35126 -1166518 -795930 -816694 -919575 -856305 -664234 -246932 447714 918638 568825 -337869
35116 -337869 -908055 -853422 -802198 -1258066 -1893329 -2106991 -1778933 -1221813 -760964 -561223
35106 -561223 -568707 -485882 -64565 513569 817609 728490 489233 195607 -362692 -1266499
35096 -1266499 -2233917 -2925072 -3162684 -2813130 -1869851 -778812 -230989 -377591 -616493
35087 -616493 -444223 -184495 -492725 -1356735 -2010842 -1806081 -857978 187919 809106
35078 809106 973564 993224 1081661 1065662 594549 -367865 -1389866 -1946257 -1813097 -1082129
$$ packed form
35146b88183l18967J8413J61887j69546j94081L97426O53768J8282n26851j14109
35136c61961M13246l3765p56681l88889O59188P39473l37623j006415m44092L51001
35126a166518L70588k0764j02881O3270J92071M17302O94646M70924l49813r06694
35116c37869n70186N4633N1224m55868o35263k13662L28058N57120M60849J99741
35106e61223p484Q2825M21317N78134L04040q9119k39257k93626n58299r03807
35096a266499r67418o91155k37612L49554R43279J091039N47823j46602k38902
35087f16493J72270K59728l08230q64010o54107K04761R48103J045897O21187
35078H09106J64458J9660Q8437j5999m71113r62414j022001n56391J33160P30968
$$ plain form
35068 -1082129 -13441 1028711 1732960 2112561 2439185 2749546 2658685 1915024 912055
35059 912055 282562 107905 -79083 -557854 -1100677 -1409174 -1448025 -1254697 -848442 -484743
35049 -484743 -540904 -888005 -843942 -139472 516005 365402 -284704 -553221 -273922 45391
35039 45391 359532 1094041 1895527 1600338 44746 -1172217 -679849 710693 1165492
35030 1165492 367517 -406613 -468813 -519131 -1090831 -1561039 -1277670 -606641 -146285 264171
35020 264171 963210 1541262 1362703 637283 179529 284122 481245 298619 -241040 -774480
35010 -774480 -856209 -243420 716982 1235180 980236 520489 458915 547245 245472 -223101
35000 -223101 -162173 422072 743924 374423 -245925 -563920 -580447 -551755 -493492 -230368
$$ packed form
35068a082129J068688J042152P04249L79601L26624L10361r0861p43661j002969
35059I12055o29493j74657j86988m78771n42823l08497l8851J93328M06255L63699
35049d84743n6161l47101M4063P04470O55477j50603o50106k68517K79299L19313
35039D5391L14141P34509Q01486k95189j555592j216963M92368J390542M54799
35030A165492p97975p74130o2200n0318n71700m70208K83369O71029M60356M10456
35020B64171O99039N78052j78559p25420m57754J04593J97123j82626n39659n33440
35010g74480q1729O12789R60402N18198k54944m59747o1574Q8330l01773m68573
35000b23101O0928N84245L21852l69501o20348l17995j6527K8692N8263K63124
$$ plain form
34990 -230368 316841 1001557 1455181 1335012 790148 421408 438498 236070 -639943 -1497675
34980 -1497675 -1281439 -131581 749700 738131 350511 125579 -13553 -25948 555136 1673369
34970 1673369 2379267 2040260 1213141 710692 489269 133912 -200911 -129717 175074 316789
34960 316789 392943 609578 564383 -218554 -1290388 -1705827 -1349645 -997782 -1073478 -1166038
34950 -1166038 -887181 -438892 -116721 109422 293682 362758 470885 930300 1539020 1571371
34940 1571371 807638 31186 -118 352806 167139 -643127 -1207617 -1018772 -677299 -944848
34930 -944848 -1526932 -1424636 -402327 546389 456400 -380056 -900126 -647399 -58453 442419
34920 442419 875347 1155995 898089 105084 -581954 -743979 -717762 -842566 -832253 -503098
$$ packed form
34990b30368N47209O84716M53624j20169n44864l68740J7090k02428q76013q57732
34980a497675K16236J149858Q81281j1569l87620k24932j39132j2395N81084J118233
34970A673369P05898l39007q27119n02449k21423l55357l34823P1194L04791J41715
34960C16789P6154K16635m5195p82937j071834m15439L56182L51863p5696r2560
34950a166038K78857M48289L22171K26143J84260O9076J08127M59415O08720L2351
34940A571371p63733p76452l1304L52924j85667q10266n64490J88845L41473k67549
34930i44848n82084J02296J022309R48716q9989q36456n20070K52727N88946N00872
34920D42419M32928K80648k57906p93005o87038j62025K6217j24804J0313L29155
$$ plain form
34910 -503098 -448752 -1105614 -1654895 -939478 743474 1847944 1558265 550036 -275174
34901 -275174 -734043 -807050 -241684 763132 1352982 1101722 618423 551570 686791 609537
34891 609537 546036 806141 995856 634898 120682 201062 780774 1119529 1031718 1015379
34881 1015379 1251191 1348691 1187525 1195184 1529837 1674620 1210982 471096 8506 -218370
34871 -218370 -704927 -1598430 -2377472 -2366816 -1464526 -313911 319628 358565 397544 793511
34861 793511 1157023 1077214 930751 1335977 2028026 2058777 1155665 137794 -220646 -56053
34851 -56053 165265 434995 901421 1245222 949820 17993 -981872 -1443967 -1060744 67041
34841 67041 1299051 1696188 835155 -695542 -1884766 -2243686 -1961400 -1424880 -965852
$$ packed form
34910e03098N4346o56862n49281P15417J682952J104470k89679j008229q25210
34901b75174m58869p3007N65366J004816N89850k51260m83299o6853J35221p7254
34891F09537o3501K60105J89715l60958n14216Q0380N79712L38755q7811j6339
34881A015379K35812R7500j61166P659L34653J44783m63638p39886m62590k26876
34871b18370m86557q93503p79042J0656R02290J150615O33539L8937L8979L95967
34861G93511L63512p9809j46463M05226O92049L0751r03112j017871l58440J64593
34851e6053K21318K69730M66426L43801k95402r31827r99865m62095L83223J127785
34841F7041J232010L97137q61033j530697j189224l58920K82286N36520M59028
$$ plain form
34832 -965852 -862020 -1145499 -1490983 -1611221 -1605326 -1591115 -1258927 -306313 840741 1345611
34822 1345611 1023059 546965 502156 712812 656752 111013 -788584 -1743632 -2365321 -2392488
34812 -2392488 -2004402 -1611309 -1254317 -628671 185037 561713 212063 -274315 -202839 305163
34802 305163 654004 687765 667171 569717 115445 -528738 -758742 -435090 -204921 -608715
34792 -608715 -1307284 -1604719 -1433280 -1315759 -1444311 -1328431 -560375 422772 723023 60060
34782 60060 -884079 -1307030 -1174631 -1015245 -1063537 -1049983 -816211 -647329 -787813 -1015083
34772 -1015083 -1000687 -800746 -629853 -385845 153641 770875 924386 494695 40551 161886
34762 161886 841497 1533413 1726061 1335380 697404 264764 238578 473225 742577 951517
$$ packed form
34832i65852J03832k83479l45484j20238N895J4211L32188R52614J147054N04870
34822A345611l22552m76094m4809K10656n6060n45739q99597r55048o21689k7167
34812b392488L88086L93093L56992O25646Q13708L76676l49650m86378P1476N08002
34802C05163L48841L3761k0594r7454m54272o44183k30004L23652K30169m03794
34792f08715o98569k97435J71439J17521j28552J15880P68056R83147L00251o62963
34782F0060r44139m22951J32399J59386m8292J3554K33772J68882j40484k27270
34772a015083J4396J99941J70893K44008N39486O17234J53511m29691m54144J21335
34762A61886O79611O91916J92648l90681o37976m32640k6186K34647K69352K08940
$$ plain form
34752 951517 1002173 721187 193194 -71332 278780 798595 655517 -338366 -1533533 -2268957
34742 -2268957 -2391428 -1917231 -813410 603455 1608488 1857676 1861357 2222950 2721850
34733 2721850 2676302 2025963 1478979 1571922 2063692 2384847 2317039 2041194 1777004 1607751
34723 1607751 1536686 1500571 1331966 867597 186292 -329240 -316450 139463 542719 551353
34713 551353 347817 280115 328509 241036 62509 95636 337012 402924 114788 -271193
34703 -271193 -551254 -828447 -1080361 -981678 -504946 -237474 -628392 -1257558 -1349054 -755068
34693 -755068 63921 796808 1435364 1782229 1415230 250937 -1245482 -2478924 -3084162
34684 -3084162 -2955850 -2286319 -1529547 -993173 -545267 -36544 220907 -83318 -502051
$$ packed form
34752I51517N0656k80986n27993k64526L50112N19815j43078r93883j195167p35424
34742b268957j22471M74197J103821J416865J005033K49188L681L61593M98900
34733B721850m5548o50339n46984R2943M91770L21155o7808k75845k64190j69253
34723A607751p1065l6115j68605m64369o81305n15532J2790M55913M03256Q634
34713E51353k03536o7702M8394q7473j78527L3127K41376O5912k88136l85981
34703b71193k80061k77193k51914R8683M76732K67472l90918o29166r1496N93986
34693g55068Q18989P32887O38556L46865l66999j164293j496419j233442o05238
34684c084162J28312O69531P56772N36374M47906N08723K57451l04225m18733
$$ plain form
34675 -502051 -249547 596661 1049817 579139 -177542 -424536 -278215 -275255 -327306 83674
34665 83674 864531 1213063 680074 -211361 -655097 -515842 -299927 -385464 -632188 -743108
34655 -743108 -696308 -652795 -634660 -544492 -413066 -348660 -283112 -113550 -104732 -675104 -1604966
34644 -1604966 -1989363 -1382541 -528696 -386095 -783238 -768884 -116966 340853 -27212 -792935
34634 -792935 -1125571 -760482 -34727 608349 884279 768315 529281 421564 333304 72492
34624 72492 -126275 49680 221733 -312760 -1343205 -1773428 -1212810 -619876 -794462 -1102499
34614 -1102499 -534232 648857 1322987 1133525 685240 312580 -288439 -1134464 -1583944
34605 -1583944 -1178518 -238433 586985 860910 387159 -672881 -1535535 -1286500 17518
$$ packed form
34675e02051K52504Q46208M53156m70678p56681k46994J46321K960n2051M10980
34665H3674P80857L48532n32989q91435m43736J39255K15915q5537k46724j10920
34655g43108M6800M3513J8135R0168J31426O4406O5548J69562Q818n70372r29862
34644a604966l84397O06822Q53845J42601l97143J4354O51918M57819l68065p65723
34634g92935l32636L65089P25755O43076K75930j15964k39034j07717q8260k60812
34624G2492j98767J75955J72053n34493j030445m30223N60618N92934j74586l08037
34614a102499N68267J183089O74130j89462m48285l72660o01019q46025m49480
34605a583944M05426R40085Q25418K73925m73751j060040q62654K49035J304018
$$ plain form
34596 17518 1222940 1413011 953915 808536 1162834 1280383 624622 -392644 -961529
34587 -961529 -878982 -695574 -870074 -1078872 -662377 321542 922788 397744 -832306 -1649862
34577 -1649862 -1450535 -529076 527554 1331022 1631357 1313388 639412 149401 121149
34568 121149 319165 354423 88814 -352697 -746554 -917928 -936896 -1140320 -1690514 -2165990
34558 -2165990 -1970971 -1179740 -543148 -515159 -697459 -508546 -33890 170815 -97988 -478643
34548 -478643 -592684 -446981 -238095 -50667 92370 74758 -163245 -348757 -31952 813357
34538 813357 1551366 1562504 1075214 913202 1377635 1881491 1903320 1735347 1809577 1783877
34528 1783877 1055454 -54046 -491502 73945 751942 633592 -138807 -826428 -1066723
$$ packed form
34596A7518J205422J90071m59096j45379L54298J17549o55761j017266n68885
34587i61529Q2547J83408j74500k08798M16495R83919O01246n25044j230050q17556
34577a649862J99327R21459J056630Q03468L00335l17969o73976m90011k8252
34568A21149J98016L5258k65609m41511l93857j71374j8968k03424n50194m75476
34558b165990J95019P91231O36592K7989j82300J88913M74656K04705k68803l80655
34548d78643j14041J45703K08886J87428J43037j7612k38003j85512L16805Q45309
34538H13357P38009J1138m87290j62012M64433N03856K1829j67973P4230k5700
34528A783877p28423j109500m37456N65447O77997j18350p72399o87621k40295
$$ plain form
34519 -1066723 -987301 -792904 -698724 -961254 -1517732 -1797712 -1310662 -298290 541152 855286
34509 855286 827607 677282 367894 -138284 -639709 -856743 -722682 -440529 -282790 -347028
34499 -347028 -529520 -777187 -1249418 -2023954 -2720713 -2770950 -2134287 -1395301 -999502 -768521
34489 -768521 -415721 -139985 -277432 -638894 -721402 -474418 -331501 -462576 -517998 -277301
34479 -277301 -62909 -172652 -273325 143526 848744 972041 138517 -937908 -1294816
34470 -1294816 -838579 -213706 234910 796160 1644937 2358648 2514098 2349970 2402500 2741416
34460 2741416 2997382 2958259 2699915 2267315 1674225 1109996 691528 132319 -808506 -1640662
34450 -1640662 -1557776 -594688 275221 348720 -124099 -645662 -1157260 -1663821 -1828363 -1466640
$$ packed form
34519a066723P9422J94397R4180k62530n56478k79980M87050J012372Q39442L14134
34509H55286k7679j50325l09388n06178n01425k17034J34061K82153J57739o4238
34499c47028j82492k47667m72231p74536o96759n0237O36663P38986L95799K30981
34489g68521L52800K75736j37447l61462q2508K46984J42917j31075n5422K40697
34479b77301K14392j09743j00673M16851P05218J23297q33524j076425l56908
34470a294816M56237O24873M48616N61250Q48777P13711J55450j64128N2530L38916
34460B741416K55966l9123k58344m32600n93090n64229m18468n59209r40825q32156
34450a640662Q2886R63088Q69909P3499m72819n21563n11598n06561j64542L61723
$$ plain form
34440 -1466640 -983720 -822667 -860002 -777819 -614169 -484710 -212924 220604 315498 -207654
34430 -207654 -703889 -399978 412870 824228 732207 859790 1352438 1403687 605350 -229242
34420 -229242 -164335 544742 850157 255846 -777055 -1525027 -1609985 -1054560 -191719 471413
34410 471413 615874 389533 165984 85246 29614 -10658 175249 685544 1251194 1457430
34400 1457430 1132849 396440 -579974 -1606188 -2265323 -2069275 -1149850 -504133 -970205
34391 -970205 -1990822 -2069092 -690486 861541 1083633 92523 -792433 -909073 -806218
34382 -806218 -1013225 -1187149 -821727 -150102 168020 -45204 -316255 -177562 260469 427616
34372 427616 -57907 -891208 -1389800 -1357507 -1295211 -1493591 -1387096 -421319 790848 1083158
$$ packed form
34440a466640M82920J61053l7335Q2183J63650J29459K71786M33528R4894n23152
34430b07654m96235L03911Q12848M11358r2021J27583M92648N1249p98337q34592
34420b29242O4907P09077L05415n94311j032901p47972q4958N55425Q62841O63132
34410D71413J44461k26341k23549q0738n5632m0272J85907N10295N65650K06236
34400A457430l24581p36409r76414j026214o59135J96048R19425O45717m66072
34391i70205j020617p8270J378606J552027K22092r91110q84956j16640J02855
34382h06218k07007j73924L65422O71625L18122k13224k71051J38693M38031J67147
34372D27616m85523q33301m98592L2293O2296j98380J06495R65777J212167K92310
$$ plain form
34362 1083158 454729 165283 828839 1388524 626547 -1047701 -2160861 -2109502 -1667332
34353 -1667332 -1683416 -2046933 -2086840 -1470362 -465149 440111 1016515 1448052 1962342 2313709
34343 2313709 1922805 684178 -723542 -1628790 -2103425 -2489758 -2573473 -1906396 -813588
34334 -813588 -322766 -912929 -1885239 -2220055 -1647265 -652859 175222 518433 364222 20712
34324 20712 -47339 356472 975891 1443330 1631965 1568812 1252128 756233 315388 84805
34314 84805 -22213 -78753 59864 464927 857098 938279 828713 810034 778037 408114
34304 408114 -174273 -390636 24064 704216 1245272 1631678 1828945 1464769 396155
34295 396155 -736721 -1075961 -544259 164825 484983 422183 187284 -122638 -434713 -690378
$$ packed form
34362A083158o28429k89446O63556N59685p61977j674248j113160N1359M42170
34353a667332j6084l63517l9907O16478J005213R05260N76404M31537N14290L51367
34343B313709l90904j238627j407720r05248m74635l86333q3715O67077J092808
34334h13588M90822n90163r72310l34816N72790R94406Q28081L43211j54211l43510
34324B0712o8051M03811O19419M67439J88635o3153l16684m95895m40845k30583
34314H4805j07018n6540J38617M05063L92171Q1181j09566j8679l1997l69923
34304D08114n82387k16363M14700O80152N41056L86406J97267l64176j068614
34295C96155j132876l39240N31702P09084L20158o2800k34899l09922l12075k55665
$$ plain form
34285 -690378 -960472 -1238755 -1200102 -600335 174181 509321 462586 588773 861105 628870
34275 628870 -119994 -414178 244361 961732 771588 125330 75006 526937 482310 -250591
34265 -250591 -817644 -819123 -866714 -1354491 -1735596 -1535461 -1223421 -1426525 -1904414 -1994497
34255 -1994497 -1661654 -1439856 -1558227 -1725931 -1734381 -1800087 -2208090 -2851503 -3233443 -2922000
34245 -2922000 -2043054 -1250352 -1060947 -1333468 -1618688 -1803275 -1986965 -1931913 -1285162 -333104
34235 -333104 162850 2735 -267698 -362455 -637228 -1139981 -1158686 -339597 480935 368093
34225 368093 -329811 -585112 -319558 -460404 -1450380 -2582703 -2952390 -2400792 -1375643
34216 -1375643 -433100 -26133 -238767 -512934 -96962 991261 1822848 1623646 668804
$$ packed form
34285f90378k70094k78283L8653N99767P74516L35140m6735J26187K72332k32235
34275F28870p48864k94184O58539P17371j90144o46258n0324M51931m4627p32901
34265b50591n67053j479m7591m87777l81105K00135L12040k03104m77889r0083
34255a994497L32843K21798j18371j67704q450o5706m08003o43413l81940L11443
34245b922000Q78946P92702J89405k72521k85220j84587j83690N5052O46751R52058
34235c33104M95954j60115k70433r4757k74773n02753j8705Q19089Q20532j12842
34225C68093o97904k55301K65554j40846r89976j132323l69687N51598J025149
34216a375643R42543M06967k12634k74167M15972J088223Q31587j99202r54842
$$ plain form
34207 668804 -135355 -282932 26406 415004 754305 1027909 1109114 942670 842219 1279537
34197 1279537 2252860 3116764 3275479 2840770 2284522 1661293 712425 -319489 -665842
34188 -665842 -73340 674229 651872 -157875 -1035537 -1396528 -1158650 -552798 73794 465532
34178 465532 695054 963267 1085863 623367 -333621 -1085835 -1289701 -1357345 -1543525 -1392689
34168 -1392689 -666677 -66781 -225070 -592908 -262588 581880 1033467 928059 890754 1130022
34158 1130022 1259435 1268593 1632307 2343132 2723612 2353760 1490174 583595 78145 467126
34148 467126 1609072 2199835 1110730 -772568 -1336930 -29538 1464717 1640109 855053
34139 855053 48636 -789281 -1931224 -2862034 -3002813 -2638948 -2173232 -1302975 55374
$$ packed form
34207F68804q04159j47577L09338L88598L39301K73604Q1205j66444j00451M37318
34197A279537R73323Q63904J58715m34709n56248o23229r48868j031914l46353
34188f65842N92502P47569k2357q09747q77662l60991K37878O05852O26592L91738
34178D65532K29522K68213J22596m62496r56988p52214k03866o7644j86180J50836
34168a392689P26012N99896j58289l67838L30320Q44468M51587j05408l7305K39268
34158A130022J29413R158L63714P10825L80480l69852q63586r06579n05450L88981
34148D67126J141946N90763j089105j883298n64362J307392J494255J75392p85056
34139H55053q06417q37917j141943r30810j40779L63865M65716Q70257J358349
$$ plain form
34130 55374 891963 382986 -617068 -667105 149165 551025 209665 155688 1019244 2158759
34120 2158759 2802102 2982634 2994533 2808257 2414372 2052108 1781263 1424582 1141401 1413766
34110 1413766 2229102 2914165 3047756 2921374 2808588 2432196 1579514 677272 237069
34101 237069 151985 59896 60708 507315 1282939 1848848 1992499 2083592 2510122 3165402 3584993
34090 3584993 3396366 2588050 1509494 656949 311041 311363 279873 102744 61846 398012
34080 398012 890902 1112786 1083342 1348646 2207501 3118728 3254144 2551209 1800458 1647887
34070 1647887 1923762 2099183 2009433 1885336 1985817 2439336 3146230 3613589 3269481 2272723
34060 2272723 1627259 2050943 3063554 3697697 3769065 3777500 3826651 3552906 3165166 3589522
$$ packed form
34130E5374Q36589n08977j000054n0037Q16270M01860l41360n3977Q63556J139515
34120B158759O43343J80532J1899j86276l93885l62264k70845l56681k83181K72365
34110A413766Q15336O85063J33591j26382j12786l76392q52682r02242m40203
34101B37069q5084r2089Q12M46607P75624N65909J43651R1093M26530O55280M19591
34090C584993j88627q08316j078556q52545l45908L22l1490j77129m0898L36166
34080C98012M92890K21884k9444K65304Q58855R11227J35416p02935p50751j52571
34070A647887K75875J75421q9750j24097J00481M53519P06894M67359l44108r96758
34060B272723o45464M23684J012611O34143P1368Q435M9151k73745l87740M24356
$$ plain form
34050 3589522 5128815 6676037 6895900 5831426 4772275 4720307 5486288 6227238 6415397
34041 6415397 6191619 6050688 6290243 6669597 6663380 6173318 5814055 6202855 7093519 7653507
34031 7653507 7631565 7735807 8588620 9772288 10396802 10299062 10045138 9889030 9512859 8933477
34021 8933477 8841118 9557899 10312495 10229660 9614085 9518815 10309481 11405524 12273569 12884337
34011 12884337 13237033 13249507 13213263 13602232 14296200 14738860 15007434 15870480 17471642
34002 17471642 18803111 18987245 18394672 17985506 18179781 18903362 20103143 21563397 22729806
33993 22729806 23392944 24161822 25652201 27541108 28979563 29651047 29967326 30529966 31746837
33984 31746837 33559656 35249124 36076812 36424515 37537841 39737885 41854306 43077337
$$ packed form
34050C589522J539293J547222K19863j064474j059151n1968P65981P40950J88159
34041F415397k23778j40931K39555L79354o217m90062l59263L88800Q90664N59988
34031G653507k1942J04242Q52813J183668O24514r7740k53924j56108l76171n79382
34021H933477r2359P16781P54596q2835o15575r5270P90666J096043Q68045O10768
34011A2884337L52696J2474l6244L88969O93968M42660K68574Q63046J601162
34002A7471642J331469J84134n92573m09166J94275P23581J199781J460254J166409
33993B2729806O63138P68878J490379J888907J438455O71484L16279N62640J216871
33984C1746837J812819J689468Q27688L47703J113326K200044K116421J223031
$$ plain form
33976 43077337 44276267 46449191 48856868 50076626 50246229 50766322 52102966 53312965
33968 53312965 53666027 53485493 53361331 53600688 54468712 56026262 57742710 59053269 60134669
33959 60134669 61454421 63010480 64798780 67350205 70810530 74284809 77267165 80774136
33951 80774136 85629546 90728531 94846418 99050071 105017929 111987708 118133725 124154069
33943 124154069 132244212 141984264 150902656 159016178 168673756 179498659 188221534 194840985
33935 194840985 203799538 216388852 226934499 230560761 230890113 235758246 248827275 270062634
33927 270062634 300307633 337946226 372550007 389745276 384048834 361844101 331324944
33920 331324944 295619902 257184835 221921869 194334751 172681619 153119640 135712541
$$ packed form
33976D3077337J198930K172924K407677J219758J69603N20093J336644J209999
33968E3312965L53062j80534j24162K39357Q68024J557550J716448J310559J081400
33959F0134669J319752J556059J788300K551425L460325L474279K982356L506971
33951H0774136M855410N098985M117887M203653N967858O969779O146017O020344
33943A24154069Q090143R740052Q918392Q113522R657578J0824903Q722875O619451
33935A94840985Q958553J2589314J0545647L626262L29352M868133J3069029K1235359
33927B70062634L0244999L7638593L4603781J7195269n696442k2204733l0519157
33920C31324944l5705042l8435067l5262966k7587118k1653132j9561979j7407099
$$ plain form
33913 135712541 122625591 113118433 104552188 96729888 91309483 87834569 83911168 78950018
33905 78950018 74649017 71838598 69514130 67068617 65115926 63853914 62603985 61229890
33897 61229890 60314479 59740099 58588608 56550396 54100825 51352045 48064517 44625754
33889 44625754 41619877 38629570 34942785 31235074 28903731 27790141 26290778 23878245
33881 23878245 21786374 20830421 20219928 19150057 18085337 17656513 17456236 16747078 15496310
33872 15496310 14081750 12739068 11757283 11436345 11470745 11158005 10485223 10144141 10282954
33863 10282954 10285690 10018930 10070930 10352234 9803434 8184511 6892622 7103477 8179156
33854 8179156 8839406 8857163 8579598 7844193 6641004 5949252 6475027 7215850 6761558
$$ packed form
33913A35712541j3086950r507158q566245p822300n420405l474914l923401m961150
33905G8950018m301001k810419k324468k445513j952691j262012j249929j374095
33897F1229890r15411n74380j151491k038212k449571k748780l287528l438763
33889D4625754l005877k990307l686785l707711k331343j113590j499363k412533
33881B3878245k091871r55953o10493j069871j064720m28824k00277p09158j250768
33872A5496310j414560j342682r81785l20938L4400l12740o72782l41082J38813
33863A0282954K736k66760N2000K81304n48800j618923j291889K10855J075679
33854H179156O60250J7757k77565p35405j203189o91752N25775P40823m54292
$$ plain form
33845 6761558 5509499 4989879 5304864 5013873 3658569 2628108 2933452 3623141 3341905
33836 3341905 2388936 2153651 3103547 4293459 4624638 3890436 2693703 1831178 1716078
33827 1716078 2120852 2544535 2880101 3431846 4229105 4803513 4854559 4648157 4455935 4101549
33817 4101549 3491280 3126179 3485635 4177698 4321383 3664730 2787071 2260377 2142507
33808 2142507 2294827 2643480 2986543 3018544 2772808 2678817 2955653 3271026 3261929 3106088
33798 3106088 3240205 3695582 4076445 4117528 3903564 3532219 2945470 2259059 1929554 2257367
33788 2257367 2867327 3059836 2689628 2320813 2378138 2560918 2460596 2414740 3110427 4384222
33778 4384222 5125935 4656576 3625580 3095515 3200290 3284464 3020009 2670591 2414016
$$ packed form
33845F761558j252059n19620L14985k90991j355304j030461L05344O89689k81236
33836C341905r52969k35285R49896J189912L31179p34202j196733q62525j15100
33827A716078M04774M23683L35566N51745P97259N74408N1046k06402j92222l54386
33817D101549o10269l65101L59456O92063J43685o56653q77659n26694j17870
33808B142507J52320L48653L43063L2001k45736r3991K76836L15373r097j55841
33798C106088J34117M55377L80863M1083k13964l71345n86749o86411l29505L27813
33788B257367O09960J92509l70208l68815N7325J82780j00322m5856O95687J273795
33778D384222P41713m69359j030996n30065J04775Q4174k64455l49418k56575
$$ plain form
33769 2414016 2176106 2160462 2766630 3775776 4334754 4093479 3729029 3915486 4342777
33760 4342777 4268501 3550669 2567626 1558288 688073 389020 877405 1550381 1601999 1108481
33750 1108481 792900 848001 797537 490391 357692 550256 659896 544037 650207 1221830
33740 1221830 1919813 2530133 3230368 3766749 3312113 1833037 757790 1337295 2891881
33731 2891881 3634674 2838203 1261207 -193734 -1161037 -1343929 -565131 530663 812847
33722 812847 33151 -880393 -1116785 -803951 -302792 451266 1432082 2100691 2120778 1955942
33712 1955942 2154872 2509165 2561643 2546616 3044265 3865424 4071484 3246384 2175882 1967322
33702 1967322 2764237 3566730 3266177 1797021 262867 -166428 513872 1226882 1169699
$$ packed form
33769B414016k37910j5644O06168J009146N58978k41275l64450J86457M27291
33760D342777p4276p17832r83043j009338q70215k99053M88385O72976N1618m93518
33750A108481l15581N5101n0464l07146j32699J92564J09640j15859J06170N71623
33740A221830O97983O10320P00235N36381m54636j479076j075247N79505J554586
33731B891881P42793p96471j576996j454941r67303j82892P78798J095794K82184
33722H12847p79696r13544k36392L12834N01159P54058R80816O68609K0087j64836
33712A955942J98930L54293N2478j5027M97649Q21159K06060q25100j070502k08560
33702A967322P96915Q02493l00553j469156j534154m29295O80300P13010n7183
$$ plain form
33693 1169699 698989 611775 960370 1117875 824849 534415 635014 868143 780097 400177
33683 400177 160264 316800 713748 1054314 1224964 1347335 1583905 1894645 2015697 1764917
33673 1764917 1329905 1098361 1204396 1422941 1534330 1570686 1621309 1638317 1600067 1648179
33663 1648179 1831948 1900494 1634920 1226610 948536 568409 -362599 -1543654 -1872595
33654 -1872595 -787480 777735 1366194 716829 -78392 -23363 838507 1963202 3035610
33645 3035610 3830209 3969478 3360899 2528797 2044005 1875648 1675234 1366919 1023633
33636 1023633 540426 6586 47996 1045687 2220951 2358343 1427967 627545 698449 1102326
33626 1102326 1156888 1066727 1286271 1649357 1829552 2034584 2467073 2615816 1970992 1085150
$$ packed form
33693A169699m70710q7214L48595J57505k93026k90434J00599K33129q8046l79920
33683D00177k39913J56536L96948L40566J70650J22371K36570L10740J21052k50780
33673A764917m35012k31544J06035K18545J11389L6356N0623J7008l8250M8112
33663A648179J83769O8546k65574m08310k78074l80127r31008j181055l28941
33654a872595J085115J565215N88459o49365p95221N5029Q61870J124695J072408
33645C035610P94599J39269o08579q32102m84792j68357k00414l08315l43286
33636A023633m83207n33840M1410R97691J175264J37392r30376q00422P0904M03877
33626A102326N4562r0161K19544L63086J80195K05032M32489J48743o44824q85842
$$ plain form
33616 1085150 957915 1531591 1782228 1314202 863334 993661 1259339 1127427 918613
33607 918613 1186185 1753485 2062590 2052305 1989795 1768934 1153099 520820 528726 1027830
33597 1027830 1141514 591657 139266 361222 767057 700463 459752 749501 1462508 1871044
33587 1871044 1780826 1603306 1408074 885028 288424 329494 825223 573876 -796602 -1872608
33577 -1872608 -1257245 467690 1642567 1768316 1628865 1614577 1349916 942090 1175222
33568 1175222 2125479 2764523 2403843 1541170 828656 204457 -389387 -405697 435728 1448898
33558 1448898 1907100 1999172 2150433 2089382 1429803 604651 357251 759960 1491990 2523857
33548 2523857 3664887 4038793 3095752 1728181 1269580 1694809 1919137 1575914 1255589
$$ packed form
33616A085150j27235N73676K50637m68026m50868J30327K65678j31912k08814
33607I18613K67572N67300L09105j0285o2510k20861o15835o32279P906M99104
33597A027830J13684n49857m52391K21956M05835o6594k40711K89749P13007M08536
33587A871044r0218j77520j95232n23046n96604M1070M95729k51347j370478j076006
33577a872608O15363J724935J174877J25749j39451j4288k64661m07826K33132
33568A175222R50257O39044l60680q62673p12514o24199n93844j6310Q41425J013170
33558A448898M58202R2072J51261o1051o59579q25152k47400M02709P32030J031867
33548B523857J141030L73906r43041j367571m58601M25229K24328l43223l20325
$$ plain form
33539 1255589 1159314 857456 412324 418335 756515 595224 -103471 -358110 188001 688186
33529 688186 653648 788285 1568654 2228444 2053074 1606324 1669577 1911832 1711151 1476543
33519 1476543 1929884 2658295 2605696 1649434 611140 16935 -133875 292142 1330663
33510 1330663 2216561 2023067 975124 158680 -17094 -76367 -232448 17935 855294
33501 855294 1651471 1839113 1522718 1002443 402861 -43238 -60165 145646 133374 115492
33491 115492 769755 1965773 2590431 2033443 1019388 491279 442421 411164 407993 654020
33481 654020 935239 908168 668087 439552 92642 -461761 -781756 -431680 265937 603369
33471 603369 394349 -9833 -358370 -602693 -579684 -176421 319560 560874 704118 1114754
$$ packed form
33539A255589r6275l01858m45132O011L38180j61291o98695k54639N46111N00185
33529F88186l4538J34637P80369O59790j75370m46750O3253K42255k00681k34608
33519A476543M53341P28411n2599r56262j038294n94205j50810M26017J038521
33510A330663Q85898j93494j047943q16444j75774n9273j56081K50383Q37359
33501H55294P96177J87642l16395n20275n99582m46099j6927K05811j2272j7882
33491A15492O54263J196018O24658n56988j014055n28109m8858l1257l171K46027
33481F54020K81219k7071k40081k28535l46910n54403l19995L50076O97617L37432
33471F03369k09020m04182l48537k44323K3009M03263M95981K41314J43244M10636
$$ plain form
33461 1114754 1632923 1701119 1197004 609964 351514 358443 452464 678179 1150054 1820683
33451 1820683 2451513 2662776 2163124 1173448 381286 106267 -215470 -1195610 -2377441
33442 -2377441 -2645474 -1696660 -374140 572348 1323317 2285640 3196084 3426240 2819481
33433 2819481 1794850 847917 272723 154221 303045 334133 79389 -167433 -2252
33424 -2252 591943 1235122 1529286 1357678 943837 689517 818596 1154664 1407501 1617727
33414 1617727 2023148 2512132 2614221 2131081 1399461 804990 425695 301849 609673
33405 609673 1308030 1990886 2339788 2359921 2004011 1124163 116376 -59284 883688 1831742
33395 1831742 1535484 224121 -826879 -994161 -638655 1547 1057886 2072941 2035974
$$ packed form
33461A114754N18169O8196n04115n87040k58450O929R4021K25715M71875O70629
33451A820683O30830K11263m99652r89676p92162k75019l21737r80140j181831
33442b377441k68033R48814J322520R46488P50969R62323R10444K30156o06759
33433B819481j024631r46933n75194j18502J48824L1088k54744k46822J65181
33424b252N94195O43179K94164j71608m13841k54320J29079L36068K52837K10226
33414A617727M05421M88984J02089m83140p31620n94471l79295j23846L07824
33405F09673O98357O82856L48902K0133l55910q79848j007787j75660R42972R48054
33395A831742k96258j311363j051000j67282L55506O40202J056339J015055l6967
$$ plain form
33386 2035974 892101 -4686 324577 1048817 735687 -601362 -1642052 -1616270 -1025954
33377 -1025954 -574658 -305028 11425 364016 681550 993272 1166449 962345 585222
33368 585222 661002 1319471 1761895 1233686 124917 -440553 11267 840171 1221937 1090610
33358 1090610 1000797 1363600 2035790 2543649 2583401 2323681 2182120 2237503 2036016 1237948
33348 1237948 298916 35096 472810 692163 110882 -590290 -368492 680174 1411206
33339 1411206 1151241 420480 -3790 -62335 -87912 -79388 126970 298363 35287 -563348
33329 -563348 -1005987 -1131308 -1202666 -1264476 -962070 -176932 641003 1044209 1109835 1109362 1025283
33318 1025283 784079 686583 1100585 1784827 1968093 1217023 -35937 -934057 -1008846 -509822
$$ packed form
33386B035974j143873q96787L29263P24240l13130j337049j040690K5782N90316
33377a025954M51296K69630L16453L52591L17534L11722J73177k04104l77123
33368E85222P5780O58469M42424n28209j108769n65470M51820Q28904L81766j31327
33358A090610q9813L62803O72190N07859L9752k59720j41561N5383k01487p98068
33348A237948r39032k63820M37714K19353n81281p01172K21798J048666P31032
33339A411206k59965p30761m24270n8545k5577Q524K06358J71393k63076n98635
33329e63348m42639j25321p1358o1810L02406P85138Q17935M03206O5626m73q4079
33318A025283k41204r7496M14002O84242J83266p51070j252960q98120p4789M99024
$$ plain form
33308 -509822 -67671 -73954 -310723 -203902 493246 1361722 1788670 1672533 1463356 1570257
33298 1570257 1960321 2331050 2449212 2290426 2048580 2036360 2365974 2700201 2577330 2062150
33288 2062150 1773482 2068092 2472667 2265120 1475561 889937 1006091 1379402 1254867
33279 1254867 586200 34498 6366 132864 -96689 -539380 -646598 -338601 -103658 -154594
33269 -154594 -29262 648937 1443170 1621579 1139697 559380 147856 -290861 -672691 -450742
33259 -450742 522849 1538654 1869325 1634073 1376340 1195819 877393 553843 518489 522313
33249 522313 39303 -723257 -890113 -260271 192679 -320057 -1179770 -1229187 -456050 70799
33239 70799 -150519 -380288 124462 931799 1025531 172760 -841279 -1191189 -787229 -119239
$$ packed form
33308e09822M42151o283k36769J06821O97148Q68476M26948j16137k09177J06901
33298A570257L90064L70729J18162j58786k41846j2220L29614L34227j22871n15180
33288B062150k88668K94610M04575k07547p89559n85624J16154L73311j24535
33279A254867o68667n51702k8132J26498k29553m42691j07218L07997K34943n0936
33269a54594J25332O78199P94233J78409m81882n80317m11524m38717l81830K21949
33259d50742R73591J015805L30671k35252k57733j80521l18426l23550l5354L824
33249E22313m83010p62560j66856O29842M52950n12736q59713m9417P73137N26849
33239G0799k21318k29769N04750Q07337R3732q52771j014039l49910M03960O67990
$$ plain form
33229 -119239 311221 343620 166038 37885 -51890 -337615 -791125 -942016 -488193 113570
33219 113570 111003 -547671 -1154448 -1221407 -1017141 -956743 -959326 -738953 -332478 56101 417995
33208 417995 729782 683620 142522 -349128 -109862 683005 1126885 772107 116726 -188800
33198 -188800 -77526 207310 579968 934975 916308 329879 -417560 -679196 -261804 513966
33188 513966 1310478 2045215 2742408 3354762 3728058 3652428 3041537 2106037 1182877 384679
33178 384679 -318001 -701877 -461238 117700 253967 -249295 -647462 -443905 -247087 -668817
33168 -668817 -981262 -26475 1764383 2544702 1458179 -262412 -1048983 -831810 -454140
33159 -454140 -155958 370332 933321 944907 495665 421019 1111289 1917220 2025525 1468961
$$ packed form
33229a19239M30460L2399j77582j28153q9775k85725m53510j50891M53823O01763
33219A13570k567o58674o06777o6959K04266O0398k583K20373M06475L88579L61894
33208D17995L11787m6162n41098m91650K39266P92867M43880l54778o55381l05526
33198a88800J11274K84836L72658L55007j8667n86429p47439k61636M17392P75770
33188E13966P96512P34737O97193O12354L73296p5630o10891r35500r23160p98198
33178C84679p02680l83876K40639N78938J36267n03262l98167K03557J96818m21730
33168f68817l12445R54787J790858P80319j086523j720591p86571K17173L77670
33159d54140K98182N26290N62989J1586m49242p4646O90270Q05931J08305n56564
$$ plain form
33149 1468961 936218 851230 997380 1010831 945515 1120620 1449502 1275201 211615 -1042011
33139 -1042011 -1283369 -282948 888083 1240410 976620 787959 652333 95015 -697399
33130 -697399 -931760 -390494 222041 303823 89306 101134 411581 779143 1088494 1292981
33120 1292981 1244606 941485 707332 782479 901940 603628 -125029 -766546 -806161 -183866
33110 -183866 707030 1302495 1205560 421262 -680121 -1617346 -1982329 -1512987 -296598
33101 -296598 1022176 1558477 993497 -44753 -616610 -429565 -2571 71118 -162723
33092 -162723 -100975 696015 1940139 2820735 2769511 1933990 888326 98910 -180291 206546
33082 206546 1106241 1844890 1720809 790697 -211065 -779902 -1040750 -1184188 -1065130
$$ packed form
33149A468961n32743q4988J46150J3451o5316J75105L28882j74301j063586j253626
33139a042011k41358J000421J171031L52327k63790j88661j35626n57318p92414
33130f97399k34361N41266O12535Q1782k14517J1828L10447L67562L09351K04487
33120A292981m8375l03121k34153P5147J19461k98312p28657o41517l9615O22295
33110a83866Q90896N95465r6935p84298j101383r37225l64983M69342J216389
33101b96598J318774N36301n64980j038250n71857J87045M26994P3689k33841
33092a62723O1748P96990J244124Q80596n1224q35521j045664p89416k79201L86837
33082B06546Q99695P38649j24081r30112j001762n68837k60848j43438J19058
$$ plain form
33073 -1065130 -631220 -253755 -223185 -252835 116140 855672 1521319 1745692 1402473 602833
33063 602833 -168231 -292806 207570 517098 102958 -445742 -232065 648655 1312067 1329266
33053 1329266 1018714 683323 396225 482062 1294185 2369823 2663828 1897188 917862
33044 917862 428197 127365 -471763 -1116604 -1279074 -989116 -638511 -381635 -207321 -169066
33034 -169066 -95564 431722 1311594 1678253 1055092 246023 310469 1049471 1369882 901543
33024 901543 358309 385967 906976 1620121 2342150 2765497 2632064 2279755 2309121 2583525
33014 2583525 2309175 1291159 321763 30559 140327 266556 643196 1436631 2029341
33005 2029341 1778634 1040707 651479 693921 578126 176064 51115 506523 1116090 1395743
$$ packed form
33073a065130M33910L77465L0570k9650L68975P39532O65647K24373l43219p99640
33063F02833p71064j24575N00376L09528m14140n48700K13677Q80720O63412J7199
33053A329266l10552l35391k87098Q5837Q12123J075638K94005p66640r79326
33044I17862m89665l00832n99128o44841j62470K89958L50605K56876J74314L8255
33034a69066P3502N27286Q79872L66659o23161q09069O4446P39002L20411m68339
33024I01543n43234K7658N21009P13145P22029M23347j33433l52309K9366K74404
33014B583525k74350j018016r69396k91204J09768J26229L76640P93435N92710
33005B029341k50707p37927l89228M2442j15795m02062j24949M55408O09567K79653
$$ plain form
32995 1395743 1400420 1434814 1604054 1874563 2225604 2515723 2484149 2091853 1622314 1273515
32985 1273515 913105 446516 151183 321066 754360 965601 837380 670449 574056 287225
32975 287225 -156158 -51068 1136851 2740810 3367230 2519553 1165602 425980 293388
32966 293388 144620 -21791 326789 1153023 1711770 1604626 1221221 930939 543554 -99242
32956 -99242 -634766 -727475 -612400 -657852 -822731 -955773 -1163716 -1421218 -1315674 -758597
32946 -758597 -476363 -1075402 -1983839 -2119471 -1365406 -554990 -164872 61055 231204 62090
32936 62090 -282435 -72550 826711 1468920 1067540 125815 -272994 137887 722959 948586
32926 948586 873000 754102 659808 489432 111784 -492407 -1088450 -1333111 -1191901 -1006851
$$ packed form
32995A395743M677L4394J69240K70509L51041K90119l1574l92296m69539l48799
32985A273515l60410m66589k95333J69883M33294K11241j28221j66931r6393k86831
32975B87225m43383J05090J187919J603959O26420q47677j353951p39622j32592
32966B93388j48768j66411L48580Q26234N58747j07144l83405k90282l87385o42796
32956i9242n35524r2709J15075m5452j64879j33042k07943k57502J05544N57077
32946g58597K82234n99039r08437j35632P54065Q10416L90118K25927J70149j69114
32936F2090l44525K09885Q99261O42209m01380r41725l98809M10881N85072K25627
32926I48586p5586j18898r4294j70376l77648o04191n96043k44661J41210J85050
$$ plain form
32916 -1006851 -1014781 -1045537 -842730 -398829 184499 834256 1313262 1277118 796036 430544
32906 430544 449800 375478 -245602 -968114 -928555 -27897 920573 1185422 807015 310834
32896 310834 132687 349547 668124 674959 318224 40662 211337 626184 865944 885902
32886 885902 838946 584206 -60909 -734420 -826991 -358608 13089 -112154 -521280 -942071
32876 -942071 -1340164 -1573334 -1383583 -900754 -536982 -213691 581512 1692953 2105538
32867 2105538 1414323 681254 980538 1720253 1514542 402757 -74005 859977 2069769
32858 2069769 2166455 1369276 913793 1216063 1564456 1378849 834511 184708 -658014 -1523415
32848 -1523415 -1700248 -860984 184363 383086 -101749 -88266 912841 1939675 1872365
$$ packed form
32916a006851p930l0756K02807M43901N83328O49757M79006l6144m81082l65492
32906D30544J9256p4322o21080p22512L9559R00658R48470K64849l78407m96181
32896C10834j78147K16860L18577O835l56735k77562J70675M14847K39760J9958
32886H85902m6956k54740o45115o73511r2571M68383L71697j25243m09126m20791
32876i42071l98093k33170J89751M82829L63772L23291P95203J111441M12585
32867B105538o91215p33069K99284P39715k05711j111785m76762R33982J209792
32858B069769R6686p97179m55483L02270L48393j85607n44338o49803q42722q65401
32848a523415j76833Q39264J045347J98723m84835J3483J001107J026834o7310
$$ plain form
32839 1872365 883579 85179 138809 788879 1484894 1814604 1460982 442466 -541013
32830 -541013 -661170 -57554 197853 -507472 -1527269 -1911461 -1639102 -1391261 -1492180
32821 -1492180 -1678334 -1692249 -1495700 -985944 -94092 798142 1073405 641632 56541 -253614
32811 -253614 -424378 -627549 -570731 76838 1022959 1544028 1271251 489491 -284977 -734688
32801 -734688 -775655 -484428 -108744 47973 -110340 -411233 -653050 -763589 -675674 -263876
32791 -263876 413837 964989 1008414 625247 227719 7097 -189778 -391284 -291950 238750
32781 238750 738697 643775 80657 -237947 65377 573701 655713 230340 -200162 -91152
32771 -91152 685368 1738692 2405807 2287491 1671602 1264151 1389405 1643700 1475604 893336
$$ packed form
32839A872365r88786p98400N3630O50070O96015L29710l53622j018516r83479
32830e41013j20157O03616K55407p05325j019797l84192K72359K47841j00919
32821a492180j86154j3915J96549N09756Q91852Q92234K75263m31773n85091l10155
32811b53614j70764k03171N6818O47569R46121N21069k72777p81760p74468m49711
32801g34688m0967K91227L75684J56717j58313l00893k41817j10539Q7915M11798
32791b63876O77713N51152M3425l83167l97528k20622j96875k01506R9334N30700
32781B38750M99947r4922n63118l18604L03324N08324Q2012m25373m30502J09010
32771i1152P76520J053324O67115j18316o15889m07451J25254K54295j68096n82268
$$ plain form
32761 893336 381741 279779 492228 731625 809545 724838 661641 872136 1374357 1787201
32751 1787201 1676421 1119495 759015 1165501 2185235 3018924 3008009 2323897 1758611
32742 1758611 1754991 1813776 1122260 -306503 -1501599 -1636153 -900095 -75601 399789 601421
32732 601421 621127 389816 -20458 -296311 -189940 255691 796567 1150934 1142285 880488
32722 880488 730890 874982 968738 517337 -413594 -1140827 -1092710 -396571 331206 622344
32712 622344 515977 394962 535989 826140 982464 1021201 1267362 1792097 2147378 1925055
32702 1925055 1311694 741412 266466 -242951 -491061 -25763 867139 1241788 729368
32693 729368 119375 298797 1044831 1388399 951828 385792 449187 1057752 1450959 1148299
$$ packed form
32761H93336n11595j01962K12449K39397P7920q4707o3197K10495N02221M12844
32751A787201j10780n56926l60480M06486J019734Q33689j0915o84112n65286
32742A758611l620N8785o91516j428763j195096j34554P36058Q24494M75390K01632
32732F01421J9706k31311m10274k75853J06371M45631N40876L54367q649k61797
32722H80488j49598J44092R3756m51401r30931p27233M8117O96139P27777K91138
32712F22344j06367j21015J41027K90151J56324L8737K46161N24735L55281k22323
32702A925055o13361n70282m74946n09417k48110M65298Q92902L74649n12420
32693G29368o09993J79422P46034L43568m36571n66036O3395O08565L93207l02660
$$ plain form
32683 1148299 517336 305210 705027 1116726 903696 103932 -830635 -1676548 -2376551
32674 -2376551 -2579147 -1901021 -675189 192949 291076 75553 5062 -76353 -357874 -479559
32664 -479559 -70652 556410 820135 694256 591159 649035 655464 523382 361454 200609
32654 200609 99680 372186 1207296 2157820 2524198 2242302 1914564 1918587 1923259 1400410
32644 1400410 305235 -819321 -1212312 -482782 863450 1640820 1143984 -13277 -638857
32635 -638857 -390257 62573 156351 20319 -88289 -216089 -383947 -448967 -514914 -876827
32625 -876827 -1340237 -1285429 -733162 -587893 -1292945 -1970608 -1652895 -780987 -538995 -1053516
32615 -1053516 -1314646 -833982 -327993 -486199 -959988 -1089032 -978703 -1193262 -1718775
$$ packed form
32683A148299o30963k12126L99817M11699k13030p99764r34567q45913p00003
32674b376551k02596O78126J225832Q68138R8127k15523p0491q1415k81521j21685
32664d79559M08907O27062K63725j25879j03097N7876O429j32082j61928j60845
32654B00609j00929K72506Q35110R50524L66378k81896l27738M023M672n22849
32644A400410j095175j124556l92991P29530J346232P77370m96836j157261o25580
32635f38857K48600M52830R3778j36032j08608j27800j67858o5020o5947l61913
32625h76827m63410N4808N52267J45269p05052o77663L17713Q71908K41992n14521
32615a053516k61130M80664N05989j58206m73789j29044J10329k14559n25513
$$ plain form
32606 -1718775 -1900196 -1389176 -660334 -428914 -824212 -1323042 -1382417 -951695 -356647 125738
32596 125738 403776 403331 80883 -348756 -543555 -568729 -943981 -1841720 -2565247 -2299364
32586 -2299364 -1192164 -187048 101264 -189649 -753921 -1428499 -1848704 -1540581 -667909
32577 -667909 -61011 -111762 -215190 221365 785069 719416 142873 -149260 154357 681720
32567 681720 1191087 1773051 2226619 2044869 1228164 425188 7181 -363671 -944943 -1346418
32557 -1346418 -1202202 -856856 -819384 -920770 -583092 323018 1380487 2159532 2401580
32548 2401580 1933793 921052 9637 -298364 -252320 -343941 -433415 -32075 704972 1046700
32538 1046700 779370 482760 576168 823433 1016613 1391539 1956392 2094835 1415783 507336
$$ packed form
32606a718775j81421N11020P28842K31420l95298m98830n9375M30722N95048M82385
32596A25738K78038m45l22448m29639j94799k5174l75252q97739p23527K65883
32586b299364J107200J005116K88312k90913n64272o74578m20205L08123Q72672
32577f67909O06898n0751j03428M36555N63704o5653n76543k92133L03617N27363
32567F81720N09367N81964M53568j81750q16705q02976m18007l70852n81272m01475
32557a346418J44216L45346L7472j01386L37678R06110J057469P79045K42048
32548B401580m67787j012741r11415l08001M6044r1621q9474M01340P37047L41728
32538A046700k67330k96610R3408K47265J93180L74926N64853J38443o79052r08447
$$ plain form
32528 507336 245959 687770 1174126 1243778 926834 404100 -87601 -219775 33507 143716
32518 143716 -311043 -905804 -857614 -136918 523432 710761 795400 1188305 1687566 1802064
32508 1802064 1355222 586379 -59548 -159955 341815 935380 1000995 536538 116156 97507
32498 97507 250240 247151 120660 68211 121509 160057 18521 -449568 -1128894 -1508366 -1189070
32487 -1189070 -485691 -33221 160505 622040 1334921 1585101 1165449 858343 1158002
32478 1158002 1322634 542836 -546881 -581118 555239 1510244 1300407 454617 45322
32469 45322 301197 611451 447078 -147008 -734017 -854567 -368558 372085 815395 794824
32459 794824 691249 920970 1405280 1670048 1410992 876950 655371 1022140 1545774 1538169
$$ packed form
32528E07336k61377M41811M86356O9652l16944n22734m91701j32174K53282J10209
32518A43716m54759n94761M8190P20696O60350J87329Q4639L92905M99261J14498
32508A802064m46842p68843o45927j00407N01770N93565O5615m64457m20382j8649
32498I7507J52733l089j26491n2449N3298L8548j41536m68089o79326l79472L19296
32487a189070P03379M52470J93726M61535P12881K50180m19652l07106K99659
32478A158002J64632p79798j089717l4237J136357R55005k09837q45790m09295
32469D5322K55875L10254j64373n94086n87009j20550M86009P40643M43310k0571
32459G94824j03575K29721M84310K64768k59056n34042k21579L66769N23634p605
$$ plain form
32449 1538169 935357 428147 554915 1006574 1135153 833276 482161 275067 114062
32440 114062 47524 262422 658758 932648 1094651 1406444 1762248 1671252 1000099 245314
32430 245314 -126136 -171763 -115299 52643 330549 448089 205201 -170322 -292316 -65235
32420 -65235 343044 783506 1181212 1464901 1598484 1574017 1345154 947886 639456 614481
32410 614481 629896 321021 -127070 -145137 320238 678835 650182 687114 1117997 1524220
32400 1524220 1463029 1223538 1254243 1332635 1009190 503741 394811 647453 715923 501131
32390 501131 456772 737062 932665 760776 432146 205265 82390 59000 199003 344446
32380 344446 181906 -297496 -785933 -1135405 -1423823 -1543844 -1232056 -587571 -73886 103366
$$ packed form
32449A538169o02812n07210J26768M51659J28579l01877l51115k07094j61005
32440A14062o6538K14898L96336K73890J62003L11793L55804r0996o71153p54785
32430B45314l71450m5627N6464J67942K77906J17540k42888l75523j21994K27081
32420f5235M08279M40462L97706K83689J33583k4467k28863l97268l08430k4975
32410F14481J5415l08875m48091j8067M65375L58597k8653L6932M30883M06223
32400A524220o1191k39491L0705P8392l23445n05449j08930K52642O8470k14792
32390E01131m4359K80290J95603j71889l28630k26881j22875k3390J40003J45443
32380C44446j62540m79402m88437l49472k88418j20021L11788O44485N13685J77252
$$ plain form
32370 103366 169332 267925 274577 189627 177751 132421 -201157 -570752 -401348 148896 104007
32359 104007 -958164 -2192713 -2659433 -2487466 -2225854 -1745263 -698374 398112 570478
32350 570478 -263068 -1218280 -1670279 -1773892 -1783047 -1648099 -1408408 -1290218 -1244081 -973425
32340 -973425 -546521 -382247 -498295 -409477 32802 348198 248259 110928 265571 411483
32330 411483 231310 52046 309901 766256 898225 787050 938642 1357362 1490767 1151086
32320 1151086 887079 1225412 1960464 2434044 2259145 1608070 1002069 913193 1320569 1546305
32310 1546305 828574 -714872 -1938184 -1820776 -675596 157958 -125669 -916148 -1094744
32301 -1094744 -499534 3874 -161786 -531576 -461699 -207375 -506195 -1322194 -1746031 -1217100
$$ packed form
32370A03366O5966R8593O652q4950j1876m5330l33578l69595J69404N50244m4889
32359A04007j062171j234549m66720J71967K61612M80591J046889J096486J72366
32350E70478q33546r55212m51999j03613r155J34948K39691J18190M6137K70656
32340i73425M26904J64274j16048Q8818M42279L15396r9939j37331J54643J45912
32330D11483j80173j79264K57855M56355J31969j11175J51592M18720J33405l39681
32320A151086k64007L38333P35052M73580j74899o51075o06001q8876M07376K25736
32310A546305p17731j543446j223312J17408J145180Q33554k83627p90479j78596
32301a094744N95210N03408j65660l69790O9877K54324k98820q15999m23837N28931
$$ plain form
32291 -1217100 -187664 633306 1062721 1136829 672687 -275188 -986789 -812970 -87740
32282 -87740 365141 427150 617858 924289 624116 -450631 -1265946 -741213 900599 2424237
32272 2424237 2930895 2514892 1827095 1412373 1394259 1517130 1500644 1404235 1468035 1614091
32262 1614091 1503166 1165531 1034896 1119219 780464 -177140 -830280 -311979 783364
32253 783364 1104357 435138 -125542 117711 605184 643900 390062 235870 92254 -85076
32243 -85076 179653 1055630 1736998 1487809 836063 702568 744943 -150364 -1793216 -2520360
32233 -2520360 -1516192 -40801 432345 266587 766798 1935410 2447774 1702981 659579
32224 659579 365089 608479 496752 -297436 -1361330 -2145463 -2272798 -1602479 -464409
$$ packed form
32291a217100J029436Q20970M29415P4108m64142r47875p11601J73819P25230
32282h7740M52881O2009J90708L06431l00173j074747q15315N24733J641812J523638
32272B424237N06658m16003o87797m14722j8114J22871j6486r6409O3800J46056
32262A614091j10925l37635j30635Q4323l38755r57604o53140N18301J095343
32253G83364L20993o69219n60680K43253M87473L8716k53838j54192j43616j77330
32243h5076K64729Q75977O81368k49189o51746j33495M2375q95307j642852p27144
32233b520360J004168J475391M73146j65758N00211J168612N12364p44793j043402
32224F59579k94490K43390j11727p94188j063894p84133j27335O70319J138070
$$ plain form
32215 -464409 379000 416114 -75436 -424326 -296939 208166 871642 1353529 1166895 200785
32205 200785 -858392 -1181787 -830788 -581445 -737127 -792905 -445708 -226139 -697984 -1567067
32195 -1567067 -2103079 -2062435 -1686629 -1144782 -571973 -373773 -782487 -1225557 -863286 208426
32185 208426 988749 934073 581524 546275 610978 304502 -187983 -335767 -128080 9020
32175 9020 -59477 -136909 -201400 -292107 2465 1150198 2642036 3155490 2169807 798143
32165 798143 449471 1118071 1674267 1557645 1346277 1605434 2000264 1974758 1729303 1876195
32155 1876195 2375280 2520038 2057704 1676966 2000009 2544655 2306164 1230322 405784
32146 405784 570540 1032926 617737 -648467 -1494685 -1057262 74936 743060 637581
$$ packed form
32215d64409Q43409L7114m91550l48890J27387N05105O63476M81887j86634r66110
32205B00785j059177l23395L50999K49343j55682n5778L47197K19569m71845q69083
32195a567067n36012M0644L75806N41847N72809J98200m08714m43070L62271J071712
32185B08426P80323n4676l52549l5249O4703l06476m92485j47784K07687J37100
32175I020o8497p7432o4491r0707K94572J147733J491838N13454r85683j371664
32165G98143l48672O68600N56196j16622k11368K59157L94830k5506k45455J46892
32155A876195M99085J44758m62334l80738L23043N44646k38491j075842q24538
32146D05784J64756M62386m15189j266204q46218M37423J132198O68124j05479
$$ plain form
32137 637581 360775 357753 376249 37676 -519856 -826861 -693049 -368312 -135492 40894
32127 40894 342790 663051 571108 -124893 -925236 -1078768 -519310 3726 -70293 -352179
32117 -352179 -138502 484576 761415 422881 75906 252223 619701 497385 -217500 -1008393
32107 -1008393 -1359799 -1086225 -295096 608053 1067411 893598 495200 309063 236038 -7836
32097 -7836 -296948 -379513 -478870 -913809 -1268409 -783017 360117 1027700 698410 183627
32087 183627 313896 716318 607789 143097 68358 436875 624965 447091 320079 315532
32077 315532 -53196 -907317 -1640160 -1781507 -1603121 -1549984 -1618203 -1636791 -1672009 -1758563
32067 -1758563 -1615824 -1016331 -151807 665088 1371245 1961326 2254220 2160570 1907942 1724790
$$ packed form
32137F37581k76806l022J8496l38573n57532l07005J33812L24737K32820J76386
32127D0894L01896L20261r1943o96001q00343j53532N59458N23036p4019k81886
32117c52179K13677O23078K76839l38534l46975J76317L67478j22316p14885p90893
32107a008393l51406K73574P91129R03149M59358j73813l98398j86137p3025k43874
32097g836k89112q2565r9357m34939l54600M85392J143134O67583l29290n14783
32087A83627J30269M02422j08529m64692p4739L68517J88090j77874j27012m547
32077C15532l68728q54121p32843j41347J78386N3137o8219j8588l5218q6554
32067a758563J42739N99493Q64524Q16895P06157N90081K92894r3650k52628j83152
$$ plain form
32057 1724790 1575182 1436352 1480268 1689607 1683370 1295705 953057 1037143 1223203 969394
32047 969394 377552 -10781 -81449 -211715 -561732 -876228 -978504 -938899 -728662 -203066
32037 -203066 486522 888497 777474 390274 107426 154700 543211 1006665 1131132 889880
32027 889880 856467 1470507 2339762 2802520 2888160 2982435 2783203 1605990 -199708 -1194975
32017 -1194975 -614197 647012 1257714 940233 283020 -187651 -165200 538354 1546656
32008 1546656 1874802 1039129 -158344 -589105 -186862 253909 321131 321710 585960 1082217
31998 1082217 1599478 1812505 1385600 507994 17940 419680 1111907 1246137 967241
31989 967241 956591 1061455 470454 -750225 -1398370 -731478 554185 1353447 1454107
$$ packed form
32057A724790j49608j38830M3916K09339o237l87665l42648Q4086J86060k53809
32047I69394n91842l88333p0668j30266l50017l14496j02276L9605K10237N25596
32037b03066O89588M01975j11023l87200k82848M7274L88511M63454J24467k41252
32027H89880l3413O14040Q69255M62758Q5640R4275j99232j177213j805698r95267
32017a194975N80778J261209O10702l17481o57213m70671K2451P03554J008302
32008A546656L28146q35673j197473m30761M02243M40771O7222N79K64250M96257
31998A082217N17261K13027m26905q77606m90054M01740O92227J34230k78896
31989I67241j0650J04864n91001j220679o48145O66892J285663P99262J00660
$$ plain form
31980 1454107 1349684 1308931 1143407 609560 -291708 -1220054 -1589630 -1058646 11173
31971 11173 909804 1362643 1545238 1437027 812616 -85653 -580336 -468115 -271562 -361145
31961 -361145 -432056 -107719 504725 1099264 1464469 1340374 634012 -75142 -39939 415317
31951 415317 87313 -1279817 -2364602 -2090959 -1109803 -622905 -604424 -244094 494327
31942 494327 894301 672693 144539 -448348 -856284 -515919 632280 1441868 857330
31933 857330 -410323 -796325 -236755 -120354 -868550 -1205720 -318930 751397 718773
31924 718773 -105211 -551270 -358083 -213829 -538167 -1071977 -1394534 -1235173 -522195 443671
31914 443671 1165185 1596690 2168677 2869326 2915009 1843573 421803 -130913 489351
$$ packed form
31980A454107j04423m0753j65524n33847r01268r28346l69576N30984J069819
31971A1173Q98631M52839J82595j08211o24411q98269m94683J12221J96553q9583
31961c61145p0911L24337O12444N94539L65205j24095p06362p09154L5203M55256
31951D15317l28004j367130j084785K73643R81156M86898J8481L60330P38421
31942D94327L99974k21608n28154n92887m07936L40365J148199Q09588n84538
31933H57330j267653l86002N59570J16401p48196l37170Q86790J070327l2624
31924G18773q23984m46059J93187J44254l24338n33810l22557J59361P12978R65866
31914D43671P21514M31505N71987P00649M5683j071436j421770n52716O20264
$$ plain form
31905 489351 1508773 1946596 1326551 -22467 -1023284 -731861 434907 913219 -119118
31896 -119118 -1670221 -2244494 -1550987 -309144 883715 1652667 1509837 487398 -333705
31887 -333705 13274 988508 1303888 751410 203597 71872 -26053 -190995 -110120 -31808
31877 -31808 -576989 -1396616 -1345665 -370057 106217 -709917 -1718374 -1607829 -739439 -331439
31867 -331439 -575118 -691576 -372225 -78363 -108503 -248756 -284690 -214455 -41757 152911
31857 152911 118654 -163137 -276364 -7305 201766 -56616 -455517 -548267 -624225 -1160083
31847 -1160083 -1779846 -1684521 -936870 -374822 -281565 -91326 450492 744117 281490 -577781
31837 -577781 -1146447 -1182634 -823038 -248781 274467 447767 309424 219057 317568 377765
$$ packed form
31905D89351J019422M37823o20045j349018j000817K91423J166768M78312j032337
31896a19118j551103n74273O93507J241843J192859P68952j42830j022439q21103
31887c33705L46979R75234L15380n52478n47813j31725r7925j64942Q0875P8312
31877c1808n45181q19627N0951R75608M76274q16134j008457J10545Q68390M08000
31867c31439k43679j16458L19351K93862l0140j40253l5934P0235J72698J94668
31857A52911l4257k81791j13227K69059K09071k58382l98901r2750p5958n35858
31847a160083o19763R5325P47651N62048R3257J90239N41818K93625m62627q59271
31837e77781n68666l6187L59596N74257N23248J73300j38343r0367R8511O0197
$$ plain form
31827 377765 275484 141059 -39145 -411965 -739289 -565618 -109728 -203005 -940434 -1225323
31817 -1225323 -326049 854192 982600 242795 -29867 563412 963009 412027 -335443
31808 -335443 -139898 898879 1633263 1334824 363197 -488708 -791660 -583883 -89438
31799 -89438 439573 741010 623936 134064 -386846 -529812 -210084 220486 354772 172420
31789 172420 -19842 -25960 42576 1689 -160441 -336615 -475127 -621703 -816299 -952981
31779 -952981 -762808 -80036 806603 1295104 1182691 1031353 1470369 2263209 2533412 1940090
31769 1940090 1131885 847422 1013560 1050890 716093 232339 -191445 -535892 -759680 -798523
31759 -798523 -753614 -761333 -701986 -371306 49513 52248 -562849 -1396505 -1923983 -2011620 -1810363
$$ packed form
31827C77765j02281j34425j80204l72820l27324J73671M55890r3277p37429k84889
31817a225323Q99274J180241J28408p39805k72662N93279L99597n50982p47470
31808c35443J95545J038777P34384k98439r71627q51905l02952K07777M94445
31799h9438N29011L01437j17074m89872n20910j42966L19728M30570J34286j82352
31789A72420j92262o118O8536m0887j62130j76174j38512j46576j94596j36682
31779i52981J90173O82772Q86639M88501j12413j51338M39016P92840K70203n93322
31769A940090q08205k84463J66138L7330l34797m83754m23784l44447k23788l8843
31759g98523M4909p719N9347L30680M20819K735o15097q33656n27478q7637K01257
$$ plain form
31748 -1810363 -1355142 -499193 793083 2173424 2930890 2441135 861511 -706341 -1172364
31739 -1172364 -657326 -297629 -700547 -1153409 -765500 154094 562626 216031 -111942
31730 -111942 81408 381139 345056 258196 493167 699684 300934 -499361 -865389 -416441
31720 -416441 373839 896692 1061481 1091799 1027807 687166 14431 -689716 -944841 -563842
31710 -563842 56359 300701 64580 -125143 149647 654681 949049 1023354 1098541 1122801
31700 1122801 1026400 1220588 2103831 3119373 3115839 1855998 439741 -137264 -197624 -644653
31690 -644653 -1541711 -2112476 -1913574 -1347169 -1004998 -1004032 -1108765 -1208966 -1479004 -2081383
31680 -2081383 -2753145 -2849561 -2061294 -992562 -566491 -812435 -815328 -47313 937836 1516360
$$ packed form
31748a810363M55221Q55949J292276J380341P57466m89755j579624j567852m66023
31739a172364N15038L59697m02918m52862L87909R19594M08532l46595l27973
31730a11942J93350K99731l6083q6860K34971K06517l98750q00295l66028M48948
31720d16441P90280N22853J64789L0318o3992l40641o72735p04147k55125L80999
31710e63842O20201K44342k36121j89723K74790N05034K94368P4305P5187K4260
31700A122801r6401J94188Q83243J015542l534j259841j416257n77005o0360m47029
31690f44653q97058n70765J98902N66405L42171R66j04733j00201k70038o02379
31680b081383o71762r6416P88267J068732M26071k45944k893P68015R85149N78524
$$ plain form
31670 1516360 1926934 2489700 2579312 1424278 -412140 -1481525 -1345414 -967716 -1109616
31661 -1109616 -1408784 -1384822 -1325720 -1580919 -1803801 -1606422 -1325851 -1388598 -1412654 -737343
31651 -737343 477605 1433010 1745381 1629353 1250409 669000 311877 650765 1325813
31642 1325813 1388584 647987 24531 187943 545394 190553 -660387 -973891 -436592 134601
31632 134601 42534 -352496 -347942 -17099 32071 -213293 -57396 723835 1306257 952957
31622 952957 232813 310666 1185134 1564360 749684 -214845 92553 1523931 2588108
31613 2588108 2386041 1511974 1005746 1142224 1494805 1623000 1342560 698231 26112
31604 26112 -194231 163025 694269 986590 1093083 1274981 1528417 1682266 1769515 1916158
$$ packed form
31670A516360M10574N62766Q9612j155034j836418j069385J36111L77698j41900
31661a109616k99168K3962N9102k55199k22882J97379K80571o2747k4056O75311
31651g37343J214948R55405L12371j16028l78944n81409l57123L38888O75048
31642A325813O2771p40597o23456J63412L57451l54841q50940l13504N37299N71193
31632A34601r2067l95030M554L30843M9170k45364J55897P81231N82422l53300
31622I52957p20144P7853Q74468L79226q14676r64529L07398J431378J064177
31613B588108k02067q74067n06228J36478L52581J28195k80440o44329o72119
31604B6112k20343L57256N31244K92321J06493J81898K53436J53849Q7249J46643
$$ plain form
31594 1916158 1948902 1520146 665976 -109623 -415354 -336508 -90196 326517 837566 931455
31584 931455 145438 -1088792 -1640218 -1014112 -75435 39189 -531386 -577877 408600 1410438
31574 1410438 1227522 74258 -827696 -945359 -901350 -1188574 -1240000 -288725 1308296
31565 1308296 2273711 1905762 885619 449890 1080208 2225674 3084357 3288900 2824823
31556 2824823 1704049 89848 -1406465 -2035757 -1688079 -1044051 -725884 -567727 -21044
31547 -21044 972888 1946214 2598208 3007866 3123139 2579782 1307493 -38440 -617598
31538 -617598 -266720 408110 731474 573468 284704 151883 29205 -379317 -896734 -849312
31528 -849312 74885 1210909 1604133 1166023 613477 323283 -79010 -843892 -1501087
$$ packed form
31594A916158L2744m28756q54170p75599l05731P8846K46312M16713N11049R3889
31584I31455p86017j234230n51426O26106R38677J14624n70575m6491R86477J001838
31574A410438j82916j153264r01954j17663M4009k87224n1426R51275J597021
31565A308296R65415l67949j020143m35729O30318J145466Q58683K04543m64077
31556B824823j120774j614201j496313o29292L47678O44028L18167J58157N46683
31547b1044R93932R73326O51994M09658J15273n43357j272289j345933n79158
31538f17598L50878O74830L23364j58006k88764j32821j22678m08522n17417M7422
31528h49312R24197J136024L93224m38110n52546k90194m02293p64882o57195
$$ plain form
31519 -1501087 -1514532 -1026094 -561600 -418079 -649033 -1134435 -1302191 -431141 1199448
31510 1199448 2128311 1488228 387371 477499 1554969 1872624 763289 -436532 -416539
31501 -416539 420373 937341 873684 644414 355384 -26180 -80944 521727 1248126 1348800
31491 1348800 995962 885625 950274 492618 -435513 -873123 -428927 45056 -267334 -979872
31481 -979872 -1222453 -926058 -689556 -736940 -716170 -386629 103929 597268 1059063 1294085
31471 1294085 983098 140988 -781333 -1372980 -1590023 -1531840 -1181568 -538558 194292 750606
31461 750606 1038672 1131205 1115804 1044472 923867 665056 159854 -481309 -882033 -734681
31451 -734681 -102340 743738 1662536 2591777 3247905 3240559 2603042 1897406 1544987 1277683
$$ packed form
31519a501087j3445M88438M64494J43521k30954m85402j67756Q71050J630589
31510A199448R28863o40083j100857R0128J077470L17655j109335j199821J9993
31501d16539Q36912N16968o3657k29270k89030l81564n4764O02671P26399J00674
31491A348800l52838j10337O4649m57656r28131m37610M44196M73983l12390p12538
31481i79872k42581K96395K36502m7384K0770L29541M90558M93339M61795K35022
31471A294085l10987q42110r22321n91647k17043N8183L50272O43010P32850N56314
31461G50606K88066R2533j5401p1332j20605k58811n05202o41163m00724J47352
31451g34681O32341Q46078R18798R29241O56128p346o37517p05636l52419k67304
$$ plain form
31441 1277683 592825 -375456 -880280 -527881 187787 538354 421791 238246 140994 -124701
31431 -124701 -640588 -993011 -711308 191826 1252787 1968371 2096431 1752758 1355141
31422 1355141 1325427 1692211 2053631 1996655 1460043 687522 24351 -211794 47943 393811
31412 393811 221325 -543589 -1267021 -1379248 -1011456 -560248 -1523 844336 1655544 1906088
31402 1906088 1727794 1756677 2068305 2009511 1285135 455423 -6611 -411425 -1066853 -1476919
31392 -1476919 -1082033 -312408 -48742 -329487 -475671 -337301 -468184 -1017873 -1372710
31383 -1372710 -1137196 -674150 -371807 -128014 84279 -79389 -554942 -530157 417715 1426365
31373 1426365 1387865 467340 -244657 -281801 -94866 32741 349961 815240 870947 399483
$$ packed form
31441A277683o84858r68281n04824L52399P15668L50567j16563j83545r7252k65695
31431a24701n15887l52423K81703R03134J060961P15584J28060l43673l97617
31422A355141k9714L66784L61420n6976n36612p72521o63171k36145K59737L45868
31412C93811j72486p64914p23432j12227L67792M51208N58725Q45859Q11208K50544
31402A906088j78294K8883L11628n8794p24376q29712m62034m04814o55428m10066
31392a476919L94886P69625K63666k80745j46184J38370j30883n49689l54837
31383a372710K35514M63046L02343K43793K12293j63668m75553K4785R47872J008650
31373A426365l8500r20525p11997l7144J86935J27607L17220M65279N5707m71464
$$ plain form
31363 399483 127775 598908 1339967 1570235 1258669 919753 717889 377983 -193624 -740506
31353 -740506 -1049361 -1100506 -897671 -520292 -252845 -274548 -316265 -60565 202473 -131423
31343 -131423 -984409 -1486245 -1088256 -265028 216924 233349 58572 -338160 -1074343 -1698311
31333 -1698311 -1551727 -797550 -331253 -499001 -649550 -294230 47776 -241514 -769817
31324 -769817 -766774 -393292 -425237 -808655 -638296 272933 890209 482694 -284326 -443116
31314 -443116 -116737 13323 -746 369692 944762 992749 496211 245651 544157 731326
31304 731326 257837 -566858 -1227266 -1673099 -1955206 -1882437 -1527661 -1470712 -1969184 -2372997
31294 -2372997 -1955869 -938036 -92738 322532 620837 947282 1138562 1155203 1049512
$$ packed form
31363C99483k71708M71133P41059K30268l11566l38916k01864l39906n71607n46882
31353g40506l08855n1145K02835L77379K67447k1703m1717K55700K63038l33896
31343a31423q52986n01836L97989Q23228M81952J6425j74777l96732p36183o23968
31333a698311J46584P54177M66297j67748j50549L55320L42006k89290n28303
31324g69817L043L73482l1945l83418J70359R11229O17276m07515p67020j58790
31314d43116L26379J30060j4069L70438N75070M7987m96538k50560K98506J87169
31304G31326m73489q24695o60408m45833k82107P2769L54776N6949m98472m03813
31294b372997M17128J017833Q45298M15270K98305L26445J91280J6641j05691
$$ plain form
31285 1049512 652888 -78987 -541099 -23987 1201060 2061322 2081205 1896450 2104448
31276 2104448 2285615 1672339 347303 -782429 -1027501 -533916 18144 33957 -546717
31267 -546717 -1144017 -991151 54730 1245786 1710048 1384160 948894 939903 1230854 1406789
31257 1406789 1338951 1212527 1135788 949483 482222 -113666 -429142 -244232 214919 589491
31247 589491 861367 1292820 1895594 2227072 1881599 1051080 413129 470884 1093773 1706086
31237 1706086 1861835 1590796 1185514 772504 310581 13347 383147 1500358 2544511
31228 2544511 2530204 1476480 356776 -140452 -248975 -382292 -400979 -55148 345699
31219 345699 321119 15923 -10108 318176 505049 331978 234859 656642 1449129 2131261
$$ packed form
31285A049512l96624p31875m62112N17112J225047Q60262J9883j84755K07998
31276B104448J81167o13276j325036j129732k45072M93585N52060J5813n80674
31267e46717n97300J52866J045881J191056M64262l25888m35266q991K90951J75935
31257A406789o7838j26424p6739j86305m67261n95888l15476J84910M59151L74572
31247E89491K71876M31453O02774L31478l45473q30519o37951N7755O22889O12313
31237A706086J55749k71039m05282m13010m61923k97234L69800J117211J044153
31228B544511j4307j053724j119704m97228j08523j33317j8687L45831M00847
31219C45699k4580l05196k6031L28284J86873j73071r7119M21783P92487O82132
$$ plain form
31209 2131261 2409040 2232122 1637918 801661 52161 -368225 -416034 -32478 876612 2021730
31199 2021730 2617304 2122733 981603 207076 234410 562559 576208 294719 93721 40914
31189 40914 -129196 -546047 -1054528 -1474407 -1703502 -1584389 -988151 -97638 658769 1035364
31179 1035364 1085398 823987 183821 -499978 -443980 636289 1804746 1780409 542237
31170 542237 -552339 -457489 280135 313537 -784359 -2074740 -2427907 -1744726 -929309
31161 -929309 -848962 -1422002 -1741329 -1148876 -99353 315250 -281058 -1077558 -1164736 -651279
31151 -651279 -262241 -182380 36066 507799 676738 147243 -702105 -1245325 -1327810 -1135563
31141 -1135563 -756452 -318900 -237711 -719731 -1155111 -676204 547872 1204154 412149
$$ packed form
31209B131261K77779j76918n94204q36257p49500m20386m7809L83556R09090J145118
31199B021730N95574m94571j141130p74527K7334L28149J3649k81489k00998n2807
31189D0914j70110m16851n08481m19879k29095J19113N96238Q90513P56407L76595
31179A035364N0034k61411o40166o83799N5998J080269J168457k4337j238172
31170E42237j094576R4850P37624L3402j097896j290381l53167O83181Q15417
31161i29309Q0347n73040l19327N92453J049523M14603n96308p96500q7178N13457
31151f51279L89038P9861K18446M71733J68939n29495q49348n43220q2485J92247
31141a135563L79111M37552Q1189m82020m35380M78907J224076O56282p92005
$$ plain form
31132 412149 -1027863 -1491640 -436930 1075394 1713693 1194844 183367 -579416 -736096
31123 -736096 -310144 337003 746096 862497 1060361 1380460 1162291 15213 -1165968
31114 -1165968 -1002268 543508 1972702 2106495 1366252 826891 736106 594252 176400
31105 176400 -249187 -466932 -481433 -304298 -44429 -19717 -353338 -689591 -718977 -678388
31095 -678388 -869752 -1050663 -876442 -590789 -615822 -782135 -678955 -419897 -246550 228029
31085 228029 1324848 2159975 1513425 -192119 -1164023 -699145 21893 -12308 -254178
31076 -254178 59505 564630 708605 807108 1102720 920993 -11569 -505875 361462 1402694
31066 1402694 927515 -487793 -774488 407887 1256817 722461 -169126 -365330 -333955
$$ packed form
31132D12149j440012m63777J054710J512324O38299n18849j011477p62783j56680
31123g36096M25952O47147M09093J16401J97864L20099k18169j147078j181181
31114a165968J63700J545776J429194J33793p40243n39361r0785j41854m17852
31105A76400m25587k17745j4501J77135K59869K4712l33621l36253k9386M0589
31095f78388j91364j80911J74221K85653k5033j66313J03180K59058J73347M74579
31085B28029J096819Q35127o46550j705544r71904M64878P21038l4201k41870
31076b54178L13683N05125J43975R8503K95612j81727r32562m94306Q67337J041232
31066A402694m75179j415308k86695J182375Q48930n34356q91587j96204L1375
$$ [...]
##END NTUPLES=NMR SPECTRUM
##END=
