##TITLE=31Pdec_LY-TMF-13.40.3
 D2O, 24 sc
 4.3.2020
##JCAMPDX= 6.0         $$ Bruker NMR JCAMP-DX V2.0
##DATA TYPE= NMR FID
##DATA CLASS= NTUPLES
##ORIGIN= UXNMR, Bruker Analytische Messtechnik GmbH
##OWNER= root
$$ XWIN-NMR		Version 3.5
$$ Wed Mar  4 14:34:53 2020 Russian Standard Time (UT+4h)  she@DPX200
##.OBSERVE FREQUENCY= 81.013821
##.OBSERVE NUCLEUS= ^31P
##.DELAY= (6, 6)
##.ACQUISITION MODE= SIMULTANEOUS
##.ACQUISITION SCHEME= undefined
##.AVERAGES= 24
##.DIGITISER RES= 17
##SPECTROMETER/DATA SYSTEM= spect
##.PULSE SEQUENCE= zgpg30
##.SOLVENT NAME= CDCl3
##.SHIFT REFERENCE= (INTERNAL, CDCl3, 0, 243.863)
##AUDIT TRAIL= $$ (NUMBER, WHEN, WHO, WHERE, WHAT)
$$ ##TITLE= Audit trail, XWIN-NMR		Version 3.5
$$ ##JCAMPDX= 5.01
$$ ##ORIGIN= Bruker BioSpin GmbH
$$ ##OWNER= she
$$ F:/spectra/data/she/nmr/P31/1/audita.txt
$$ ##AUDIT TRAIL=  $$ (NUMBER, WHEN, WHO, WHERE, WHAT)
(   1,<2020-03-04 14:33:59.73 +0400>,<she>,<DPX200>,
      <created by zg, POWCHK disabled, PULCHK disabled
       configuration hash MD5:
       00 E9 B6 7A A2 85 ED C7 34 08 36 98 17 FE 4E 26
       data hash MD5: 32K
       1B 05 EE 1C 6D B1 DF D9 C5 20 E4 ED EB D2 F4 76>)
$$ ##END=
$$ 
$$ hash MD5
$$ A5 25 95 86 FB 9A 85 E2 E9 84 B1 D7 39 22 F5 F5
##$RELAX= 
##$RELAX= 
##$RELAX= 
##$RELAX= 
##$RELAX= 
##$RELAX= 
##$RELAX= 
##$RELAX= 
$$ Bruker specific parameters
$$ --------------------------
##$DU= <F:/spectra>
##$EXPNO= 1
##$NAME= <P31>
##$PROCNO= 1
##$TYPE= <nmr>
##$USER= <she>
##$AMP= (0..31)
100 100 100 100 100 100 100 100 100 100 100 100 100 100 100 100 100 100 
100 100 100 100 100 100 100 100 100 100 100 100 100 100 
##$AQSEQ= 0
##$AQ_mod= 1
##$AUNM= <au_zg>
##$AUTOPOS= <>
##$BF1= 81.014009
##$BF2= 200.13
##$BF3= 200.13
##$BF4= 200.13
##$BF5= 200.13
##$BF6= 200.13
##$BF7= 200.13
##$BF8= 200.13
##$BYTORDA= 1
##$CFDGTYP= 0
##$CFRGTYP= 5
##$CHEMSTR= <none>
##$CNST= (0..31)
1 1 145 1 1 1 1 1 1 1 1 1 1 1 1 1 1 1 1 1 1 1 1 1 1 1 1 1 1 1 1 1 
##$CPDPRG= <waltz16>
##$CPDPRG1= <>
##$CPDPRG2= <waltz16>
##$CPDPRG3= <>
##$CPDPRG4= <mlev>
##$CPDPRG5= <mlev>
##$CPDPRG6= <mlev>
##$CPDPRG7= <mlev>
##$CPDPRG8= <mlev>
##$CPDPRGB= <>
##$CPDPRGT= <>
##$D= (0..31)
0 1 0 0 0 0 0 0 0 0 0 0.03 2e-05 3e-06 0 0 0 0 0 0 0 0 0 0 0 0 0 0 0 0 
0 0 
##$DATE= 1583318039
##$DBL= (0..7)
120 120 120 11 120 120 24 19 
##$DBP= (0..7)
150 150 150 150 150 150 150 150 
##$DBP07= 0
##$DBPNAM0= <>
##$DBPNAM1= <>
##$DBPNAM2= <>
##$DBPNAM3= <>
##$DBPNAM4= <>
##$DBPNAM5= <>
##$DBPNAM6= <>
##$DBPNAM7= <>
##$DBPOAL= (0..7)
0.5 0.5 0.5 0.5 0.5 0.5 0.5 0.5 
##$DBPOFFS= (0..7)
0 0 0 0 0 0 0 0 
##$DE= 6
##$DECBNUC= <off>
##$DECIM= 4
##$DECNUC= <off>
##$DECSTAT= 4
##$DIGMOD= 1
##$DIGTYP= 9
##$DL= (0..7)
0 0 52 120 120 21 21 25 
##$DP= (0..7)
150 150 150 150 150 150 150 150 
##$DP07= 0
##$DPNAME0= <>
##$DPNAME1= <>
##$DPNAME2= <>
##$DPNAME3= <>
##$DPNAME4= <>
##$DPNAME5= <>
##$DPNAME6= <>
##$DPNAME7= <>
##$DPOAL= (0..7)
0.5 0.5 0.5 0.5 0.5 0.5 0.5 0.5 
##$DPOFFS= (0..7)
0 0 0 0 0 0 0 0 
##$DQDMODE= 0
##$DR= 17
##$DS= 0
$$ [...]
##$SUBNAM1= <"">
##$SUBNAM2= <"">
##$SUBNAM3= <"">
##$SUBNAM4= <"">
##$SUBNAM5= <"">
##$SUBNAM6= <"">
##$SUBNAM7= <"">
##$SUBNAM8= <"">
##$SUBNAM9= <"">
##$SW= 369.568048894756
##$SWIBOX= (0..15)
0 1 3 0 0 0 0 0 0 0 0 0 0 0 0 0 
##$SW_h= 29940.119760479
##$TD= 32768
##$TD0= 1
##$TE= 0
##$TE2= 300
##$TE3= 300
##$TEG= 300
##$TL= (0..7)
0 120 53 12 22 120 120 120 
##$TP= (0..7)
150 150 150 150 150 150 150 150 
##$TP07= 0
##$TPNAME0= <>
##$TPNAME1= <>
##$TPNAME2= <>
##$TPNAME3= <>
##$TPNAME4= <>
##$TPNAME5= <>
##$TPNAME6= <>
##$TPNAME7= <>
##$TPOAL= (0..7)
0.5 0.5 0.5 0.5 0.5 0.5 0.5 0.5 
##$TPOFFS= (0..7)
0 0 0 0 0 0 0 0 
##$TUNHIN= 0
##$TUNHOUT= 0
##$TUNXOUT= 0
##$USERA1= <user>
##$USERA2= <user>
##$USERA3= <user>
##$USERA4= <user>
##$USERA5= <user>
##$V9= 5
##$VALIST= <valist>
##$VCLIST= <CCCCCCCCCCCCCCC>
##$VD= 0
##$VDLIST= <DDDDDDDDDDDDDDD>
##$VPLIST= <PPPPPPPPPPPPPPP>
##$VTLIST= <TTTTTTTTTTTTTTT>
##$WBST= 1024
##$WBSW= 4
##$XGAIN= (0..3)
0 0 0 0 
##$XL= 0
##$YL= 0
##$YMAX_a= 8911
##$YMIN_a= -7870
##$ZGOPTNS= <>
##$ZL1= 120
##$ZL2= 120
##$ZL3= 120
##$ZL4= 120
##$ABSF1= 60
##$ABSF2= -190
##$ABSG= 5
##$ABSL= 3
##$ALPHA= 0
##$AQORDER= 0
##$ASSFAC= 0
##$ASSFACI= 0
##$ASSFACX= 0
##$ASSWID= 0
##$AUNMP= <proc_1d>
##$AZFE= 0.1
##$AZFW= 0.5
##$BCFW= 1
##$BC_mod= 2
##$BYTORDP= 1
##$COROFFS= 0
##$CY= 9.86611175537109
##$DATMOD= 1
##$DC= 1
##$DFILT= <>
##$DTYPP= 0
##$F1P= 182.46299112037
##$F2P= -745.623069630181
##$FCOR= 0.5
##$FTSIZE= 0
##$FT_mod= 0
##$GAMMA= 1
##$GB= 0
##$INTBC= 1
##$INTSCL= 1
##$ISEN= 30
##$LB= 1
##$LEV0= 0
##$LPBIN= 0
##$MAXI= 11.51145
##$MC2= 0
##$MEAN= 0
##$ME_mod= 0
##$MI= 1.244541
##$NCOEF= 0
##$NC_proc= 0
##$NLEV= 6
##$NOISF1= 0
##$NOISF2= 0
##$NSP= 1
##$NTH_PI= 0
##$NZP= 1
##$OFFSET= 243.8632
##$PC= 1.4
##$PHC0= -1320.203
##$PHC1= 73.8017
##$PH_mod= 0
##$PKNL= yes
##$PPARMOD= 0
##$PSCAL= 0
##$PSIGN= 0
##$REVERSE= no
##$SF= 81.0140731611343
##$SI= 65536
##$SIGF1= 0
##$SIGF2= 0
##$SINO= 80
##$SIOLD= 65536
##$SREGLST= <31P.CDCl3>
##$SSB= 0
##$STSI= 0
##$STSR= 0
##$SW_p= 25641.0256410257
##$SYMM= 0
##$S_DEV= 0
##$TDeff= 0
##$TDoff= 0
##$TI= <>
##$TILT= no
##$TM1= 0
##$TM2= 0
##$TOPLEV= 0
##$USERP1= <user>
##$USERP2= <user>
##$USERP3= <user>
##$USERP4= <user>
##$USERP5= <user>
##$WDW= 1
##$XDIM= 64
##$YMAX_p= 0
##$YMIN_p= 0
$$ End of Bruker specific parameters
$$ ---------------------------------
##NTUPLES= NMR FID
##VAR_NAME=  TIME,          FID/REAL,        FID/IMAG
##SYMBOL=    X,             R,               I
##VAR_TYPE=  INDEPENDENT,   DEPENDENT,       DEPENDENT
##VAR_FORM=  AFFN,          ASDF,            ASDF
##VAR_DIM=   16384,         16384,           16384
##UNITS=     SECONDS,       ARBITRARY UNITS, ARBITRARY UNITS
##FACTOR=    3.34e-05,      1,               1
##FIRST=     0,             0,               0
##LAST=      0.547192200000001, 0,           0
##MIN=       0,             -7870,           0
##MAX=       0.547192200000001, 8911,        0
$$ Real data points
##PAGE= N=1
##DATA TABLE= (X++(R..R)), XYDATA
0 0 0 0 0 0 0 0 0 0 0 0 0 0 0 0 0 0 0 0 0 0 0 0 -1 1 -1 1 0 1 -1 3 -4 2 -1 3 -4 3 -2 6 -6 7 -8 11 -11 11 -11 13 -15 13 -20 23 -25
51 -25 29 -28 32 -37 39 -41 45 -52 58 -66 78 -82 92 -101 104 7786 1512 1894 2827 2023 4320 1327
73 1327 4961 4945 4709 5413 6049 7605 6718 8911 5551 6406 7089 3995 4409 4675 4430 3956 4632 2361 1880
92 1880 1600 469 2321 -932 -3737 -3152 -3476 -3585 -4516 -5540 -5106 -5817 -5021 -4696 -6433 -5417 -7121 -6708
110 -6708 -6570 -4999 -4973 -6470 -4989 -3015 -5448 -4973 -1768 -1865 243 -262 879 43 1826 1551 3086
127 3086 3175 3288 2198 6701 5055 6349 6679 7108 6676 5626 6933 6661 7770 4548 5809 3622 3672
144 3672 2548 4400 3492 1983 1619 1068 156 -1575 453 -3500 -2850 -3905 -2687 -3896 -4672 -6334 -4366
161 -4366 -5894 -5711 -4662 -7762 -5614 -7243 -5657 -7064 -6568 -5455 -2348 -5224 -3435 -1385 -1980 -2175
177 -2175 -194 665 1484 1699 2004 2788 3309 3982 4399 3606 4581 5785 5700 6639 6030 3199 5384 5326 5557
196 5557 7103 4026 4986 3615 3776 2774 2665 1598 1885 1102 1066 39 -1024 -320 -1902 -4602 -4146
213 -4146 -4584 -4181 -4005 -4194 -4954 -6981 -7554 -5334 -5804 -4889 -7064 -7419 -5671 -3784 -3598 -3754 -3307 -2782
231 -2782 -2459 -1938 -957 -1163 449 775 2108 2977 2588 4120 5169 5702 6225 5163 5615 5569 6879 7990
249 7990 7952 6896 7517 6739 5113 2752 4128 5201 3927 3557 1438 950 652 1192 -860 -2124 -2156 -2265
267 -2265 -4140 -3967 -3736 -6023 -6613 -5392 -5801 -6159 -6759 -3372 -5123 -5569 -7497 -5578 -4930 -4199 -4038 -3330
285 -3330 -4072 -3141 -3689 -1583 792 -1004 -861 45 566 2211 3275 2795 2674 4252 5750 4115 7143
302 7143 5523 4420 4983 6027 5301 5594 4940 4190 6418 4519 5486 2943 2744 2493 1510 643 -411 -345
320 -345 984 -1751 -2783 -3648 -3590 -2343 -3156 -2766 -4812 -5361 -5324 -4276 -4073 -5989 -5690 -5174 -5568 -5203 -6438
339 -6438 -6155 -3384 -4208 -3601 -2549 -731 -1040 -972 1938 928 409 939 2756 2693 4135 5271 4458 6634
357 6634 4298 6060 6067 5349 5492 4666 5064 6758 5492 5351 3507 4855 3541 3020 1313 1651 1232 1657
375 1657 973 454 -116 -2304 -113 -1842 -3185 -3130 -4037 -4815 -6852 -5376 -4569 -5981 -5123 -5488 -5615 -5714
393 -5714 -3085 -5856 -4282 -3926 -4199 -2425 -3649 -2632 -898 -996 -371 -289 1391 3756 2134 1529 2264
410 2264 4327 6229 5549 5123 5917 7269 5697 4660 4761 6889 4096 5287 4781 5764 3902 3635 4303
427 4303 1744 957 3172 73 -917 -477 -1880 -2357 -2582 -2312 -1804 -3042 -4531 -2105 -4473 -4870 -4746
444 -4746 -5862 -6268 -5448 -5179 -6027 -7297 -5703 -4548 -4737 -4599 -3506 -1964 -2834 -1017 -1677 -1209 -203
461 -203 1030 2325 1298 1702 3336 4632 5897 4333 5092 5050 5592 6936 5329 4445 6000 6030 7268
478 7268 5345 5384 4301 2761 2948 2993 1692 1882 1762 -394 -797 -854 -2185 -787 -2143 -3344 -4477 -6070
496 -6070 -4351 -4130 -5948 -5228 -6128 -6757 -5575 -5143 -5208 -4219 -5585 -3957 -6276 -4355 -3605 -4749 -2378
513 -2378 -2820 -137 108 254 -543 1854 3445 2623 3130 3109 3987 5852 5706 6388 6565 6215 4420 5053 5108
532 5108 7374 6758 3935 6851 4966 3269 3813 6020 4348 129 673 -95 -783 -2728 -2005 -2213 -3064
549 -3064 -4272 -3391 -4196 -4033 -4034 -5875 -4605 -5473 -4937 -5484 -5467 -5405 -6245 -5656 -4674 -5210 -4358 -4216 -3006 -914
569 -914 -2490 -1699 -1675 -188 558 1969 767 2429 1967 3924 3597 4863 4152 5087 5844 7622 5382 4754
587 4754 4010 5456 6419 5906 5103 3095 3483 3456 2247 2494 1065 1813 44 1521 -831 -2004 -1711 -2332
605 -2332 -4704 -3010 -4390 -4552 -2247 -7146 -4033 -5973 -6345 -5401 -6513 -4789 -5287 -7130 -5277 -4120
621 -4120 -4264 -3786 -4048 -1174 -3150 -527 178 -97 854 2283 -726 2548 2620 3976 4266 5261 3510 4713
639 4713 6094 5784 5777 6958 4727 6869 4468 4867 6203 3026 3790 4124 3045 2052 1700 124 1644
656 1644 395 -1998 -1148 -704 -2621 -3260 -2862 -4174 -4359 -4004 -7418 -3054 -6196 -5449 -5304 -6688 -5825
673 -5825 -6476 -5029 -4000 -4920 -4374 -4816 -3043 -3272 -836 -1810 -581 80 781 -12 3081 442 3723
690 3723 5563 4184 5310 3741 4535 6102 5314 5646 6928 4259 5461 5301 4561 4596 4330 2241 2711
707 2711 1239 2470 1865 2618 736 -665 1246 -953 -1358 -889 -2328 -4376 -5248 -3263 -6344 -4396
723 -4396 -4583 -6017 -6294 -5961 -4682 -6215 -6344 -6518 -5871 -5024 -5920 -3771 -3341 -3154 -1667 -3134 94 845
741 845 -294 695 1716 1693 2639 4844 3788 5428 5420 5550 5445 4007 5079 5413 6273 5822 4360 5745
759 5745 4475 6098 4292 3183 4418 2974 3978 2804 1438 193 134 -1486 629 -2124 -835 -3852
775 -3852 -4267 -4356 -4738 -4507 -3570 -5642 -6432 -5515 -4695 -5186 -4759 -4209 -4769 -4481 -3626 -2314 -5189 -4452 -2331
794 -2331 -522 349 -243 -130 -34 1339 2874 3247 3663 4849 3262 4375 4010 6078 3707 4277 6019
811 6019 6676 5376 5225 5675 4850 5052 4546 2910 3601 1976 2976 2730 374 1294 -2089 -788 -1912
828 -1912 -1757 -94 -1852 -1035 -4567 -4771 -4884 -3705 -6353 -5381 -7752 -5531 -5583 -5080 -5708 -4876 -5655 -3212
846 -3212 -2836 -2219 -3404 -2521 179 -219 -499 708 -218 2504 4479 3234 2291 2672 6343 4339 5399
863 5399 2308 3308 4518 6875 4798 5744 5440 4237 6600 3861 4541 4078 3399 2725 3568 1497 507
880 507 1362 -125 1103 -1678 -1435 -1247 -3415 -2232 -5323 -4162 -5141 -5218 -4199 -4854 -6143 -6748 -6605 -5493
898 -5493 -4556 -4917 -6044 -3658 -3369 -2820 -1840 -3221 -2365 318 -1679 -1640 -778 657 2558 3897 2621
915 2621 1506 2142 6557 4832 3098 5266 4094 3184 5487 4808 6865 5186 5793 5344 4316 2536
931 2536 4883 2520 1046 2648 1924 1170 346 1094 -2037 -1882 -1397 -1673 -3628 -4043 -4523 -2756 -3777
948 -3777 -4873 -5384 -5141 -5569 -6557 -5830 -6529 -2739 -4488 -3933 -5761 -4833 -5175 -1397 -2260 -742 -594 -553
966 -553 -360 552 835 1560 2550 3531 3310 4115 4806 6705 3933 5343 4505 6485 5550 4691 5182 4964 6068
985 6068 2947 4218 2681 3950 1348 2770 975 -85 774 434 -118 -1462 -2654 -2181 -3136 -2199 -4396
1002 -4396 -4028 -5309 -5424 -5606 -6077 -6711 -4207 -6535 -6515 -5013 -4092 -3612 -3110 -1901 -4104 -2970 -323
1019 -323 -1945 -1546 -1356 1933 362 -267 1205 2866 3131 3243 3029 4861 4765 5075 5346 4646 5239 4829
1037 4829 4395 5586 4801 3401 5223 5401 4543 2301 2469 333 730 1370 718 -1315 -666 -3981 -2900
1054 -2900 -3611 -3277 -3050 -4897 -5008 -4474 -5196 -7382 -4982 -5180 -5311 -5735 -5058 -5451 -4828 -2660 -5671 -1809
1072 -1809 -4064 -2632 -1535 -856 -1002 927 723 713 1302 176 2301 3553 3190 1792 3280 4733 4719
1089 4719 3466 6511 5670 5217 4911 6966 3616 4356 3494 4920 5157 3671 2769 2695 2777 -181 1364 984
1107 984 459 -189 558 -2621 -2628 -3009 -2962 -4836 -5414 -5559 -4622 -5180 -3142 -6430 -6517 -6153 -5693 -3660 -4607 -3154
1127 -3154 -4718 -3620 -3752 -3495 -1128 -1391 -2255 -1348 1789 45 1577 2557 2026 3795 4474 3871 4518
1144 4518 4696 5632 6413 5061 8148 7003 5621 6640 5020 4495 4174 4464 4707 3025 1176 1038 956
1161 956 488 1019 709 -2116 -1224 -2134 -1529 -586 -3474 -3447 -3984 -3234 -4956 -5115 -4682 -5040 -4242 -6435 -5064
1180 -5064 -3937 -4611 -3550 -3369 -3165 -2792 -1702 -1140 -1207 567 -959 277 1563 1306 2947 2288 3455
1197 3455 4442 4342 5661 4189 5143 6441 5503 5533 7043 5333 5916 4908 5009 3842 2973 3851 3061 1321
1215 1321 3613 2109 352 374 -258 -826 -2338 -1883 -2211 -4670 -4980 -3373 -3782 -4340 -4799 -4087 -5035 -5931
1233 -5931 -5902 -5144 -4940 -3386 -4545 -4690 -3609 -5845 -4697 -3022 -1628 -3119 -317 856 723 1579 3210
1250 3210 1025 2623 3536 4339 5022 4979 5819 5358 4644 4949 5923 5207 5533 3347 6260 4089 4014 3231 2675
1269 2675 2456 1712 20 129 584 2552 -820 1298 -2253 -2484 -1657 -3059 -4125 -3374 -4888 -4284 -4491
1286 -4491 -4842 -4215 -4765 -6314 -6095 -4524 -5989 -4112 -3378 -4544 -2076 -2190 -3324 -2386 -2615 -133 -174
1303 -174 -430 2514 2642 2063 2440 2259 1716 1659 4469 3424 4932 3928 6381 4086 6207 6196 3855 6223
1321 6223 3738 5367 3184 4469 2732 4566 2830 2790 796 1404 405 -570 -2049 -2420 -4191 -2694
1337 -2694 -4021 -4034 -3430 -5081 -5122 -6473 -4470 -6249 -4529 -5165 -5841 -4804 -5308 -4002 -4267 -2812 -2858 -2780
1355 -2780 -2524 -3151 -1983 -282 -809 -426 1290 1998 559 340 4680 4476 3068 5225 6190 4520 4842
1372 4842 3867 5405 5914 6225 4226 3266 5079 4066 4466 2707 4386 1503 2164 1213 -522 -371 -342
1389 -342 -1700 -2951 -3283 -1715 -2255 -4198 -3393 -3244 -5559 -4604 -4167 -5075 -4501 -6076 -6439 -3670 -5764
1406 -5764 -3774 -5072 -5983 -4141 -3412 -2519 -1336 -1338 -511 -102 -167 1794 1845 2907 3673 3924 2346 5507
1424 5507 4075 5366 5448 5624 3632 3599 5001 4469 5916 2609 5409 3363 2339 2236 2635 594 1892
1441 1892 602 -198 -295 -1333 -1110 -3185 -2006 -1360 -3205 -3185 -4502 -4886 -4541 -5886 -4569 -4542 -4112 -3776
1459 -3776 -5157 -5064 -3527 -2436 -4166 -3873 -3445 -3974 -3054 -2072 -1790 -1009 -429 3032 1233 1093 447 2640
1477 2640 3640 2405 4915 4746 3362 5151 4527 4824 3448 3457 6322 6606 4273 3778 2475 3592 3732
1494 3732 4174 1984 1563 2128 813 -268 -725 39 -1639 -4442 -2753 -4266 -2985 -4222 -2995 -4555
1510 -4555 -5011 -5613 -4900 -6430 -5990 -4842 -4658 -5433 -3595 -3876 -3599 -3139 -4126 -2949 -1525 -2799 258
1527 258 986 -1412 -934 731 1595 3613 3802 2670 4299 5355 6035 4492 4590 4268 6550 6687 3544
1544 3544 2600 3775 5375 4066 3726 4269 2172 1126 1250 1142 -1513 1377 -551 -1199 -1161 -2195 -1474
1561 -1474 -1088 -3867 -4832 -3906 -5242 -3480 -4812 -4935 -5092 -5990 -4818 -5778 -5058 -3434 -3823 -5017 -4415
1578 -4415 -1238 -2500 -3569 -1222 -1386 -374 169 2053 703 3043 3196 2174 3720 4392 3040 5127
1594 5127 4394 6249 4629 5157 4403 4337 4889 5085 3904 3380 3367 4166 1531 1903 1169 627 1875 1152 -830
1613 -830 -3518 -2233 -1834 -1392 -2714 -3494 -2842 -3695 -4190 -6605 -4703 -5030 -3826 -2866 -3365 -2171 -3172
1630 -3172 -5216 -4421 -4359 -4433 -2736 -2807 -2145 -1227 1159 1733 -618 1024 1673 -27 2667 1165 3318 1972
1648 1972 2753 3284 4861 6003 4122 4896 4401 5981 3543 5105 4253 3953 2891 4082 4828 3071 4199
1665 4199 1183 -159 1782 982 543 -1571 -2023 -410 -1727 -3171 -3251 -4344 -4444 -4051 -4775 -3255 -3207
1682 -3207 -5021 -4385 -6037 -4436 -3799 -4569 -4359 -3335 -2008 -3889 -1794 -981 -1243 -1486 -1145 -298 -239 1013
1700 1013 382 2131 1899 3042 4311 5159 3781 5241 4753 4451 5976 5501 2965 2771 4693 3841 2994
1717 2994 3595 3962 2307 4442 554 646 1159 369 -1916 -532 -1403 -3848 -3648 -3876 -3037 -5691 -3486
1734 -3486 -4508 -4035 -4541 -3638 -7031 -3661 -6693 -2581 -3973 -4841 -5018 -3930 -4964 -2558 -2959 -2519 -1984
1751 -1984 9 1322 439 2373 1917 1898 2252 2310 4571 4452 3706 3944 4386 4700 3929 5877 5706 5407 3621
1770 3621 2750 4426 3188 3773 4469 1778 1615 1500 1766 692 -903 -905 -1756 -2576 291 -2401 -3569 -2297
1788 -2297 -3710 -4113 -4456 -5662 -6775 -3344 -3633 -3064 -4891 -5900 -5760 -4413 -2587 -3074 -967 -2605
1804 -2605 -3113 -1531 -416 -1812 32 629 -645 2913 2372 1845 2214 3444 4120 3963 3666 3195 4136
1821 4136 7119 6682 3845 4406 4133 3988 3093 3838 3322 3999 1006 1409 2910 1249 -353 1963 -786
1838 -786 -540 -3949 -2553 -1631 -3262 -1696 -3739 -3759 -4474 -4044 -4963 -5115 -4773 -4939 -3850 -5576 -3445 -3180
1856 -3180 -1724 -3842 -2305 -1984 -2080 -1401 -2947 -1201 -673 1754 -880 1848 2633 1002 4687 4714 4259
1873 4259 3201 4800 3494 5067 5032 4940 2897 5365 2975 3580 4601 3778 5694 2676 2170 2949 3470
1890 3470 656 2684 475 -41 340 -1845 -2974 -3076 -1355 -4475 -3703 -3160 -3157 -3605 -4973 -3083 -6072
1907 -6072 -4978 -6206 -4620 -3711 -1405 -4460 -4223 -3917 -3021 -1306 -483 -650 -510 -2083 170 2224 69
1924 69 2390 2801 1571 3095 3396 4354 3918 3777 3912 6147 4345 4668 5191 4508 5647 4484 3668 6171
1942 6171 1728 2276 1952 1949 1604 58 1096 -310 -1182 -2916 -876 -1899 -2605 -3547 -3506 -3255 -4448 -5468
1960 -5468 -7359 -5893 -4068 -4840 -5717 -4664 -5385 -4956 -4122 -3134 -2320 -2938 -3318 -1061 -2361 -781 644
1977 644 -446 -135 655 2574 1344 1736 1398 1571 2461 6883 3995 4545 5128 5240 5612 3387 4207 3997
1995 3997 3935 4378 3931 5903 2887 1855 941 2983 969 -167 1784 -1929 -1569 -2781 -1721 -1644 -2922
2012 -2922 -3346 -4873 -4817 -3480 -6382 -3322 -5142 -4940 -5351 -3993 -4383 -3439 -2353 -4469 -4462 -3533 -2376 -2814
2030 -2814 -1430 -1663 -81 -1611 866 133 3907 1355 472 3471 1961 4676 4353 5427 3576 4680
2046 4680 4472 7237 4801 3414 4403 4713 5680 5305 3295 2222 4421 2263 3577 1084 297 -1536
2062 -1536 -1496 -415 -1052 -2771 -4337 -1656 -2543 -2947 -3655 -4281 -6311 -3580 -5228 -6545 -5386 -4927 -4893
2079 -4893 -3657 -3967 -3601 -4516 -3132 -2442 -2854 481 -1730 -893 2675 34 1507 642 1140 1702 2969
2096 2969 3541 2428 1327 4374 4099 5289 4721 4598 5589 5406 5076 4777 2227 6659 3235 2400 2978
2113 2978 2251 698 342 220 1345 -2087 -374 -1398 -1698 -526 -4420 -3102 -3043 -3719 -3602 -3986 -3518
2130 -3518 -5126 -3601 -7178 -5163 -2868 -3747 -4993 -3994 -4064 -3239 -3722 -637 -3177 -2843 -148 -1914 1618
2147 1618 1030 1334 3403 3060 3438 1825 2878 1258 3714 3989 3437 4253 3526 4308 3665 4910 3065
2164 3065 2944 3473 3800 4053 3451 1039 2399 -940 55 3833 -1443 -739 -1265 -3870 -1640 -2918 -2998
2181 -2998 -4371 -3229 -2934 -4900 -4711 -5018 -5479 -2887 -6060 -4730 -4787 -3548 -3380 -2128 -3998 -1905 -1015
2198 -1015 -2165 -943 -656 -1889 -1065 2032 625 15 1744 2815 2801 3793 3966 3743 3993 5441 5768
2215 5768 4596 5480 4217 3220 3269 2885 4412 4276 1891 1820 2296 -115 1650 1620 665 190 -1101 -171
2233 -171 -1655 -1566 -2536 -3747 -1985 -4594 -3546 -4046 -2497 -4366 -4759 -3540 -3669 -4521 -4016 -3279 -4130 -3038
2251 -3038 -1787 -4482 -2344 -2664 -2326 -2175 -1585 -731 258 2060 752 2332 2401 1819 2374 3948 2852
2268 2852 3844 2608 4458 5959 3934 4148 3547 1397 4208 5635 2998 2650 2145 2488 1874 2376 761
2285 761 -108 -929 -1188 -2720 -2115 -2198 -2878 -2738 -2028 -3663 -3116 -3324 -4450 -5425 -1524 -4617 -4909 -4139 -3971
2304 -3971 -5144 -3966 -3554 -2989 -1587 -1483 -84 -1649 -722 510 -1774 -681 1427 2479 1616 2180
2320 2180 -189 3907 888 4362 4868 3230 4414 4207 4774 3837 4252 5237 4608 2906 3994 2908 2634
2337 2634 1143 372 1717 666 -742 1048 -772 -1114 -1137 -3125 -1490 -700 -2957 -3776 -3537 -3656 -1774
2354 -1774 -2213 -3339 -5350 -6177 -4711 -4790 -4799 -4343 -3459 -3741 -2624 -1772 -1759 -150 4 -1582 699 -76 1310
2373 1310 878 2213 2135 3819 3301 1769 3981 5446 2971 4896 5382 5811 4441 4385 2815 4126 4717
2390 4717 4435 2946 1583 1057 2345 1558 1317 263 -529 -439 -1777 -676 -2116 -4999 -3157 -1885 -2098
2407 -2098 -4159 -4766 -5517 -4773 -4236 -4374 -4333 -4600 -4459 -1927 -4152 -1256 -3450 -2823 -2314 -2591 -271 -1714
2425 -1714 -338 -1014 -1013 947 -1022 1794 2705 2716 2431 3063 3718 4163 5610 2934 4398 4983 1986 4278
2443 4278 4996 4593 2836 3858 4245 1649 3714 3459 3330 2111 1190 1518 82 -330 -1745 -1611 -1030
2460 -1030 -2464 -3541 -4522 -3110 -4603 -4634 -3793 -5069 -6159 -3892 -2388 -5270 -4004 -4545 -3235 -5182
2476 -5182 -2999 -2948 -2652 -1568 -2767 -891 -30 2413 421 2716 1528 1355 2253 2684 3505 5527 4030
2493 4030 4981 4863 4697 3702 4931 4710 3244 5032 3180 3285 3064 5258 1598 4017 2805 1073 19
2510 19 53 311 -1592 -766 -3545 -2069 -2291 -1389 -2492 -3616 -3347 -4766 -4875 -4255 -4066 -4947 -3159 -3150 -3266
2529 -3266 -4418 -4156 -2585 -2580 -3096 -3166 -3166 -1058 -951 336 620 -1061 740 776 2479 1519 2007 2779 4914
2548 4914 3040 3299 3972 4522 4094 4362 3144 4274 4348 3259 4653 5058 2913 2929 1038 2766 -144
2565 -144 -623 -87 -20 -2670 -111 -364 -1264 -1752 -2166 -2803 -2824 -2728 -4339 -3949 -4635 -4580 -4571 -4837 -5017 -4940 -2118
2586 -2118 -3521 -3020 -4345 -2369 -2075 -3054 -2224 348 -1400 361 2159 2668 2898 1662 2446 3185 4076
2603 4076 5013 4544 5203 5920 4953 3772 3342 4302 3681 3168 4023 4413 3075 1344 1782 2163 1027 1497
2621 1497 952 -181 782 -331 -779 -994 -1533 240 -2932 -3241 -1977 -4574 -5538 -5080 -4046 -4103 -4671 -3161
2639 -3161 -4468 -3618 -4500 -4176 -4625 -4172 -1939 -2045 -990 -999 -2734 -970 -731 798 657 2591 1687 1460
2657 1460 1471 1834 3516 3072 4291 4109 3511 4557 5941 4680 4378 4980 3043 3341 2853 2161 2487 2857
2675 2857 1678 807 2689 426 -642 -729 1587 -651 -2601 -2314 -985 -2008 -4193 -4312 -3255 -4764
2691 -4764 -4769 -5486 -5896 -3868 -3946 -5100 -4654 -2086 -2948 -3383 -2102 -1663 -3963 -487 1043 295 -2130 1049
2709 1049 -587 683 1330 1040 2285 4361 2296 4082 3399 1438 5709 4434 4305 3944 2387 3955
2725 3955 4966 3621 4813 3087 2106 4263 3111 866 -60 1709 -444 -126 -520 -2002 -50 -1428
2741 -1428 -1586 -2949 -3498 -3094 -5090 -4031 -3222 -4937 -4037 -4099 -3352 -4556 -3088 -5269 -4957 -3764 -3512
2758 -3512 -3871 -1491 -1502 -2622 1716 -704 359 1766 2721 1455 2341 1716 4129 2998 5088 2726
2774 2726 3761 3570 2696 2948 3860 4526 3807 3439 2994 3221 3580 2655 2131 560 346 319 -802 220 86
2793 86 -94 -2642 -3573 -2806 -733 -3905 -3233 -3116 -4685 -5222 -6094 -2691 -2779 -3073 -3923 -5914 -5212 -2349
2811 -2349 -3275 -3057 -1619 -4083 -2835 -79 -2271 -1965 -1366 -2747 913 1095 1729 1237 1673 3841 3572
2828 3572 2250 2105 4116 3407 5551 4527 5002 4783 4983 3739 3605 4651 1235 3409 2586 3121 1080
2845 1080 3714 -439 319 -1368 -1036 -700 -1810 -1075 -2915 -645 -1831 -3329 -4049 -2254 -2936 -4760
2861 -4760 -6306 -6469 -5469 -5144 -3296 -4182 -4047 -3277 -3108 -2986 -2084 -1641 456 -1753 -1516 -689 -2366 -885
2879 -885 1880 1970 1946 1607 3773 2752 3498 3856 4584 4970 3155 813 4894 4126 1995 4281 2494 1551
2897 1551 5003 1302 3927 4623 2136 1225 866 -938 -1295 -1106 -296 -793 -1710 -2016 -1833 -3791 -2936 -4498
2915 -4498 -4788 -5570 -5157 -4525 -4749 -4041 -4642 -2082 -2876 -4978 -2910 -2027 873 -1062 -2047 -2729 -804 2221
2933 2221 1161 1180 -727 1760 3402 4479 3835 3797 5301 5288 2151 5132 3906 1932 3979 3405 4801
2950 4801 3765 2220 1632 3856 2405 3876 958 2358 1219 294 595 1550 266 -1619 -3734 -3748
2966 -3748 -2571 -1877 -2749 -2967 -2532 -3628 -3789 -3601 -4483 -4588 -2788 -3146 -2491 -3490 -1672 -3639 -3095 -1685
2984 -1685 -1376 59 -46 93 2409 1153 321 13 -1219 2230 1568 1345 3469 2922 3504 3928 3785 3775
3002 3775 4451 4867 3886 3845 5041 4274 3738 2436 2806 3200 1017 2925 -403 228 492 244 163 -992
3020 -992 -2919 -2092 -1025 -3842 -1905 -2682 -4272 -3341 -3743 -5633 -3542 -2976 -5278 -2393 -4006 -3842 -3918
3037 -3918 -1604 -2887 -3096 -3091 -979 -1771 -1279 -640 1570 357 1659 2706 193 3029 2115 2434 2472 4711
3055 4711 4090 4730 4242 3525 4310 2527 5258 4173 3371 2214 2556 1529 3447 2919 1056 1225 2255
3072 2255 1072 1053 -653 -1594 -2275 -507 -2984 -2706 -4580 -4124 -4343 -2536 -3587 -5116 -2328 -3731 -2130
3089 -2130 -5013 -2505 -4042 -1798 -3814 -1858 -1148 -3523 -1729 -1095 -137 1154 -1639 1446 649 2268
3105 2268 510 2831 3458 2354 3859 4394 4476 4299 2853 4593 4826 5091 4770 2680 3684 3727 2676
3122 2676 3987 1109 1235 1172 82 2121 432 -2846 -1638 -442 -942 -2022 -3252 -2536 -3681 -1667
3138 -1667 -4526 -3363 -3010 -3246 -2234 -2691 -3759 -5093 -4582 -2921 -3578 -3321 -3631 -1575 -1915 -1486 -1610
3155 -1610 -3404 -176 1272 106 2819 328 1224 1514 2291 1891 2545 3851 3820 3023 4441 4335 4231
3172 4231 4749 3210 1852 3496 5712 3490 2798 1784 1038 2822 3822 659 -20 644 113 205 483
3189 483 -891 -816 -1643 -3096 -3610 -4108 -2494 -2664 -4584 -2633 -3766 -3775 -3546 -2463 -4856 -3925 -4831 -3902
3207 -3902 -1283 -1611 -575 -2934 -884 12 -195 1359 -74 237 1727 2581 2683 2144 3678 3804 4398
3224 4398 2936 4280 3051 4994 4019 5072 4499 3874 3550 3700 2670 255 1903 3003 1064 2952
3240 2952 300 -106 -269 -1016 -970 -1045 -1960 -5164 -2983 -3716 -3289 -2181 -3104 -4845 -4328 -4916 -3421 -4878
3258 -4878 -4947 -2354 -2747 -2199 -1062 -2360 -375 -1711 -808 -1269 -466 -939 -424 2011 218 1482 3940
3275 3940 2083 1814 1048 2868 651 3788 4200 3470 3185 2336 4002 2852 3765 4133 3407 -174 3643
3292 3643 1677 2596 -149 306 -285 -438 -1127 -747 1186 -2246 -3151 -2998 -2629 -2923 -3632 -2238 -3168 -4603
3310 -4603 -6483 -3947 -3116 -3983 -2865 -2441 -4381 -4710 -2667 -2816 -2939 -2998 -646 -1006 -1266 483 838 1214
3328 1214 2533 1507 2838 2816 4231 2516 3777 5051 2609 3252 1574 3737 2473 4379 4824 5662
3344 5662 3228 4220 2299 3650 -425 1580 1964 -192 -210 -734 18 39 -2429 -2961 -1054 -1951 -2162 -1564
3362 -1564 -2783 -3057 -3987 -3328 -3185 -4358 -3690 -3662 -2575 -3866 -2104 -4958 -3211 -2517 -3796 -3038 -1609
3379 -1609 487 -510 -206 1089 618 980 3220 2467 1466 1299 638 4324 4679 3843 3629 3819 4831 4830
3397 4830 3857 2997 4103 2035 5365 3366 2188 719 3099 1335 1552 3426 1166 832 -1886 -221
3413 -221 -3051 -2431 -2458 -2808 -2923 -1466 -3653 -4650 -5180 -3002 -4473 -4288 -2633 -5275 -4311 -4064 -1608 -3848
3431 -3848 -4732 -1446 -1687 -1925 -1609 -173 -544 -472 678 2915 520 1484 1710 4471 636 2172 3964
3448 3964 4431 4693 4285 3726 5095 4427 5043 2328 5055 3834 3114 1431 2644 66 2687 802 2858
3465 2858 1570 -383 150 -1233 -2269 -1744 -1222 -2837 -3099 -3705 -4178 -3526 -2374 -2460 -3620 -4760 -1982
3482 -1982 -4387 -4939 -2756 -3637 -3665 -3304 -2372 -876 -1409 -235 -208 -412 -735 699 355 1339 999 2261
3500 2261 1472 2927 1844 2662 4329 4412 3754 2124 4921 5392 3790 3660 5066 2708 2255 2947 2140
3517 2140 3059 1793 1859 1453 1721 -35 -548 1021 -287 -907 -1077 -2412 -1433 -4091 -2465 -3968 -1236
3534 -1236 -3178 -4888 -4879 -3656 -3673 -4956 -2517 -2828 -3226 -3578 -2540 -2722 -2111 -1715 -1377 1748 -258 2840
3552 2840 1723 68 1166 4264 2567 2525 2734 4115 5867 3139 3217 3842 5005 3824 3967 3060 5016
3569 5016 3757 3569 3429 3578 1264 2625 2404 -432 1156 37 -1265 -2165 -1885 -687 -1871 -3919
3585 -3919 -4131 -2427 -5027 -3867 -3550 -1541 -5159 -2456 -3616 -3658 -3805 -3681 -3974 -2961 -3616 -1254 -2080
3602 -2080 -2246 -142 -1937 218 792 -2507 837 2476 1165 1773 -446 3866 1142 3349 2885 2247
3618 2247 4949 1720 4668 3887 2633 5074 3840 3628 2179 2859 1446 1821 1147 809 361 45 -305
3635 -305 -893 -769 -1107 -3018 -723 -302 -3423 -3721 -3105 -4960 -5391 -3270 -4637 -4801 -4124 -2996 -2050 -3698
3653 -3698 -3619 -3943 -2462 -1928 -2625 -1505 -938 -408 937 561 55 -2992 958 303 817 955 1125 4183
3671 4183 1081 2764 4264 3049 4883 2039 2873 1693 4126 3914 3328 2789 4035 1304 3277 991
3687 991 1363 403 2465 364 1541 -500 -1660 1072 -1119 -3637 -2550 -3355 -3149 -2744 -3523 -5430 -4103
3704 -4103 -2943 -3817 -3176 -4267 -4350 -2653 -2699 -2578 -354 -3121 -146 -2103 -2334 -457 -477 120 10 2932
3722 2932 1671 1457 2393 3490 3731 4636 4361 5125 4272 3229 4021 5285 3609 3464 3981 2794 3877
3739 3877 4157 3997 3038 1819 2738 2754 1016 2001 352 256 -703 -143 -1166 -2863 -846 -2745 -1486 -3564
3757 -3564 -3058 -1299 -3780 -3485 -5035 -4179 -1807 -5606 -3606 -2963 -3176 -3680 -1753 -1587 -2259 -1886 -656
3774 -656 -756 -643 53 985 2394 2510 1209 3272 1041 2840 3380 3599 4423 4256 4492 2925 3408 3334
3792 3334 4944 2832 3209 3623 3156 2093 2981 2535 1823 1361 1158 229 -425 376 -1856 -1495 -1140 -2030
3810 -2030 -3251 -4602 -2089 -3914 -3043 -2904 -4154 -2753 -4651 -3571 -4754 -2298 -4212 -3464 -3334 -1119
3826 -1119 -587 -4053 -162 1314 -1062 -329 -897 1443 2719 885 1441 2455 1026 703 4068 5847
3842 5847 2117 4266 4675 4078 3774 1899 3460 3257 3186 4537 1877 2431 1946 3955 1861 1423 -41
3859 -41 -38 7 -511 1294 1142 -1227 -3351 -1523 -4488 -1961 -2476 -3363 -2589 -4304 -3902 -5057 -2967 -3862
3877 -3862 -3650 -2678 -4230 -2785 -3223 -1320 -636 -885 -829 -133 500 1084 2591 -655 1610 1815 2074 4977
3895 4977 2040 3205 2836 1903 2898 4022 3071 4944 4468 2940 3175 4772 2953 2928 1258 1694 2460
3912 2460 2903 1786 1494 1491 -799 1109 -1466 -2483 -1072 -2408 -2879 -5002 -3952 -3575 -3003 -3074 -4297
3929 -4297 -3852 -2829 -4947 -4280 -2649 -3602 -2408 -1275 -2365 -1480 -2899 -202 -1555 -1151 -652 -70 737
3946 737 -268 125 3173 720 1469 5212 3610 2677 4039 4480 2946 5273 4357 1944 3016 3282 1539
3963 1539 3137 2727 185 388 1927 1269 1495 970 -638 -819 -1182 -636 -683 -769 -1689 -1863 -2190 -378 -2942
3982 -2942 -4326 -3163 -1881 -3669 -3305 -3694 -2471 -4754 -1535 -3764 -2185 -1429 -3128 290 -667 -527
3998 -527 -1101 -1576 -993 1169 2798 2641 621 1789 2918 2310 2111 3378 2813 3148 3827 3355 1853 3804
4016 3804 4167 5069 3025 4636 466 3780 1678 1913 3302 158 -898 -597 -1193 -952 -2112 -2486 -1851
4033 -1851 -1037 -3164 -3931 -3072 -2049 -4502 -3362 -3121 -4364 -3455 -3057 -3838 -5376 -4203 -2891 -1226 -2794
4050 -2794 -1850 -2957 -2607 -1635 1401 -693 236 -1013 -184 2199 2018 825 2213 2331 3015 1521 2430
4067 2430 2939 3689 3953 2704 4816 1968 3260 3119 2842 1773 2825 1106 2997 1234 1800 20
4083 20 744 95 1724 -1226 -510 -616 -803 -1728 -1498 -2862 -3388 -2783 -4139 -5275 -4191 -2736 -4992 -3568
4101 -3568 -3941 -4272 -2803 -1999 -3164 -3622 -2411 715 -812 479 1558 154 -790 38 219 1092 1287
4118 1287 1487 3411 3664 2256 2870 3863 3664 2221 5204 3801 1987 3523 3179 2053 2832 3708 2637
4135 2637 2914 1448 1138 -98 1288 -914 -52 -1106 -2040 -894 -3246 -2000 -2879 -1970 -3412 -3533 -2569
4152 -2569 -3992 -4496 -1859 -1072 -4549 -4555 -2837 -3261 -3202 -2213 -3400 -2183 -2549 -1698 -1502 -1020 1228 1264 -107
4171 -107 568 2645 2664 1723 1890 1864 2512 3782 2902 3488 2470 4277 5525 3989 3080 1528 3447 1889
4189 1889 1922 1522 1395 1719 2670 924 1531 -1244 -225 -18 107 -131 -3054 -2969 -1445 -1920 -2887 -4502
4207 -4502 -3000 -2940 -2593 -4207 -5913 -2914 -3897 -2884 -5625 -1902 -1485 -2524 -4084 -2560 -1693 -3039
4223 -3039 741 -830 -739 703 802 2119 2120 2660 -10 3190 3148 3629 3511 2885 3062 3173 4402 4336 953
4242 953 1972 2035 4615 3217 1001 2145 2664 2150 1974 594 1249 -121 733 -243 -1947 -2415 -1156
4259 -1156 -3073 -2785 -958 -2786 -4164 -3842 -3225 -1922 -2985 -3074 -5777 -3608 -2279 -2002 -2895 -1564 -804
4276 -804 -1577 -199 -494 -1127 -795 140 -1384 1681 1498 1022 1082 2174 3353 4540 3267 2288 2348 3102
4294 3102 4367 2301 2467 2981 2786 469 3673 2677 1121 2522 3022 2574 877 697 151 348 574
4311 574 904 -1100 -2478 -1664 -2067 -3140 -3447 -2400 -2476 -2307 -3457 -3372 -2545 -3141 -3242 -2203 -1836 -2174 -2127
4330 -2127 -2696 -1804 -1475 -1141 -1232 -1431 -725 806 205 1910 1689 2153 1985 1882 1915 4369 2532 1202 3756
4349 3756 3731 3087 3823 2764 3430 3786 1594 4067 4145 1365 3031 1065 2359 1802 733 1582 450
4366 450 -525 -157 -639 -3462 -1954 197 -2072 -2135 -2958 -2671 -3205 -3550 -2992 -2230 -2071 -4164 -3944 -3472 -3245
4385 -3245 -3841 -1921 -1661 -3584 -1533 -1001 -1491 -1561 -934 1775 451 1208 2691 2675 1240 2990 2223 3113
4403 3113 3631 3980 1738 3626 4533 3767 2892 1526 1720 4386 3168 4040 2075 1582 3180 1940 -658
4420 -658 80 604 -1554 -2058 361 -723 -1387 -1302 -2977 -3941 -2978 -1811 -2773 -2362 -3067 -5298 -4547 -4158
4438 -4158 -4493 -875 -2994 -1036 -1975 -3190 -2937 -1849 -4015 -3010 -1378 -1214 829 549 996 849 3348
4455 3348 588 1827 1065 3467 2797 3124 4466 2616 3360 1885 3600 2836 3653 3689 3819 3042 670
4472 670 689 -967 1042 466 -1371 572 293 -416 249 -1937 343 -2676 -2877 -1940 -2533 -2410 -1968 -3372
4490 -3372 -5022 -3906 -4181 -3018 -1960 -2908 -3581 -4025 -3315 -1161 -273 -917 -474 -975 -1440 351 1199 96
4508 96 -448 -344 2147 2115 1910 1961 3310 3886 4749 3981 4607 4430 2992 2638 3045 4786 4199 3385 3617 3553
4528 3553 1332 2556 1306 -276 41 520 -698 -799 -783 327 -1067 -3034 -4204 -1869 -3251 -3126
4544 -3126 -3391 -3992 -3791 -2478 -3010 -3588 -2301 -3098 -2144 -1252 -3280 -3266 -2758 -3048 -2298 -830 -2546 489
4562 489 1056 1541 12 1563 3256 1088 1612 2093 1365 1947 1073 2082 3090 2399 4132 3487 4852
4579 4852 3610 3533 2247 2893 2497 1979 2098 2518 1077 -74 2007 -891 55 -238 104 -55 -1602 -1311
4597 -1311 -2970 -1895 -1872 -3330 -5416 -3151 -3148 -6041 -2994 -3516 -4277 -4224 -4115 -3667 -2234 -2969 -914 -254
4615 -254 24 -1190 -114 26 102 -485 1353 168 1903 2396 2619 1580 3567 4710 2644 2830 4006
4632 4006 4600 3897 2735 2879 3498 4108 2793 4424 1580 488 -269 635 1010 -2365 535 -1535 -2368
4649 -2368 -2646 -362 -1940 -1775 -1670 -3271 -3061 -3149 -3292 -3274 -3896 -2327 -3968 -4110 -3828 -4870 -3345 -1452
4667 -1452 -3050 -2431 -2138 -2369 -1481 -2803 -404 -2438 1786 908 575 1513 -248 1279 1639 478 3306
4684 3306 4194 1816 3894 2306 4203 2013 2642 6199 3647 3493 2262 4289 2943 1440 1585 2663
4700 2663 1821 1301 1224 -271 -764 -1762 -830 -2346 -2219 -2914 -2904 -1622 -3978 -2929 -5773 -3395 -4363 -3502
4718 -3502 -2025 -2626 -4225 -3977 -1838 -1899 -4166 242 -1382 -835 -1044 204 -884 745 666 667 1234 2236
4736 2236 3958 3154 1869 3817 4079 1765 3582 1865 3422 3809 3841 3508 2160 4776 2077 4096
4752 4096 2309 1209 1807 2011 2137 130 -944 -438 -528 -526 -1009 -2412 -4191 -3450 -2062 -1961 -2857 -3838
4770 -3838 -2836 -3513 -3877 -4599 -4238 -2638 -3921 -3916 -2536 -1668 -1825 -2893 -2239 -1793 -2040 1212 -829 -714
4788 -714 1963 817 744 1689 3491 661 1617 3978 4032 2517 3063 2670 3155 2878 4764 2112 1517 4268
4806 4268 2114 3211 1601 2135 3351 156 -244 -883 -1433 -285 -1755 -926 -1943 -848 -1447 -3308
4822 -3308 -1360 -2733 -1646 -2893 -3378 -3511 -5209 -1429 -3161 -2764 -3586 -4027 -3130 -2299 -2904 -1836 -3078
4839 -3078 -1850 220 -110 -121 1633 603 -1018 1681 3239 2652 -513 3163 3458 2184 3550 3140
4855 3140 3829 2541 3439 2708 4620 4018 3554 2186 2412 1418 3585 2185 588 2644 -59 -518 -2417
4872 -2417 -952 -955 79 -3335 -613 -4390 -1341 -3191 -1671 -4003 -3383 -2701 -2471 -4419 -5089 -3668 -1125
4889 -1125 -3656 -2801 -1705 -1767 -1413 -2207 -88 36 -727 101 461 1221 1818 1672 2168 547 40 1947
4907 1947 5394 2507 4693 3519 3986 2999 3587 5088 3022 3878 3141 2332 2749 3069 1879 -33 816
4924 816 1902 874 -166 -83 1304 -1005 -1728 -1875 -885 -2336 -2614 -2880 -2839 -1845 -4384 -2503 -2603 -2816
4942 -2816 -2827 -2252 -2443 -3480 -1812 -2830 -2545 -1618 -920 -2358 -2634 -1537 198 399 1583 352 1045
4959 1045 1056 2086 2064 1393 983 2456 3463 2641 2193 4196 4190 2082 4119 1240 4397 1884 3535 4105
4977 4105 4112 1562 335 1704 -1700 64 311 -1126 -1771 42 -120 -1099 -985 -1799 -2152 -3719 -3647 -4534
4995 -4534 -2834 -4357 -3612 -3253 -1739 -2927 -6059 -3223 -3184 -1946 -2061 -964 -2482 -1594 309 181 148
5012 148 96 1637 1328 1528 1412 1919 906 3730 1966 3440 3232 5278 4849 3026 2770 2513 3222 4300
5030 4300 3541 2223 1471 898 590 2222 1562 117 -1476 591 -147 -1072 -164 -1130 -3114 -4360 -3137
5047 -3137 -2849 -2028 -3969 -2986 -2177 -4353 -2495 -2959 -3916 -2835 -3379 -1210 -3878 -3069 -1968 -587 -1874
5064 -1874 -1464 649 -1594 1209 13 7 72 2834 1723 1334 2705 882 1201 2690 2544 2690 4453
5081 4453 2678 3020 1515 3528 4494 3045 2750 2481 2846 2716 1351 124 2294 1319 561 -374 -1162
5098 -1162 -2669 -1625 -1953 -3962 -873 -1819 -2927 -3267 -3168 -3750 -2820 -2812 -3107 -3648 -1372 -2584 -4145 -3742
5116 -3742 -3900 -2556 -1042 -2919 -1569 -1233 -1381 -560 2334 77 -715 -195 1367 1124 3202 2307 1834
5133 1834 5451 2260 3791 4071 3721 3679 1802 2534 2645 2252 4549 2059 3135 864 2044 1180 1540
5150 1540 743 1096 531 126 274 -1256 -169 -2533 -2962 -2042 -1735 -1894 -5417 -3290 -2937 -2040 -4095 -3636
5168 -3636 -1822 -3728 -1959 -3682 -3684 -3319 -1248 -1512 179 -2104 628 -564 -1741 288 618 957 2526
5185 2526 1161 3132 2210 2807 3570 3279 3298 4432 3187 2478 3589 4129 2003 3707 4857 1856 2784
5202 2784 2549 2157 698 1125 -1243 1199 -746 525 -1382 -818 -58 -1560 -1895 -1153 -2360 -3086 -2201
5219 -2201 -2638 -2064 -2819 -4316 -4046 -3361 -3682 -4840 -1639 -3020 -1572 -2992 -3192 -2243 717 -708 316
5236 316 -345 -1309 -2015 1124 3441 1353 3132 3970 3396 4819 1689 3455 3918 2986 2769 4759 3178
5253 3178 2778 936 2324 3035 565 2738 2506 974 1092 1370 256 -1641 -910 -1127 305 -1143 -2152
5270 -2152 -1848 -1622 -1725 -1498 -2781 -3868 -2440 -4284 -3353 -2536 -4009 -3933 -3291 -1771 -2321 -2337 -3214 -2640
5288 -2640 -619 -2267 -3085 -914 1546 798 1120 1225 1870 1827 3227 1361 2145 2617 4041 3462 4631
5305 4631 2060 3054 3481 3043 1146 2455 3451 3870 1668 1413 1404 1210 911 1579 2160 1351 346 1040 -1072
5324 -1072 -2436 -1183 -2259 -1451 -2796 -2842 -3913 -172 -3336 -3714 -2534 -4775 -2502 -3450 -2134 -3468
5340 -3468 -2371 -1064 -536 -2078 -2277 -383 -1719 139 -217 -1865 -186 535 -56 682 1939 1222 1882
5357 1882 3869 3015 2370 2206 2928 2095 1971 3036 2875 2782 4938 3485 2901 3679 1388 2682 630 625
5375 625 245 -1450 -22 -172 -1434 1029 -2616 -1638 -3257 -1111 -3263 -2860 -2246 -3469 -4423 -2486 -3634
5392 -3634 -3274 -2970 -2669 -1818 -3660 -1426 -2500 -1792 -290 -1608 -564 320 92 430 -91 1326 353
5409 353 1471 1113 2491 3862 1500 2723 2762 3843 3557 3667 2462 2423 3144 3118 3158 2127 3182 3670
5427 3670 2178 1986 1608 1357 629 169 719 1782 -1003 -1587 -1110 -1521 -1545 -1429 -2467 -1611 -1669 -4391 -3948
5446 -3948 -4500 -3240 -4532 -1082 -2037 -3895 -1994 -3058 -990 -1366 -2365 -541 -1116 -662 -1382 990 1166
5463 1166 -661 1375 1717 1675 3612 3027 2252 3276 2212 3940 2281 1943 4921 4241 4218 1930 3387
5480 3387 2785 1975 2911 2138 358 582 -201 1014 783 881 -92 -2346 -3070 -1663 -1721 -1153 -2069 -2915 -3038
5499 -3038 -3817 -2460 -2876 -4097 -4675 -2299 -4382 -2888 -2065 -3057 -2349 -2749 -2237 -1722 -1749 -1011 -936 -1744 714
5518 714 2398 393 480 1187 1965 812 2446 1198 2906 4407 2293 4136 1954 4132 2645 2375
5534 2375 1692 1574 2117 1096 2043 1603 2036 2693 946 -293 706 -825 875 -1029 -366 -2158 -2730
5551 -2730 -798 -2297 -1028 -2120 -3191 -4106 -1882 -2886 -4034 -4849 -2461 -1917 -2409 -2730 -2769 -4441 -3739
5568 -3739 -1173 -2690 -307 -908 -561 -513 832 -233 -2 2484 2487 2958 4215 3750 2595 3978 2464
5585 2464 2815 3238 3789 2130 4358 3591 2358 3177 3983 1736 3344 3949 2113 1461 422 1938 448
5602 448 -1261 -568 1411 -3571 -660 -2534 -669 -2013 -2721 -1958 -4506 -4698 -4789 -3542 -4559 -3268 -3520
5619 -3520 -3089 -1242 -3612 -3814 -2662 -3183 -3141 -1571 601 -1054 604 715 1563 2765 1852 2861 2283
5636 2283 4924 1539 2020 4029 1955 1967 4288 3544 2896 3193 3071 2634 3251 2277 189 1110 3711 2273
5654 2273 439 -455 1062 776 -384 -671 -1205 -2074 -1129 -2287 -1113 -2170 -3972 -2196 -3526 -2557 -2211
5671 -2211 -3908 -3506 -2938 -3401 -3410 -1788 -2226 -4007 -824 -929 -1934 -1915 -612 -656 195 857 1730 2153 -375
5690 -375 2234 1255 3140 1190 1379 1720 3531 1587 3285 2279 2977 3178 2204 3255 1591 2920 2252
5707 2252 2524 2594 2267 660 1585 1635 771 -831 -1197 -865 595 -259 -1351 -3384 -1514 -3503 -3041 -2828
5725 -2828 -2845 -3452 -1878 -3223 -2326 -2471 -3232 -3275 -4303 -731 -2038 -2622 -3067 -1345 -1494 126 162 -243
5743 -243 -880 -487 1983 526 1747 2577 1159 61 1946 2994 3096 2570 6338 1690 3045 3072 3870
5760 3870 3009 1862 1928 2938 2217 1059 1462 1479 420 -1054 -1281 65 -613 -22 -348 -393 -76 -2177
5778 -2177 -2333 -1996 -1764 -4360 -2754 -2436 -4819 -3638 -2309 -2131 -1966 -2266 -2302 -1193 -1430 -2214 -1343 -1603
5796 -1603 -769 927 -1225 1118 2888 -60 1106 1991 922 1457 1881 3023 1496 4169 4248 2581
5812 2581 3403 4443 3513 1732 3436 3917 2392 1792 917 1871 1313 89 192 961 1472 -1900 1600
5829 1600 -1938 -1595 -1355 -67 -2079 -711 -3492 -2565 -1156 -2680 -2929 -2177 -4670 -3203 -2119 -1310
5845 -1310 -3911 -2793 -1656 -1879 -1621 -723 -852 -186 -558 -646 535 221 334 2183 2588 1688 1869 1371
5863 1371 2207 3956 2920 3367 4644 2327 4155 2308 1462 3102 2916 3695 1840 675 3334 1003
5879 1003 928 -1678 1346 1270 397 136 -841 -898 -1177 -2116 -1873 -2195 -3385 -1706 -4741 -2187 -4299 -2481
5897 -2481 -1271 -2931 -572 -2124 -2625 -3308 -2490 -1652 -2224 -2113 -51 279 1738 -324 833 236 3155
5914 3155 1907 526 1415 511 3759 2008 2410 2173 2017 2413 3936 1924 3562 3670 5168 3411 1945
5931 1945 2294 3102 2296 2428 -241 270 1974 1395 1505 -222 442 -2030 -2737 782 -2345 -3266 -2550 -3603
5949 -3603 -3706 -2976 -2865 -3845 -1388 -3490 -4803 -2869 -4705 -3181 -2061 -1336 -3653 -2292 -637 60
5965 60 26 254 815 1635 302 1739 2531 929 819 3418 1422 1004 2584 1469 2654 4142 3501 2414
5983 2414 3786 3670 3788 1724 2958 1877 1295 853 1935 2222 787 -476 1643 -50 -400 -1032 -806
6000 -806 -1644 -2875 -2800 -1514 -2350 -895 -4233 -2991 -3230 -3116 -2833 -4349 -3268 -4308 -2462 -1110 -89
6017 -89 -2345 -872 -1045 303 179 -160 -499 -1201 426 867 1355 573 2899 1818 159 3198 1904
6034 1904 2245 1797 3305 2261 1344 3492 2743 1675 3606 1918 2623 480 3395 679 1593 2396 540
6051 540 1194 857 -163 -1199 -525 -1808 -2461 -1957 -1397 -4201 -4082 -3175 -3023 -2556 -2559 -4479 -906 -1355 -1676
6070 -1676 -1897 -4189 -3243 -2984 -2771 -612 284 -184 -322 345 92 -465 -280 67 1781 2129 2192 1501 3578
6089 3578 2608 3673 2390 3180 1671 5697 4119 1496 3730 2397 3062 957 1510 2992 1518 1274
6105 1274 2435 286 -70 -123 -849 -1032 -1314 -750 -729 -3934 -3491 -1741 -3728 -4087 -4478 -1990 -3209 -4907
6123 -4907 -2561 -1797 -2493 -3576 -3480 -1033 -743 -1857 -1839 -3014 -1839 -333 1618 2015 1090 437 1719
6140 1719 468 2740 4154 2812 2749 3911 1821 3652 4624 2715 2914 2429 2810 3591 2088 2406 2457
6157 2457 1747 1696 36 1618 2092 1583 256 -661 -56 -1303 -725 -1435 -2474 -210 -2839 -4265 -4617
6174 -4617 -2997 -1428 -3016 -2484 -3067 -1454 -2207 -2650 -3412 -2698 -1418 -1023 -685 -1175 -2049 -2127 854 -1575
6192 -1575 -1370 -517 2764 1332 1322 1543 1490 3566 1557 2490 2484 1271 1900 3120 5347 2004 4245 4897
6210 4897 4704 1986 1173 2090 3028 2436 881 1779 -269 -512 1134 129 -712 -1525 1098 -2627 -2951
6227 -2951 -3300 -1534 -3330 -3548 -4510 -3136 -4027 -1417 -2717 -4103 -2484 -3505 -2064 -1587 -678 -1512 -2520
6244 -2520 -1700 -2823 -1127 1082 -207 1174 2847 925 3332 1838 1605 2929 1454 2233 3121 1831
6260 1831 2142 2858 2983 4112 3264 2208 3645 4389 4077 1801 1461 2617 2432 2238 1037 -2285 513
6277 513 156 -1506 -506 -26 -1425 -3120 -2069 -1911 -2765 -2713 -4972 -2927 -2547 -2846 -2786 -2979 -3747 -2760
6295 -2760 -2396 -1566 -1364 -3195 -1313 -2815 -140 -1854 -377 -848 -376 1997 369 1526 2011 2179 3271
6312 3271 3793 2799 2950 1569 2532 4071 4112 712 2002 2822 1120 2841 2420 1198 424 808 666 615
6330 615 -270 2343 -698 -1363 -762 -1232 -178 -48 -2056 -1589 -2836 -2159 -1876 -2532 -4120 -3156 -3430 -3117
6348 -3117 -1547 -3845 -2072 -2144 -4381 -3326 -1847 -2257 290 -2545 774 -511 -833 1028 -214 708
6364 708 1580 2464 343 2852 1212 3476 2426 3284 3758 5316 3773 1444 3040 2343 3524 1481
6380 1481 2336 2506 2153 1937 1538 1179 218 -686 -1691 -36 -507 -2703 -1481 -2280 -3237 -2332 -2167 -2861
6398 -2861 -3152 -2710 -3816 -2713 -2706 -2172 -3635 -4980 -3286 -3013 -2922 -3052 -1183 -1792 -1367 -3227 -1799 -424
6416 -424 -154 1442 1517 1413 1652 444 1722 3531 2342 5089 3150 2755 2131 3152 3337 3210 3433 3815
6434 3815 4419 3612 3369 2565 2631 2644 3617 1600 -199 795 723 -1390 -1655 164 -1414 -1279 1286 221
6452 221 -2179 -2786 -1929 -3518 -992 -4099 -2615 -2475 -4044 -3166 -4030 -2334 -2065 -2614 -1541 -2512 -1737
6469 -1737 -942 -1832 -284 -321 1088 -302 2757 1093 1522 1842 1236 2706 2178 1871 3364 2295 3214
6486 3214 4185 4721 2160 2228 1216 2478 1784 3223 -947 1151 1089 1486 1358 693 -555 648 -85 -1445
6504 -1445 -1857 -1439 -2920 -1484 -1076 -2779 -3771 -1487 -2474 -4128 -4425 -3358 -3201 -3233 -913 -4304 -900
6521 -900 -1532 -2101 -614 -808 -885 -1702 -964 148 -1732 1289 1088 -563 2647 848 979 774 3278 4904
6539 4904 3040 4220 1222 2919 3838 2453 4735 967 3001 3047 2603 1440 210 1760 1665 532
6555 532 -110 -1811 115 -1333 -562 -1408 35 -1862 -2127 -1755 -1778 -1927 -2839 -2994 -2063 -3277 -4231 -4252 -4322
6574 -4322 -3360 -2748 -629 -3057 -2786 -733 -551 -113 -1488 -618 1268 -195 1209 1802 1241 1361 1669
6591 1669 1867 3303 1220 1420 2347 3527 3381 2702 1043 1514 4512 908 3404 2694 2897 883 3142
6608 3142 269 1417 2844 401 249 643 1374 680 -875 -1643 311 23 -463 -1409 -2085 -4222 -3570
6625 -3570 -1637 -1913 -1475 -4218 -3016 -3346 -1823 -2008 -455 -755 -2472 -2451 -354 -1507 639 389 -1037
6642 -1037 609 716 2728 2202 2783 1258 533 567 3279 4355 4292 2758 513 857 2282 5506 2671
6659 2671 1973 1799 558 3443 3199 2488 2369 622 1846 1346 -385 807 -3268 1819 -1296 -3493
6675 -3493 -1637 -1780 -1447 -2543 -1721 -4099 -1648 -2771 -609 -3899 -2172 -2664 -3562 -3602 -1327 -1324 -1963 -2805
6693 -2805 -2636 -2023 -1202 -61 1587 -271 1688 1646 1522 1457 1838 2427 3614 693 4420 1181 2543
6710 2543 2907 3071 3597 3476 3589 2681 4633 4230 3111 1740 2190 770 2517 -104 -165 -1468 -646 -1363
6728 -1363 -1241 -118 -3251 -3067 -2640 -3354 -2497 -3775 -2518 -2466 -2467 -2070 -419 -4044 -1799 -4851 -3536 -3751
6746 -3751 -2774 -1914 -947 -888 -2487 760 -27 280 483 718 -854 1216 2521 2262 195 3479 1107
6763 1107 4691 2006 4073 4299 2414 1780 3846 3372 2265 788 2085 2085 1262 1292 2400 1326 -546
6780 -546 1724 -1193 -439 71 -6 -2238 -1986 -1964 -2183 -1333 -1612 -2300 -4320 -2770 -4529 -1062 -2710 -2598
6798 -2598 -3068 -1963 -3770 -2560 -4002 -520 -3336 -1655 -699 -560 -2145 771 -1304 350 603 -569
6814 -569 1557 1433 3483 1338 3305 3486 2189 3136 3001 1190 3215 2989 3224 2888 2240 1469 3350
6831 3350 2241 1160 1853 1036 769 771 -497 322 -743 -645 -1010 -949 -1975 -3125 -2756 -2963 -2402 -3972 -2083
6850 -2083 -2174 -2496 -3673 -2995 -3273 -2025 -1932 -1193 -1425 -1655 -1424 -3007 -1104 -795 -85 164 -33 801 243
6869 243 395 1935 1227 1441 1695 3045 3537 2746 4114 2144 1684 3488 3278 2115 2037 3905 2373 1933
6887 1933 3963 2707 1303 456 1924 -556 -400 -669 -250 -467 459 -48 -369 127 -2478 -2894 -1680
6904 -1680 -4138 -3831 -2572 -3720 -3611 -1820 -3055 -2057 -970 -2631 -1714 -1599 -691 -2250 -462 739
6920 739 214 -1167 -1432 -667 2363 1704 2436 1958 983 793 2740 3582 2333 3752 3172 3816 2997 4600
6938 4600 2218 2141 3534 3702 2882 3058 2185 2066 -143 842 2696 -74 531 -590 -226 850 528 -3185
6956 -3185 -2006 -2581 -4068 -792 -1058 -2894 -3684 -2024 -2677 -2651 -3311 -2753 -2195 -3501 -2150 -2581 -1961 -1683
6974 -1683 65 -976 -1136 725 -241 1255 1067 99 2308 -758 1957 3290 3567 3137 3518 4045 448
6991 448 1739 1762 3751 1968 2596 263 751 1291 2070 1676 1067 1704 -848 2188 168 -963 389
7008 389 363 -2525 434 -1989 -662 -2809 -3360 -1571 -2385 -2419 -3445 -3075 -4688 -1999 -2539 -2862 -3594 -2203
7026 -2203 -2541 -4054 -871 -1115 -1053 -1317 773 60 -539 -807 545 1633 401 2478 1774 1961 2371 1869
7044 1869 2963 2978 3643 4625 3806 3523 2975 4163 2289 1967 4676 3233 2204 1713 964 371 1827 -428
7062 -428 -836 101 -667 -1344 -1108 -1868 -2420 -307 -331 -3045 -1488 -2805 -4104 -2192 -3565 -3722 -3919 -629
7080 -629 -2833 -4551 -2804 -3078 -1414 -2550 -405 316 -904 -1900 890 -1167 -984 615 2115 1344
7096 1344 3619 1323 1200 2297 3710 5056 3814 2637 2876 2690 3419 1146 1372 3680 1818 1870 2894
7113 2894 1523 330 1381 552 161 1159 -482 -7 -268 -2086 -1314 -1441 -809 -2434 -1773 -3028 -3474
7130 -3474 -4036 -3289 -2954 -2085 -3670 -4179 -3873 -3231 -2614 -4493 -1712 -2330 -2477 -1629 -1425 -829 -2176 -2245 537
7149 537 2089 952 1252 484 3397 1393 459 3021 1432 1731 2737 4929 2475 2135 3132 3850 2376
7166 2376 2647 2674 3303 1422 2275 -855 216 -1208 1112 2075 -2541 -639 -782 -1303 -584 -1883 -3139
7183 -3139 -3697 -2170 -3856 -2629 -3045 -2760 -1584 -2818 -2703 -1741 -2552 -1951 -896 -1068 -2255 -559 -2589
7200 -2589 -1976 -537 -81 855 2312 -42 -423 2905 1633 1744 2128 2198 2455 3143 2604 2397 1776 1718 2612
7219 2612 2808 3493 3934 1914 1112 1558 2412 -68 110 603 119 516 -100 693 507 59 -1961 -628
7237 -628 -2005 -3448 -3575 -685 -2178 -2888 -3523 -2015 -2641 -1220 -1627 -2857 -1206 -1054 -2204 -1705 -1199
7254 -1199 -3381 -2442 -684 773 -439 2245 -919 -855 812 1998 2898 34 1212 2696 1648 1886
7270 1886 3986 4798 2579 2610 2333 4284 2389 3722 2323 2843 1635 1592 2448 3391 265 1416 1625
7287 1625 -493 748 867 -736 -2215 -2280 -901 -463 -2495 -2545 -2024 -3220 -1718 -2171 -1449 -3075 -4297
7304 -4297 -6107 -4121 -2342 271 -2207 -530 -974 674 -1932 -1783 -149 -1171 68 1819 865 2354
7320 2354 80 3243 2584 2724 1662 1364 3567 3885 2037 3097 1384 2265 4561 3619 735 3651
7336 3651 1356 803 1631 2428 216 566 899 61 159 -896 -790 -608 -2437 -2227 -923 -1011 -1854 -1118 -3507
7355 -3507 -1705 -4237 -3501 -1688 -3951 -1674 -5358 -2810 -2529 -1488 -1598 -2704 -2969 450 -2692 -522
7371 -522 -704 -322 -596 1829 -409 912 2667 1411 3271 2623 1953 555 2593 2871 2216 1975 2359
7388 2359 4890 5464 1980 1413 3152 3353 1217 1396 739 1031 -683 -1566 -91 243 -1957 -1633 -1207
7405 -1207 -1693 -1556 126 -792 -2908 -2535 -2626 -4153 -3607 -2498 -1918 -2257 -3934 -3163 -750 -1309 -1459 -2809
7423 -2809 -571 -44 -1962 -1216 11 577 -1008 1614 1394 1457 2008 3096 2622 3325 2677 4427 3307
7440 3307 1564 3498 3680 4629 2800 3139 5196 3352 2491 516 2978 3316 806 1794 2013 617 -106
7457 -106 -636 -1198 128 -575 -896 -1174 -3017 36 -632 -2328 -2636 -2591 -3243 -3322 -3352 -3854 -3716 -2110 -2134 -1605
7477 -1605 -3065 -1705 -1194 -674 -1553 -1168 491 1298 916 1296 191 1081 193 1854 712 2496 1780
7494 1780 1401 2063 1550 1703 2737 1884 2141 1824 1535 3891 1530 2851 2622 2358 -140 947 1084 -307
7512 -307 -1027 448 -1436 -929 -291 -846 -1823 -1290 -2608 -1834 -2059 -1872 -2755 -3024 -2078 -2376 -1088 -2818
7530 -2818 -929 -3539 -2412 -2597 -2002 -491 -2000 -1293 -1428 -388 123 472 -1424 780 1796 2913
7546 2913 968 3440 2517 2363 4080 3259 3211 1368 3325 2209 1435 3013 1997 1901 2791 58 1865
7563 1865 716 1413 -225 -1051 -187 844 330 -1064 825 -2158 -2254 -1478 -1663 -1327 -2939 -2456 -3243 -2610
7581 -2610 -2697 -3099 -3645 -1632 -2175 -1309 -1271 -1573 -2638 -1185 -3341 -2460 -1218 -555 -499 -585 -691 -200 -626
7600 -626 1962 1840 1163 3303 2800 1764 3033 1624 2109 2853 3149 3091 1470 3318 1851 2006 4726
7617 4726 3303 1824 2044 553 3611 -671 -565 673 1143 -1170 -1804 -1498 -795 -1027 -2881 -2153 -2089
7634 -2089 -254 -3031 -3309 -3465 -3107 -1762 -3017 -3187 -3718 -3802 -1574 -2364 -2562 -966 -1655 -1109 -1344 -713
7652 -713 -966 -1211 2237 1007 533 2017 1011 2509 1847 1026 323 3052 1703 1634 738 3689 2794 1745
7670 1745 4323 4777 3316 1425 1933 2154 2340 1916 380 -369 -689 -1824 -85 -1536 -121 -1699 -1517
7687 -1517 -844 -2362 -1853 -3033 -2117 -3457 -1980 -4004 -3300 -4188 -4270 -913 -1397 -1070 -3097 -612 -111
7704 -111 -2798 -2267 -928 -516 -25 909 -16 695 1209 1148 2044 136 2344 2763 2825 2888 368 1155 2697
7723 2697 3446 1148 2013 2250 4417 1021 2019 1842 2180 1682 824 1875 352 -74 -611 607 -24 -619
7741 -619 -830 -2259 -512 -1642 -2500 -2664 -1231 -2960 -3038 -3246 -3321 -2551 -3667 -1134 -2150 -1180 -3788 -3273
7759 -3273 -2577 -1634 -1210 -292 -1241 575 -438 1530 1855 606 947 593 2513 1892 4310 2791 2481
7776 2481 2247 2058 1297 1664 1017 3089 3668 2030 3382 2831 1501 973 1380 1849 905 138 -393 -403 621
7795 621 -937 940 -1310 -2316 -742 -1854 -4196 -2321 -909 -4332 -2997 -4776 -2764 -3673 -3052 -4397
7811 -4397 -2545 -1541 -2128 -1714 -2343 -1781 963 -766 -778 -276 383 271 334 -709 1456 650 996 872
7829 872 1944 4646 3413 1377 1792 2741 1760 4002 1056 2236 1848 2488 2428 1161 2881 352 1718
7846 1718 902 1365 -546 733 -800 -2023 -1556 1250 -2336 -458 268 -2045 -951 -1287 -1006 -3761
7862 -3761 -3059 -1122 -4040 -1469 -2589 -3248 -2187 -2529 -432 136 -1137 -739 -1375 -1384 -1119 284 -989
7879 -989 938 1052 -709 -932 1436 3452 3305 1766 2831 2572 1524 2534 2618 2850 1207 2041 1723
7896 1723 1656 2905 2717 2883 2217 1231 2310 -827 1169 -403 1019 -881 -1890 -1001 -388 -1414 -2958
7913 -2958 -2016 -2863 -3418 -2121 -1732 -1903 -2831 -1286 -2414 -3127 -2394 -3415 -1040 -2696 -2756 -2564 -1593 -2375
7931 -2375 309 61 -196 -2635 1376 1234 213 1802 1873 1589 1682 2268 2108 2803 3228 2312 1989 2585 2541
7950 2541 1086 1416 1065 177 2920 336 809 3833 1822 -592 3502 1021 -972 -530 -3188 -327
7966 -327 -1088 -439 -704 -1164 -1972 -1669 -2388 -1803 -2405 -3236 -3213 -3544 -1836 -2137 -2962 -1554 -2865 -1175 -1526
7985 -1526 -668 -1627 69 549 -369 573 460 683 1478 2997 1382 2327 3649 1310 2465 2898 3599 2567
8003 2567 1917 1406 720 2084 408 125 211 2812 2206 3292 1729 -515 2314 935 353 -726 -892
8020 -892 1171 46 -629 -3279 -2464 -2627 -2566 -4233 -2391 -2784 -3352 -3989 -3004 -2445 -2161 -1972 -1634 -2700
8038 -2700 -502 -2957 -1820 -179 -484 -1739 -1564 11 844 -1042 219 554 -529 1744 1954 946
8054 946 2403 686 3544 1957 2822 1019 2389 782 2632 1582 2713 2799 2104 1695 1694 755 1703 633
8072 633 1149 828 264 -1352 -407 19 -2347 -2238 -1517 -2027 -1614 -2109 -3849 -2391 -2708 -2615 -3254 -1288 -1812
8091 -1812 -2475 -3853 -2960 -3352 -1305 -1531 -91 473 1529 -321 -1087 775 2166 2127 1240 1630 2113 125
8109 125 1580 2153 3618 2626 3916 3186 298 3501 3832 4452 3369 4218 989 2496 1427 1901 282
8126 282 1503 1068 53 412 -591 723 -2352 73 -732 -2639 -678 -2293 -1766 -3717 -2474 -2441 -2758
8143 -2758 -3084 -2890 -894 -4193 -1252 -2824 -1167 -845 -1569 -621 -1955 -242 -1596 -349 664 -130
8159 -130 -1275 1370 923 1218 1531 2432 2212 1907 3679 2045 4000 3017 3612 3160 3039 1114 2390 2828
8177 2828 1925 1305 2779 508 -17 1226 12 919 940 313 -1148 736 -746 -647 -2810 -1536 -1978
8194 -1978 -1311 -3630 -2365 -2528 -3956 -2323 -2319 -3925 -4607 -1326 -1782 -1302 -3228 -1364 -3473 -2147 -1337
8211 -1337 -1618 -1659 -1355 2026 -980 468 874 1079 1951 1124 441 884 1785 3647 768 3699 3856 1614
8229 1614 2215 1550 2920 2985 1709 743 2525 493 1267 1524 247 3043 563 2241 575 -1048 -379
8246 -379 -1449 -3020 -1343 -2378 -1283 -2055 -2723 -47 -3383 -2942 -2116 -1753 -2705 -1982 -1802 -1723 -1076 -2938
8264 -2938 -512 -3590 -912 -647 -1366 583 -493 -1257 250 18 670 2050 -449 315 254 2540 3428
8281 3428 2771 2881 2515 2956 681 3641 2215 4062 2463 2447 2867 2709 2667 2623 730 1724 1763 1899 764
8300 764 848 709 -1183 -2168 -693 -3894 -2470 -1627 -1338 -2795 -3046 -3545 -1570 -4964 -2474 -2687 -5136
8317 -5136 -2795 -3057 315 -2292 -2355 -2689 238 -985 208 -1861 -854 -812 951 735 2015 1896 1498
8334 1498 2189 1478 2888 1410 2593 3067 2658 3310 3086 3054 1879 3434 3672 1531 2011 1700 2266 1240
8352 1240 1541 -190 366 940 -396 922 240 -289 -1856 -3589 -1168 -2953 -1585 -3355 -2459 -1945 -3291
8369 -3291 -1038 -2170 -2046 -1650 -2101 -3075 -1909 -1017 -2359 -2659 -791 319 280 -210 -33 1896 1024 776
8387 776 -642 1705 2287 -242 1485 600 4928 988 3034 2631 3420 1515 1882 1617 3065 54 2016
8404 2016 1157 2306 -305 736 1167 1544 44 778 657 -707 -2012 -1037 -2129 -2829 -2272 -1514 -2777
8421 -2777 -1161 -4856 -3942 -2455 -4756 -1366 -1852 -2126 -983 -4409 -2999 -2398 -1738 -2299 -310 -1713
8437 -1713 -571 -1263 -284 0 -304 1222 336 1635 1784 1047 2768 3441 1401 2065 1753 3621 2324
8454 2324 3075 2324 2598 1716 4122 4270 1148 542 1717 -523 1172 1792 494 -1564 1298 501 -272
8471 -272 -866 -1047 -268 -2187 -1015 -392 -2494 -1962 -1990 -5100 -3600 -1318 -2205 -2258 -705 -1244 -2641 -2801
8489 -2801 185 -1844 -2878 -268 -1522 1065 -423 119 1858 1546 1329 -578 1715 2407 2050 2220
8505 2220 2648 800 5658 2727 2465 2919 1765 1124 1230 3819 3080 1604 2912 3360 2145 1862 1370
8522 1370 -553 -294 -242 -1576 286 -1927 -400 -873 -2791 -2473 -1460 -3056 -4947 -2589 -4282 -4172
8538 -4172 -3147 -3051 -2799 -1377 -1654 -2961 -1818 -2621 -1061 -558 -1314 299 694 -32 -1249 1741 130
8555 130 1214 2602 46 1927 1773 1950 1777 2836 2003 3406 2440 2665 63 2988 1262 3258 1867
8572 1867 3534 2180 2655 2701 149 56 314 1469 1337 888 -2584 -3876 -1234 -1849 -2039 -462 -2736
8589 -2736 -1969 -2239 -3323 -2941 -957 -2560 -2833 -1057 -2603 -2741 -1937 -2390 -1768 -2865 -2010 -1482 -2336 -106
8607 -106 -906 -304 -997 1906 312 2585 1258 1207 2032 2732 2399 3685 2917 2518 3141 3333 2962 3625 2777
8626 2777 2290 2442 2602 2279 2023 3170 1090 664 -1002 755 -2205 -1043 844 -246 -2225 -670
8642 -670 -329 -1939 -2203 -3125 -3451 -3509 -1073 -3059 -3065 -2988 -1907 -3411 -3512 -1865 -1014 -1977 -873 -2228 -1130
8661 -1130 -582 -1977 604 -1798 108 1011 173 1012 2575 1606 330 1246 2021 1697 3302 3346 2804 2708
8679 2708 2258 3666 3241 3487 1576 2584 1620 2617 1170 960 -691 -144 966 -774 -1253 -1569 305
8696 305 -1928 -2352 -4259 -2429 -534 -2735 -2633 -2624 -2914 -1488 -2632 -2644 -2270 -3064 -2519 -1877 -2468 -2273 -3539
8715 -3539 -2597 528 977 -451 -137 -34 -232 713 -152 2187 1475 2245 2140 3218 684 1651 2958 161
8733 161 3313 3843 2146 2861 2515 4050 1736 3403 1871 1872 1275 -19 -232 754 1000 430 -17 -32 -154
8752 -154 -1371 -2237 -528 -1259 -2105 -3022 -635 -754 -2235 -1871 -2850 -2168 -3599 -3110 -2322 -2341 -4400 -281
8770 -281 -1369 -122 -1036 -973 -1420 -456 764 1383 2133 1282 1192 2350 884 2611 1668 2421 1893 1153 816
8789 816 4316 3040 2507 2374 2615 3082 3558 2208 1525 1513 2036 3796 -1188 -627 585 1004 247 -114
8807 -114 -1214 -1311 -1381 -1428 -2720 -1908 -3123 -3150 -1893 -2174 -1013 -3667 -1566 -2654 -3288 -3367 -2697 -1571 -1792
8826 -1792 -2486 -2661 -214 -3306 -1036 -1614 -706 779 802 1222 2235 1163 763 2721 1863 1797 2096 3665
8844 3665 1088 2820 993 2898 1207 1289 558 3068 3331 2866 2886 1473 2003 1795 1709 1 -440 361
8862 361 -819 811 323 -1260 -1140 -252 -2018 -1846 -2236 -3506 -2562 -2889 -3660 -4023 -1426 -2296 -2883 -2885 -2892
8881 -2892 -575 -2627 -2425 -1976 -197 -365 -697 1008 1188 1582 -1604 -120 1181 1543 662 1487 2530
8898 2530 1975 3676 3048 2189 3553 2128 2654 1936 3255 1018 2404 1827 2511 1339 1205 1990 -1233
8915 -1233 1054 469 2026 -1327 -724 620 -783 -1627 -2104 -1692 -1867 -2009 -1553 -2587 -3637 -2138 -2735
8932 -2735 -2445 -2996 -806 -1704 -1874 -2002 -198 -2632 -2368 -845 -577 -1026 -44 626 -1077 2104 1041
8949 1041 73 446 2697 895 161 2173 3833 2509 324 1910 3810 2465 2389 1580 1332 3862 2920
8966 2920 2594 1253 553 2737 77 584 1635 -715 -1173 -682 -796 -2657 -908 -561 -2305 -1928 -1938
8983 -1938 -1435 -2364 -3101 -1261 -2871 -2269 -1472 -3053 -1425 -1840 -1493 -903 -2039 -1026 -1307 -325 -860 -603
9001 -603 -89 140 -674 1636 1127 1207 2801 1587 1821 2761 -133 1282 1144 2811 4432 3658 3332 2003
9019 2003 3416 1552 2193 3017 2092 613 -333 861 2659 -255 361 -195 -1809 261 -2129 -1552 -2114
9036 -2114 -1405 -3921 -2195 -2355 -671 -3356 -3201 -2969 -3673 -1180 -786 -1052 -2494 -3549 -3181 -642 -53
9053 -53 -899 -1766 -716 -1141 -491 -65 1709 533 1451 2551 1422 2170 2516 2621 1949 2621 5733 2408
9071 2408 1389 2567 2960 1152 2435 4415 3373 719 771 4296 -17 3312 1128 -2134 -242 894
9087 894 -1147 -180 -202 -1859 -2410 -1188 -2392 -1605 -2496 -2314 -2172 -1511 -1758 -2059 -2023 -5284 -4563 -3194 -1904
9106 -1904 -1642 -3141 -2225 -1391 -1813 -295 1497 -1346 -301 887 -172 2068 2015 370 1374 1156 731
9123 731 3399 3656 5057 5177 1968 3853 3585 3796 3165 1178 3042 1530 2519 3441 923 -486 707
9140 707 327 385 -159 -350 -429 -1508 -839 -1798 -2757 -3616 -1672 -2867 -2265 -3669 -1477 -2431 -2038 -2195 -2609
9159 -2609 -2982 -1615 -3244 -2631 -2717 -972 -997 738 -1364 70 -2258 759 252 1023 1388 1381 1877 1117
9177 1117 1417 2996 2203 1555 1909 1589 3941 2812 4776 2616 3580 1767 3725 2363 -285 2735
9193 2735 -1032 1179 664 -122 1342 256 -659 -513 -1959 -2562 -2568 -2157 -2160 -628 -1235 -1844 -1595 -1840 -1331
9212 -1331 -4025 -2850 -1295 -1639 -2210 -1816 -3583 -2785 -1550 -3953 -1538 -2438 -2796 587 -1747 880
9228 880 -879 2259 1122 1667 2171 1131 854 1966 2076 2517 3005 1566 1829 3150 2615 2974 4229
9245 4229 1873 134 2776 2483 2229 295 1967 769 1157 372 -304 -2429 -1852 -2190 -2750 -2143 -193
9262 -193 -2521 -2792 -3032 -1891 -2860 -2360 -1576 -3214 -629 -3469 -1827 -1100 -2252 -1682 -313 -985 254
9279 254 -1977 340 -1458 -737 241 628 98 1885 -81 -224 3294 1827 1976 1845 1432 2014 2400 4092
9297 4092 1500 2763 3145 1115 3270 2218 2713 658 1729 2356 -171 756 -917 -761 1866 420
9313 420 -1177 -3713 -1199 -278 -2040 -2859 -1557 -3356 -2722 -2303 -1375 -2321 -1094 -2617 -1415 -3690 -3747
9330 -3747 -2807 -2606 -2629 -1964 -936 -980 535 -771 -759 685 -684 -1218 255 3557 1735 3755 3247 2812
9348 2812 3041 2072 1736 2906 2879 3750 2004 2230 3156 -240 3681 3205 3433 2904 2776 2222 1023 2472
9366 2472 -612 787 -691 -1303 -1190 13 -1580 7 -1640 -2724 -3225 -2280 -2512 -281 -1464 -4224
9382 -4224 -999 -3334 -2261 -2050 -1660 -2412 -958 -2892 19 -809 714 -256 -258 -430 -1892 2334 1078
9399 1078 865 1820 609 3066 492 2409 53 3278 2724 2205 1506 1920 2045 2262 2498 -361 -170
9416 -170 109 2614 247 3657 85 1152 -2474 -905 957 -2162 334 -1994 -887 196 -2005
9431 -2005 1211 -1599 -1715 -2120 -1081 -3273 -328 -2815 -697 -2393 -1211 -826 925 -2913 -2296 -1959
9447 -1959 -1686 -2422 -945 -59 -1649 702 -417 1692 510 1912 2776 1774 2272 2163 1677 3317 2107
9464 2107 4153 4101 2375 1457 1587 1977 1312 3462 -447 789 1692 799 1182 545 81 608 -187 -651
9482 -651 71 -1596 -1078 -146 -2448 -3073 -1288 -1371 -2750 -1970 -2849 -1400 -4042 -3752 -3573 -4404 -3071 -3837
9500 -3837 -1432 -2941 -75 -2297 -1131 -1987 -1541 -48 -131 -585 2985 1108 2485 696 334 3679
9516 3679 1509 4348 2620 2424 109 1243 824 1171 1337 2985 2323 2961 2337 1425 225 1799 184
9533 184 911 -1132 988 322 -48 -561 -2929 -1922 -2992 -828 -2100 -2351 -2312 -2620 -2310 -275 -2623
9550 -2623 -4043 -1734 -2426 -2046 -1884 -947 -814 -1964 -344 -2237 -1167 -1050 -1023 507 -1121 -94 357
9567 357 2755 386 3409 1923 2020 1842 2134 1342 2605 3170 2829 2013 2500 3316 3085 1007 2470 2306
9585 2306 673 1369 1980 1460 984 489 773 586 -1917 -528 -446 -1786 -1417 -890 -1360 -3088 -1145 -2232
9603 -2232 -61 -2659 -1217 -2807 -3037 -4843 -2028 -3487 -1920 -2140 -2084 -492 -1525 -147 -1455 -515
9619 -515 -99 770 -695 83 1565 2158 1284 1701 3354 1323 2116 2293 1700 3711 2787 4009 2099 621
9637 621 2426 966 2096 3001 2278 306 -365 1967 532 -1877 206 -796 -466 263 -1824 -871 -1297
9654 -1297 -2429 -1894 117 -3335 -1881 -3450 -1831 -2646 -3344 -3034 -3217 -3319 -2439 -719 -1070 -1658 -1953
9671 -1953 -460 -2264 -543 -989 296 113 856 1586 -7 474 1036 928 258 450 3249 1352 1311 1739
9689 1739 1700 957 1933 1977 1797 2965 2265 2032 1902 2345 -158 1411 1457 150 -978 -44 911 -148 1404
9708 1404 -1809 -2084 -1527 -903 -2663 -1415 -1081 -2725 -3470 -1926 -3891 -1522 -3248 -2201 -2849 -651
9724 -651 -2841 -1939 -2738 -208 -2182 -2086 -346 -799 -451 -320 1310 296 820 1719 2414 83 2700 4390
9742 4390 1219 2145 3326 1694 2393 2040 1155 2575 2252 543 2090 1248 1290 1118 899 2764 1607
9759 1607 1056 -82 -425 -2395 -907 -686 -656 -1041 -1546 -1187 -2829 -1746 -3098 -2542 -1997 -2683 -3219 -1585
9777 -1585 -1574 -1432 -1431 -2700 455 -2343 -1932 -1665 -1874 -323 300 -986 533 234 1682 140 2751 830
9795 830 1908 780 2639 3227 3320 3466 3438 2296 959 3446 3071 1023 586 1380 1456 1134 -161 2657
9813 2657 2583 888 -300 101 153 605 -2796 -1930 -2387 -1822 -3026 -1013 -1693 -2361 -2929 -3596 -3404 -1388
9831 -1388 -1236 -2715 -4325 -1780 -2752 -1703 -521 -3365 -317 -3342 -2429 -511 152 -1227 346 271
9847 271 -852 59 484 1160 852 318 1743 4313 1804 2427 2479 952 2545 1530 3525 1907 2260
9864 2260 3016 1502 2025 2085 796 575 1441 -32 795 1148 541 -2253 64 -1537 -337 -86 -1465
9881 -1465 -1236 -4380 -1027 -2008 -3416 -2030 -2398 -2361 -2621 -2792 -850 -2865 -3801 -1489 -2403 -1742 -1657 -52
9899 -52 250 -567 1270 -504 -1325 567 -225 3428 2614 1700 3100 1694 3713 2106 4100 1559 3189
9916 3189 2958 3212 3870 1388 2056 2206 3762 2242 1573 49 1381 281 229 -1883 -181 -1616 215
9933 215 -2139 -1020 881 -547 -2934 -2823 -1892 -2788 -4752 -2023 -2683 -2231 -1817 -3979 -1767 -1774 -2236 -1469
9951 -1469 -2199 -287 -1866 -2342 -1418 -1386 195 -243 -714 405 2268 173 2294 2389 1165 2595 3075
9968 3075 3475 1092 2733 1145 2390 2809 1424 674 4267 2522 1054 2964 1937 1181 1033 -52
9984 -52 2124 811 -618 -563 1125 107 -2378 -1203 -3016 -2241 -1212 -2123 -1259 -4014 -2269 -2228 -4288
10001 -4288 -1190 -2074 -3775 -1634 -3541 -2067 -2252 -1953 -607 -601 -395 -573 1015 608 205 1189 2236
10018 2236 824 1587 1532 2034 2303 3968 3900 1144 1929 3150 3684 2909 2754 3155 1762 2574 3605 1575
10036 1575 3164 1412 281 87 1374 -414 -395 -1270 -2028 -1209 -902 -871 -155 -679 -1716 -428 -2897
10053 -2897 -4310 -2782 -3813 -2627 -3614 -1737 -2433 -1879 -1684 -695 -686 -2127 -2035 -1668 -434 -225 1265 425
10071 425 2070 510 1166 1805 909 1101 1041 2630 2970 2074 2294 1750 3169 2161 3210 2955 3759 2417
10089 2417 -16 1810 -285 1779 675 1662 -291 481 1173 203 -1969 -1141 -1667 -1558 -2449 -2590 -2479
10106 -2479 -1537 -1122 -3608 -2623 -3988 -2503 -2526 -2749 -3376 -1063 -3328 -2711 -1952 -1545 -523 -1432 -2536
10123 -2536 -561 -512 -277 546 590 1325 332 1816 1346 2113 2200 2630 2523 1273 1526 2767 2162 171 2254
10142 2254 2727 947 3801 1722 4972 1974 2489 2566 652 1070 1153 1149 -728 -517 36 412 -1307 -1250
10160 -1250 -2479 -2409 -859 -2495 -3880 -1889 -3311 -2583 -4681 -3156 -2899 -4199 -2241 -1566 -1379 -1702
10176 -1702 -1532 -2124 142 -81 -1676 -596 2564 -144 1433 314 1942 260 772 2046 2345 3823
10192 3823 1137 2796 3331 4397 4194 3882 921 1473 1694 1473 2520 314 518 -226 1451 230 174
10209 174 614 -1496 724 -794 268 -688 -2152 -791 -2141 -2922 -541 -2764 -2259 -3849 -2120 -2913
10225 -2913 -2783 -2363 -2569 -2508 -4134 -841 -3654 -2967 -1509 -746 -817 175 957 1617 899 -487 1871 1236
10243 1236 1409 408 2035 2596 1757 1579 1690 2374 2314 1702 3123 838 3430 3600 1424 2010 756
10260 756 147 2890 -544 1806 555 1337 -663 -826 -512 -67 -1979 -1323 -2373 -2008 -555 -1104 -2591
10277 -2591 -2794 -1725 -2760 -3322 -1738 -2613 -2130 -490 -2489 -870 -2801 -2128 -1512 -66 -2154 -422
10293 -422 -2658 -1159 472 163 577 539 740 1379 1986 1467 3334 1218 1839 3564 2798 3817 3780 546
10311 546 2651 2971 4447 2458 2030 970 -621 2270 -219 1295 425 258 1024 576 -585 -703 -1574
10328 -1574 -1867 -1803 -1965 -2479 -2859 -3052 -3252 -307 -1665 -3531 -1776 -2066 -1715 -1858 -447 -2147 -3725
10345 -3725 -1372 -480 -1473 -1988 223 -547 1799 64 -491 1171 1403 946 2021 3010 2563 2669 1593
10362 1593 3762 2558 2730 2866 5640 2814 1463 1170 2720 1380 -213 -138 444 805 269 161 848
10379 848 -2069 -425 -62 -1392 -1670 -3323 -1205 -3577 -923 -2959 -2809 553 -1742 -3494 -2909 -2659
10395 -2659 -1421 -1855 -564 -2147 -2080 -2037 498 -900 -2407 -505 454 879 267 3098 1297 1749 1594
10412 1594 981 805 2288 2059 3101 1890 1441 1837 4039 2614 3108 2879 1013 1161 2272 1189 -284
10429 -284 810 1190 -413 1770 91 -701 2886 -273 726 -96 471 -422 -3395 -1870 -2717 -564 -1083
10446 -1083 -3546 -1351 -1788 -3047 -2732 -3127 -1936 -1445 -2084 -1372 -633 -899 -968 -324 -770 1005 55 1785
10464 1785 -1271 366 1612 1639 553 1764 2700 2836 1146 2742 1713 2543 4100 2898 2580 1519
10480 1519 3099 651 2640 2396 1550 1752 1412 882 907 1223 -565 317 -764 1352 -1145 -650 -1076
10497 -1076 -2231 -463 -2757 -1161 -947 -1393 -1703 -1601 -1201 -1565 -2067 -1470 -1085 -3597 -1755 -2740 -2354
10514 -2354 -315 -1485 1214 -504 -241 -909 -1469 -296 833 1610 1667 2412 2223 2010 1592 2977 2310
10531 2310 2765 2645 4198 2765 1571 1978 3189 1365 2680 2398 2056 1608 -671 664 450 -1209
10547 -1209 435 137 191 684 -680 -2207 73 -1269 -2669 -2485 -1984 -1629 -3032 -3461 -1301 -165 -2283
10564 -2283 65 -2474 -2724 -1216 -1060 -1420 -1534 -881 -1336 -2193 -1756 771 1260 328 522 1868 1790 2928
10582 2928 350 1315 1831 1279 4346 2515 961 2863 2439 2137 3146 3855 1468 1538 1861 598 1326
10599 1326 1048 1906 1304 892 124 738 -640 -1297 -1578 -1029 -1761 -2640 -366 -1536 -2808 -1506 -3310
10616 -3310 -3592 -2010 -662 -1893 -2757 -2592 -575 -1424 -1062 -1559 -1178 -861 -119 -159 -80 -453 -428 511 459
10635 459 1037 496 2591 2144 1511 1454 3031 3085 3868 1612 3384 1803 2609 3574 2414 2490 -83 1389
10653 1389 1246 1161 -830 404 857 -752 1659 560 1017 -1951 218 -71 875 480 -2193 -688 -1583
10670 -1583 -2474 -2009 -647 -1325 -2291 -2382 -1792 -1587 -1700 -4228 -1781 -2030 -1391 -621 -1287 373 -273 1326
10688 1326 1164 638 255 1142 510 -315 -24 1812 -491 2316 2426 1841 3562 3572 2098 769 1903
10705 1903 1984 3002 1991 2202 -208 1984 1184 2271 2254 -1319 1977 -925 -488 -1375 -1149 -902 -1055
10722 -1055 -2043 -2285 -981 -3384 -5046 -2717 -1197 -1598 -652 -1610 -3360 -1355 235 -2108 -1221 -2265
10738 -2265 -1976 -754 -768 -1350 691 1132 -455 -1514 1250 337 307 58 87 744 811 2911 2536 3251 49
10757 49 1821 3411 2664 2714 2541 2549 3553 1382 224 2421 73 1675 -56 1712 2212 -289 -1822
10774 -1822 -985 -1072 -2531 -1250 -705 -2070 -2309 -1664 -2626 -1900 -1860 -1755 -1572 -2753 -2499 -2165 -1115 -791
10792 -791 -1084 -1993 -173 -1631 -1492 -744 1560 -2817 -438 42 -1359 1562 2765 2411 1898 287 1225
10809 1225 3011 1882 1801 2899 1914 2182 470 2642 2628 1602 1753 955 1702 298 1039 692 -1371
10826 -1371 139 1810 1287 -1445 797 -1107 -667 -1205 -2015 -2418 -686 -3115 -2936 -2487 -41 -3559
10842 -3559 -2065 -2800 -3126 -1260 -2866 -413 -2005 -990 -2111 -1398 -544 -2185 -354 -1720 1020 1076
10858 1076 138 1981 1913 2562 2509 2049 3815 1768 3099 1802 2493 1670 4482 2196 1669 901 2329
10875 2329 3711 1320 1703 1046 843 668 1491 -565 346 405 -1835 -263 -1953 -500 25 -2680 -1740
10892 -1740 412 -2491 -913 -2873 -2020 -1243 -3986 -3202 -998 -1497 -3131 -2321 -1398 -1638 -1838 -1618 -970
10909 -970 -625 -1179 -1691 -1068 1520 -562 1578 344 2826 1368 1478 1943 1740 1675 2669 2340 2427 2197
10927 2197 3145 2574 1680 1353 4747 686 2088 1934 383 1116 851 1993 -436 -193 -243 -184 -592 -2055
10945 -2055 -1907 -2333 -3593 -1234 -3347 -2351 -937 -2450 -1634 -2138 -1806 -3349 -1117 -233 -2531 -477
10961 -477 -445 -3178 676 -463 -1560 -1163 -710 -281 737 -421 -845 799 1927 996 2284 1611 1079
10978 1079 2004 1775 3237 3557 1574 2861 3574 1881 2961 2005 2934 625 2959 1493 1513 -1019 -101
10995 -101 97 964 -422 240 -1554 -961 -1179 -483 -3287 -1472 -836 -2393 -61 -391 -3170 -1037 -2633
11012 -2633 -1653 -2504 -1880 -2670 -3047 -902 -262 -2602 -1516 518 1825 -215 555 287 1112 2513 1708
11029 1708 765 1610 2111 -39 1481 979 2342 3075 999 1348 2737 1958 688 791 1926 1732 1676
11046 1676 3147 2254 378 1765 16 1410 -240 -214 -1321 -810 -1371 -225 -1323 -1613 -1460 -1133 939
11063 939 -1147 -2561 -3859 -2294 -2380 -1475 -1411 -1958 -1321 -651 -1630 -1664 -3026 -401 -1095 387 -647 229
11081 229 -335 -777 706 120 2118 1812 1423 2443 834 1967 2146 1876 1941 851 2213 1971 3251
11098 3251 1436 -103 1625 2354 2664 1566 2989 1321 333 -36 1503 -1441 -734 478 -2202 1152
11114 1152 -2620 -841 -640 -1855 -2115 -922 -1944 -2937 -785 -1411 -1575 -3410 -2871 -2531 -1236 -3713
11130 -3713 -2188 -1056 -335 -484 -1555 -1534 -247 -646 1823 2705 820 689 983 1447 2256 2141 905
11147 905 1644 2875 2670 2814 641 2458 1715 984 2259 2241 3100 1900 736 815 939 -318 -148 154
11165 154 -757 -369 -1025 -1331 -1634 -797 -2090 -2223 -1120 -1506 -2336 -1847 -1771 -1296 -3922 -363 -1960 -2006 -1048
11184 -1048 -3370 -1570 -102 -2900 -1517 -2476 328 -1000 364 -1235 -1235 1488 2341 1707 -741 3462
11200 3462 1737 825 2211 3398 2698 3795 1872 2248 3039 2516 1847 2706 1409 1182 2766 384 1161
11217 1161 1911 1980 943 -642 646 1153 -1680 -141 -2455 -635 -1939 -129 -2512 -3437 -2921 -2377
11233 -2377 -3505 -1386 -2292 -1806 -507 -4617 -2847 -1793 -2396 -2543 -2423 -359 -2985 342 80 -1098
11249 -1098 213 -1520 -1047 2822 502 452 2012 1965 984 2565 186 1469 3131 2862 3285 3036 1453
11266 1453 2427 2995 2310 1895 911 3087 1355 85 1458 -96 -1776 1261 1070 -763 -474 -653 -1605
11283 -1605 -502 -2197 -461 -1613 -3053 -2956 -3168 -2400 -845 -2294 -1947 -2038 -1434 -457 -1368 -1208 -2365
11300 -2365 -169 -1013 -1515 1730 1643 -272 977 -310 121 -180 706 -1180 -35 2211 2007 4267 1755
11317 1755 1595 1551 5022 2845 707 2320 1945 2180 3452 2917 2555 1920 -436 720 374 1438 360
11334 360 442 -1462 -708 1168 -1742 -1818 -1987 -4033 -849 -2779 -1298 -1804 -4820 -2765 -2139 -1268 -5296
11351 -5296 -1184 -2839 -2064 280 -1378 -591 -1425 -1386 -190 -975 870 1045 147 921 2041 353 1134
11368 1134 2042 1456 2356 2001 606 177 3384 1432 2080 1824 656 3944 2979 3085 2019 459 987
11385 987 2289 1006 138 -1144 416 1144 -391 467 -285 -99 -960 -1273 -539 -2357 -1379 -1947 -1713 -2579
11403 -2579 -310 -2677 -2971 -3670 -3807 -1647 -3618 -3496 -2493 -214 -788 -1151 -3113 334 223 143 303
11420 303 824 182 1548 1351 2305 850 -460 2648 2851 2696 2126 1600 1195 3822 3475 1752 649
11437 649 650 2227 1693 744 1718 1205 1723 783 2226 -404 41 -1121 -355 253 -833 -841 -871 -1367 -1515 -1896
11457 -1896 -2749 -2961 -2901 -1912 -1371 -1569 -4209 -885 -1961 -1317 544 -1907 -2004 -1678 -909 -331 -540 -839
11475 -839 1417 1773 1005 1217 731 -390 1798 1968 3449 2699 2264 2457 1631 1845 2386 2777 1442 2470
11493 2470 1329 1134 1616 708 2179 1751 -560 1742 1039 488 934 -570 -330 -1201 -624 -648 838 -709
11511 -709 -1286 -3153 -3208 -1780 -2147 -3063 -1353 -1600 -2092 -1263 -3566 -1730 -409 -492 340 -839 -1249 -1894
11529 -1894 -1808 1534 -2200 19 192 -331 -663 1393 1768 869 2813 3027 3082 3664 1281 2135 3257 2153
11547 2153 3847 1778 718 1487 2063 1854 2120 628 89 3282 -419 577 -571 -940 -862 -1959 -2239
11564 -2239 -1254 -1748 -2797 -1843 -2856 -2081 -806 -2270 -3643 -2781 -2517 -2698 -2926 13 -671 -3446 -437
11581 -437 -459 -2545 -1462 -1372 -745 1233 -2068 -1955 427 1471 2804 -415 2242 1138 2075 2320 2109
11598 2109 2852 1791 4063 1753 3718 2173 1359 2306 1515 1355 -312 1334 1093 503 2395 -115
11614 -115 -166 -498 -694 -826 394 -1802 72 -2193 -1357 -2177 -2045 -1962 -2037 -1981 -1212 -4500 -3968 -823 -1912
11633 -1912 -2535 -2453 -1122 -1534 -1090 -92 -1021 -1274 -1175 -1220 -113 1011 -2 613 2009 1773 1250 1953 693
11652 693 3417 1771 2691 1196 808 2779 2109 3997 1689 3140 1340 2711 2687 3424 -127 1232
11668 1232 -477 249 -716 -1566 738 -408 494 39 -2454 -2140 -2809 -1792 -2411 -1827 -2450 -2500 -3166 -4531
11686 -4531 -2473 -1313 -4160 -1660 -2574 -2425 -812 -2850 -716 -295 789 -1606 47 -1388 1722
11701 1722 1362 1438 1906 1336 956 -360 1532 1572 1449 1513 611 3342 4201 2175 2265 2882 3917 1932 3316
11720 3316 1613 1283 1466 627 1495 665 1441 -1348 -925 -1113 -589 -1162 -894 -1265 -1498 -1143 -2044 79
11738 79 -2382 -2182 -3278 -1671 -1841 -1220 -2278 -1492 -1880 -624 -1587 -1418 -1300 -738 -975 -1640 547 432
11756 432 3 791 1246 814 902 2047 553 1583 1084 1307 4561 90 2627 349 1341 2693 1708
11773 1708 2191 2517 167 2424 961 1925 614 1836 777 -921 -146 -832 699 -1099 424 -2185
11789 -2185 -176 125 -3201 -1005 -2811 -2393 -1104 -1378 -2423 -3422 -1898 -943 -2494 -2238 -519 -559 -1625
11806 -1625 -2241 -2297 -823 -1024 -249 62 -269 -986 1744 641 1197 1366 3751 4239 2629 2391 2956 3110
11824 3110 447 2757 3337 2032 1959 1030 2697 2093 1378 837 -419 928 605 535 1163 -687 -1566 -2100
11842 -2100 715 -895 -908 -732 -1777 -1937 -1230 -3308 -1191 -2024 -2024 -2464 -1587 -2561 -117 -2959 -3259 -1331
11860 -1331 -1062 -1505 -971 -648 -1351 -1029 -1087 -9 608 870 1843 -288 1206 3591 2179 2842 2953 2573
11878 2573 661 619 3484 2449 2453 2053 935 2415 2009 3009 2434 883 528 2085 -155 2561 395
11895 395 604 309 -364 -1744 493 -1419 158 -737 -2047 -3322 -169 -1064 -3386 -2184 -3501 -2952
11911 -2952 -1563 -395 -2005 -2414 -2250 -3059 733 -1045 -1940 -1348 -1944 -466 234 -165 2846 1930 897
11928 897 1377 -516 1802 -502 2447 2952 2016 1228 2751 1201 1448 3501 3851 1834 2469 1583 798
11945 798 1339 930 663 -837 755 632 433 39 -1658 -1085 -672 370 -1093 -1311 -1564 -1169 -1704 -3124
11963 -3124 -2260 -3165 -814 -2604 -1810 -1983 -1296 -2361 -849 -2104 -2724 -1363 -363 -1324 338 864 -2243
11980 -2243 195 -1137 2019 296 528 860 1958 -881 100 708 -107 2467 437 2085 3806 2560
11996 2560 2789 2381 3139 2337 1053 1072 357 779 288 846 -101 -2130 84 -843 -1713 -46 -642 -679 -1466
12015 -1466 -1458 -2236 -1773 -1615 -1299 -200 -1051 -1965 -896 -1502 -3547 -63 -1972 -1096 -2751 -2387 -1042 229
12033 229 -626 315 -1352 -1668 1013 2668 2220 1280 256 822 695 -268 2143 3521 1536 1229 1133 2957
12051 2957 4608 1910 2300 2274 3087 3369 3046 1048 2770 1349 609 -652 190 -1095 -1200 953 237
12068 237 53 -1767 -1475 -887 -658 -1144 -622 -1347 -1166 -1810 -407 -1006 -2944 -3996 -222 -2172 -1472 -951
12086 -951 -1482 -982 -2383 2370 189 -506 291 -774 1114 588 28 1417 853 1664 2542 138 3289
12103 3289 4620 2598 1667 2430 1564 2858 814 1218 727 1990 2244 655 2514 2091 494 1609
12119 1609 1001 560 -816 -1359 -2586 -195 -511 -2521 -1504 -503 -1175 -2446 -2595 -2716 -3164 -3147 -2346
12136 -2346 -2419 -2089 -677 -2748 -1114 -3019 -1316 -500 -674 -2127 -205 246 -1194 419 1072 2497
12152 2497 -356 709 931 2333 2590 3152 1728 3226 3036 2351 1749 1665 1999 3933 3081 2059 681
12169 681 876 1644 -938 1443 1092 110 2158 -2535 376 -388 -1366 -710 216 -769 103 -1171 -1422 -2960
12187 -2960 -1063 -1875 -2565 -888 -2082 -1064 -3235 550 -2124 -1918 -1275 -2157 110 902 171 361 -1640
12204 -1640 -863 799 -486 1053 2374 -1173 100 699 219 2289 3128 455 1719 1369 2356 2202
12220 2202 -386 774 2061 1404 613 2449 2987 477 71 1819 -693 831 504 -589 1356 1450
12236 1450 -1085 -1061 -249 -426 -692 -3183 -2239 -2759 -568 68 -911 -3530 -2573 -1316 -1491 -1924 -2739 -1127
12254 -1127 -1068 -1089 -1591 -1201 -698 -2083 -2299 -1050 277 -354 -774 -182 3461 1401 2031 1310 2284 1689
12272 1689 154 1970 1261 2358 2398 3437 1913 2696 836 2050 2880 -54 -82 2770 -478 1089
12288 1089 -13 2562 196 -1566 -1508 -1860 -742 -2329 -939 431 -2602 -1363 -1931 -1510 -1185 -3570
12304 -3570 -1137 -3046 -2105 -2842 -1926 -379 -125 -2881 -1342 -470 -117 -1120 -1215 996 2065 -1262 1459
12321 1459 581 -1116 534 1439 1627 845 1286 2194 393 3103 2161 1164 2595 1810 227 587 1910
12338 1910 -272 1908 353 617 344 -208 -73 -320 -400 -917 -1493 -1519 135 -3564 -209 -616 -1875 -3242
12356 -3242 -1320 -982 -2787 -2078 -2802 -496 -1444 -1703 -1765 -1842 -913 496 -3122 365 -1875 -586 317
12373 317 1850 -405 -524 -119 1993 1768 1178 2715 2388 993 1056 1420 573 1574 969 2413 2118 1828
12391 1828 3238 1572 1920 2239 1753 791 1877 225 -625 1356 253 -638 -442 -1387 4 -1435 -1653
12408 -1653 -2718 -4065 30 -3371 -2116 -2785 -3919 -1871 -2705 -1219 -1803 -2481 -2443 -2065 -3584 -1373
12424 -1373 -1329 -1179 -1702 -2 -1191 269 179 -1684 -889 1089 1127 1276 1162 1110 854 2148 2359 1564 857
12443 857 4435 1766 3049 563 992 1375 2866 1390 1717 2340 264 844 1406 408 120 -674 1640
12460 1640 3173 -1629 -2109 -1339 -2117 87 -2205 -440 -204 -1814 -2991 -2520 -1079 -2595 -1103 -2734
12476 -2734 -2359 -1521 -1385 -2021 -2170 111 -419 -1853 -51 598 -1407 1782 1787 527 469 1594 3386 2409
12494 2409 1431 291 1148 1793 2061 831 3014 755 1732 538 2883 1646 1326 -296 942 485
12510 485 778 -8 -116 -762 -712 307 -1116 -1070 -1616 -2416 -1573 -2843 -3824 581 -1121 -774 -2611 -2429
12528 -2429 -2787 -3305 -285 -3290 -2309 -990 -335 -837 -38 -1354 -972 -1292 -2479 393 199 618 254
12545 254 -22 143 559 1583 875 279 549 2885 1776 1796 2304 1255 3453 2733 1299 2335 2087 1928
12563 1928 2080 1011 1611 1627 687 436 1990 990 -200 -1998 -532 340 -2161 -3339 -186 -95 -469
12580 -469 -839 -1375 -1888 -366 -2700 -2257 -3010 -3809 -978 -2805 -1752 -2230 -396 556 -1418 -799 376
12597 376 -1161 -906 609 -684 1118 1188 594 1037 1668 590 1711 967 -1498 691 3131 3627 2448
12614 2448 1700 134 541 1883 1540 1463 1406 140 367 929 2862 -868 82 -681 -26 -259 -1347 -323
12632 -323 -1008 -1950 -4035 -1106 -1672 -2254 -2548 -1618 -1384 -2209 -1024 -2043 -1121 -440 -1843 -2009 -2370 -1349
12650 -1349 -1626 -1275 -254 -386 1147 494 -919 671 637 526 -462 -62 961 2013 1321 636 1353 4141
12668 4141 2082 3181 653 1373 1107 2793 1174 562 2390 2434 497 1746 -413 -16 -504 -245 -341
12685 -341 329 -1081 1512 -1173 -2053 -1356 -3180 -2025 -3108 -1017 -3138 -1848 -3091 -408 -1590 -511
12701 -511 -1105 -1783 -1356 -569 -1228 -1789 -245 -72 -338 746 1198 575 501 345 1968 1575 1717 1510 1826
12720 1826 3469 2396 1375 3607 2394 1888 2606 2809 1407 4134 1216 772 1772 2102 1906 147
12736 147 -133 -470 478 -16 -907 -476 -2249 -1097 -1590 -1101 -1137 -3204 -3185 -3301 -3575 -728 -3850 -1691
12754 -1691 -2664 -2082 -3443 -2693 -2767 276 -1475 -404 -1023 164 -529 1225 1230 -1383 -214 -774 181 270
12772 270 475 2276 3180 -843 2021 1666 358 3271 2465 3505 1397 740 708 2991 1288 1760 1350
12789 1350 398 556 622 543 487 -714 379 -1239 -446 -1021 -2265 -1363 -2587 -2791 -2963 -2511 63 -1744
12807 -1744 -1040 -681 -2775 -175 -2613 -2218 -1206 605 -1983 -157 -687 -245 -364 -314 -36 -100 1006
12824 1006 -1532 2204 412 2018 99 953 2160 1631 263 1339 1950 2805 1555 874 2547 683
12840 683 2956 1260 -124 163 1743 -12 572 -198 36 907 1754 469 -1154 1075 44 698 -430
12857 -430 -1795 -1208 -2653 -487 -1400 -3850 -92 -2394 -2920 -2210 -1040 -1709 11 -1121 -3252 -2550
12873 -2550 -2622 -2657 -296 -1890 415 944 -1627 162 -37 1703 2256 1561 1044 1783 2296 -442 2568
12890 2568 2122 2491 1441 2708 929 1964 3132 2081 1733 774 2124 1436 -257 1512 -416 -1378
12906 -1378 2617 -410 77 -202 -444 -399 203 315 -2799 -2712 -968 -1941 -1252 -1235 -2503 -2125 -2761 -2943 -1344
12925 -1344 -3860 -1771 -1714 -1502 -425 -733 -1465 -242 515 474 -649 681 390 2181 421 -302 1439
12942 1439 2853 1295 695 2078 468 1133 3740 1136 231 916 2546 1829 -436 441 551 957 1736
12959 1736 192 1802 165 1350 902 -53 -94 485 -922 921 -415 -2328 -1412 -1184 389 -3270
12975 -3270 -1635 -139 -1002 -2800 -1773 -2362 -760 -3241 -1483 -890 -1457 -749 -1474 -945 -610 -263 77
12992 77 494 960 460 -1151 2214 2210 1022 804 2027 978 270 632 2920 1241 1727 1741 2122 2384 2080
13011 2080 1981 908 847 505 1542 1088 1413 289 727 473 -1471 -1054 -1524 -1273 -649 -1611 -1181 -1344 -1211
13030 -1211 -2080 -2303 -2006 -1338 -94 -1615 -2506 -1611 -753 -656 -1223 -1507 -935 2168 188 -1279 -1394 -455
13048 -455 985 793 33 1518 1691 2111 2487 254 1781 3150 4251 1367 1366 1586 11 2171 1743
13065 1743 2779 826 3216 2938 1973 -685 -383 317 604 1330 -1498 -130 -1556 46 -1613 -340
13081 -340 -1120 -328 -1480 -2135 -1982 -1092 -2583 -2783 -1879 -3081 -1943 -2444 -839 -1243 -1200 -1463 616 -1588
13099 -1588 1251 -1625 509 681 760 -1384 -184 490 994 1359 1388 2486 97 323 2389 804 1478
13116 1478 512 3285 3303 974 1079 1223 2818 1231 2163 2504 3603 -417 572 -701 1053 -1019 -1796
13133 -1796 470 -591 -347 -423 -1566 -645 -1723 -3633 -1454 -1954 -1489 -1415 -118 -2893 -1859 -1102 -2477
13150 -2477 -54 -3902 -2548 -2255 -2894 -2499 -936 1385 527 -1387 -322 -311 1664 950 1666 1736 2629
13167 2629 1164 1593 833 1302 1229 1988 2139 645 1359 3188 1149 1415 1677 464 1526 569 791 1878
13185 1878 870 -480 1 477 50 -1541 -1630 -988 -1740 -811 -2588 -2068 -1481 -1411 -1716 -2575 -1219 -2165
13203 -2165 -1141 -3219 -2971 -1546 -2757 -186 -1473 -1270 -1953 -1264 -1489 -856 -698 1960 256 -259 421
13220 421 1948 900 1097 1439 121 2123 441 2574 2331 1065 3424 1573 2202 797 3636 2808
13236 2808 1601 -348 2647 -45 1713 -1211 -203 -970 875 -1495 1691 -1347 -1651 -214 -2026
13251 -2026 -943 -2700 -475 -3338 -2662 -1889 -870 -663 -2786 -4063 -461 -2104 -2132 -1461 -1762 -1777 -1243
13268 -1243 -1367 -821 -300 -1070 -2437 483 473 758 618 616 1984 1462 964 1119 3353 962 2398 1841
13286 1841 901 2329 3841 929 2919 1518 2290 1831 78 2128 912 58 106 1205 1768 -1870
13302 -1870 -1065 -917 -245 -1294 -654 -4724 -1515 -2631 -2026 -1181 -756 -1375 -3012 -1954 -1409 -2091 -209
13319 -209 -1285 -2012 -875 775 -683 -2060 -408 560 -1272 -312 1658 -540 819 1097 1831 1291
13335 1291 1628 1922 1829 3434 2526 1315 1964 2540 2297 702 1087 1602 3052 -421 -803 -338 1755 1387
13353 1387 1564 69 103 -138 139 -1419 431 -559 -1521 881 -655 -1097 -3375 -2116 -2459 -2271 -248
13370 -248 -1271 -882 -2019 -654 -738 -2034 -206 -586 -1489 -1122 -617 -1246 -1904 278 -634 2614 1289
13387 1289 -1588 111 -447 1900 1238 2771 735 2087 2065 3959 1915 1061 2095 328 672 1891
13403 1891 600 3093 369 2199 1111 2659 3257 838 1031 -193 -368 -1239 -1079 -669 -735 -874 -2959
13420 -2959 82 -2757 62 -1498 -2613 -2218 -2286 -1513 -1710 -2881 -2260 -2968 -2069 -1632 -3378 -1114 -734
13437 -734 1882 -2089 -1658 137 1838 -574 835 -290 -1958 1171 -86 1660 2379 3026 -352 415
13453 415 2758 1621 3162 3540 -133 674 1415 1041 1682 1761 1281 1343 -650 286 -512 -157 795 1088 -317
13472 -317 -2120 -111 -1825 -3336 -3650 -346 -2809 -1216 -336 -1631 -769 -2925 -2711 73 462 -1266
13488 -1266 -882 -1325 -1506 -998 -1670 -789 -1459 515 1021 -472 208 325 -292 2085 -827 -29 2278 590
13506 590 3486 1595 548 3297 960 397 2026 2050 1871 1610 3318 1351 1927 231 1019 1742 796
13523 796 409 383 338 -1657 42 -1578 -106 -1669 -98 -1570 -1883 -3537 -1668 -1576 -2309 -1975 870
13540 870 -2922 715 -1793 -2276 -1297 -1776 -1296 -1806 -1355 -1859 -834 -1264 -684 -168 196 2014 179 588
13558 588 641 1204 365 441 1053 1525 1996 1410 -861 1290 1295 906 3510 1923 2391 252 1445 229 338
13577 338 436 2515 -338 1090 297 30 -1538 -981 -3434 -785 -1222 -1873 -686 -14 -2804 -618 -927
13594 -927 -2727 -515 -669 -1526 192 -2980 -2520 -737 -1972 -674 -3632 859 -1324 100 -86 -73
13610 -73 -1096 2065 420 -290 35 234 1462 1122 240 559 1510 449 723 2178 1929 -493 3284
13627 3284 2040 2454 1537 1678 -341 2364 2744 1909 341 -151 -781 -861 -370 -1469 97 618 -921
13644 -921 -621 -479 -1788 -1258 -2181 -672 -2288 -313 -632 -4095 -1103 -2580 -1658 -2029 -1857 -2479 646
13661 646 -929 -1262 436 -94 -1892 -928 763 1337 -44 -61 794 1596 -561 2435 1773 1889 1701 1297
13679 1297 1414 1776 3487 641 889 2629 1526 2248 624 823 3200 -438 1120 -25 2246 823
13695 823 -687 -1584 -1396 349 -2572 -606 -1933 -1047 -2289 -796 -2952 -1233 -1987 -3476 -2197 -4911
13711 -4911 -1106 -1880 -2082 -880 -1610 -2456 -357 -1319 -1098 -1714 1227 225 1010 -662 -83 913 -333
13728 -333 3398 2510 466 2483 3032 2278 3956 1949 1735 2276 -358 210 1611 1382 3132 1562 3103
13745 3103 1020 1277 -52 1257 -16 -2487 177 -270 -2677 -463 -975 -1217 -2149 -2483 -1309 -3644
13761 -3644 -3253 -2622 -1875 -2988 -3053 76 -1821 -2842 -888 -634 -1774 -204 -1085 -1027 -699 -1697 809
13778 809 591 855 475 -432 1713 451 1964 876 1857 909 1885 1183 1763 3361 127 1527 2501
13795 2501 2611 1245 2217 2751 2854 1983 706 860 1509 1468 -352 526 278 -214 -739 -1820 494 -2882
13813 -2882 -912 -1554 -2515 -1113 -2855 -2080 -2412 -3689 -1063 -757 -1268 -1494 -2424 -1101 -1432 -982 -790
13830 -790 -2550 -1055 1444 -1234 -337 -1283 2033 604 3516 1029 639 2627 2774 2084 2067 1720 3126
13847 3126 3158 999 545 1840 1735 2289 3358 -364 102 1773 2637 1405 333 1873 -794 -1033 -341
13864 -341 745 -3221 508 -1011 -1146 -2717 -3092 -1857 -1587 -2986 -932 -1023 -199 -2711 -2986 -1215 -1845
13881 -1845 -2054 -2344 -877 -122 -2697 -624 -379 -1283 516 985 -22 -1962 1375 -726 -226 1355
13897 1355 2366 1050 1012 2216 -305 2338 1356 415 914 957 903 2704 2636 1330 551 1730 1805 1405
13915 1405 1546 -1693 579 -751 -514 782 -1383 -1741 -755 -1769 -2228 -1209 -2093 -3459 -3031 -520
13931 -520 -839 -618 -2909 -1729 -2044 -1067 -201 -2444 -604 -1361 -178 -294 -225 932 -785 977 101
13948 101 1543 1180 15 815 2020 -786 613 940 671 143 473 1661 -919 1869 2688 639 1750
13965 1750 1725 907 -1415 1162 -264 529 364 571 81 -1321 -2608 -758 -1637 -963 -632 -364 359 773
13983 773 -400 -476 -1465 -151 -1807 115 468 -1879 -1847 -2406 -2876 -1225 -1233 -1571 -538 -1687 -684 -1852
14001 -1852 -1373 -2070 -189 672 50 216 2114 1515 1470 2945 1096 1774 3826 3841 1369 1892 1856 1520
14019 1520 1372 3317 1752 2370 1331 1120 -13 -380 1295 932 796 523 -733 -1909 271 -390 25
14036 25 -191 -1187 -2164 -1183 -1418 -3665 -2255 -1319 -1942 -1208 -1417 -1400 -1700 -657 -1018 -2732 -196 -2061
14054 -2061 -663 912 -1986 13 -1121 -1700 -351 -726 1414 -20 663 1383 669 1792 2147 2598
14070 2598 -1073 1267 2487 1021 1200 2661 2642 2516 907 2375 1927 153 2308 2157 -602 726
14086 726 -1462 -779 -2291 -1382 -505 -732 -2424 -3120 -816 -1870 988 -4072 -6 -2048 -1972 -1038 -2953
14103 -2953 -2993 -951 -1996 -1393 -1006 -736 -2211 -250 256 -1230 -206 -346 1463 1188 153 1123 474
14120 474 921 2028 3236 -795 2427 283 2473 389 1583 2660 1473 2492 790 3458 3229
14135 3229 725 3102 1798 -1611 2617 -54 -621 1003 1987 503 -1570 -2480 -590 -629 -1278 -995
14151 -995 -1175 -426 -2466 -3348 -1212 -2081 -2775 -2527 -1883 -860 -1573 -1748 -3373 -1349 -1291 -658 -20 -744
14169 -744 262 -564 -1822 1569 -81 764 2939 2980 302 773 438 2943 2817 623 111 2749 3742
14186 3742 -145 3150 561 3099 -403 2909 394 1999 854 -5 1448 781 1084 1403 79 -1119
14202 -1119 339 -1432 822 -984 491 -1849 -1667 -639 -2193 -1725 -2581 -1077 -1823 -1144 -1781 -1418
14218 -1418 -1899 -3464 600 -855 -1034 -1306 -1691 601 -713 -285 -2239 -430 1033 78 1625 -501
14234 -501 1713 1604 -220 1451 3809 2452 2870 456 2826 940 -227 1636 463 577 1356 701
14250 701 2119 -742 821 1407 -680 1528 -530 -409 808 148 134 -622 1032 520 -545 -494 -1898
14267 -1898 -1839 -2347 -1097 -2914 -2242 367 -1906 -3404 473 -1787 -321 853 -413 -188 -2183 -1459
14283 -1459 288 681 744 -718 -119 1136 1565 2082 2813 1800 1847 1535 1573 2781 619 2419 1002 4821
14301 4821 1449 48 1287 779 1189 1303 2171 610 -347 240 -1598 1190 -593 -381 979 -485
14317 -485 1105 -2727 -1828 -521 -2654 -1838 -2170 -2251 -2079 200 -2101 -2104 -3249 -832 -2525 -1840 -2183 60
14335 60 -2772 1106 -654 -1530 -366 199 1289 -680 478 1658 1139 922 1112 2319 2571 282 3841
14352 3841 588 1760 1010 835 2853 2945 2385 1649 1376 1619 1299 556 2062 689 681 1320 -400 -238
14370 -238 -490 -794 -1562 -1809 -1060 -1670 -2581 -2166 -2805 -1589 -603 -1111 -4663 -2691 -1557 -2303 -78 -1118
14388 -1118 -794 -1687 -1085 1412 -577 -1610 -289 980 -793 4066 -1209 714 2832 2575 729 1693
14404 1693 548 968 910 202 1881 2320 2267 1552 1800 2811 2129 3939 1840 1507 2521 862 -349
14421 -349 -691 1420 602 1028 -241 1252 1591 -1522 -1217 -753 -837 106 -2384 463 -1048 -1443 -2258 -2245
14439 -2245 -3458 -1979 -894 -1163 -1207 -1904 -311 -2254 -1826 -1275 -1286 -1517 -547 -381 -801 -793 1221 995 213
14458 213 2200 1473 658 3277 3119 1455 2019 742 2126 2529 4183 2006 345 2168 2241 896 2008
14475 2008 1190 22 -1544 145 1261 -1181 -1140 -1035 -361 1075 -1644 -1983 -3055 -2244 -722 -4231
14491 -4231 -895 -1628 -969 -1741 -1958 -1411 -870 -891 -576 -1951 -2227 -1079 -362 -1008 -653 966 866 -2174
14509 -2174 -873 -303 390 1243 -580 2562 3514 2722 2255 1449 881 -306 2598 1295 1590 2099 1953
14526 1953 -1406 1850 2000 1395 1211 1563 3084 162 1293 -191 572 -265 -1610 -906 201 -1030
14542 -1030 -2320 -513 -2294 -1361 -1887 -2537 -1404 -2155 -2434 -2593 -2813 -1402 -2006 98 -198 -1960 838
14559 838 -2037 516 -2537 1298 343 21 231 2094 -1711 120 555 485 1846 -474 1985 1447 2228
14576 2228 998 3012 1024 2735 -113 1721 2005 1711 -506 1230 1558 1230 1449 -608 799 153
14592 153 456 1722 -1607 844 -971 -1338 -1097 -2350 -677 -3134 -503 -2228 -1542 -2886 -3165 -210
14608 -210 -3173 -2665 -1790 -335 -1230 -2136 -794 -469 218 -249 -925 229 -268 106 -386 -92 98 1031
14626 1031 1555 1190 -1484 2002 403 1735 2241 2893 377 1909 924 857 1727 1105 2631 2775 2779 753
14644 753 1779 474 1915 1883 1300 -295 -202 -1899 -2414 236 -889 -1739 -1100 -597 -2005 -1462 -2331 -1163
14662 -1163 -1266 1686 -1341 -2279 -632 -763 -1711 -879 -493 -1399 -2512 -968 -247 -344 -242 1257 1077 -120
14680 -120 1352 971 192 960 1339 1338 1610 705 1832 366 3432 96 1560 -17 218 228 1638 945
14698 945 2099 -866 1542 2484 80 -55 -2452 309 -170 855 -1330 -1820 1130 -2311 159 -1846
14714 -1846 -2154 -1377 -976 -546 -2445 -3219 -2466 -2977 -2162 -3090 -1698 -1794 -2823 -431 -1382 -917 44 905
14732 905 -2035 -1455 1666 2074 -65 1068 1643 1429 721 2667 1432 761 542 1293 1859 1237 444 2429
14750 2429 1432 856 2146 1991 2175 944 1994 930 1280 640 -139 -974 408 -841 385 -1329 -563
14767 -563 -344 -656 -1073 -1478 -1177 -2869 -1397 -2612 -26 -2678 -1721 -1171 -2225 -1215 -2650 -2543 -2565
14784 -2565 -2989 -549 -112 -1643 -669 749 441 405 244 718 508 694 891 620 1509 -526 1924 -571
14802 -571 878 1475 1786 1558 1820 379 1425 341 1912 1789 1523 2524 443 -678 101 -112 -890
14819 -890 1252 296 -1318 -463 -2980 -1767 -819 -365 -2028 -1171 -433 -1081 -1275 -804 -752 -1784 -3052 -1500
14837 -1500 -493 -1350 -2096 33 -17 483 -330 273 -1507 1194 801 -300 3966 92 -703 2180 570
14854 570 2140 534 11 2829 1277 4543 2190 2721 2352 2223 1281 1671 2412 1573 -593 2130 600
14871 600 1050 118 158 1453 -796 171 -960 -947 -2678 -690 -1807 -354 -1380 -1919 -350 -773 -2417
14888 -2417 -2372 -2960 -3550 -1569 -3497 -898 -3045 -1657 -1308 -650 -2396 219 -2101 58 -391 -1288 -229
14905 -229 365 1730 -616 121 -94 1912 973 423 15 542 2170 2720 1240 633 717 1388 3627 63
14923 63 557 1194 2359 1763 -393 -350 1137 1282 504 -594 169 869 -380 -2671 -163 -589 -1456 -3579
14941 -3579 -3795 -1715 -2042 -3160 -1891 -3480 -2856 -2351 -288 -169 -2230 -1599 -1342 557 421 -778 35
14958 35 -452 -645 -686 878 488 1627 -875 233 2794 1153 1825 1326 604 2783 2853 1442 673 1647
14976 1647 1228 1891 419 1853 776 424 438 39 486 443 292 1482 5 266 -1507 -1743 -510 -1940
14994 -1940 -917 -1607 -1093 -1755 -2240 -848 -2490 -2189 -1732 -2597 -3570 -1866 313 -643 119 -1180 -1509
15011 -1509 211 -96 -78 -2 605 -108 1304 698 -1394 -425 3045 2596 509 897 1782 1149 1969 2219
15029 2219 2876 2220 1690 2234 1411 832 1387 1815 1970 1461 -189 -1861 484 895 45 35 1424 -1746
15047 -1746 1308 -1178 -1186 -1140 354 -3080 -309 -3265 447 -1785 -1397 -2107 -1510 -2033 -726 -3078 -872
15064 -872 -1702 166 -43 -2467 794 -1132 -310 -208 417 315 394 1870 2112 1186 172 1313 2395
15081 2395 859 1797 1735 3195 3135 937 1774 3783 1105 3041 1613 -515 920 1044 1129 -250 2156
15098 2156 685 226 771 1931 -2955 -1165 -157 -1908 -2001 -339 -1473 -3947 -2823 -2368 -2216 -2224 -1516
15115 -1516 -3054 -2488 -433 -1411 -1285 365 -2400 -1056 703 -2231 -1342 677 238 -883 358 561
15131 561 491 883 1340 2604 284 1182 1707 2593 564 239 -151 331 1971 2482 657 2045 126 2752
15149 2752 1452 1311 456 1191 -994 -140 2010 30 699 -2078 -187 1358 -2760 -1191 -1805 -364
15165 -364 -1826 -292 -1089 -3157 131 -1624 -460 -1921 -1406 -2408 -787 -809 -896 -674 -1193 755 421
15182 421 -942 2089 -620 -579 1292 1522 748 621 -395 -528 2489 1073 931 1998 2451 1048 3550
15199 3550 1034 2153 2123 -151 1190 -227 1496 -320 2213 -365 830 692 306 383 -869 -1500
15215 -1500 -1779 -2426 -1658 -1985 254 -711 -3151 -908 -1307 -1168 -2061 -1426 -297 -1097 -1084 -3291 -1611 -738
15233 -738 552 -1407 -1688 483 -474 -752 -2281 978 -112 1738 -837 -298 1518 1577 1652 828 -291
15250 -291 2298 1362 738 1316 281 2227 1750 1890 -336 2486 184 2607 1456 -1125 588 -25
15266 -25 -496 1105 -584 -407 403 -353 -1377 -842 -1083 -2241 -1807 -575 -651 -2675 -2531 -1555 -2733 -1558
15284 -1558 -3173 -1534 -1454 -2414 -1774 -462 -2201 -710 671 561 -1197 -598 404 882 269 578 1744
15301 1744 102 -717 1236 30 2002 1435 1525 1339 892 633 1884 258 2419 1989 2597 643 1518
15318 1518 1720 -73 698 2335 1254 1918 -352 -813 357 -147 -1684 -784 -2292 -703 -2129 -1739
15334 -1739 -1740 -2129 -1377 -2257 -678 -2749 -2419 -2482 -760 -2360 -2184 -850 -1211 -1144 -1224 -878 -1157 -763 1258
15353 1258 -1029 1977 700 -379 1701 811 1440 1963 3250 1237 1373 226 2941 -351 1474 2747
15369 2747 1465 300 -72 2451 104 1854 333 2812 -128 -331 605 236 471 -1086 174 -86
15385 -86 -2829 -1781 -3548 -1983 -2384 -1173 -2234 -965 -1341 -1859 -1671 -578 -1235 -638 -1350 436 -1483
15402 -1483 -648 -1086 1041 -1750 473 601 697 26 871 848 790 1176 1061 791 1229 1857 1607 1237 2377
15421 2377 -104 598 2217 1317 2755 2285 -159 -41 1943 -368 986 2035 599 -476 719 -1516
15437 -1516 -1198 411 -674 349 -1165 -1600 -707 -972 -681 -1608 -2537 -1482 -442 -2906 -1073 -325 90
15454 90 -2432 -287 -1399 315 -708 -642 -843 1728 -639 -2917 -181 -682 1695 2505 511 1599
15470 1599 2547 -16 591 2434 -1397 2002 2356 1369 1163 1520 2006 2388 1582 1422 4008 566 991
15487 991 1823 145 1398 -1823 622 -1463 -94 -1300 -376 431 -1454 -2557 -2781 -452 -1561 -872
15503 -872 -703 -2584 -1759 -1911 -2304 -1702 -1218 -1349 -2380 -1976 -1571 -2121 8 -2118 -117 941 -225
15520 -225 -374 364 153 -1500 1067 2111 1279 1025 1306 482 1685 2203 1271 1157 2175 1285 2041 1745
15538 1745 2185 2676 224 2622 449 1649 -898 673 1038 560 899 645 -124 -1310 -130 -210 -2187
15555 -2187 -561 -2092 -1208 -1528 -1011 -1163 -1958 -952 -916 -2341 -1594 -2738 197 -822 -2043 -796 -1104
15572 -1104 -592 776 469 1830 61 -151 -1268 -354 -915 701 2062 1142 2408 2711 48 1859
15588 1859 649 2644 1691 1082 1674 1532 932 1142 1947 2336 926 1380 2 -741 914 -25 -1335
15605 -1335 137 156 -1610 -1927 -2516 -673 -507 -1756 -1626 -978 -2100 -636 -1302 -1238 -1641 -313 -2311
15622 -2311 -2452 -2 -346 -227 -2332 247 -548 591 -1776 869 644 -916 448 -894 3957 306
15638 306 1379 -516 1386 2351 610 2226 682 1704 645 2215 1416 2122 2427 3089 1074 424
15654 424 1347 37 215 369 1682 682 626 -543 -132 -499 -1575 -447 -1982 -216 -1032 -592 -744
15671 -744 -2234 -1331 -1149 -1769 -2291 -2030 -1643 -1243 -237 -1641 -1290 433 -1284 67 -168 -56 -1438
15688 -1438 1262 -78 -1574 -911 1931 1062 437 1147 965 3005 1098 2880 1741 1068 2092 1680
15704 1680 1856 1422 997 2346 932 1504 943 1160 1670 624 2021 668 1270 -864 573 104 -900
15721 -900 1898 -1436 -1429 -1492 -881 -736 -2349 -3090 -734 -2932 -1205 -1541 -1269 -70 -1546 -667 -2017 -2191
15739 -2191 -1992 -798 -656 297 -474 -795 -1161 -681 1603 24 478 1599 2556 1469 1889 -261 1019
15756 1019 369 1891 1559 315 -716 420 1604 1554 1367 2665 2083 418 1932 1427 1407 -200 -555
15773 -555 990 658 -1305 -561 264 -2224 -368 -161 -447 -582 -1945 -3648 -737 -2194 -2160 -2774 -412
15790 -412 -3987 -1726 -1542 -3600 -1983 -2450 -2308 -900 -1339 1364 139 -1383 -859 970 1539 -1348
15806 -1348 -1511 46 508 210 1563 -31 917 487 1638 2934 2026 318 1790 1332 2089 1426 1670
15823 1670 687 1303 631 1839 1351 -186 969 287 -423 -874 -613 -197 -529 162 74 -1830 -2477 -370
15841 -370 -1466 -1228 -345 -2388 -2204 -324 -1735 -738 -1012 -1030 -1198 -1419 19 -944 702 -908 140
15858 140 1311 -281 344 986 1194 -684 1732 425 2407 1480 2218 610 2083 2616 2846 430 293
15875 293 -405 -534 1762 909 1913 389 1566 287 -1678 223 -1050 661 -1104 -882 -1542 -467
15891 -467 891 -1535 -156 -590 -2493 -3347 -1405 -2395 -1681 -1887 -1525 -1438 -1055 -1270 -926 -2851 -737 -657
15909 -657 -809 -1511 -156 609 -619 713 2055 -1057 -333 1122 1650 -398 1721 2508 1728 1736 1619 2856
15927 2856 312 11 -1304 270 3318 1514 1626 1418 2856 429 925 1820 223 352 123 601 -1537
15944 -1537 -319 331 567 -431 -397 -910 -1801 -1719 -1055 -2672 -2643 -2982 -2218 -2976 -882 -2261 -2506 -1403 -2129
15963 -2129 -400 -1334 -82 80 -678 -209 -3089 1157 575 1757 34 -944 563 863 1048 177 927
15980 927 125 2935 751 732 1443 1198 1824 2088 455 2352 1295 1210 3118 -377 869 -1192 1758
15997 1758 264 870 -376 349 -1450 219 -1389 -29 -1828 -1532 -392 -1448 -1444 -1044 -2230 -968
16013 -968 -934 -1823 -963 -1146 -2154 -346 -1752 -1977 -503 -1001 -3035 -1000 826 1147 377 2316 570
16030 570 1693 2586 223 -82 1236 853 1677 1252 1536 1289 739 2448 871 1510 1026 2371 121
16047 121 979 2347 1387 2306 1034 444 -1110 1393 920 -318 1374 435 -284 -1818 -1033 -804 -2679
16064 -2679 -401 721 -1737 -2229 -2864 -453 -494 -1810 -732 -1691 -1344 -1371 291 -218 20 -1255 258
16081 258 672 -1955 1485 305 706 -711 -584 3184 2064 2199 2064 2660 1403 1344 1519 713 1288 2000
16099 2000 1313 -277 2074 550 837 2423 1338 -592 -1060 -680 211 -1538 894 441 -1578 -1993
16115 -1993 -1828 -82 36 35 -1800 -879 -1895 348 -2174 -1029 -2307 -382 -1929 -1607 -2001 -50 -1088
16132 -1088 -371 -394 -1768 -714 870 92 117 -741 1576 39 2356 824 2157 2064 259 1384 1778
16149 1778 534 465 1945 1255 1763 690 1535 1098 990 -198 3044 2543 733 2063 -533 633 175
16166 175 496 -1088 850 -525 -844 -970 2 -1826 -1035 -843 -2647 -2415 95 -1190 -2458 -2624 -2013
16183 -2013 -2960 -1559 -331 -2477 -766 -733 -2736 -1731 -999 -1355 -1240 -136 -384 2048 1314 1684 2334
16200 2334 486 843 2076 1817 954 708 2340 39 1885 1145 1299 1501 2444 1293 431 1402 861
$$ [...]
16383c32
##END NTUPLES=NMR FID
##END=
