##TITLE=31Pdec_LY-TMF-13.24.R.t
 D2O, 24 sc
 4.3.2020
##JCAMPDX= 6.0         $$ Bruker NMR JCAMP-DX V2.0
##DATA TYPE= NMR SPECTRUM
##DATA CLASS= NTUPLES
##ORIGIN= UXNMR, Bruker Analytische Messtechnik GmbH
##OWNER= root
$$ XWIN-NMR		Version 3.5
$$ Wed Mar  4 14:51:02 2020 Russian Standard Time (UT+4h)  she@DPX200
##.OBSERVE FREQUENCY= 81.013821
##.OBSERVE NUCLEUS= ^31P
##.ACQUISITION MODE= SIMULTANEOUS
##.ACQUISITION SCHEME= undefined
##.AVERAGES= 24
##.DIGITISER RES= 17
##SPECTROMETER/DATA SYSTEM= spect
##.PULSE SEQUENCE= zgpg30
##.SOLVENT NAME= CDCl3
##.SHIFT REFERENCE= (INTERNAL, CDCl3, 0, 182.463)
##AUDIT TRAIL= $$ (NUMBER, WHEN, WHO, WHERE, WHAT)
$$ ##TITLE= Audit trail, XWIN-NMR		Version 3.5
$$ ##JCAMPDX= 5.01
$$ ##ORIGIN= Bruker BioSpin GmbH
$$ ##OWNER= she
$$ F:/spectra/data/she/nmr/P31/1/pdata/1/auditp.txt
$$ ##AUDIT TRAIL=  $$ (NUMBER, WHEN, WHO, WHERE, WHAT)
(   1,<2020-03-04 14:50:05.95 +0400>,<she>,<DPX200>,
      <created by zg, POWCHK disabled, PULCHK disabled
       configuration hash MD5:
       00 E9 B6 7A A2 85 ED C7 34 08 36 98 17 FE 4E 26
       data hash MD5: 32K
       6F DB 26 21 95 53 D5 AD 77 AC DD F4 22 7F 12 E3>)
(   2,<2020-03-04 14:50:08.60 +0400>,<she>,<DPX200>,
      <Start of raw data processing
       efp BC_mod = 2 LB = 1 FT_mod = 6 PKNL = 1 PHC0 = -1321.407 PHC1 = 73.8017 SI = 64K 
       data hash MD5: 64K
       AD 33 AF 0D 1A 28 4A 3F 2C 11 E7 DB 07 62 59 4D>)
(   3,<2020-03-04 14:50:20.06 +0400>,<she>,<DPX200>,
      <pk PHC0 = 5.965533 PHC1 = 0 
       data hash MD5: 64K
       DB 23 16 5C 55 DB 69 4E CF DD 49 9F 3D EC BC 3E>)
(   4,<2020-03-04 14:50:26.95 +0400>,<she>,<DPX200>,
      <abs ABSG = 5 
       data hash MD5: 64K
       6E 26 79 44 1D D8 4F 57 2F B4 1D 4F 74 36 D2 B6>)
$$ ##END=
$$ 
$$ hash MD5
$$ 4A 16 F5 A7 48 F3 E9 7E AA 2F 34 2D 82 7C 5F 5B
##$RELAX= 
##$RELAX= 
##$RELAX= 
##$RELAX= 
##$RELAX= 
##$RELAX= 
##$RELAX= 
##$RELAX= 
$$ Bruker specific parameters
$$ --------------------------
##$DU= <F:/spectra>
##$EXPNO= 1
##$NAME= <P31>
##$PROCNO= 1
##$TYPE= <nmr>
##$USER= <she>
##$AMP= (0..31)
100 100 100 100 100 100 100 100 100 100 100 100 100 100 100 100 100 100 
100 100 100 100 100 100 100 100 100 100 100 100 100 100 
##$AQSEQ= 0
##$AQ_mod= 1
##$AUNM= <au_zg>
##$AUTOPOS= <>
##$BF1= 81.014009
##$BF2= 200.13
##$BF3= 200.13
##$BF4= 200.13
##$BF5= 200.13
##$BF6= 200.13
##$BF7= 200.13
##$BF8= 200.13
##$BYTORDA= 1
##$CFDGTYP= 0
##$CFRGTYP= 5
##$CHEMSTR= <none>
##$CNST= (0..31)
1 1 145 1 1 1 1 1 1 1 1 1 1 1 1 1 1 1 1 1 1 1 1 1 1 1 1 1 1 1 1 1 
##$CPDPRG= <waltz16>
##$CPDPRG1= <>
##$CPDPRG2= <waltz16>
##$CPDPRG3= <>
##$CPDPRG4= <mlev>
##$CPDPRG5= <mlev>
##$CPDPRG6= <mlev>
##$CPDPRG7= <mlev>
##$CPDPRG8= <mlev>
##$CPDPRGB= <>
##$CPDPRGT= <>
##$D= (0..31)
0 1 0 0 0 0 0 0 0 0 0 0.03 2e-05 3e-06 0 0 0 0 0 0 0 0 0 0 0 0 0 0 0 0 
0 0 
##$DATE= 1583319005
##$DBL= (0..7)
120 120 120 11 120 120 24 19 
##$DBP= (0..7)
150 150 150 150 150 150 150 150 
##$DBP07= 0
##$DBPNAM0= <>
##$DBPNAM1= <>
##$DBPNAM2= <>
$$ [...]
##$SUBNAM3= <"">
##$SUBNAM4= <"">
##$SUBNAM5= <"">
##$SUBNAM6= <"">
##$SUBNAM7= <"">
##$SUBNAM8= <"">
##$SUBNAM9= <"">
##$SW= 369.568048894756
##$SWIBOX= (0..15)
0 1 3 0 0 0 0 0 0 0 0 0 0 0 0 0 
##$SW_h= 29940.119760479
##$TD= 32768
##$TD0= 1
##$TE= 0
##$TE2= 300
##$TE3= 300
##$TEG= 300
##$TL= (0..7)
0 120 53 12 22 120 120 120 
##$TP= (0..7)
150 150 150 150 150 150 150 150 
##$TP07= 0
##$TPNAME0= <>
##$TPNAME1= <>
##$TPNAME2= <>
##$TPNAME3= <>
##$TPNAME4= <>
##$TPNAME5= <>
##$TPNAME6= <>
##$TPNAME7= <>
##$TPOAL= (0..7)
0.5 0.5 0.5 0.5 0.5 0.5 0.5 0.5 
##$TPOFFS= (0..7)
0 0 0 0 0 0 0 0 
##$TUNHIN= 0
##$TUNHOUT= 0
##$TUNXOUT= 0
##$USERA1= <user>
##$USERA2= <user>
##$USERA3= <user>
##$USERA4= <user>
##$USERA5= <user>
##$V9= 5
##$VALIST= <valist>
##$VCLIST= <CCCCCCCCCCCCCCC>
##$VD= 0
##$VDLIST= <DDDDDDDDDDDDDDD>
##$VPLIST= <PPPPPPPPPPPPPPP>
##$VTLIST= <TTTTTTTTTTTTTTT>
##$WBST= 1024
##$WBSW= 4
##$XGAIN= (0..3)
0 0 0 0 
##$XL= 0
##$YL= 0
##$YMAX_a= 9077
##$YMIN_a= -17211
##$ZGOPTNS= <>
##$ZL1= 120
##$ZL2= 120
##$ZL3= 120
##$ZL4= 120
##$ABSF1= 182.463
##$ABSF2= -187.1042
##$ABSG= 5
##$ABSL= 3
##$ALPHA= 0
##$AQORDER= 0
##$ASSFAC= 0
##$ASSFACI= 0
##$ASSFACX= 0
##$ASSWID= 0
##$AUNMP= <proc_1d>
##$AZFE= 0.1
##$AZFW= 0.5
##$BCFW= 0
##$BC_mod= 2
##$BYTORDP= 0
##$COROFFS= 0
##$CY= -3
##$DATMOD= 1
##$DC= 0
##$DFILT= <>
##$DTYPP= 0
##$F1P= 0
##$F2P= 0
##$FCOR= 1
##$FTSIZE= 65536
##$FT_mod= 6
##$GAMMA= 0
##$GB= 0
##$INTBC= 1
##$INTSCL= 5.30512e-09
##$ISEN= 30
##$LB= 1
##$LEV0= 0
##$LPBIN= 0
##$MAXI= 10000
##$MC2= 0
##$MEAN= 0
##$ME_mod= 0
##$MI= 50
##$NCOEF= 0
##$NC_proc= -5
##$NLEV= 6
##$NOISF1= 182.463
##$NOISF2= 159.3651
##$NSP= 0
##$NTH_PI= 0
##$NZP= 0
##$OFFSET= 182.463
##$PC= 4
##$PHC0= -1315.441
##$PHC1= 73.8017
##$PH_mod= 1
##$PKNL= yes
##$PPARMOD= 0
##$PSCAL= 0
##$PSIGN= 0
##$REVERSE= no
##$SF= 81.0140089999434
##$SI= 65536
##$SIGF1= 159.3651
##$SIGF2= -187.1042
##$SINO= 113.3802
##$SIOLD= 16384
##$SREGLST= <1H.CDCl3>
##$SSB= 0
##$STSI= 65536
##$STSR= 0
##$SW_p= 29940.119760479
##$SYMM= 0
##$S_DEV= 0
##$TDeff= 32768
##$TDoff= 0
##$TI= <>
##$TILT= no
##$TM1= 0
##$TM2= 0
##$TOPLEV= 0
##$USERP1= <user>
##$USERP2= <user>
##$USERP3= <user>
##$USERP4= <user>
##$USERP5= <user>
##$WDW= 1
##$XDIM= 65536
##$YMAX_p= 422842781
##$YMIN_p= -5747954
$$ End of Bruker specific parameters
$$ ---------------------------------
##NTUPLES= NMR SPECTRUM
##VAR_NAME=  FREQUENCY,     SPECTRUM/REAL,   SPECTRUM/IMAG
##SYMBOL=    X,             R,               I
##VAR_TYPE=  INDEPENDENT,   DEPENDENT,       DEPENDENT
##VAR_FORM=  AFFN,          ASDF,            ASDF
##VAR_DIM=   65536,         65536,           65536
##UNITS=     HZ,            ARBITRARY UNITS, ARBITRARY UNITS
##FACTOR=    0.456856943014862, 1,           1
##FIRST=     14782.0589164792, 0,            0
##LAST=      -15158.0608439998, 0,           0
##MIN=       -15158.0608439998, -5747954,    0
##MAX=       14782.0589164792, 422842781,    0
$$ Real data points
##PAGE= N=1
##DATA TABLE= (X++(R..R)), XYDATA
$$ [...]
36792a087392K12557j9349k7869j66890m66712m25721J09103N08173K74651j43061
$$ -1087392 -874835 -894184 -922053 -1088943 -1555655 -1981376 -1872273 -1364100 -1089449 -1232510
36782a232510l9572M57096O51065L74747J23595J92247L13799J79123j90957n97150
$$ -1232510 -1272082 -814986 -163921 210826 334421 526668 840467 1019590 828633 231483
36772B31483p73271m52228K40712O48365L46873j99045l46336k77865m63039n02888
$$ 231483 -541788 -994016 -753304 -104939 241934 42889 -303447 -581312 -1044351 -1547239
36762a547239K88602J314694J164599j52369r69702m76778Q7197l74582r40172
$$ -1547239 -1258637 56057 1220656 1068287 98585 -378193 -290996 -665578 -1605750
36753a605750l02023R29227J151702K28989n77068o36708l80062l3777N29601
$$ -1605750 -1907773 -978546 173156 402145 -174923 -811631 -1191693 -1225470 -695869
36744f95869Q43143K76901n66379l75727P74769J313185N14707m21255k33851
$$ -695869 147274 424175 -142204 -517931 256838 1570023 2084730 1663475 1429624
36735A429624O36218R02978J94807p76864j234670r57070k83086J76120J55724
$$ 1429624 2065842 2968820 3163627 2386763 1152093 195023 -88063 88057 243781
36726B43781P7698L20002M15632j93575q77601m85043P38363J247061M50148m95619
$$ 243781 321479 641481 1057113 863538 -14063 -499106 239257 1486318 1936466 1440847
36716A440847n75237k25148j28713n2052K69922L21354j14349j77382O19542J156147
$$ 1440847 865610 640462 511749 459697 729619 1050973 936624 759242 1378784 2534931
36706B534931K51015j300782j682101o38537L01737J11317n02601m01545L83639
$$ 2534931 2785946 1485164 -196937 -835474 -533737 -422420 -925021 -1326566 -942927
36697i42927Q31865L04397o43464q97868k08687L84185J987o36276k26474R23053
$$ -942927 -111062 193335 -450129 -1347997 -1556684 -1172499 -1170512 -1806788 -2033262 -1110209
36687a110209J150487L6975r21415p63310l90801n36909l01623Q47923J420773
$$ -1110209 40278 77253 -844162 -1607472 -1998273 -2535182 -2836805 -1988882 -568109
36678e68109K10268j225374p29728Q91445J077053l63790j107733j83993P95749
$$ -568109 -357841 -1583215 -2312943 -1421498 -344445 -708235 -1815968 -1999961 -1204212
36669a204212O80415M16183P60309P15947m60403j582163j321292k54852K56534
$$ -1204212 -523797 -107614 652695 1368642 908239 -673924 -1995216 -2250068 -1993534
36660a993534R7083L278Q8480K1487k9236K44634N31004M22832J87962K30727
$$ -1993534 -1896451 -1893173 -1804693 -1783206 -1812442 -1567808 -1036804 -613972 -426010 -195283
36650a95283L38623J85341n375J4427l3999k92001k51379L25185O87662J89027
$$ -195283 143340 328681 323306 337733 303734 11733 -239646 85539 773201 962228
36640I62228n55085n66963j7731J90506p9493j94287L1632J59243N0868J8342
$$ 962228 407143 -159820 -177551 12955 -66538 -260825 -229193 -69950 -19082 -740
36630g40P3605j01424m01374l03400K69547P60124P66139M62319J61335m1065
$$ -740 72865 -28559 -429933 -733333 -463786 296338 1062477 1524796 1686131 1645066
36620A645066j29296j22716j83207l83220m47577j33516K82308L64651J77368
$$ 1645066 1515770 1393054 1209847 826627 379050 245534 527842 892493 1069861
36611A069861L0270k03136p84984j268023q64619K15781P28816Q5858p41813o07157
$$ 1069861 1100131 896995 112011 -1156012 -2020631 -1804850 -1076034 -990176 -1731989 -2339146
36601b339146K02039N37662J40451j34862K36172P02182N90947O5495l28721n08268
$$ -2339146 -2137107 -1599445 -1458994 -1593856 -1357684 -655502 -64555 940 -327781 -836049
36591h36049o53098n69102Q506O46131N66757j37080m48870J07845P11282M67598
$$ -836049 -1489147 -2058249 -2049743 -1403612 -836855 -973935 -1422805 -1314960 -603678 -136080
36581a36080k68398n14266j02539L35333N00905O28295O89600L38371k92629n89370
$$ -136080 -404478 -918744 -1021283 -685950 -185045 443250 1132850 1471221 1178592 589222
36571E89222m01368k11292k11147l4891L49595L57546j81729n16152p3577N73468
$$ 589222 187854 -23438 -234585 -269476 80119 437665 255936 -260216 -333793 239675
36561B39675N00459k66538q66474p33418j10006L58050K01859m52509q39371k96594
$$ 239675 740134 473596 -392878 -1126296 -1236302 -878252 -676393 -1128902 -1968273 -2264867
36551b264867P82700J264184P52679J01687R5492L59888J52526m30291p66646
$$ -2264867 -1482167 -217983 534696 636383 731875 1091763 1244289 813998 47352
36542D7352p23107n89711l74879P5617N15735N65359L58760L03813L73030K24233
$$ 47352 -675755 -1265466 -1640345 -1564728 -1048993 -483634 -124874 178939 551969 776202
36532G76202j43902m21794n15024n19183l50341Q4740N24560O37695M80566K57943
$$ 776202 632300 210506 -304518 -823701 -1174042 -1089302 -564742 72953 553519 811462
36522H11462o9205m85934o31408l58207j56888l71821m50023K13649J077775J077536
$$ 811462 742257 256323 -375085 -733292 -890180 -1262001 -1712024 -1498375 -420600 656936
36512F56936K30689l94587k69093K9893o1746l19308k99758L6743M66166O77555
$$ 656936 887625 493038 223945 253838 192092 -127216 -426974 -390231 75935 753490
36502G53490L00499n91025j092528m11624Q42919J257392N40761j99248k63455
$$ 753490 1053989 462964 -629564 -1041188 -198269 1059123 1599884 1400636 1137181
36493A137181k27202n55761o06687J41030Q70230N25962n10067r45811m16438
$$ 1137181 909979 354218 -252469 -111439 758791 1284753 774686 -171125 -587563
36484e87563K33924L33770Q2165j42912l05777l69244j47225K27211K55049j86441
$$ -587563 -353639 -19869 62296 -80616 -386393 -755637 -902862 -675651 -420602 -607043
36474f07043n09445k01501L92023N18950P7498k67563n6673L38251L12864p2913
$$ -607043 -1116488 -1317989 -925966 -407016 -329518 -597081 -653754 -315503 -2639 -75552
36464g5552k17087J17578M75273L75191o9875l92142l51177q7978R4772j0309
$$ -75552 -292639 -175061 300212 675403 605528 213386 -137791 -225769 -130997 -141306
36454a41306k54038j25206N98127J206753P33668n52397j166169l99397N79191
$$ -141306 -395344 -520550 77577 1284330 2017998 1465601 299432 -99965 479226
36445D79226M14784m54573o51337r9434K8426n71884p93115J4220R45507Q96382
$$ 479226 894010 439437 -211900 -311334 -282908 -854792 -1647907 -1633687 -688180 208202
36435B08202K6468p35839q74153m30912L19204Q19316N10280l17737n74876J95454
$$ 208202 234670 -501169 -1375322 -1806234 -1487030 -667714 -157434 -475171 -1050047 -854593
36425h54593J038858Q41420j74220q53684o08657J20016O12938N26592j3365n33003
$$ -854593 184265 1025685 851465 -2219 -610876 -490860 122078 648670 635305 102302
36415A02302n63344j39575K45489K88299J09413j87578n86009o86757O182J035854
$$ 102302 -461042 -600617 -355128 -66829 42584 -144994 -731003 -1417760 -1411578 -375724
36405c75724J171601J75255n86451q8528P39261M48198o51940j031673l25601
$$ -375724 795877 971132 384681 296153 1035414 1483612 831672 -200001 -525602
36396e25602L18111K16325J7775K92616N54015K83935p1023J31591O51729P76016
$$ -525602 -207491 8834 26609 319225 873240 1157175 1086152 1217743 1869472 2645488
36386B645488L52602k11690o49297r23659q43435k04667O64861R86355L59977
$$ 2645488 2998090 2786400 2137103 1213444 370009 165342 830203 1816558 2176535
36377B176535o93569j205344p47476J46949O03193L64430n1774j57197j13241
$$ 2176535 1482966 277622 -469854 -322905 280288 644718 592944 435747 322506
36368C22506l03490o00413n39596j18645J27717m0740j69812J68476O52323O52976
$$ 322506 19016 -581397 -1120993 -1239638 -1111921 -1152661 -1322473 -1153997 -501674 151302
36358A51302J97255m3766K26611M45280M3527o02451o39107j3399M25132K55265
$$ 151302 348557 304791 531402 976682 1020209 417758 -221349 -234748 190384 445649
36348D45649J37325O15544R88336L04771r38316j275626m09192L70378J88937
$$ 445649 582974 1198518 2186854 2491625 1553309 277683 -131509 238869 427806
36339D27806k17733M7039N25229L23900k98727m50538j72625k28226n67326k90272
$$ 427806 210073 257112 782341 1106241 807514 356976 184351 -43875 -611201 -901473
36329i01473P47437J448077R83776p6243o41881m76083j77932j97103l54837k10751
$$ -901473 -154036 1294041 2277817 2201574 1559693 1083610 905678 708575 353738 142987
36319A42987L75359J028131J178884O86327L570m47588p95665j253786j458630
$$ 142987 518346 1546477 2725361 3411688 3415258 2967670 2172005 918219 -540411
36310e40411r06498Q3663N73151K60970j36235R283L61284K37537l45029p27931
$$ -540411 -1446909 -1363246 -790095 -529125 -665360 -656077 -294793 -57256 -402285 -1130216
36300a130216n25642o1362J45349P0090J57212N85889Q32440L47008m53864n52730
$$ -1130216 -1655858 -1717220 -1571871 -1501781 -1344569 -758680 73760 420768 -33096 -585826
36290e85826J28340M05955l70959j081728m21549R36160J175711Q0298o45475
$$ -585826 -457486 -51531 -422490 -1504218 -1925767 -989607 186104 266402 -379073
36281c79073K19R19926P69203j48756p58958q86420r38145p29948J21068J086131
$$ -379073 -378854 541072 1310275 1161519 402561 -483859 -1422004 -2151952 -2030884 -944753
36271i44753J203481N02065o6338m4025J10864J9533j06487j07240k32950n79085
$$ -944753 258728 760793 694455 650430 761294 780827 674340 567100 334150 -244935
36261b44935p70666m98748P2100O07296Q84646O91006j9944p17192o48392J12889
$$ -244935 -1015601 -1514349 -1442249 -834953 49693 740699 720755 3563 -644829 -531940
36251e31940N78183K01598k85086j696O48180N51803l51585q93878l92798L97857
$$ -531940 46243 247841 -37245 -38941 609239 1161042 809457 -84421 -477219 -79362
36241g9362M86763K1320j80902Q3178L55583M15030M18094L15009p0682m35705
$$ -79362 407401 428721 247819 330997 686580 1101610 1519704 1834713 1764031 1328326
36231A328326k87805J32014Q6873l93140m81610o1574j15096r95824j457025m25481
$$ 1328326 1040521 1172535 1259408 866268 384658 323084 207988 -787836 -2244861 -2670342
36221b670342J155821J527362N62289l44765m87519m85212p38931p09840r3199
$$ -2670342 -1514521 12841 575130 230365 -257154 -742366 -1481297 -2191137 -2284336
36212b284336M91334N05255K71818K70352M19761M82906M83320L62700q1224n89957
$$ -2284336 -1793002 -1287747 -1015929 -745577 -325816 157090 640410 1003110 921886 331929
36202C31929n03188K18343P28837M26334l00866p50913o45050M0731J150397J950580
$$ 331929 -171259 47084 775921 1202255 901389 150476 -494574 -453843 696554 2647134
36192B647134J557949J75847r44680j123085q66940n79652N8060Q48914O85836
$$ 2647134 4205083 4380930 3436250 2313165 1446225 866573 924633 1773547 2459383
36183B459383o20336j489158q02817K67049J60756n03991j17428J031081J162650
$$ 2459383 1839047 349889 -452928 -185879 -25123 -529114 -646542 384539 1547189
36174A547189n8416j078374r39970l06730J70973O82443J091829O88950l50543
$$ 1547189 1488773 410399 -529571 -836301 -665328 17115 1108944 1797894 1447351
36165A447351q31777m52944l08946q30577q65459K10982J041028L14267r71263
$$ 1447351 615574 162630 -146316 -976893 -1842352 -1631370 -590342 -276075 -1247338
36156a247338q81009N74462J535123R58257k44605p67377m45321L8865J95326
$$ -1247338 -2128347 -1553885 -18762 939495 694890 -72487 -517808 -478943 -283617
36147b83617J12112J33738L23339K45981m40993j160012q31781N32277J400576
$$ -283617 -171505 -37767 285572 531553 90560 -1069452 -1901233 -1368956 31620
36138C1620N83457j043474j564807m67902Q64103J063638L30520j74259J12645
$$ 31620 615077 -428397 -1993204 -2461106 -1597003 -533365 -202845 -377104 -264459
36129b64459O41041O29246J22350q0370M01281Q35155L66939n79441p62610L155
$$ -264459 376582 1005828 1128178 1047808 1449089 2284244 2651183 2071742 1309132 1312287
36119A312287M87248r9052r58653j052568n67473j87397J34742N77434M84550
$$ 1312287 1799535 1700483 741830 -310738 -878211 -1065608 -930866 -353432 131118
36110A31118o12665j614076j069549N02505J159162M00131k17180L00764Q53422
$$ 131118 -481547 -2095623 -3165172 -2662667 -1503505 -1103374 -1320554 -1019790 -166368
36101a66368K21403q29463p13096N28621J290670O54790n37613r58191l70277
$$ -166368 55035 -774428 -1487524 -958903 331767 986557 448944 -509247 -879524
36092h79524L41501L45199k07522m39397R7671P59454O33271j57742n85054j76817
$$ -879524 -538023 -192824 -400346 -839743 -742072 17382 650653 492911 -92143 -268960
36082b68960L80784L76086Q4248J31525M17888L51999j44130n16402l77566O0814
$$ -268960 111824 487910 572158 703683 1121571 1473570 1329440 813038 435472 496286
36072D96286L40867K20671j76518m67993l73729r5215j00869m24206n64062k93366
$$ 496286 837153 1057824 881306 413313 39584 -55631 -156500 -580706 -1144768 -1438134
36062a438134o8852k31595k96514L23162J205175J299521L72514o35990q49693
$$ -1438134 -1506986 -1738581 -2035095 -1711933 -506758 792763 1165277 529287 -320406
36053c20406m79580l22004o15566p79281k25686Q02393J374640R46566J44523
$$ -320406 -799986 -1121990 -1737556 -2516837 -2742523 -1940130 -565490 381076 525599
36044E25599Q9879Q84942J331619N18934q52888j376082p89440j21015j34336
$$ 525599 615478 1500420 2832039 3350973 2498085 1122003 332563 211548 77212
36035G7212n17784p04258o25012l48514K38635R16900R77950K04634n12253k57747
$$ 77212 -440572 -1144830 -1769842 -2118356 -1879721 -962821 15129 219763 -292490 -550237
36025e50237N55279P15657m8942p07677m26983L34720O22163K97791q872L3740
$$ -550237 5042 720699 671757 -35920 -462903 -128183 493980 791771 782899 816639
36015H16639P8641j99524n47259n22330j44045J50798R3929j30271j74926R3101
$$ 816639 895280 695756 148497 -373833 -517878 -367080 -273151 -403422 -578348 -485247
36005d85247N16120P62272N14814k10283q58205p39394J33720Q52610O02469k79038
$$ -485247 30873 793145 1307959 1097676 239471 -499923 -366203 486407 1088876 809838
35995H09838o53198j7628Q41118Q46466m1127q31289p03969J12392O78385L60007
$$ 809838 156640 139012 980130 1826596 1785469 954180 250211 362603 1040988 1400995
35985A400995n49492j139847q02170J42051P93939O62537J20488j96371j59713
$$ 1400995 851503 -288344 -1090514 -948463 -154524 508013 628501 432130 272417
35976B72417n2897L4061K25099L48721J7236o00986o94892O1279P98637N39911
$$ 272417 219520 253581 478680 827401 844637 243651 -451241 -389962 408675 948586
35966I48586l45438o49040j91866j09190r34187j482714n08055J290069K062788
$$ 948586 603148 -45892 -237758 -346948 -1281135 -2763849 -3271904 -1981835 80953
35957H0953J286673K27997p6278n7834m10921p40212k51702Q37575J462749J053123
$$ 80953 1367626 1595623 1519345 1461511 1050590 310378 58676 896251 2359000 3412123
35947C412123N8485p41207r51955o88597l84154m17039o96299p78854n22672k57060
$$ 3412123 3470608 2729401 1777446 1088849 704695 287656 -408643 -1187497 -1710169 -1967229
35937a967229j37826J17485N44299O48692L04285J97801O59524Q05178j36483
$$ -1967229 -2105055 -1987570 -1443271 -794579 -490294 -292493 367031 1172209 1035726
35928A035726j283427j179320k205P47219N55538K86302K30586l98761j525475
$$ 1035726 -247701 -1427021 -1429226 -682007 -126469 159833 390419 -8342 -1533817
35919a533817j612770m4947J464179J214944K8370j75195O31988Q14788j79685
$$ -1533817 -3146587 -3191534 -1727355 -512411 -484041 -659236 -27248 787540 607855
35910F07855j126797j062167m02511K19247Q18482J316459J166186L38095k80888
$$ 607855 -518942 -1581109 -1983620 -1764373 -945891 370568 1536754 1874849 1593961
35901A593961j08207K88692J62792l07021n27505m80753m63376l24769K02213
$$ 1593961 1485754 1774446 1937238 1630217 1102712 621959 158583 -166186 36027
35892C6027O91292M24369m07059p26087m7569P53665O35921j30235l79582K10135
$$ 36027 727319 1151688 744629 18542 -29027 724638 1360559 1230324 850742 1060877
35882A060877O28599N9765q41190q70495j1794O43453N39939K04761L3817l55524
$$ 1060877 1689476 1749241 908051 37556 25762 669215 1209154 1413915 1447732 1092208
35872A092208j064841j252486l81852O67032P65109K43920K91643R83727J164523
$$ 1092208 27367 -1225119 -1606971 -939939 -174830 69090 360733 1344460 2508983
35863B508983K85120p96949j097179o45208l2935L94808N38176L39575p7179m59212
$$ 2508983 2794103 1997154 899975 254767 221832 616640 1154816 1494391 1417212 958000
35853I58000p35008q99699p12675p8004M42253K38840l41838m50567q6393M194
$$ 958000 222992 -676707 -1389382 -1467386 -1025133 -786293 -1128131 -1578698 -1665091 -1660897
35843a660897k45269p2069O39911R54173L73328l87462o22498n48816m57454q8214
$$ -1660897 -1906166 -1978235 -1338324 -384151 -10823 -398285 -1020783 -1569599 -2027053 -2115267
35833b115267M77870M57376k73688n86414J55213Q68376M49186l54209j96782
$$ -2115267 -1637397 -1180021 -1453709 -2040123 -1884910 -1016534 -567348 -921557 -1118339
35824a118339O01140O89840O010l01856N298j0580n55182o38259J03324O51375
$$ -1118339 -517199 172641 178651 -123205 -117907 -128487 -683669 -1321928 -1218604 -567229
35814e67229K99551j81829J41486Q85233J026802L79160l97643p92112p70670
$$ -567229 -267678 -449507 -308021 577212 1604014 1983174 1585531 793419 22749
35805B2749m21492J32477N64853M93561j43804r32242j194042n53074N17716J006228
$$ 22749 -398743 -266266 298587 792148 648344 -283898 -1477940 -2031014 -1513298 -507070
35795e07070N68764N0011K69497P43543M45578m95923r26220m15906K31061L60358
$$ -507070 61694 111705 381202 1124745 1570323 1074400 148180 -267726 -36665 323693
35785C23693K65723K96327K09778j16568k59644p7307j13174n86560p90235j93020
$$ 323693 589416 885743 1095521 978953 719309 642002 528828 -57732 -847967 -1040987
35775a040987N74833O29307J52456k3839K67695M62190K61188n5590k14077k47292
$$ -1040987 -466154 163153 315609 291770 559465 1021655 1282843 1227253 1013176 765884
35765G65884k70601l70999n85333o83744k78504M96319Q32165K76117m88554n14445
$$ 765884 495283 124284 -461049 -1144793 -1423297 -926978 -94813 181304 -307250 -821695
35755h21695Q8218M10095R1258l63452n21436m74393k96501J58573O81644O43540
$$ -821695 -733477 -323382 -232124 -595576 -1117012 -1591405 -1887906 -1729333 -1047689 -404149
35745d04149p5569o37613k50492P23298J203316P53667l6333m94463o06681o22318
$$ -404149 -479718 -1117331 -1367823 -644525 558791 1312458 1276125 781662 174981 -447337
35735d47337m49060Q5657O56038O96229J90629l19789n36806o21837n30559R0607
$$ -447337 -896397 -810740 -154702 541527 732156 412367 -124439 -746276 -1276835 -1186228
35725a186228R82723J086996k897j089090q20761L98314J042532O61242J81303
$$ -1186228 -203505 883491 880594 -208496 -1029257 -630943 411589 1072831 1254134
35716A254134J27805n2234o37507r36162m78534J93832N02822N95299N86122J24015
$$ 1254134 1381939 1329705 692198 -243964 -722498 -528666 -25844 569455 1155577 1279592
35706A279592o07994n88323M45382J161818N04957n68757n46290K48653K88141
$$ 1279592 671598 83275 528657 1690475 2195432 1626675 1080385 1329038 1617179
35697A617179o01767j016618k97432N02430L49264l43841n86621j84014L40032
$$ 1617179 1015412 -1206 -298638 203792 553056 209215 -377406 -561420 -221388
35688b21388N58902M04680M3609j85041k8194L19452M03246Q7182l46995n88440
$$ -221388 337514 742194 785803 600762 572568 892020 1295266 1382448 1035453 447013
35678D47013m68623L8796N96926N99484j8575m60085j84508J33510l59797j144647
$$ 447013 -21610 17186 614112 1213596 1195021 734936 550428 683938 324141 -820506
35668h20506r72391J37051Q35775M77355p2894L17K77791O8582l94961m20648
$$ -820506 -1792897 -1655846 -820071 -342716 -415610 -415293 -137502 -68920 -463881 -884529
35658h84529J21498Q02051J179018R88072K84545l76970m56575k26519l63500
$$ -884529 -763031 39020 1218038 2206110 2490655 2113685 1657110 1430591 1067091
35649A067091p25222n04621K42157M10977l56286q98472k86060P42647J003138
$$ 1067091 341869 -162752 79405 490382 134096 -764376 -1050436 -307789 695349
35640F95349N70118K24864J4588m57210q86133o30555R9054M91086L60530J88403
$$ 695349 1265467 1490331 1504919 1047709 161576 -468979 -369925 121161 481691 670094
35630F70094J59419O5471l4476P0204J60269o2495l07746k26024k44634q56730
$$ 670094 829513 894984 860508 930712 1090981 1028486 720740 494716 250082 -606648
35620f06648j413310q55806N00185J243342R63775O81949R37992R05448M77r38478
$$ -606648 -2019958 -2875764 -2375579 -1132237 -168462 513487 1451479 2356927 2357404 1418926
35610A418926r41376l43792R67J05721M45825Q16707O37756J2925m30340m90828
$$ 1418926 477550 133758 134725 240446 686271 1502978 2140734 2153659 1723319 1232491
35600A232491m02255k06266Q2211M191p29823j364047q51083N20075J263075O63151
$$ 1232491 830236 623970 706181 710372 -19451 -1383498 -2234581 -1714506 -451431 211720
35590B11720l41832o21032k98092j27087j44964J88420Q43449J095545N90055
$$ 211720 -130112 -751144 -1049236 -1176323 -1321287 -1132867 -289418 806127 1396182
35581A396182j41028m56449m23268n10580p46220o31890O7614Q12303Q43326J40155
$$ 1396182 1255154 798705 375437 -135143 -881363 -1513253 -1445639 -633336 209990 350145
35571C50145m88109l37351M18334J031479J022083M88318k03622o99335p42249
$$ 350145 -137964 -475315 -56981 974498 1996581 2484899 2281277 1581942 839693
35562H39693l55306P6291K16732K22209M15761O16851L32394l44231o63990l05117
$$ 839693 484387 560678 777410 999619 1415380 2032231 2364625 2020394 1356404 1051287
35552A051287Q2081j62364p21748q34205m13631l133J33167K03300K92759K29005
$$ 1051287 1133368 971004 249256 -584949 -998580 -1001713 -868546 -665246 -372487 -143482
35542a43482M6605J5791J45385J45585n9233k20122j85947k3732K23332M40018
$$ -143482 -96877 -81086 64299 209884 150651 -69471 -255418 -279150 -55818 384200
35532C84200K43050n13266j157200q75595N8393N67497L23179O5244K13409K56777
$$ 384200 627250 113984 -1043216 -1918811 -1860418 -1292921 -969742 -904498 -691089 -434312
35522d34312p8257j89853K22345M24198n4890l94588J82000R16311O14179m13070
$$ -434312 -512569 -702422 -480077 -55879 -110769 -505357 -323357 592954 1207133 794063
35512G94063q53126l90632J65514M33442O99241P57098K5002j058276j199421
$$ 794063 -59063 -449695 -284181 149261 848502 1605600 1630602 572326 -627095
35503f27095j52841Q22607P99811K62338q9634l71464p31579o86111l2734M93195
$$ -627095 -779936 42671 842482 1104820 1015186 643722 -87857 -773968 -806702 -313507
35493c13507K72561k57084m33476l85697m79207m69038j8145N29854O68776N12657
$$ -313507 -40946 -298030 -731506 -1117203 -1596410 -2065448 -2083593 -1553739 -884963 -372306
35483c72306L84577J74590k07260l15848J32651N60843K85837m78284j063116
$$ -372306 12271 186861 -20399 -336247 -203596 357247 643084 164800 -898316
35474h98316j274689j171027n18636O56589J507685J314968N83322K66180L24411
$$ -898316 -2173005 -3344032 -3862668 -3206079 -1698394 -383426 199896 466076 790487
35465G90487P0117m47634n53985k34648j54441m28049m38878N4042N68951P21045
$$ 790487 860604 412970 -141015 -375663 -530104 -958153 -1397031 -1342989 -774038 -52993
35455e2993N46417L9777p44468j181146o34113M33498Q45880K73632m85249p69811
$$ -52993 493424 533201 -211267 -1392413 -2026526 -1593028 -747148 -473516 -958765 -1728576
35445a728576o26733j48498O37164J144277O91908k23700l50783L67230N96617
$$ -1728576 -2355309 -2503807 -1866643 -722366 -30458 -254158 -604941 -237711 358906
35436C58906k17350r15151n45822J58675J82728j30556K2350L93482L21887O7644
$$ 358906 141556 -773595 -1319417 -1160742 -978014 -1108570 -1086220 -692738 -370851 -303207
35426c03207K25285M55460R5723m81916m33565L9535P5762k29334J844P22395
$$ -303207 -77922 377538 473261 -8655 -442220 -402685 -326923 -556257 -554413 167982
35416A67982Q60029J00860n40443l04814K91592M70034K21109j63800o72050j119860
$$ 167982 1028011 1128871 588428 283614 575206 1045240 1266349 1102549 430499 -689361
35406f89361r44386p5964O64569O58983L57222M15488N86792K44678m62381q26823
$$ -689361 -1633747 -1709711 -1045142 -386159 -28937 386551 973343 1218021 755640 -71183
35396g1183o58005l27324N3605O42504J125258Q66310m1908o85950n83062l03125
$$ -71183 -729188 -1056512 -1002907 -360403 764855 1631165 1589257 903307 320245 17120
35386A7120m32742o06145j98495N20753P19210K66350j18969J0041K81462K52163
$$ 17120 -415622 -1021767 -1220262 -699509 19701 286051 167082 177123 458585 710748
35376G10748N8036l387j3459j38969j99756Q509K56106K22336O6934J43207L00684
$$ 710748 768784 765397 751938 612969 413213 421722 677828 900164 967098 1110305 1410989
35365A410989N6179n57291q93887n88190o8454L9412l28591p14091o74810j45373
$$ 1410989 1467168 909877 15990 -572200 -640654 -601242 -929833 -1643924 -2318734 -2464107
35355b464107N05721P18406L10535j94352j72508J88231J13824n24721q62808
$$ -2464107 -1958386 -1239980 -929445 -1123797 -1296305 -1108074 -994250 -1518971 -2381779
35346b381779k59332P45542J204333J002425O97483M96188J45655l14866m61088
$$ -2381779 -2641111 -1895569 -691236 311189 1008672 1504860 1650515 1335649 874561
35337H74561k01536N1658N9541L5995R1971j6165l08799l19085J55206N05412
$$ 874561 673025 724683 784224 820219 912190 896025 587226 268141 423347 928759
35327I28759J16636n77651n69731K41972Q16880M58574j85981j70262K65637J24376
$$ 928759 1045395 467744 -101987 139985 956865 1415439 1229458 1059196 1324833 1449209
35317A449209o33851q55429L0492R47966O10433o16425j241460p50888j37046
$$ 1449209 815358 -40071 -9579 938387 1548820 932395 -309065 -1059953 -1196999
35308a196999k41247n78049k91098M61779P87831L75762j36944p7184M53546Q02604
$$ -1196999 -1438246 -2016295 -2307393 -1845614 -1057783 -682021 -818965 -896149 -442603 360001
35298C60001N71781M7550j94313n4354m0424m58200p97503m09106M15680P25864
$$ 360001 931782 979332 785019 730665 690241 232041 -565462 -974568 -558888 166976
35288A66976K57665k62449l13759k51751m19244m16450J21970O91587O15342J00054
$$ 166976 424641 162192 -151567 -403318 -822562 -1239012 -1117042 -425455 189887 289941
35278B89941j65221r4921j08699k26599q6457K59034L42021P3648j34646p6490
$$ 289941 124720 29799 -78900 -305499 -391956 -132922 209099 282747 148101 71611
35268G1611J5918k0000o8664o0186k9108J11138L79739M27296k4158n51009m68465
$$ 71611 87529 67529 -1135 -61321 -90429 20709 400448 827744 803586 252577 -215888
35257b15888J53352N73070M63345K15251J16014l2289l09081m04765k22612j32289
$$ -215888 -62536 510534 973879 1189130 1305144 1272855 963774 559009 336397 204108
35247B04108l16393l95885l1520N17298P12503L24595m05053q96523o14197K47849
$$ 204108 -112285 -508170 -539690 -22392 690111 1014706 609653 -286870 -901067 -653218
35237f53218O60009k9150j000354r53892k0405M52501L8709k06473L23818P44925
$$ -653218 6791 -22359 -1022713 -1976605 -1997010 -1544509 -1505800 -1712273 -1388455 -643530
35227f43530L14704k23364P527M40443J07466o12037o74222j78695m7253k77790
$$ -643530 -328826 -552190 -544663 -104220 3246 -608791 -1283013 -1461708 -1508961 -1786751
35217a786751J0328Q88768J352566Q67455K6850n09298p05357o15740j51534L85630
$$ -1786751 -1776423 -887655 464911 1332366 1359216 849918 144561 -471179 -622713 -237083
35207b37083M17104l9362l87121m43659n63925o92842k84398O07268J132423Q70416
$$ -237083 180021 140659 -246462 -690121 -1254046 -1946888 -2231286 -1624018 -491595 378821
35197C78821L54007N8353j99566m90824l93007J19859L34138q5777m97447l68682
$$ 378821 732828 791181 591615 100791 -292216 -172357 161781 76004 -421443 -790125
35187g90125q7002o6560K8683M35571N87529J27996k36980J30244O23985M17637
$$ -790125 -877127 -943687 -915004 -479433 108096 236092 -888 129356 753341 1170978
35177A170978r9545r4250J92409J9175l41924j16181L74926J67172n51649o95022
$$ 1170978 1071433 977183 1169592 1188767 846843 730662 1105588 1272760 721111 26089
35167B6089k05129n4449k95657Q0594J052916J224825K00417n44383j11582K65336
$$ 26089 -179040 -233489 -529146 -448552 604364 1829189 2029606 1485223 1373641 1638977
35157A638977n81081j587035j172348Q4664L97096l53936o55223L9892O43027
$$ 1638977 1057896 -529139 -1701487 -1616823 -1219727 -1573663 -2228886 -2188994 -1545967
35148a545967M49777J34221L28090O01592M19353L2309j37894j50001j23168N9667
$$ -1545967 -1096190 -961969 -633879 -32287 387066 419375 281481 131480 8312 67979
35138F7979K41425k6012n75932n24196L86821J113552O82713l78903p89976k70491
$$ 67979 309404 283392 -292540 -816736 -429915 683637 1366350 987447 197471 -73020
35128g3020K99112K75625l6893j33807l3502L0090J15571L55679N05523J71567
$$ -73020 226092 501717 464824 331017 297515 327605 443176 798855 1304378 1475945
35118A475945n25962r23286o28576o9270R9408p6897r398L98640N30000R4678
$$ 1475945 949983 26697 -601879 -671149 -571741 -648638 -658036 -259396 270604 365282
35108C65282k85444m8750L23955M5597o52076q38219l78131j31432n25870q54943
$$ 365282 79838 31088 355043 400640 -251436 -1089655 -1467786 -1599218 -2125088 -2980031
35098b980031l88188N42230J075076R39705N37425K38398O6217p8319k18347k76001
$$ -2980031 -3368219 -2825989 -1750913 -811208 -273783 -35385 30832 -47487 -265834 -541835
35088e41835j33308J65846L11058R6132j57117N5622O43230R35843N54331j62010
$$ -541835 -675143 -509297 -198239 -102107 -259224 -203602 439628 1375471 1929802 1767792
35078A767792o60813o83322k57040L14888M57942q8667o78329m40567L94037O81112
$$ 1767792 1106979 423657 166617 481505 939447 850780 172451 -268116 125921 807033
35068H07033L6670o14808n12584j03820o0323j80669k7437J31866j03280l75320
$$ 807033 843703 228895 -283689 -387509 -447832 -628501 -655938 -524072 -627352 -1002672
35058a002672j54039K71374K74409k9521n9172K00005K94448J72457J28999J01334
$$ -1002672 -1156711 -885337 -610928 -640449 -699621 -499616 -205168 -32711 96288 197622
35048A97622j73736m80089l76787K0396K33874K12741K10548J24277k44856n06413
$$ 197622 23886 -456203 -832990 -812594 -578720 -365979 -155431 -31154 -276010 -782423
35038g82423j48920M53565M19242l14568r23087r15201n44069l8244O18682J078475
$$ -782423 -931343 -477778 -58536 -373104 -1296191 -2211392 -2755461 -2793705 -2175023 -1096548
35028a096548P74227j17095p07155n86655j93617J24807N25647R42291Q65835
$$ -1096548 -322321 -439416 -1146571 -1733226 -1926843 -1802036 -1276389 -334098 531737
35019E31737K08236m00320n18089l92829k97403j05959K04453L73581M18699O10510
$$ 531737 739973 339653 -178436 -571265 -868668 -974627 -770174 -396593 22106 632616
35009F32616P17606J94239o41858o86430K72008J037969P64169J40862N9750J29084
$$ 632616 1350222 1544461 902603 216173 488181 1526150 2290319 2431181 2490931 2620015
34999B620015m51522j345164j554039r35302j94051K75468N91661P24661N36790
$$ 2620015 2168493 823329 -730710 -1666012 -1860063 -1584595 -992934 -268273 268517
34990B68517K85274K95275L22340m1835n52360o20053k34907J14709K51837L62016
$$ 268517 553791 849066 1171406 1129571 577211 -42842 -277749 -163040 88797 450813
34980D50813M23449K59792J1539n2221j3195n4149l5038R4292j12961q44597j323306
$$ 450813 874262 1134054 1145593 1093372 1080177 1026028 990990 1085282 972321 127724 -1195582
34969a195582q04879J05414K60518j79347m1896P47927Q70783j76646j031959
$$ -1195582 -2000461 -1895047 -1634529 -1813876 -1855772 -1107845 -237062 -413708 -1445667
34960a445667m57437P82720J113358L94923k19529j82521l3987q3472J52753Q46195
$$ -1445667 -1903104 -1120384 -7026 387897 168368 -14153 -48140 -131612 21141 867336
34950H67336J167016L97027q15929j120524k44329O35742M95879k10290l51086
$$ 867336 2034352 2431379 1615450 494926 250597 886339 1382218 1171928 820842
34941H20842J77256L50580l61664j103287q11380K72271R08303M23803o33467
$$ 820842 998098 1348678 987014 -116273 -927653 -655382 252921 676724 43257
34932D3257j314226j186176m04981O09346J348865J398723P37320j72002o91468
$$ 43257 -1270969 -2457145 -2862126 -2252780 -903915 494808 1232128 1060126 368658
34923C68658m92493J37042M70023N4432o85933q49570j56102P02591R50613N40276
$$ 368658 -123835 13207 483230 537662 -148271 -997841 -1153943 -451352 499261 1039537
34913A039537j12560o55509p42018r7440Q13214Q29097m16986j592801j217401
$$ 1039537 926977 271468 -470550 -567990 245224 1074321 657335 -935466 -2152867
34904b152867K61676J056717N29957j46749M1114N67143M62325j95299o14497
$$ -2152867 -1891191 -834474 -304517 -451266 -410152 156991 619316 424017 -190480
34895a90480m80767j21632J40771K45990K25824J56267J25482R4508J9603R6209
$$ -190480 -671247 -792879 -652108 -406118 -180294 -24027 101455 195963 215566 311775
34885C11775M46914O10766Q042r88877j233466l52665O48216P58115K07419j91285
$$ 311775 758689 1369455 1377497 388620 -844846 -1197511 -549295 208820 416239 224954
34875B24954k36767j87973l7095K61057L02051j83849o18125l10535L65258M55274
$$ 224954 -11813 -199786 -236881 24176 326227 142378 -475747 -786282 -421024 34250
34865C4250p3013l01299J34338M97924J81169l80243m50120j1551M05858M50093
$$ 34250 -38763 -340062 -205724 292200 473369 93126 -356994 -368545 37313 487406
34855D87406J23502l63830o15205l23599K16886L30470o1432k53900J00048L55650
$$ 487406 610908 247078 -368127 -691726 -474840 -144370 -205802 -459702 -359654 -4004
34845d004j1838l43633K21386J152180J066397k16873j321833j223789m37131
$$ -4004 -15842 -359475 -138089 1014091 2080488 1863615 541782 -682007 -1119138
34836a119138J13895L71117O05450N04627k44209j038107j032210m05490q905
$$ -1119138 -1005243 -634126 -28676 475951 231742 -806365 -1838575 -2244065 -2252970
34827b252970J9135K92731R12284J186933P78540K15133k774j7029m4799N2529
$$ -2252970 -2233835 -1941104 -1028820 158113 936653 1151786 1149012 1131983 1087184 1139713
34817A139713K90703L36354J11778j1936O1628p0801m78042o03398k37384K8572
$$ 1139713 1430416 1766770 1878548 1866612 1928240 1857439 1379397 775999 538615 567187
34807E67187j37757j48524L84955P02522J2126j092519j377367o82924J18075
$$ 567187 429430 280906 665861 1368383 1380509 287990 -1089377 -1772301 -1654226
34798a654226N05834O28766N31091J35390j64321Q9024N15693L76637j63565k59056
$$ -1654226 -1148392 -519626 11465 146855 -17466 71558 587251 963888 800323 541267
34788E41267K14782N43254M46157L73803M56494K72343j69817l14352j40556k47244
$$ 541267 756049 1299303 1745460 2119263 2575757 2848100 2678283 2363931 2223375 1976131
34778A976131o03456m20166L33681N52946k34079r15299m63328M72541O31589
$$ 1976131 1372675 952509 1286190 1839136 1605057 689758 226430 698971 1330560
34769A330560r402m90001l90544j19241o1950k69047o66615r26572n42461L57037
$$ 1330560 1321158 831157 440613 321372 259422 -9625 -676240 -1602812 -2145273 -1788236
34759a788236Q14414L59075j02376L97706J242503J018881l46398j416054j226279
$$ -1788236 -973822 -614747 -717123 -319417 923086 1941967 1595569 179515 -1046764
34750a046764l95417q126k26511m14167j38318L33495L88484j72587p24368m45038
$$ -1046764 -1442181 -1450307 -1676818 -2090985 -2229303 -1895808 -1507324 -1679911 -2404279 -2849317
34740b849317N14259J020604M96214j82601J066O20215N38766j87604l93402K67639
$$ -2849317 -2335058 -1314454 -818240 -1000841 -999775 -379560 159206 -28398 -421800 -154161
34730a54161P58396L31354l79049m97940j92412q0414j08175J00753K72731j53448
$$ -154161 604235 935589 556540 58600 -133812 -214226 -322401 -221648 51083 -102365
34720a02365q59576q14181K14398J113388Q31697k30066q22560n04999K4129J96414
$$ -102365 -961941 -1776122 -1561724 -448336 383361 153295 -669265 -1174264 -1150135 -953721
34710i53721L40081Q13426J098209N21060m99848q49365l19599J01609k23276
$$ -953721 -613640 199786 1297995 1819055 1319207 469842 150243 251852 28576
34701B8576o35885l02495M49593O71971K38132p4003J75625M80386J61108o97087
$$ 28576 -607309 -909804 -460211 211760 449892 375889 551514 1031900 1193008 495921
34691D95921j300366j007653n8373O18040M51099o3215q4370L15706L37263r8581
$$ 495921 -804445 -1812098 -1870471 -1252431 -801332 -864547 -948917 -633211 -295948 -394529
34681c94529r9508O10388R57888K01875o39472k46113Q37028R60990n5011p19549
$$ -394529 -494037 116351 1074239 1276114 636642 390529 1227557 2188547 2133536 1413987
34671A413987k84121K54761K6950l38665o6015K83039j56884q88172p48235J54270
$$ 1413987 1129866 1384627 1411577 1072912 1006897 1289936 1133052 244880 -503355 -349085
34661c49085N46433M431m01726J68669J014382R82955J55276m09905k50266P1110
$$ -349085 197348 201779 -199947 -31278 983104 1966059 2121335 1711430 1461164 1532274
34651A532274N5602p6856n5959j19803m41238o10315l09028j8824k99712p25864
$$ 1532274 1587876 1511020 1455061 1335258 894020 283705 -25323 -44147 -343859 -1069723
34641a069723m52300L44365O38262K05408k7802M08020P17612K45237l71008l20345
$$ -1069723 -1522023 -1177658 -539396 -333988 -361790 46230 763842 1009079 638071 317726
34631C17726n794k19428n90935j32976R74383J434861P17274k32432m19167l0227
$$ 317726 311932 92504 -498431 -631407 342976 1777837 2495111 2262679 1843512 1813285
34621A813285J35875k13677p27386r35186o07609P8609N52441L39693l30354o98558
$$ 1813285 1949160 1735483 1008097 72911 -534698 -456089 96352 436045 105691 -592867
34611e92867l41837L93055Q50664P02814J17974m55702o59174n25283l51717k23753
$$ -592867 -934704 -541649 309015 1011829 1129803 674101 14927 -510356 -862073 -1085826
34601a085826N7685M58424N70018K65728Q983J12528K06643o1214l69321m02964
$$ -1085826 -1028141 -569717 301 266029 275012 387540 594183 532969 163648 -239316
34591b39316n77306j211748j539661o72286P76569J288914O00727j6059K10275
$$ -239316 -816622 -2028370 -3568031 -4240317 -3463748 -2174834 -1574107 -1590166 -1379891
34582a379891N27942J48020m14200k77774L49007N64426J77951j32699N6059L20310
$$ -1379891 -851949 -703929 -1118129 -1395903 -1046896 -482470 -304519 -437218 -381159 -60849
34572f0849O6273n82671q58490k97170N89574Q59551L30026k03747r3899L45712
$$ -60849 5424 -577247 -1435737 -1732907 -1143333 -283782 46244 -157503 -251402 94310
34562I4310N03903L81263K72838P0737l81359o65428l57563J06799K2007l93941
$$ 94310 598213 979476 1252314 1323051 941692 276264 -81299 25500 47507 -346434
34552c46434l46331J67213L45286q6524n07477m42582r8194K27603M62287M33108
$$ -346434 -692765 -525552 -180266 -266790 -774267 -1216849 -1315043 -1087440 -625153 -192045
34542a92045L739m36866l57516R9627M04607N24626O92891O28722K7094n13104
$$ -192045 -188306 -625172 -982688 -883061 -478454 46172 739063 1367785 1394879 881775
34532H81775k73067J92023j35977q07800m86690O21154Q48180j78897q89062m46837
$$ 881775 608708 800731 664754 -143046 -629736 -8582 839598 660701 -228361 -675198
34522f75198m3791n72531r44219m8061J220281J380653N69101j15798l97582n59207
$$ -675198 -718989 -1291520 -2235739 -2283800 -1063519 317134 886235 770437 372855 -186352
34512a86352l44050M69250J128995Q30102l3903n79907o81013n64949q4586N72730
$$ -186352 -530402 -61152 1067843 1897945 1864042 1284135 603122 38173 -46413 526317
34502E26317M69016o03734j285307o26329K05591k05623j023974m93589J008811
$$ 526317 995333 391599 -893708 -1520037 -1314446 -1520069 -2544043 -3037632 -2028821
34493b028821J464812M35110m19635j24273L77250K01198j09566Q3851L12154
$$ -2028821 -564009 -128899 -548534 -672807 -295557 -94359 -203925 -120074 192080
34484A92080j5625n06357m69381M6943N27596P13618N90084J47578m59659q43063
$$ 192080 176455 -329902 -799283 -752340 -224744 488874 1078958 1226536 766877 -76186
34474g6186o94913l4767P61199J045798M46767l89826k80203P65045J159596o5736
$$ -76186 -771099 -805866 -44667 1001131 1447898 1058072 777869 1542914 2702510 2636774
34464B636774j606803j633712m06523L50521J16550q8218K37328M56342K93456
$$ 2636774 1029971 -603741 -1010264 -659743 -543193 -631411 -394083 62259 355715
34455C55715K81461M68476K27879l28411k65440M34858N55886l62504j144864
$$ 355715 637176 1105652 1333531 1005120 739680 1174538 1730424 1367920 223056
34446B23056q04324N3628M40521M01802L62746J61126k98667l75538K84115Q08990
$$ 223056 -581268 -527640 -87119 314683 677429 838555 539888 164350 448465 1257455
34436A257455K38348r62307j504295r92377j55437L29220M24854L35981K21780
$$ 1257455 1495803 533496 -970799 -1963176 -2118613 -1789393 -1364539 -1028558 -806778
34427h06778K30911L33255K46725j07734l41188j85415l9905m16882j028136r86972
$$ -806778 -575867 -242612 4113 -103621 -444809 -630224 -670129 -1087011 -2115147 -3102119
34417c102119K7925J219214J496565P15403j45849j58949M08184N26085p0223
$$ -3102119 -3074194 -1854980 -358415 356988 211139 52190 460374 986459 916236
34408I16236n06015k19177P3593l79870r31171n05873M79830O09667k37122o03300
$$ 916236 410221 191044 264637 -115233 -1046404 -1552277 -1072447 -462780 -699902 -1303202
34398a303202K43812J167108R53830M4822l84042j47495R1472P2015J08042L14068
$$ -1303202 -1059390 107718 1061548 1106370 722328 574833 666305 738320 846362 1160430
34388A160430M20724K75889M1563p6263o0146j20544n07395j066933j153210m26636
$$ 1160430 1581154 1857043 1898606 1822343 1762197 1641653 1134258 67325 -1085885 -1512521
34378a512521M64871O54798L25432L51007P70259O90890j32936p76696o15007
$$ -1512521 -1047650 -392852 -67420 283587 1053846 1744736 1611800 835104 220097
34369B20097k39388k98730l85044J34121R09539J088275N32976j56122n04602
$$ 220097 -19291 -318021 -703065 -568944 340595 1428870 1961846 1805724 1301122
34360A301122m82853k59068q1217j30597k04118R1244O20171O98996M9406p55190
$$ 1301122 818269 559201 477984 347387 143269 234513 854684 1553680 1603086 847896
34350H47896j056698p89174j82163N71338J094484R63581L92505J28797L75033
$$ 847896 -208802 -997976 -1180139 -608801 485683 1449264 1841769 1970566 2345599
34341B345599N11004J66959k20476k63395j93939j87942R59K81848M1920p30275
$$ 2345599 2856603 3023562 2803086 2539691 2345752 2157810 2158769 2440617 2482537 1752262
34331A752262j104418o42017j80225m02758o31055l0877Q62285R71802L56273
$$ 1752262 647844 5827 -174398 -577156 -1208211 -1239088 -376803 594999 951272
34322I51272j06936j88962l07744m57737k70561J08857K18799J33928K08637K49268
$$ 951272 844336 655374 347630 -110107 -380668 -271811 -53012 80916 289553 538821
34312E38821j09323m82365k16504L97650M46509j49819n35880l06670q98o4235
$$ 538821 429498 -52867 -269371 128279 574788 424969 -110911 -417581 -418479 -482714
34302d82714k32883k00391j20020j47942j17443O1311J95618K06791K59995L46638
$$ -482714 -715597 -915988 -1036008 -1183950 -1301393 -1240082 -1044464 -837673 -577678 -231040
34292b31040K11341j36980k86895j2297L44150K87863k35202p80066q04610j50240
$$ -231040 -19699 -156679 -443574 -455871 -111721 176142 -59060 -839126 -1643736 -1793976
34282a793976P21101J062268O07042j20658m59319l75344k96235l78767l45831
$$ -1793976 -1072875 -10607 596435 475777 16458 -358886 -655121 -1033888 -1379719
34273a379719j6699L51909L64357j6722l56451j84487L90219O65929K20799l73255
$$ -1379719 -1396418 -1044509 -680152 -696874 -1053325 -1237812 -847593 -181664 39135 -334120
34263c34120k04088O60069J139160N89789l45357o66255k65557J74129J65193
$$ -334120 -538208 121861 1261021 1850810 1505453 839198 573641 747770 912963
34254I12963j23327k20067P2928L86033J35194o10873r24597k22723O60736M66312
$$ 912963 789636 569569 642497 1028530 1163724 552851 -371746 -594469 66267 532579
34244E32579o29004j220838p27420k939K75358M75955Q09269O33130k53621q32113
$$ 532579 -96425 -1317263 -2044683 -2047622 -1772264 -1296309 -487040 146090 -107531 -939644
34234i39644l49434M09094L57814k17127k91068K47702O20605L80568k49337q60394
$$ -939644 -1289078 -879984 -522170 -739297 -1030365 -782663 -162058 218510 -30827 -891221
34224h91221j019073m38465M40661O53328L4920l91564R6876R04817J185975R52630
$$ -891221 -1910294 -2348759 -1908098 -1254770 -1219850 -1611414 -1514538 -609721 576254 1528884
34214A528884M41397n06207j563537j598781l22821Q47879P60776K46622N31302
$$ 1528884 1970281 1464074 -99463 -1698244 -2021065 -1173186 -412410 -165788 365514
34205C65514J057417N36508p09340j235183p19324m3210M02053Q60675J063304
$$ 365514 1422931 1959439 1250099 14916 -704408 -747618 -345565 515110 1578414
34196A578414N42146j99595l25765j29600l79741o62875n9177Q89232P32348m78357
$$ 1578414 2120560 1920965 1595200 1465600 1085859 422984 363807 1253039 1985387 1507030
34186A507030j164365o86093q5213j37656l26407j36652J10827J68393L21486
$$ 1507030 342665 -343428 -428641 -566297 -892704 -1029356 -918529 -750136 -428650
34177d28650N42168L38124k17951l77681Q1454N07903M04989p6805o74627j126691
$$ -428650 113518 451642 233691 -143990 -62536 445367 850356 773551 98924 -1027767
34167a027767r08578J19776J037873R53370M36991N89344J075036O65334n07856
$$ -1027767 -1936345 -1816569 -778696 174674 611665 1201009 2276045 2941379 2433523
34158B433523j019565m89707n8154l00980m39517m4561J59898k05338l92983O1284
$$ 2433523 1413958 924251 866097 565117 125600 81039 240937 35599 -357384 -296100
34148b96100M73724K56410j37660j70958p4556j28687l7465L84706O94895M95756
$$ -296100 177624 434034 296374 125416 50860 -77827 -115292 269414 964309 1460065
34138A460065Q042l34737l33133n708L38710J90856m09837o46553j56912K01923
$$ 1460065 1468107 1133370 800237 794529 1133239 1324095 914258 267705 110793 312716
34128C12716k25019o06920o9970N64364J73139m88056o2645P67958L51192p87396
$$ 312716 87697 -519223 -589193 -24829 148310 -339746 -402391 365567 716759 -70637
34118g0637n87100R18245J462639K89320p64849m83609J02397P0543M4871L59393
$$ -70637 -657737 260508 1723147 2012467 1247618 764009 866406 936949 981820 1341213
34108A341213J77175n63769n98611K93026O30790o9366l05910N82974J042928
$$ 1341213 1518388 954619 356008 649034 1279824 1210458 904548 1487522 2530450
34099B530450J17066p48851l18297K62331k98480j063843o75386K25882L37293
$$ 2530450 2647516 1898665 1580368 1842699 1544219 480376 -195010 30872 368165
34090C68165n9561n2039O7482l10200o38348k92738O7581k34857m82643P5158
$$ 368165 308604 256565 324047 13847 -624501 -917239 -849658 -1084515 -1567158 -1492000
34080a492000O79885M16688p3758K17837Q65038Q85966M19025J30070o7168m19071
$$ -1492000 -812115 -395427 -469185 -251348 613690 1499656 1918681 2048751 1981583 1562512
34070A562512m80767n7069P1935m95773q39173k34814N60035O28648K69748J9906
$$ 1562512 1081745 1024676 1096611 600838 -238335 -473149 86886 715534 985282 1005188
34060A005188l59006q63892o52560M10563J032219M38225l80040m23783j66413
$$ 1005188 646182 -217710 -870270 -459707 572512 1010737 630697 206914 40501
34051D0501k15163j14299L95366N44969M9473k00388R4429K5763m94090k43821
$$ 40501 -174662 -288961 106405 651374 700847 500459 594888 620651 126561 -117260
34041a17260P96072Q83904l50570q70047K22531R15494j34851j114662l05677
$$ -117260 678812 1562716 1212146 342099 564630 1480124 1345273 230611 -75066
34032g5066R07594P11010j7962J62720M19975l78141j079050l52780O82799N38969
$$ -75066 832528 1543538 1525576 1688296 2108271 1730130 651080 298300 981099 1520068
34022A520068r931J46089J27113q01439j158486K1093Q80765k6542q34177K78120
$$ 1520068 1510137 1656226 1783339 981900 -176586 -155493 725272 698730 -135447 142673
34012A42673J545505P82185o05034l77231L60805m18339j531296q75557M44237
$$ 142673 1688178 2470363 1865329 1488098 1848903 1430564 -100732 -976289 -532052
34003e32052L26487k46157N58523J403034K73441j273045p68971N11396J04168
$$ -532052 -205565 -451722 106801 1509835 1783276 510231 -258740 252656 356824
33994C56824p79995K32922J633740O57221j204443p13404J052250P04728j155263
$$ 356824 -423171 -190249 1443491 2100712 896269 182865 1235115 1939843 784580
33985G84580j287531J34087M25294k12894K38051Q53403k99842j392991J68450
$$ 784580 -502951 -368864 56430 -156464 81587 934990 635148 -757843 -589393
33976e89393K151609J055620j163601n59200J262006L39328j620374m43494J901533
$$ -589393 1562216 2617836 1454235 895035 2157041 2496369 875995 432501 2334034
33967B334034O41909k235797j171218K314492K164607q32682q21665J564036P25839
$$ 2334034 2975943 740146 -431072 1883420 4048027 3215345 2393680 3957716 4683555
33958D683555k167923j033843K613262J846252j861420q54908L404835K467650
$$ 4683555 2515632 1481789 4095051 5941303 4079883 3224975 6629810 9097460
33950I097460k100777p24640N040591M260874j551168K88953Q466973Q307682
$$ 9097460 6996683 6272043 11312634 15573508 14022340 14311293 22778266 31085948
33942C1085948J423051N866796J9778910K0217416J2466016L7725883J00684465
$$ 31085948 32508999 38375795 58154705 78372121 90838137 128564020 229248485
33935B29248485J30283992O3310304n7004241j23047904r5479564l7698525j5551096
$$ 229248485 359532477 422842781 365838540 242790636 147311072 109612547 94061451
33928I4061451k1454191j8116101m949094l700746j1838213j0353456m61064J328287
$$ 94061451 72607260 54491159 49542065 45841319 34003106 23649650 23188586 24516873
33920B4516873n350534o503138n06204J439818k406014k986586R09117J460260
$$ 24516873 19166339 12663201 12156997 13596815 11190801 8204215 9113332 10573592
33912A0573592j956148k034461J521058J394739k983525m179351m11345J917613
$$ 10573592 8617444 6582983 8104041 9498780 6515255 2335904 1924559 3842172
33904C842172K49470p97842P32217J160532o34833j171807K38139K44076j472246
$$ 3842172 4091642 3293800 4026017 5186549 4551716 3379909 3618048 3862124 2389878
33895B389878j517760K07620J71491j684990j658002N15868J172417j78898j76517
$$ 2389878 872118 1079738 1251229 -433761 -2091763 -1575895 -403478 -582376 -758893
33886g58893J503862J430008p36181j349976L67398J040200k97322o48705P61592
$$ -758893 744969 2174977 1438796 88820 456218 1496418 1199096 550391 1311983
33877A311983R26435q96977j536159M4673P56689o80628j304015M41892J759013
$$ 1311983 2238418 1341441 -194718 -150045 606644 -73984 -1377999 -936107 822906
33868H22906O22996q01146l99074M17325J2698m31470L09708R45647K38549o64294
$$ 822906 1445902 644756 245682 663007 675705 244235 553943 1499590 1738139 1073845
33858A073845m92002N1988R1385R7674L04484l7931p89465o95447J80489L14367
$$ 1073845 581843 633831 725216 822890 1127374 1089443 299978 -395469 -214980 99387
33848I9387l87438k84104Q44882J248550M31225q9593Q1065m84269j757536j602781
$$ 99387 -288051 -572155 272727 1521277 1952502 1862909 1943974 1459705 -297831 -1900612
33838a900612M07897J721046P79248o71044p48125j43686r0736j77477J91678
$$ -1900612 -1492715 228331 1007579 336535 -411590 -555276 -646012 -823489 -631811
33829f31811L83645K7200j01314K08386O6954m84093k04840P93915P85264m04909
$$ -631811 -248166 -220966 -322280 -113894 -46940 -531033 -735873 58042 843306 438397
33819D38397p17080N47066J303688K67901q47355m03062N18899M19681o4174R7594
$$ 438397 -278683 268383 1572071 1839972 992617 589555 1108454 1528135 1463961 1561555
33809A561555J95379n67745j187050o15517K65177K95664P3453N44259J073455
$$ 1561555 1756934 1189189 2139 -613378 -348201 -52537 20916 565175 1638630
33800A638630P03563k5874j89774j39187n05777p85585l80388J32284R2635q3107
$$ 1638630 2342193 2316319 2126545 1987358 1481581 695996 315608 447892 540527 457420
33790D57420q357k36451r09842r91281q4128N39098O0545l60875L00744R42093
$$ 457420 449063 212612 -697230 -1688511 -1772639 -1233541 -1172996 -1533871 -1233127 -291034
33780b91034K22395r85062r86094M487M68053Q6570j92085l862J65030J65098
$$ -291034 -68639 -1053701 -2039795 -2035308 -1567255 -1480685 -1672770 -1676632 -1511602 -1346504
33770a346504K68192L90757K98683K02072L28113M20886K91301J62501K093n14999
$$ -1346504 -1078312 -687555 -388872 -186800 141313 562199 853500 1016001 1018094 503095
33760E03095r73085m53808O81510Q37832k44522p45568L54659J494837J043761
$$ 503095 -469990 -923798 -242288 595544 351022 -394546 -39887 1454950 2498711
33751B498711j51330m52213j42782m92483j275380j249603l54000L87426N91251
$$ 2498711 2347381 1895168 1752386 1259903 -15477 -1265080 -1619080 -1231654 -640403
33742f40403O01108M24337k7825k50249M5692J55957l80290o74507N4622Q84347
$$ -640403 -39295 385042 357217 106968 152660 308617 -71673 -746180 -691558 192789
33732A92789N54366m39294p01249j31518L27157M48758O24683O19315M0658m69782
$$ 192789 747155 307861 -393388 -524906 -197749 251009 875692 1495007 1535665 1065883
33722A065883j03582N30328K56141o65248r62212m26336J3194K2570J15802L23025
$$ 1065883 962301 1492629 1748770 1083522 121310 -305026 -291832 -269262 -153460 169565
33712A69565R7104m59213n91224j44876L03389N09879P11484Q26178N07648r4327
$$ 169565 266669 -192544 -783768 -928644 -625255 -115376 596108 1422286 1929934 1835607
33702A835607m70478m84020l18821r0857p7180o47964j358647j085403J61507
$$ 1835607 1365129 881109 562288 471431 394251 -253713 -1612360 -2697763 -2536256
33693b536256P94167N3605n79108J90803J146805N83335o96911p49121J67722
$$ -2536256 -1742089 -1688484 -2267592 -2076789 -929984 -346649 -1043560 -1792681 -1624959
33684a624959K23522o20591o33199M72277J045039M21540j86252j31227k38861
$$ -1624959 -1401437 -2022028 -2655227 -2182950 -1137911 -716371 -902623 -1033850 -1272711
33675a272711o87784l38560R63154J577212O22221n54155n69175L3972J63618
$$ -1272711 -1960495 -2299055 -1335901 241311 863532 309377 -259798 -225826 -62208
33666f2208m5913n3806j23328m57410l20483O97908J520296R34865n97146j552274
$$ -62208 -108121 -161927 -285255 -742665 -1063148 -365240 1155056 2089921 1492775 -59499
33656e9499j209670r8488Q45254R26100J15082o66393l87374O27245R99333L61191
$$ -59499 -1269169 -1367657 -522403 403697 518779 -147614 -534988 92257 1091590 1452781
33646A452781j42490R1330Q8848p70337j316478m42179Q81175J062685L94123
$$ 1452781 1310291 1401621 1490469 720132 -596346 -1038525 -157350 905335 1299458
33637A299458L06118P97772N60404n65085j195515o91700j07259l08803o25277
$$ 1299458 1605576 2403348 2963752 2398667 1203152 511452 404193 95390 -529887
33628e29887j77968N98402P33441K37553j30625j25333j22725k27194j34478J41417
$$ -529887 -707855 -109453 623988 861541 730916 605583 482858 255664 121186 262603
33618B62603J60240j76119l65559q6242K56103J29190l32996n67165l91185j34899
$$ 262603 422843 246724 -118835 -205077 51026 180216 -152780 -719945 -1111130 -1246029
33608a246029p4295j64099k80996l11882l8398N98702J121848R37136K06843k68884
$$ -1246029 -1320324 -1484423 -1765419 -2077301 -2115699 -1516997 -395149 541987 748830 479946
33598D79946j76253n4782k98395m85062j35957M61703P05100M48936j39233r38187
$$ 479946 303693 248911 -49484 -534546 -670503 -208800 496300 945236 806003 -132184
33588a32184j556178j275110l1156J059484R55826Q3814l24564O6140N14474M84996
$$ -132184 -1688362 -2963472 -2994628 -1935144 -979318 -895504 -1220068 -1153928 -639454 -154458
33578a54458K25473J20550K12392L69913L95798Q0477m13946n41927k13181j18730
$$ -154458 71015 191565 403957 773870 1169668 1250145 836199 294272 81091 -37639
33568c7639n90429q06115n2710Q62257O69173l36976o83223O4641Q32616P80657
$$ -37639 -628068 -1434183 -1486893 -624636 44537 -292439 -975662 -911021 -78405 702252
33558G02252K17634l30935p36128p72885j92851M94123M34727j74953k55881L99746
$$ 702252 919886 588951 -147177 -920062 -1112913 -618790 -184063 -359016 -614897 -215151
33548b15151P76799L35762k17765k97967l08836n78067o21913j60787K17274J24480
$$ -215151 561648 897410 679645 381678 72842 -505225 -1127138 -1287925 -1070651 -946171
33538i46171Q6404M60648O53974K25582j93853K0855L78005J92064j82115o7839
$$ -946171 -859767 -399119 254855 480437 286584 307439 685444 877508 695393 627554
33528F27554K64383J35827k56107j89512K95736M99345K38588j3402n2519j65187
$$ 627554 891937 1027764 771657 582145 877881 1377226 1615814 1602412 1549893 1384706
33518A384706m48099o07453m61292j23227K63267N47418M79191K2772m09167m31223
$$ 1384706 936607 329154 -132138 -255365 7902 555320 1034511 1057283 648116 216893
33508B16893j95681p1896q6375o3203l1084r1614j64419k21668m29717o93516
$$ 216893 21212 -50684 -137059 -200262 -231346 -322960 -487379 -709047 -1138764 -1832280
33498a832280n06739K62316Q83919O65684k9502l13850k5867K44026J72373J4336
$$ -1832280 -2339019 -2076703 -1192784 -527100 -556602 -870452 -896319 -652293 -479920 -465584
33488d65584l6506r7855j45053P1753M95543O59886L44068o5054j29184J3821
$$ -465584 -502090 -599945 -744998 -673245 -177702 482184 826252 761198 632014 645835
33478F45835r7663m95610o40619j56135N52277P43471L42286L8021K34414M48102
$$ 645835 548172 52562 -588057 -744192 -191915 551556 893842 931863 1166277 1614379
33468A614379J82006j39991J45132O85127N07424m09174r83494o35802o6830n4340
$$ 1614379 1796385 1656394 1801526 2486653 2994077 2584903 1601409 965607 898777 844437
33458H44437l54689l52141q5562M647j56019l40150m72050n45114m13915n2753
$$ 844437 489748 137607 52045 56692 -99327 -439477 -911527 -1456641 -1870556 -1923309
33448a923309K76228L87217L87665L74591L11777K85896L75998K58173l72271
$$ -1923309 -1647081 -1259864 -872199 -497608 -185831 100065 476063 734236 361965
33439C61965r68794o27125M37615R44842L98838k31807j69942L8773k11802l91813
$$ 361965 -606829 -1233954 -796339 148503 547341 315534 145592 184365 -27437 -419250
33429d19250P2370N55760L09705q2961K94201Q89990M13664r44741j551377o51926
$$ -419250 -346880 208880 518585 435624 729825 1619815 2033479 1088738 -462639 -1114565
33419a114565O51703J025862M61192j59920k51116J16638N17786N38609J30256
$$ -1114565 -462862 563000 1024192 864272 613156 729794 1247580 1786189 1916445
33410A916445l27725n05008m83492m08265j54477K68095M27475J20332j31412
$$ 1916445 1588720 1083712 600220 191955 37478 305573 733048 853380 721968
33401G21968J34232M59880J28888o53160j018129o55761n0782L22045L85275K20092
$$ 721968 856200 1316080 1444968 791808 -226321 -882082 -932864 -610819 -225544 -5452
33391e452J8515M9817K01050l2927n91271n30866N63777J553672J184445k1482
$$ -5452 13063 62880 263930 231003 -360268 -891134 -327357 1226315 2410760 2389278
33381B389278n50485j59429L8553m38071q33925o50131l65698l33276j55572L83530
$$ 2389278 1838793 1679364 1717917 1279846 445921 -204210 -569908 -903184 -1058756 -675226
33371f75226P64993N77083J01561k85645n27959m74568O5817N91278K05020r19860
$$ -675226 89767 666850 768411 482766 -45193 -519761 -453944 137334 342354 -577506
33361e77506j333251k01102J383066J721132N86287p41739j124714n63098K34918
$$ -577506 -1910757 -2111859 -728793 992339 1578626 836887 -287827 -850925 -616007
33352f16007O45880M76609m6772m63791l95574J60792P52577P65724P2679o12581
$$ -616007 29873 506482 459710 -4081 -399655 -238863 513714 1279438 1352117 739536
33342G39536m69309K47353M13453k91429p75634k18746N52581L89274k58387r3765
$$ 739536 270227 517580 931033 639604 -136030 -354776 197805 587079 328692 234927
33332B34927Q33642J201910N35502k46018m89539n90112q38984q17877l61729
$$ 234927 1068569 2270479 2805981 2559963 2070424 1480312 641328 -176549 -538278
33323e38278J9807Q6116J90354L65139J85045j91326o8628L70783P6710r40168
$$ -538278 -518471 -432355 -242001 123138 308183 116857 48229 419012 495722 -444446
33313d44446j176323M4522J228237Q10073n70780j182188o83390j21637k8373
$$ -444446 -1620769 -1576247 -348010 462063 -108717 -1290905 -1974295 -2095932 -2124305
33304b124305J11224O71334J258742J311178O77205l06604r31974o66443P2594
$$ -2124305 -2013081 -1341747 -83005 1228173 1905378 1598774 666800 357 72951
33295G2951K46665l30185o08107P8914Q94468P90587R5108j76716O8603J65786
$$ 72951 319616 -10569 -618676 -539762 354706 1145293 1240401 1063685 1132288 1298074
33285A298074k6156j07648q4566k76890m84182k28320K87337L78482p099k18828
$$ 1298074 1271918 1164270 1079704 802814 318632 90312 377649 756131 749032 530204
33275E30204L1757K85068J15513k85043m35293j24676L71697M89201P772m53648
$$ 530204 561961 847029 962542 677499 242206 117530 489227 978428 986200 532552
33265E32552j16189O61118O14747n14112j327586p38772M20830P35805K18626
$$ 532552 416363 1077481 1692228 1178116 -149470 -888242 -467412 268393 487019
33256D87019j89398k91173m29758l00331M82105J104238M86066p76486j070286
$$ 487019 297621 6448 -423310 -723641 -241536 862702 1348768 572282 -498004
33247d98004k57670K10297k60065o39853l00967l4099l87221n76622N3471P81350
$$ -498004 -755674 -545377 -805442 -1445295 -1746262 -1780361 -2167582 -2744204 -2690733 -1909383
33237a909383O61021r3711o87177p74474k49989R57283K145855J991105L31497
$$ -1909383 -1248362 -1342073 -2029250 -2803724 -3053713 -2096430 49425 2040530 2372027
33228B372027j178723j147798k45215O4164l67359o86725o26273m59595j5061
$$ 2372027 1193304 45506 -199709 -135545 -502904 -1189629 -1815902 -2275497 -2290558
33219b290558R00046J535266J002613k29132q78436o32282j88857J53547N91084
$$ -2290558 -1390512 144754 1147367 918235 39799 -592483 -781340 -627793 -36709
33210c6709P40540J6588r14979o63571O55846J304836M94500n05437n34448k41964
$$ -36709 703831 720419 -194560 -858131 -202285 1102551 1597051 1091614 557166 315202
33200C15202n54946q64727k01789Q00627P68054j50283n07730J29471O15414J14064
$$ 315202 -239744 -1104471 -1306260 -505633 262421 112138 -395592 -266121 349293 463357
33190D63357p47661r90682n41696L9316L19644J34690l65944n44489J74839J301222
$$ 463357 -284304 -1274986 -1816682 -1777366 -1457722 -1323032 -1688976 -2233465 -2058626 -757404
33180g57404J533690M24766q47287q75235K82314J311388J219307K44250o17304
$$ -757404 776286 1201052 353765 -521470 -239156 1072232 2291539 2535789 1918485
33171A918485o56439j14034J07124m53574j137705j011159j89640L87928M11417
$$ 1918485 1262046 1148012 1255136 801562 -336143 -1347302 -1536942 -1149014 -737597
33162g37597M56902O80302M19408m43774q99974l52953L26599K31894j14723J06497
$$ -737597 -280695 399607 819015 375241 -524733 -877686 -551087 -319193 -433916 -327419
33152c27419L76707j81999r31942n76385N00657O34436l96049r50369j95750O38588
$$ -327419 49288 -132711 -1064653 -1641038 -1140381 -505945 -901994 -1852363 -2048113 -1409525
33142a409525M08445j82910j6488N75449O07803J44519o1848J0039k08989o84212
$$ -1409525 -1001080 -1183990 -1200478 -625029 -17226 127293 65445 75484 -133505 -817717
33132h17717p75010k77292L32100N94614M34288j1057m51017n45021l05196j03282
$$ -817717 -1592727 -1870019 -1537919 -943305 -509017 -520074 -971091 -1516112 -1821308 -1924590
33122a924590j9359L26668R77075J281845P91397q0201p23472j008649q51442
$$ -1924590 -1943949 -1617281 -640206 641639 1433036 1352835 629363 -379286 -1230728
33113a230728L9106J308532J747146Q49406k09903k06545K85747n3377j024129
$$ -1230728 -1191622 116910 1864056 2713462 2503559 2297014 2582761 2529384 1505255
33104A505255j218525l07296N58353O52693M85123M61898J67353n23695q71662
$$ 1505255 286730 -20566 537787 1190480 1675603 2137501 2304854 1781159 909497
33095I09497m82923o6832k50853n11363j00992O49012Q41072L77580n2930j26282
$$ 909497 426574 359742 108889 -402474 -503466 145546 986618 1364198 1311268 1184986
33085A184986k01821m86537n81472j20747N61437P58114K56053m22195o94554
$$ 1184986 983165 496628 -84844 -205591 355846 1113960 1370013 947818 253264
33076B53264n82897m73984m20579j37200L15867M28360O0228k01004P1312L98277
$$ 253264 -329633 -803617 -1224196 -1361396 -1045529 -617169 -556941 -757945 -686633 -288356
33066b88356J14332n42105p05312n0471Q75191J337852R91363J4159q88880r54116
$$ -288356 -174024 -716129 -1421441 -1471912 -596721 741131 1732494 1746653 857773 -96343
33056i6343k89522J02968k52701m99939J70488J032532Q43377j63704o51721k90029
$$ -96343 -385865 -282897 -535598 -1035537 -865049 167483 1010860 847156 195435 -94594
33046i4594n4148m20765p12187m74880j41887N4475N14908J122910R52890j90747
$$ -94594 -148742 -569507 -1281694 -1756574 -1898461 -1843986 -1329078 -206168 746722 555975
33036E55975j107962q71632j28939J17175N3740L71329Q24272O27568j53030o52130
$$ 555975 -551987 -1423619 -1552558 -1435383 -1381643 -1010314 -186042 441526 288496 -363634
33026c63634m54303J3593K31527J30255l0393L8358L19276L35792k43929q13871
$$ -363634 -817937 -804344 -572817 -442562 -472955 -434597 -115321 220471 -23458 -837329
33016h37329m11424P11745J107196K09289o76481k77189P33629Q14837j76000
$$ -837329 -1248753 -537008 570188 779477 102996 -174193 559436 1374273 1198273
33007A198273r98183q71983j74751M42358O27804K22076n28574q56888l66980
$$ 1198273 200090 -671893 -846644 -404286 223518 445594 -82980 -939868 -1306848
32998a306848K73869L26466J63737M57605P31449P6267j012703j082554k6678
$$ -1306848 -1032979 -706513 -542776 -85171 646278 722545 -290158 -1372712 -1399390
32989a399390O56598K41056j68027L68377J009882N78340m81084q42425l32483
$$ -1399390 -742792 -501736 -669763 -301386 708496 1286836 805752 -36673 -369156
32980c69156N1188j52504l45489q4741K15182J12020r7079O5208L93308K78178
$$ -369156 -317968 -470472 -815961 -900702 -685520 -573500 -670579 -605371 -212063 66115
32970F6115k92168n85949j61710M07075L04258k79940l62319L09854P57552K35835
$$ 66115 -226053 -812002 -973712 -566637 -262379 -542319 -904638 -594784 162768 398603
32960C98603n44890m46357L82582Q00048L79248k54366o66860j000759j033861
$$ 398603 -146287 -592644 -210062 589986 969234 714868 48008 -952751 -1986612
32951a986612j85964J112363J395770K81800o21947j6698R85818N44359r28738
$$ -1986612 -2172576 -1060213 335557 617357 -4590 -21288 964530 1508889 580151
32942E80151j337698k27156M96676l58645j347474o69674J013396J595974O15341
$$ 580151 -757547 -984703 -488027 -846672 -2194146 -2863820 -1850424 -254450 360891
32933C60891l18676m2922O99212O64928j65791q87023r46618n07780J4267K67180
$$ 360891 42215 -707 698505 1363433 1197642 310619 -635999 -1143779 -1129512 -862332
32923h62332J35281k7118L18971J050280J267805M78574n64811q16219l62409
$$ -862332 -727051 -754169 -435198 615082 1882887 2361461 1796650 980431 618022
32914F18022j57402n49126r02450o84292j16849M00351P77834R10463N75237j6027
$$ 618022 460620 -88506 -990956 -1675248 -1792097 -1391746 -613912 296551 871788 855761
32904H55761k30223K5625L2682n40505q74480j97224Q32605R39713J20045m06290
$$ 855761 625538 651163 683845 143340 -731140 -928364 -95759 843954 963999 557709
32894E57709j27432N2961n66176j230023q95530Q3765M79054O8296j14320M86365
$$ 557709 430277 483238 -82938 -1312961 -2208491 -2124726 -1645672 -1577376 -1691696 -1205331
32884a205331R99690M48748p24144j224482o28497K51558O11945N01947L22561
$$ -1205331 -205641 243107 -481037 -1705519 -2334016 -2082458 -1470513 -968566 -646005
32875f46005J80190M6688N1012K53836M61480N00411L68465L0746m63550o21148
$$ -646005 -465815 -419127 -368115 -114279 347201 847612 1216077 1246823 783273 162125
32865A62125J1845Q42625O64085m93645j063636k40652O31324J53295q07545n71036
$$ 162125 173970 1016595 1680680 1187035 123399 -117253 514071 667366 -140179 -711215
32855g11215M79458N89807k49278k83232Q07802J188042K5664j007120n56711
$$ -711215 -231757 358050 108772 -174460 633342 1821384 1847048 839928 283217
32846B83217K49118J185n42072j04032N78005N1641j117685j172800o4080O37940
$$ 283217 532335 533520 -8552 -112584 465421 517062 -600623 -1773423 -1837503 -1199563
32836a199563L43592r0156k60366n58983o81291J70955J433670J499693K49499
$$ -1199563 -855971 -946127 -1206493 -1765476 -2446767 -2275812 -842142 657551 907050
32827I07050o13444k29504K84879K4391k66924R4625L32068k29636o93922j33854
$$ 907050 293606 64102 348981 373372 106448 201073 533141 303505 -390417 -524271
32817e24271O09751K62189o47485n59916O14307J392249R63888R3038l31099m05415
$$ -524271 85480 347669 -299816 -859732 -245425 1146824 2110712 2203750 1872651 1467236
32807A467236n60609p58117p72221o48546n13613l25059m2007K49438M94209O92900
$$ 1467236 906627 148510 -623711 -1272257 -1785870 -2110929 -2152936 -1903498 -1409289 -716389
32797g16389P36874M93541Q5763j70040j52585o2147j12284k40405j83531K03191
$$ -716389 20485 514026 599789 429749 277164 215017 102733 -137672 -321203 -118012
32787a18012P22569R73540P66343L02911j51138n59864q58089p15593m4597M90778
$$ -118012 604557 1578097 2344440 2647351 2496213 1936349 1078260 362667 318070 808848
32777H08848J55510p07678r53241j83024P08462P83928J57878m90843q18842p89846
$$ 808848 964358 256680 -696561 -879585 -171123 612805 770683 279840 -539002 -1328848
32767a328848l63417K54250N27606K59627p4526p8069j5327j75927k24482J80334
$$ -1328848 -1692265 -1438015 -910409 -650782 -725308 -803377 -818704 -994631 -1219113 -1038779
32757a038779O02984M08729k16145n63175m64405l07637j80552J96134P16209
$$ -1038779 -435795 -27066 -243211 -806386 -1270791 -1578428 -1758980 -1562846 -846637
32748h46637Q43972M45717K2980m8680M5999O9941J37033L29582L60474j4159
$$ -846637 -2665 443052 466032 417352 463351 533292 670325 999907 1360381 1346222
32738A346222n24816o92793m54973j53908L6124L12382P41984Q70617K27285q31145
$$ 1346222 821406 128613 -326360 -480268 -444144 -131762 610222 1480839 1708124 876979
32728H76979j269185o16993L32806M89981j81451q06962q36279m49861J03243
$$ 876979 -392206 -1009199 -676393 -186412 -367863 -1174825 -2011104 -2460965 -2357722
32719b357722P25268J013615N28322k66289k95918M96327Q21955l5802r78217
$$ -2357722 -1632454 -618839 -90517 -356806 -652724 -156397 665558 629756 -348461
32710c48461o92568L32259N78426k26162q90896o48264k0369L22503M71541O65472
$$ -348461 -1041029 -708770 -130344 -356506 -1247402 -1895666 -1916035 -1593532 -1121991 -456519
32700d56519O11090k2731q75696j140848m36133P44929J435020J122669L20844
$$ -456519 154571 131840 -743856 -1884704 -2320837 -1575908 -140888 981781 1302625
32691A302625n0973J18191Q9265l67385m33663L26373R02932K60079q85569j052833
$$ 1302625 1251652 1369843 1459108 1091723 658060 984433 1887365 2147444 1261875 209042
32681B09042l14060n5903n62013n92442L07411Q40783J10423p89241m90597N16857
$$ 209042 -105018 -160921 -722934 -1315376 -1007965 -167182 -56759 -846000 -1336597 -819740
32671h19740Q27620L56212J63230M96734M81100k67214r83107r59996m44328r05
$$ -819740 7880 364092 527322 1024056 1505156 1237942 254835 -705161 -1149489 -1150394
32661a150394K55225M31763M39651J76000k20238n29826o22180m10901M1760L86347
$$ -1150394 -895169 -463406 -23755 152245 -67993 -597819 -1219999 -1630900 -1589140 -1202793
32651a202793L48937K09918M36219Q38225P16009o999m81579j23293N16684N99932
$$ -1202793 -853856 -643938 -207719 630506 1346515 1339516 857937 734644 1251328 1851260
32641A851260K04361K268R6778j5111m42210o85143n24922l74441m80874m47801
$$ 1851260 2055621 2057889 2154667 2139556 1697346 1012203 487281 112840 -368034 -815835
32631h15835M5909O10849P27960N23484M19497L69480N0220m38176p02848p22905
$$ -815835 -769926 -159077 568883 1092367 1511864 1881344 1931564 1493388 790540 67635
32621F7635p37069o00585R226P72296R18238L69244j10716j32906j86916n31285
$$ 67635 -669434 -1270019 -1260793 -488497 429741 798985 688269 555363 368447 -162838
32611a62838n02729L42049J144333P69863n05869j311254r85613j69596L41212
$$ -162838 -665567 -323518 820815 1590678 1084809 -226445 -1212058 -1381654 -1040442
32602a040442M43498L32270P5673j67019j42184L5636l8271l27811k84687K48624
$$ -1040442 -596944 -264674 -189001 -356020 -498204 -462568 -500839 -828650 -1113337 -864713
32592h64713O59069M35575j09899l98918l75666k69177k3025M40380P21005L92151
$$ -864713 -205644 229931 120032 -278886 -654552 -923729 -946754 -506374 214631 606782
32582F06782k16708l85852j13318j12432n62985o55392J61627J124612J080737
$$ 606782 390074 4222 -109096 -221528 -784513 -1439905 -1278278 -153666 927071
32573I27071J34384m67610p4830N69134N28638p1969n27680p02768r38268j110932
$$ 927071 1061455 593845 519015 1088149 1616787 1544818 1017138 314370 -623898 -1734830
32563a734830o66886L44925J054555Q89328L22122J05995K12531L4505n84899
$$ -1734830 -2401716 -2056791 -1002236 -112908 209214 315209 527740 562245 -22654
32554b2654j032511o81261L10254J086666R71284K11387k99559j18535K31802
$$ -22654 -1055165 -1736426 -1426172 -339506 631778 843165 543606 425071 656873
32545F56873J25154j97501j29667J42606j06970p86369r27635k32069L68675J66774
$$ 656873 782027 584526 454859 597465 490495 -295874 -1223509 -1455578 -1086903 -920129
32535i20129k95234k90844n8217o6505k825N08290Q94847M65949k97782m27479
$$ -920129 -1215363 -1506207 -1564424 -1630929 -1633754 -1125464 -230617 235332 -62450 -489929
32525d89929M375K03253R5434J83952K92134j34805o37161j81117R34927J176299
$$ -489929 -485554 -282301 -186867 -2915 289219 154414 -482747 -663864 271063 1447362
32515A447362R6651r39158q67052l03279j12562q174M44487O54165L7297o82949
$$ 1447362 1544013 604855 -262197 -565476 -678038 -686212 -241725 412440 449737 -233212
32505b33212m62643L92823P10610J64241n53755r17542r26638n69118J07624N97926
$$ -233212 -695855 -303032 407578 571819 18064 -899478 -1826116 -2395234 -2287610 -1689684
32495a689684M98185K60163N22782R45570O87210j25709m94530j20367K16740
$$ -1689684 -1191499 -931336 -408554 537016 1224226 1098517 603987 483620 700360
32486G00360L2466j81953k6717N9171l09649o56677m28256M8970J44592k2388
$$ 700360 732826 550873 524156 583327 273678 -382999 -811255 -762285 -617693 -640081
32476f40081Q4482L37372O8660p38400j170893n59943N72779J065407L82083q57297
$$ -640081 -555599 -218227 -149567 -887967 -2058860 -2618803 -2046024 -980617 -598534 -1455831
32466a455831j479791q45659N15878J375907J066500J47447m06953l99462k89167
$$ -1455831 -2935622 -3781281 -3265403 -1889496 -822996 -675549 -1082502 -1481964 -1771131
32457a771131j56943L28037Q66920N40605o36552j196508j48864J378225J589870
$$ -1771131 -1928074 -1600037 -733117 -192512 -829064 -2025572 -2174436 -796211 793659
32448G93659N38183j97045l0149K5028o18646j115058p49864r6470J45509K28630
$$ 793659 1331842 1134797 1104648 1129676 511030 -604028 -1353892 -1450362 -1304853 -1076223
32438a076223M31555K41811n30000r18615k52063N49519M05247j00708K15527
$$ -1076223 -644668 -402857 -932857 -1851472 -2103535 -1554016 -1148769 -1249477 -1033950
32429a033950J013299J019950K35718j73582Q0372J75393j06099j11020J80869
$$ -1033950 -20651 999299 1235017 1061435 1141807 1317200 1211101 1100081 1280950
32420A280950L9860m52806l62648K99041L89733l18019n67986K56612J020698
$$ 1280950 1320810 868004 505356 804397 1194130 876111 308125 564737 1585435
32411A585435O87147j30678m03854k27687j44269l8975K63760K57177l85181r95721
$$ 1585435 2272582 2141904 1738050 1510363 1366094 1327119 1590879 1848056 1462875 467154
32401D67154q67283l10776J4217R1240J58848R7366j10376o7144K80204L74728
$$ 467154 -400129 -710905 -696688 -605448 -446600 -349234 -459610 -526754 -246550 128178
32391A28178M6551j74181j85513n44824j027014m32399J297517K308911J363896
$$ 128178 174729 548 -184965 -729789 -1756803 -2189202 -891685 1417226 2781122
32382B781122k81884q61515n60265m67704m38687J48855O33355J12770n78454
$$ 2781122 2499238 1637723 1077458 609754 171067 319922 953277 1066047 487593
32373D87593k3958J213400J266338j18007j310423j313997p33946l03110j05155
$$ 487593 463635 1677035 2943373 2825366 1514943 200946 -533000 -836110 -941265
32364i41265k01813n17092l05720P70592J479205O40665o32073l91106Q86876
$$ -941265 -1143078 -1660170 -1965890 -1195298 283907 924572 292499 -98607 788269
32355G88269R34424n25759j314338m75610K86372k88668j012673o13226J12256
$$ 788269 1722693 1196934 -117404 -593014 -306642 -595310 -1607983 -2221209 -2108953
32346b108953K2101l31606J2N23305L45440j53116j58160J03310O6278M4134M81443
$$ -2108953 -2086852 -2418458 -2418446 -1895141 -1549701 -1702817 -1860977 -1757667 -1691389 -1647255 -1165812
32335a165812Q89591P06939L41002K59030J5365o65641q94127m6829P86712L15821
$$ -1165812 -276221 430718 771720 1030750 1046115 380474 -513653 -560482 226230 542051
32325E42051p84373q44240K24507R83691P83101L88564L48799K56150j45896l92477
$$ 542051 -242322 -1086562 -862055 121636 904737 1293301 1642100 1898250 1752354 1359877
32315A359877k04596M57j30800l47187l06417o5329J65900L31432M36073M26275
$$ 1359877 1155281 1155738 1024938 677751 371334 306005 471905 803337 1239410 1665685
32305A665685K26458k12807p53721r35638m21491L25552M25201j45080m09374
$$ 1665685 1892143 1679336 925615 -10023 -431514 -105962 319239 174159 -235215
32296b35215J13561O39400M07997j39170k54810j51086m09316p78227o10482l3584
$$ -235215 -121654 517746 925743 786573 531763 380677 -28639 -806866 -1417348 -1450932
32286a450932L20920L78055M53717M01826q3776o20002n73010j06920J38899J51728
$$ -1450932 -1130012 -751957 -298240 103586 19810 -600192 -1173202 -1280122 -1141223 -989495
32276i89495L47034N35010J77552m55318n02382J02440N18932L65150J56685J93616
$$ -989495 -642461 -107451 70101 -385217 -887599 -785159 -266227 98923 255608 449224
32266D49224L3447n41231q96810m20057N55157J156563R57251K57938l36881m46680
$$ 449224 482671 -58560 -955370 -1375427 -820270 336293 1293544 1551482 1214601 767921
32256G67921k18297j34257l72714n51807l57081p7553q3928j33823K08303P34805
$$ 767921 549624 415367 42653 -509154 -866235 -943788 -1027716 -1161539 -953236 -218431
32246b18431Q41775M43522J6623j27311l8791K06525M50987K95958l59960q77660
$$ -218431 623344 1066866 1083489 956178 917387 1123912 1574899 1870857 1510897 633237
32236F33237o66356j36474p4341l41773j48389N22364Q00369L13670k90526m32968
$$ 633237 -33119 -169593 -243934 -585707 -734096 -211732 588637 902307 611781 178813
32226A78813l57927m85832o97580o12187j21035N54531R98754Q16057R7634m78701
$$ 178813 -179114 -664946 -1362526 -1974713 -2095748 -1541217 -542463 273594 371228 -107473
32216a07473m52154j92212j82165j51164L10178P59031N41843J8401l9089Q2798
$$ -107473 -559627 -751839 -934004 -1085168 -774990 -15959 525884 544285 505196 587994
32206E87994m17178j064649n70258Q04936J207751P5873p71532O5152J316280
$$ 587994 170816 -893833 -1464091 -659155 548596 624469 -147063 -81911 1234369
32197A234369J030210m28303j073875l02798N20556L18738l70106n80801k99288
$$ 1234369 2264579 1836276 762401 459603 980159 1298897 928791 347990 48702
32188D8702j41693l30411n19942l89114l6247K39190L79527N68522P20926L57065
$$ 48702 -92991 -423402 -943344 -1332458 -1368705 -1129515 -749988 -181466 539460 896525
32178H96525o04073j303187r20468L3004L45080m9315j2187Q07025J237523M59429
$$ 896525 292452 -1010735 -1931203 -1898199 -1553119 -1602434 -1614621 -807596 429927 889356
32168H89356n97163o68847k2686J99275j95161m47316k37544N4563K57194N47688
$$ 889356 292193 -376654 -399340 -200065 -395226 -842542 -1080086 -1025523 -768329 -220641
32158b20641P73202N40362j673k26377Q3810N19710O65937L93853k96388j101073
$$ -220641 552561 1092923 1091250 864873 948683 1468393 2134330 2528183 2231795 1130722
32148A130722j273556m03044P57895J005524K16712n80903o95857n00679m86847
$$ 1130722 -142834 -545878 212017 1217541 1434253 853350 157493 -343186 -830033
32139h30033m39905j7821M84793N39203J90877o3176n576J52511K51985L77832
$$ -830033 -1269938 -1287759 -802966 -263763 -72886 -136062 -141638 10873 262858 640690
32129F40690N27327M53046L2776m17135m63331j32849J00778m2245l04828l43574
$$ 640690 1168017 1621063 1653839 1236704 773373 640524 741302 699057 394229 50655
32119E0655k18880j44173l4447K52280M41200J80204k52121k29047K25257M23743
$$ 50655 -168225 -312398 -346845 -94565 346635 526839 274718 45671 270928 694671
32109F94671J17308j52720m3555N6482j07549q2632L76937N64518j62404j159435
$$ 694671 811979 659259 615704 672186 564637 482005 858942 1423460 1261056 101621
32099A01621j249118m04207K79028J93243j23284n6506J95600J53909j11592j31050
$$ 101621 -1147497 -1551704 -1272676 -1079433 -1202717 -1259223 -1063623 -909714 -1021306 -1152356
32089a152356K58940P07083P78236M17177l1755k28450j89818j38063j01599N0959
$$ -1152356 -893416 -186333 591903 1009080 977325 748875 559057 420994 319395 370354
32079C70354K22538J42170j37694k59411j80652k39926m33283k62046L85535Q50434
$$ 370354 592892 735062 597368 337957 157305 -82621 -515904 -777950 -392415 458019
32069D58019O28538O9303l01362m92538n68760k30665M23510N13348l21681r71148
$$ 458019 1086557 1155860 854498 361960 -206800 -437465 -13955 499393 177712 -793436
32059g93436l43734Q08572R08817j6456m61152J18696O05516K26656k79820j21569
$$ -793436 -1137170 -328598 580219 563763 102611 221307 826823 1053479 773659 652090
32049F52090K27172N240n15338n95738k32886M6257J09393J90432K74299J47697
$$ 652090 879262 884502 369164 -226574 -459460 -413203 -303810 -113378 160921 308618
32039C08618j51445l94538m61151k74694K34763Q09826R00209L64905k24840l18681
$$ 308618 157173 -237365 -698516 -973210 -738447 71379 971588 1336493 1111653 792972
32029G92972n0432J60699K55587L72429M02605J60297k56003o30437q91644r15931
$$ 792972 742540 903239 1158826 1531255 1933860 2094157 1838154 1207717 316073 -599858
32019e99858m59156L17544O71729J87553m53669k73271N87210R69206K95185o18052
$$ -599858 -1059014 -741470 -69741 117812 -335857 -609128 -21918 947288 1242473 624421
32009F24421o86827p912L77640M66l97173j759P68829P38788l30290j264701j020638
$$ 624421 -62406 -70318 307322 307788 -89385 -91144 677685 1416473 1086183 -178518 -1199156
31998a199156n2440M48910J78546k07078k97577k66062j20178L63460Q51273O12759
$$ -1199156 -1251596 -802686 -624140 -831218 -1128795 -1394857 -1515035 -1151575 -300302 312457
31988C12457k43750o62169j80682L60781K07087j45051P9353N96783O17270J47140
$$ 312457 68707 -593462 -774144 -413363 -206276 -351327 -271974 324809 942079 1089219
31978A089219j86180j79280n0663K14883O38056P17467O2307p29714p82943k98730
$$ 1089219 903039 723759 673096 887979 1526035 2243502 2305809 1576095 793152 494422
31968D94422j93257n63822o28054j49492K42525K68258L57103N53323K74653m19445
$$ 494422 301165 -262657 -890711 -1040203 -797678 -529420 -172317 381006 655659 236214
31958B36214n46059J71719N75550j36814r57590n61534N84351R63518L44564q2460
$$ 236214 -309845 -138126 437424 300610 -656980 -1218514 -634163 329355 673919 591459
31948E91459K58937N89645K51739l27223n54199n24305m68618k31431J71140K63112
$$ 591459 850396 1440041 1691780 1364557 810358 286053 -182565 -413996 -242856 20256
31938B0256m3589o0611N51723R85403M46877m75164o07294K9397L45118n3356
$$ 20256 -23333 -83944 467779 1453182 1900059 1424895 817601 846998 1192116 1138760
31928A138760l74574o4787L69593L62914J78875K25829K45224j29844n78883n80466
$$ 1138760 764186 699399 1068992 1431906 1610781 1836610 2081834 1951990 1373107 792641
31918G92641k72768j13394k8548L29971P29178N98330L3813l01020l25468o81525
$$ 792641 519873 406479 377931 707902 1437080 2035410 2069223 1768203 1442735 761210
31908G61210j465934j732524q32130M59589R17490N17830K61346N57542P27119
$$ 761210 -704724 -2437248 -3269378 -2809789 -1892299 -1374469 -1113123 -555581 171538
31899A71538K61289k98603k51574J10324r914n47667n66189K48970Q94736L96414
$$ 171538 432827 134224 -117350 -7026 -16940 -564607 -1130796 -881826 12910 409324
31889D09324o88525r09208J03464J144712J075891J82247n13789o33356n03953
$$ 409324 -279201 -1188409 -1084945 59767 1135658 1317905 804116 170760 -333193
31880c33193l09778L0699L20815J96122j83664k21467K00413M81119J86851l50153
$$ -333193 -642971 -612272 -291457 -95335 -278999 -500466 -300053 181066 367917 17764
31870A7764n82645m38375j61364J20075L22404K64144k3586j41154J23285L44488
$$ 17764 -564881 -1003256 -1164620 -1044545 -722141 -457997 -481583 -622737 -499452 -154964
31860a54964L4217n16833n11416K51842J057841J186129P10114J58895k45468
$$ -154964 -120747 -637580 -1148996 -897154 160687 1346816 2056930 2215825 1970357
31851A970357o26886r22370p78955p8464P45770J103443P97639O0896p39270j222590
$$ 1970357 1343471 421101 -357854 -436318 309452 1412895 2210534 2271430 1532160 309570
31841C09570j062224l15915L97995M76252Q6773q1692J50298K32603j29476m08856
$$ 309570 -752654 -1068569 -670574 -194322 -107549 -189241 -38943 193660 64184 -344672
31831c44672j04165L88354L48603j90539n78107n16061k68303o1289J12389J88376
$$ -344672 -448837 -60483 288120 97581 -480526 -996587 -1264890 -1326179 -1213790 -1025414
31821a025414Q8270p502N6193L9731k29857l19754J68614P10440N15424j24487
$$ -1025414 -937144 -944646 -888453 -848722 -1078579 -1398333 -1229719 -519279 -3855 -128342
31811a28342k12317K90524L91662j93880n36575j29453K74078J15607N7687O17160
$$ -128342 -340659 -50135 341527 147647 -388928 -518381 -244303 -128696 -71009 546151
31801E46151R13895K7378j226593j267002l9802R93115R50178L63869p5335m16741
$$ 546151 1460046 1487424 260831 -1006171 -1045973 -52858 897320 1261189 1185854 769113
31791G69113q01286q57013k47172O63370J078287N74357m05933q16571n1108J134291
$$ 769113 -32173 -889186 -1136358 -472988 605299 1179656 773723 -42848 -93956 1040335
31781A040335J273053Q1217j014668q14798Q904J31407l27572k39131M66720O98859
$$ 1040335 2313388 2394605 1379937 565139 574043 705450 377878 138747 605467 1304326
31771A304326J14035l70234k18555o1989l96923p30542o00189l58196l01652k0594
$$ 1304326 1418361 1048127 829572 767583 370660 -359882 -960071 -1318267 -1619919 -1640513
31761a640513O67917J052800O08574m2848q9709K50592L35342K41016L16630J98114
$$ -1640513 -972596 80204 688778 645930 556221 806813 1142155 1383171 1699801 1897915
31751A897915n50039j198223n90743R10477J533082M74411r57680j174768l65830
$$ 1897915 1347876 149653 -441090 469387 2002469 2476880 1519200 344432 -21398
31742b1398J02740k49411n52225o2702P96087J149068Q15669L03830L990j10329
$$ -21398 81342 -168069 -720294 -782996 13091 1162159 1977828 2281658 2285648 2175319
31732B175319j08102N0276K09945L1586m70063p77550n59076j69189r3832k14327
$$ 2175319 2067217 2117493 2327438 2359024 1888961 1111411 552335 383146 289314 74987
31722G4987j05046J90808K67862R6109K4915J05341O4641l5612J56953M66410
$$ 74987 -30059 160749 428611 524720 549635 654976 719617 684005 840958 1307368
31712A307368K09496o53249j159865o53900J94943L26031k26352n05477l4239
$$ 1307368 1516864 863615 -296250 -950150 -755207 -429176 -655528 -1161005 -1195244
31703a195244O58560Q74795N47921J14637n4391K2640M1267j87015m53035m31964
$$ -1195244 -536684 338111 886032 1000669 946278 968918 1010185 823170 370135 -61829
31693f1829j75510K7462K11734N89449Q25204K65251q34733j227235m00318N01237
$$ -61829 -237339 -209877 1857 591306 1416510 1681761 847028 -380207 -780525 -279288
31683b79288L35204k76790j8820Q99833J068721K24418k90511L16329J088175
$$ -279288 55916 -220874 -239694 660139 1728860 1953278 1662767 1979096 3067271
31674C067271Q78808l9013o91337q24312p65416n59264j32422J37384j51423p03610
$$ 3067271 3946079 3907066 3215729 2391417 1626001 1066737 934315 1071699 920276 216666
31664B16666r07961o81429l52777k9934K98589L77951R6627m9041L22114O10758
$$ 216666 -691295 -1372724 -1725501 -1755435 -1456846 -1078895 -982268 -1031309 -709195 -98437
31654i8437M5439q53989p64834M26458J300099R36364J15829j13286J5346k42030
$$ -98437 -52998 -906987 -1671821 -1245363 54736 991100 1106929 993643 1008989 766959
31644G66959p04871p19968m45231m76369n51458R3514J170534J439025N57554
$$ 766959 62088 -657880 -1103111 -1579480 -2130938 -2037424 -866890 572135 1129689
31635A129689l59333m25540j12166j26349k12197J06121M29291J25700m89860
$$ 1129689 770356 344816 232650 106301 -105896 225 429516 555216 65356
31626F5356o16699k43621j2370o7469l09K12294J87808J7810J82494N06526K21548
$$ 65356 -551343 -794964 -807334 -874803 -875112 -662818 -475010 -457200 -274706 231820 453368
31615D53368o62345j046569k94931P58993R83516M47730N7333K16353N69053O95322
$$ 453368 -208977 -1255546 -1550477 -791484 192032 639762 697095 913448 1482501 2177823
31605B177823L68046n65096j805595k316586j260151O99281J765414R78582o76808
$$ 2177823 2545869 1980773 175178 -2141408 -3401559 -2702278 -936864 41718 -635090
31596f35090j441634p03058N81769J139285O61241j53333n10214k61571J74725
$$ -635090 -2076724 -2779782 -2198013 -1058728 -397487 -550820 -1061034 -1322605 -1147880
31587a147880L79510K69461O717j94521j82106Q444J29701J3572j38156j6671
$$ -1147880 -768370 -498909 -492192 -686713 -868819 -860375 -730674 -717102 -855258 -871929
31577h71929K50982J88207k92089o14643k57008N36784J037302Q51818K34295
$$ -871929 -620947 -432740 -724829 -1339472 -1596480 -1059696 -22394 829424 1063719
31568A063719k86343l89246j74734k2512j47465l05720j68066O4634j48277p85126
$$ 1063719 777376 388130 213396 190884 43419 -262301 -430367 -365733 -514010 -1299136
31558a299136j066963m68191N11236R84319P52217L09630M9014m9871p3820Q437
$$ -1299136 -2366099 -2834290 -2323054 -1338735 -586518 -276888 -227874 -277745 -351565 -343128
31548c43128J64505K39750J27811j25548l26326k02361L19359Q53546Q81449M14204
$$ -343128 -178623 61127 188938 63390 -262936 -465297 -145938 707608 1589057 2003261
31538B003261l4404j93336k47822k26330J23907O00559M98899k50531p46715n30315
$$ 2003261 1968857 1775521 1527699 1301369 1425276 2025835 2524734 2274203 1527488 997173
31528I97173l91724q90090j060270P1129J448312J179490n29256j448820m94456
$$ 997173 605449 -284641 -1344911 -1273782 174530 1354020 824764 -624056 -1118512
31519a118512R14078J167122N40112J18414J4574k24494m09109r1923M27658N05680
$$ -1118512 -204434 962688 1502800 1621214 1635788 1411294 1002185 910262 1337920 1843600
31509A843600J62231j32767k82991m22484l65694K7902L11253M1288m19394m47971
$$ 1843600 2005831 1873064 1590073 1167589 801895 829797 1141050 1182338 762944 314973
31499C14973j67332r7828j31594K16960P44668P40976J90165j92432j85442l12388
$$ 314973 147641 49813 -81781 135179 879847 1620823 1810988 1618556 1433114 1120726
31489A120726o75604o06177P8237M77658k3239o44900l91495L09686K86930m04719
$$ 1120726 445122 -161055 -82818 394840 371601 -273299 -664794 -355108 -68178 -472897
31479d72897n10180L29054Q45665J25376q31131n95266M15267N63225l74238q02151
$$ -472897 -983077 -654023 191642 317018 -514113 -1109379 -694112 -130887 -505125 -1307276
31469a307276J04098R59360L18076r44593q89532N02784J310007N62827n18626
$$ -1307276 -1203178 -243818 74258 -870335 -1759867 -1257083 52924 615751 97125
31460I7125o30801k18193k95804o19013k77164N50137P45954N431o83833m68056
$$ 97125 -533676 -751869 -1047673 -1666686 -1943850 -1393713 -647759 -642328 -1326161 -1794217
31450a794217K95358O89794M18696j5032m5583L07705N20026K50501j49672p1160
$$ -1794217 -1498859 -809065 -390369 -405401 -450984 -143279 376747 627248 477576 406416
31440D06416M30833O12280J18121m46856m03256L7361K08432k3343l08002n09531
$$ 406416 837249 1449529 1567650 1120794 717538 754899 963331 939988 631986 122455
31430A22455o73912n58679M2089O24301M27485l91422q05355l28055L31703L71962
$$ 122455 -551457 -1110136 -1068047 -443746 -16261 -407683 -1213038 -1541093 -1209390 -837428
31420h37428M8663J85112Q63623J221001O02012n11505j034607o14001j4623p533
$$ -837428 -788765 -603653 259970 1480971 2082983 1571478 536871 -77130 -91753 -99286
31410i9286l48241m04853l79355q81306j375535m70501J697789K809681J285289
$$ -99286 -447527 -852380 -1231735 -2113041 -3488576 -3959077 -2261288 548393 1833682
31401A833682j233247j893138m19535R00247P04618L8713R2058L76352J6552n97781
$$ 1833682 600435 -1292703 -1712238 -811991 -107373 -68660 23398 399750 416302 -181479
31391a81479n54197J03524N92132M77053j19462q03388r38078j26519R15070Q82166
$$ -181479 -735676 -632152 -40020 437033 317571 -485817 -1423895 -1550414 -635344 246822
31381B46822k10541p29837K23405J307645Q69882o16270j390711r59552l22888
$$ 246822 36281 -693556 -470151 837494 1707376 1091106 -299605 -1259157 -1582045
31372a582045q2338J33520M33907L08873k57128m99185n9529M56052M41942O4392
$$ -1582045 -1664383 -1530863 -1096956 -788083 -1045211 -1544396 -1603925 -1147873 -705931 -641539
31362f41539j92659j03344L43613R22466J010262J68205r76638j193240k44903
$$ -641539 -834198 -937542 -593929 328537 1338799 1507004 530366 -662874 -907777
31353i07777O89810N43087l24069p61281k98916M97420Q66243O36173K31524P8123
$$ -907777 -217967 325120 1051 -760230 -1059146 -561726 304517 940690 1172214 1250337
31343A250337N2387l25158j053306j382658p68182K61494P41600M99247J15877
$$ 1250337 1302724 977566 -75740 -1458398 -2226580 -1965086 -1223486 -724239 -608362
31334f08362o5532j36981l8028L49904O07167J99363m89065n05144J87052N83213
$$ -608362 -673894 -810875 -848903 -498999 108168 307531 -181534 -686678 -499626 83587
31324H3587K30001j05011K32379P56845P23392K15190k60354n77126p94597p44101
$$ 83587 313588 208577 440956 1197801 1921193 2136383 1876029 1298903 504306 -239795
31314b39795l67827K0920K37435M51706N93584K27718n76841j012478o65667j26499
$$ -239795 -607622 -586702 -349267 102439 696023 923741 346900 -665578 -1331245 -1457744
31304a457744O5825K56330P83110J089686N94331k23153n03640k40521J2787J42631
$$ -1457744 -1391919 -1135589 -352479 737207 1331538 1108385 604745 364224 377011 519642
31294E19642L22263L40827l9942m56381m63104k70403k47695k19177Q018O6408
$$ 519642 841905 1182732 1142790 686409 223305 -47098 -294793 -513970 -505952 -439544
31284d39544j83975m8546Q16496J427281R00785M6182O3903M23921j61272j202041
$$ -439544 -623519 -672065 144431 1571712 2472497 2518679 2582582 3006503 2845231 1643190
31274A643190r77210N10892J297675M63394o65672q61091n84370m70320r1117
$$ 1643190 665980 1176872 2474547 2937941 2272269 1411178 826808 356488 265371
31265B65371P12006R23491L1038p81148m15370L84086M05477k6562O5606L53236
$$ 265371 977377 1900868 1931906 1150758 735388 1119474 1524951 1498389 1563995 1917231
31255A917231j75219j180236j271924k07469P24457O43834J26223Q528K02813
$$ 1917231 1742012 561776 -710148 -917617 -193160 450674 576897 585425 788238
31246G88238J82637p6084j91292n8431J6977j76639l98944k95300k8114j63674
$$ 788238 970875 894791 703499 645068 662045 485406 86462 -208838 -236952 -400626
31236d00626o91703p17883K21205J092507O83475l99205m72914N68587J025273
$$ -400626 -1092329 -1810212 -1589007 -496500 186975 -212230 -685144 -116557 908716
31227I08716J05764r02905q34736k55221N6365M72301J132387R27939n39891j554315
$$ 908716 1014480 111575 -723161 -978382 -922017 -449716 682671 1610610 1070719 -483596
31217d83596p02815O72553N38258n22859m60000O82777R87120J1537p27355n76783
$$ -483596 -1186411 -513858 24400 -498459 -958459 -275682 711438 722975 -4380 -581163
31207e81163m87824p01963j92980J043085J467946N31942l65254k50863P1879
$$ -581163 -1068987 -1770950 -1963930 -920845 547101 1079043 713789 462926 534805
31198E34805r9327j25612L36592L90977k54501l63987N94875J102275J2207j318003
$$ 534805 435478 309866 646458 1037435 782934 418947 1013822 2116097 2128304 810301
31188H10301j082966J61392N97575n3660o89149q70577q75591m52294O40797J441840
$$ 810301 -272665 -111273 486302 432642 -256507 -1127084 -2002675 -2454969 -1814172 -372332
31178c72332R36397q4265j06502O02602M91458n45120r92533l49400J16274l06720
$$ -372332 564065 479800 373298 975900 1467358 922238 -70295 -419695 -303421 -610141
31168f10141n79600J70965J132195J181909N50854R1357j36872m92501o81163
$$ -610141 -1189741 -1018776 113419 1295328 1846182 1937539 1800667 1308166 627003
31159F27003j56070P52375J055546M17308m13575n65973l4403M34197K73977k28189
$$ 627003 470933 1223308 2278854 2696162 2282587 1716614 1682211 2116408 2390385 2162196
31149B162196l05719K56630P71559N44101k25916q27840r97121r40784o83113
$$ 2162196 1856477 2113107 2884666 3428767 3202851 2375011 1377890 437106 -246007
31140b46007j12242M00406K05479o30563j169607p31777K45529P60300M02384
$$ -246007 -358249 42157 247636 -382927 -1552534 -2284311 -2038782 -1278482 -876098
31131h76098k53050l11418M40702J214052J070942R6738o85614o59625k60429
$$ -876098 -1129148 -1440566 -999864 214188 1285130 1381868 696254 36629 -223800
31122b23800j7735K46529P06101Q45482L28329j94667j55798k03522r93980j557659
$$ -223800 -241535 4994 711095 1556577 1884906 1690239 1534441 1330919 336939 -1220720
31112a220720n62222J185412J478749L1427r92976k95125P38021N19033k87480
$$ -1220720 -1782942 -597530 881219 912646 -80330 -375455 362566 881599 594119
31103E94119k62830K91139J60023m75128m23518L08733N07909j51241o51130m54590
$$ 594119 331289 622428 782451 307323 -116195 192538 700447 549206 -101924 -556514
31093e56514k77364n82778o29467K15671J201898J178088K86871k65060O3619
$$ -556514 -833878 -1416656 -2046123 -1830452 -628554 549534 836405 571345 634964
31084F34964M87052J11925p84185j115561m21203N13037O24135j03192o48587
$$ 634964 1122016 1233941 449756 -665805 -1087008 -573971 50164 -53028 -701615
31075g01615k89618M77654O10821j34643r21494q80279j13063N16219M22880j12498
$$ -701615 -991233 -513579 97242 -37401 -958895 -1839174 -1952237 -1436018 -1013138 -1125636
31065a125636m23782k80556J8460K45487M99378P55165O58446J29030k67465q2946
$$ -1125636 -1549418 -1829974 -1811514 -1566027 -1066649 -311484 346962 475992 208527 125581
$$ [...]
##END NTUPLES=NMR SPECTRUM
##END=
