##TITLE=31Pdec_LY-TMF-13.100
 D2O, 24 sc
 5.3.2020
##JCAMPDX= 6.0         $$ Bruker NMR JCAMP-DX V2.0
##DATA TYPE= NMR SPECTRUM
##DATA CLASS= NTUPLES
##ORIGIN= UXNMR, Bruker Analytische Messtechnik GmbH
##OWNER= root
$$ XWIN-NMR		Version 3.5
$$ Thu Mar  5 14:10:35 2020 Russian Standard Time (UT+4h)  she@DPX200
##.OBSERVE FREQUENCY= 81.013821
##.OBSERVE NUCLEUS= ^31P
##.ACQUISITION MODE= SIMULTANEOUS
##.ACQUISITION SCHEME= undefined
##.AVERAGES= 24
##.DIGITISER RES= 17
##SPECTROMETER/DATA SYSTEM= spect
##.PULSE SEQUENCE= zgpg30
##.SOLVENT NAME= DMSO
##.SHIFT REFERENCE= (INTERNAL, DMSO, 0, 182.463)
##AUDIT TRAIL= $$ (NUMBER, WHEN, WHO, WHERE, WHAT)
$$ ##TITLE= Audit trail, XWIN-NMR		Version 3.5
$$ ##JCAMPDX= 5.01
$$ ##ORIGIN= Bruker BioSpin GmbH
$$ ##OWNER= she
$$ F:/spectra/data/she/nmr/P31/1/pdata/1/auditp.txt
$$ ##AUDIT TRAIL=  $$ (NUMBER, WHEN, WHO, WHERE, WHAT)
(   1,<2020-03-05 14:09:03.04 +0400>,<she>,<DPX200>,
      <created by zg, POWCHK disabled, PULCHK disabled
       configuration hash MD5:
       00 E9 B6 7A A2 85 ED C7 34 08 36 98 17 FE 4E 26
       data hash MD5: 32K
       7E CD E5 8E D4 91 0A AA 6B 9E 95 76 83 39 CF E6>)
(   2,<2020-03-05 14:09:22.85 +0400>,<she>,<DPX200>,
      <Start of raw data processing
       efp BC_mod = 2 LB = 1 FT_mod = 6 PKNL = 1 PHC0 = -1315.441 PHC1 = 73.8017 SI = 64K 
       data hash MD5: 64K
       90 DD 48 F8 C2 3A 6E 8B 9C 70 03 34 40 79 5C C3>)
(   3,<2020-03-05 14:09:54.79 +0400>,<she>,<DPX200>,
      <pk PHC0 = -46.51988 PHC1 = 76.8 
       data hash MD5: 64K
       FE 18 0E 04 BC 7F B2 02 01 3B 21 46 3B 46 FC 44>)
(   4,<2020-03-05 14:09:57.85 +0400>,<she>,<DPX200>,
      <abs ABSG = 5 
       data hash MD5: 64K
       DF A2 7C 89 60 44 AC 43 44 98 ED 13 AE B8 73 F8>)
$$ ##END=
$$ 
$$ hash MD5
$$ 6B 41 B6 99 01 46 AD 22 86 1B 81 CC C0 07 22 23
##$RELAX= 
##$RELAX= 
##$RELAX= 
##$RELAX= 
##$RELAX= 
##$RELAX= 
##$RELAX= 
##$RELAX= 
$$ Bruker specific parameters
$$ --------------------------
##$DU= <F:/spectra>
##$EXPNO= 1
##$NAME= <P31>
##$PROCNO= 1
##$TYPE= <nmr>
##$USER= <she>
##$AMP= (0..31)
100 100 100 100 100 100 100 100 100 100 100 100 100 100 100 100 100 100 
100 100 100 100 100 100 100 100 100 100 100 100 100 100 
##$AQSEQ= 0
##$AQ_mod= 1
##$AUNM= <au_zg>
##$AUTOPOS= <>
##$BF1= 81.014009
##$BF2= 200.13
##$BF3= 200.13
##$BF4= 200.13
##$BF5= 200.13
##$BF6= 200.13
##$BF7= 200.13
##$BF8= 200.13
##$BYTORDA= 1
##$CFDGTYP= 0
##$CFRGTYP= 5
##$CHEMSTR= <none>
##$CNST= (0..31)
1 1 145 1 1 1 1 1 1 1 1 1 1 1 1 1 1 1 1 1 1 1 1 1 1 1 1 1 1 1 1 1 
##$CPDPRG= <waltz16>
##$CPDPRG1= <>
##$CPDPRG2= <waltz16>
##$CPDPRG3= <>
##$CPDPRG4= <mlev>
##$CPDPRG5= <mlev>
##$CPDPRG6= <mlev>
##$CPDPRG7= <mlev>
##$CPDPRG8= <mlev>
##$CPDPRGB= <>
##$CPDPRGT= <>
##$D= (0..31)
0 1 0 0 0 0 0 0 0 0 0 0.03 2e-05 3e-06 0 0 0 0 0 0 0 0 0 0 0 0 0 0 0 0 
0 0 
##$DATE= 1583402942
##$DBL= (0..7)
120 120 120 11 120 120 24 19 
##$DBP= (0..7)
150 150 150 150 150 150 150 150 
##$DBP07= 0
##$DBPNAM0= <>
##$DBPNAM1= <>
##$DBPNAM2= <>
$$ [...]
##$SUBNAM3= <"">
##$SUBNAM4= <"">
##$SUBNAM5= <"">
##$SUBNAM6= <"">
##$SUBNAM7= <"">
##$SUBNAM8= <"">
##$SUBNAM9= <"">
##$SW= 369.568048894756
##$SWIBOX= (0..15)
0 1 3 0 0 0 0 0 0 0 0 0 0 0 0 0 
##$SW_h= 29940.119760479
##$TD= 32768
##$TD0= 1
##$TE= 0
##$TE2= 300
##$TE3= 300
##$TEG= 300
##$TL= (0..7)
0 120 53 12 22 120 120 120 
##$TP= (0..7)
150 150 150 150 150 150 150 150 
##$TP07= 0
##$TPNAME0= <>
##$TPNAME1= <>
##$TPNAME2= <>
##$TPNAME3= <>
##$TPNAME4= <>
##$TPNAME5= <>
##$TPNAME6= <>
##$TPNAME7= <>
##$TPOAL= (0..7)
0.5 0.5 0.5 0.5 0.5 0.5 0.5 0.5 
##$TPOFFS= (0..7)
0 0 0 0 0 0 0 0 
##$TUNHIN= 0
##$TUNHOUT= 0
##$TUNXOUT= 0
##$USERA1= <user>
##$USERA2= <user>
##$USERA3= <user>
##$USERA4= <user>
##$USERA5= <user>
##$V9= 5
##$VALIST= <valist>
##$VCLIST= <CCCCCCCCCCCCCCC>
##$VD= 0
##$VDLIST= <DDDDDDDDDDDDDDD>
##$VPLIST= <PPPPPPPPPPPPPPP>
##$VTLIST= <TTTTTTTTTTTTTTT>
##$WBST= 1024
##$WBSW= 4
##$XGAIN= (0..3)
0 0 0 0 
##$XL= 0
##$YL= 0
##$YMAX_a= 5656
##$YMIN_a= -11265
##$ZGOPTNS= <>
##$ZL1= 120
##$ZL2= 120
##$ZL3= 120
##$ZL4= 120
##$ABSF1= 182.463
##$ABSF2= -187.1042
##$ABSG= 5
##$ABSL= 3
##$ALPHA= 0
##$AQORDER= 0
##$ASSFAC= 0
##$ASSFACI= 0
##$ASSFACX= 0
##$ASSWID= 0
##$AUNMP= <proc_1d>
##$AZFE= 0.1
##$AZFW= 0.5
##$BCFW= 0
##$BC_mod= 2
##$BYTORDP= 0
##$COROFFS= 0
##$CY= -3
##$DATMOD= 1
##$DC= 0
##$DFILT= <>
##$DTYPP= 0
##$F1P= 0
##$F2P= 0
##$FCOR= 1
##$FTSIZE= 65536
##$FT_mod= 6
##$GAMMA= 0
##$GB= 0
##$INTBC= 1
##$INTSCL= 5.30512e-09
##$ISEN= 30
##$LB= 1
##$LEV0= 0
##$LPBIN= 0
##$MAXI= 10000
##$MC2= 0
##$MEAN= 0
##$ME_mod= 0
##$MI= 50
##$NCOEF= 0
##$NC_proc= -6
##$NLEV= 6
##$NOISF1= 182.463
##$NOISF2= 159.3651
##$NSP= 0
##$NTH_PI= 0
##$NZP= 0
##$OFFSET= 182.463
##$PC= 4
##$PHC0= -1361.961
##$PHC1= 150.6017
##$PH_mod= 1
##$PKNL= yes
##$PPARMOD= 0
##$PSCAL= 0
##$PSIGN= 0
##$REVERSE= no
##$SF= 81.0140089999434
##$SI= 65536
##$SIGF1= 159.3651
##$SIGF2= -187.1042
##$SINO= 113.3802
##$SIOLD= 16384
##$SREGLST= <1H.CDCl3>
##$SSB= 0
##$STSI= 65536
##$STSR= 0
##$SW_p= 29940.119760479
##$SYMM= 0
##$S_DEV= 0
##$TDeff= 32768
##$TDoff= 0
##$TI= <>
##$TILT= no
##$TM1= 0
##$TM2= 0
##$TOPLEV= 0
##$USERP1= <user>
##$USERP2= <user>
##$USERP3= <user>
##$USERP4= <user>
##$USERP5= <user>
##$WDW= 1
##$XDIM= 65536
##$YMAX_p= 343168909
##$YMIN_p= -21981870
$$ End of Bruker specific parameters
$$ ---------------------------------
##NTUPLES= NMR SPECTRUM
##VAR_NAME=  FREQUENCY,     SPECTRUM/REAL,   SPECTRUM/IMAG
##SYMBOL=    X,             R,               I
##VAR_TYPE=  INDEPENDENT,   DEPENDENT,       DEPENDENT
##VAR_FORM=  AFFN,          ASDF,            ASDF
##VAR_DIM=   65536,         65536,           65536
##UNITS=     HZ,            ARBITRARY UNITS, ARBITRARY UNITS
##FACTOR=    0.456856943014862, 1,           1
##FIRST=     14782.0589164792, 0,            0
##LAST=      -15158.0608439998, 0,           0
##MIN=       -15158.0608439998, -21981870,   0
##MAX=       14782.0589164792, 343168909,    0
$$ Real data points
##PAGE= N=1
##DATA TABLE= (X++(R..R)), XYDATA
$$ [...]
##PAGE= N=2
##DATA TABLE= (X++(I..I)), XYDATA
36626B594537n33332L70610M94185l76507n82322L52695P11823m81013j610886
$$ 2594537 2061205 2431815 2926000 2549493 1967171 2319866 3031689 2550676 939790
36617I39790r93306M34536O97818j98805p47397n36939l85326m36606j36465J95230
$$ 939790 -53516 381020 1078838 880033 132636 -404303 -789629 -1226235 -1362700 -1167470
36607a167470k18663p52773n2225J343033J346459k18961r27375M59092J841338
$$ -1167470 -1386133 -2138906 -2191131 -848098 498361 279400 -647975 -188883 1652455
36598A652455J038305q26669j279898k86888L01186L9128L5675L16996k65603
$$ 1652455 2690760 1864091 584193 297305 598491 637619 673294 990290 724687
36589G24687j379513j075541R52104K276010J136062r35243j421243l15510M74262
$$ 724687 -654826 -1730367 -778263 1497747 2633809 1698566 277323 -38187 436075
36580D36075K57119J01236N29803N92596l45680j351176j251552l10077K87698
$$ 436075 693194 794430 1324233 1916829 1571149 219973 -1031579 -1341656 -1053958
36571a053958J00747k61927k92515k00299k29560q0268M95831R57361N51511m23923
$$ -1053958 -953211 -1215138 -1507653 -1707952 -1937512 -2017780 -1521949 -564588 -13077 -437000
36561d37000p03818K56275J300535R42789o08083j601692r58507M38043J001154
$$ -437000 -1140818 -884543 415992 1358781 750698 -850994 -1809501 -1371458 -370304
36552c70304L95909l36806l01700K81909O93630P33898P61279R48108R36909L20344
$$ -370304 25605 -311201 -612901 -330992 362638 1096536 1857815 2805923 3742832 4063176
36542D063176p93581j832707k221815j724183n93527M28010N81935p2244n47984
$$ 4063176 3269595 1436888 -784927 -2509110 -3102637 -2674627 -2092692 -2164936 -2712920
36533b712920j06311P18765Q73553L22949j0907K36778M67139L77744M40029O73202
$$ -2712920 -2819231 -2100466 -1226913 -903964 -914871 -678093 -210954 166790 606819 1280021
36523A280021K20722j023924j603575n27660R16710R04098j51460l28807P35007
$$ 1280021 1500743 476819 -1126756 -1654416 -737706 166392 14932 -313875 421132
36514D21132J472738J058228M46898L46251P0193p90575j287881q05081l58799
$$ 421132 1893870 2952098 3398996 3745247 3815440 3024865 1736984 931903 573104
36505E73104r16866j629401j192012l2836M26394N3407n0917M45930P28256M17261
$$ 573104 -343762 -1973163 -3165175 -3198011 -2771617 -2718210 -2769127 -2323197 -1594941 -1177680
36495a177680J12389J64954J41975j88060l96925k67412j71513j99696J90092
$$ -1177680 -1065291 -900337 -758362 -946422 -1343347 -1610759 -1782272 -1981968 -1791876
36486a791876J157630J873273J508629L19971p16576r12909j98447R88753J733926
$$ -1791876 -634246 1239027 2747656 3067627 2351051 1438142 1239695 2228448 3962374
36477C962374J160330n10452j836700j667029m43891N16103O54959M36407K97065
$$ 3962374 5122704 4612252 2775552 1108523 664632 1180735 1835694 2272101 2569166
36468B569166J56152q1479l00042n50584r80871j264783q35943M8620K81415n17229
$$ 2569166 2725318 2643839 2343797 1793213 812342 -452441 -1288384 -1239764 -958349 -1475578
36458a475578j119564k44079J474277K123061J016655n31000j151194j043122
$$ -1475578 -2595142 -2839221 -1364944 758117 1774772 1243772 92578 -950544
36450i50544j052308j089735n06492M85523R70284Q29570R30524J533562J597593
$$ -950544 -2002852 -3092587 -3599079 -3113556 -2143272 -1313702 -383178 1150384 2747977
36441B747977L76569j086573j096032L52271J420865Q04092o42598j187480n10711
$$ 2747977 3124546 2037973 941941 1294212 2715077 3519169 2876571 1689091 1178380
36432A178380J42743o9308m17133J89978J474800K019513J051561o70982j826820
$$ 1178380 1321123 1251815 834682 1024660 2499460 4518973 5570534 4899552 3072732
36423C072732j823358r73402M8528N88265K96940n16278j044551q18732j63824
$$ 3072732 1249374 275972 324500 912765 1209705 693427 -351124 -1169856 -1333680
36414a333680L84668P11834Q28278M40100n57737j444692j239676J09663J596551
$$ -1333680 -949012 -237178 591100 1031200 473463 -971229 -2210905 -2101242 -504691
36405e04691K179957J576775K41966r60320j272101p56380k97498l92660l47335
$$ -504691 1675266 3252041 3494007 2533687 1261586 505206 207708 -184952 -532287
36396e32287N56934J520079J043433p36770j836513r86997O50081J016067l16697
$$ -532287 24647 1544726 2588159 1851389 14876 -972121 -322040 694027 377330
36387C77330j845594j929913l41518J673030K514310J668531J94560n12136l41226
$$ 377330 -1468264 -3398177 -3739695 -2066665 447645 2116176 2310736 1798600 1457374
36378A457374k61781o44818p97551l56702j8488l08643o08000k08363M18813L30619
$$ 1457374 1195593 550775 -246776 -603478 -621966 -930609 -1538609 -1746972 -1328159 -997540
36368i97540l87830p11734m3085J175012K048014J944850Q18920p53469j941931
$$ -997540 -1385370 -2097104 -2140189 -965177 1082837 3027687 3846607 3093138 1151207
36359A151207k239134j556739o613J806377K570211J479383k86311o31625N51498
$$ 1151207 -1087927 -2644666 -2651279 -844902 1725309 3204692 2918381 2286756 2838254
36350B838254J016049o05063k694647k898623j196054O11699J420048J376907
$$ 2838254 3854303 3249240 554593 -2344030 -3540084 -2928385 -1508337 -131430
36342a31430P84478j0419k15567M97207J157809P92380q4482m96375o61869j142235
$$ -131430 653048 642629 427062 924269 2082078 2874458 2789976 2293601 1631732 489497
36332D89497j262116k18040J013759R46102J28796J33945M95867o17024k705730
$$ 489497 -772619 -990659 23100 969202 1097998 1231943 1727810 1110786 -1594944
36323a594944k903960l51115K164609K159808O57542n7839K15812K96749J7208
$$ -1594944 -4498904 -4850019 -2685410 -525602 131940 74101 289913 586662 603870
36314F03870j1983K9698m45517j168019j436131j174014n97622L45747J321886
$$ 603870 591887 621585 176068 -991951 -2428082 -3602096 -4199718 -3853971 -2532085
36305b532085J404846M74473k42306L3825M97729M13035M70144J188079J439031
$$ -2532085 -1127239 -652766 -895072 -861247 -363518 49517 519661 1707740 3146771
36296C146771K52246j195248j279115n15552m22782p82911l15642O46957O42783
$$ 3146771 3399017 2203769 924654 409102 -13680 -796591 -1112233 -465276 177507
36287A77507j30442o6719Q11523O62502q93293j783782o73099R92241J263708
$$ 177507 47065 -19654 791869 1454371 561078 -1222704 -1895803 -903562 360146
36278C60146K77751o12978q27798n07323K76130J126788J203852M77758N4123
$$ 360146 637897 24919 -802879 -1310202 -1034072 92716 1296568 1774326 1828449
36269A828449L41196J36649j304621k533867j778169L42784J637839J351133O86611
$$ 1828449 2169645 2306294 1001673 -1532194 -3310363 -2967579 -1329740 21393 708004
36260G08004N67089N41587J18801k48289l2855M85966O97785L55995m51586j367215
$$ 708004 1275093 1816680 1935481 1687192 1654337 2140303 2838088 3194083 2742497 1375282
36250A375282j653243q03409M92185Q23441r5296q60286k38303J133176J690572
$$ 1375282 -277961 -1081370 -589185 234256 138960 -721326 -959629 173547 1864119
36241A864119J037359J36073k88193m61801o55766o25090l08885k09830n58494
$$ 1864119 2901478 3037551 2749358 2287557 1631791 1006701 697816 487986 -70508
36232g0508q26227o34263m21144n11779l10671N80321J173088M03356q58781q18184
$$ -70508 -896735 -1530998 -1952142 -2463921 -2774592 -2194271 -1021183 -617827 -1476608 -2294792
36222b294792L56638O45366m63931r17363N48643K089460J542401j53688n65847
$$ -2294792 -1938154 -1292788 -1756719 -2674082 -2125439 -35979 1506422 1352734 786887
36213G86887L82983P28509J6802k11924M66856M94847p48486j626197r92743j37623
$$ 786887 1169870 1898379 1915181 1703257 2170113 2664960 1916474 290277 -702466 -840089
36203h40089n01550j220250p15140N70441R24383P8956n90264j92198Q07476J575725
$$ -840089 -1341639 -2561889 -3277029 -2706588 -1782205 -1703249 -2293513 -2485711 -1678235 -102510
36193a02510J576458N88163q12327j212218j0840J328386R78792p05406j804932
$$ -102510 1473948 2062111 1249784 37566 26726 1355112 2333904 1628498 -176434
36184a76434j646842j268665j168044n91145M96353P26335l68881j062814J29166
$$ -176434 -1823276 -3091941 -4259985 -4851130 -4354777 -3628442 -3997323 -5060137 -4930971
36175d930971J977317K169495O33708n48176k60420L88893J93536l28819k1510
$$ -4930971 -2953654 -784159 -150451 -698627 -959047 -570154 -376618 -705437 -726947
36166g26947J049502J779360J536752O53824l03505r81346j074455n02289J07134
$$ -726947 322555 2101915 3638667 4292491 3988986 3007640 1933185 1430896 1538030
36157A538030j93894j403652k204483j450996K39087J070771K80263r14859q96379
$$ 1538030 1344136 -59516 -2263999 -3714995 -3475908 -2405137 -2124874 -3039733 -3936112
36148c936112L62320J457915J437561Q07087N55675P88767P70325M6835r62129
$$ -3936112 -3573792 -2115877 -678316 128771 684446 1473213 2243538 2290373 1328244
36139A328244j505086j264406m69162M37315J003186Q97543K31715l33335k39857
$$ 1328244 -176842 -1441248 -1910410 -1473095 -469909 427634 659349 326014 86157
36130H6157J75545L7447p70132j245200n86562O90570J526539J670374J479696
$$ 86157 261702 299149 -470983 -1716183 -2302745 -1612175 -85636 1584738 3064434
36121C064434Q85084k81108j163100n67571R59321J254483m84968k192914j624019
$$ 3064434 3949518 3668410 2505310 1937739 2897060 4151543 3666575 1473661 -150358
36112a50358M53664J306715k6728j705825j841407p61426L1331L8018O251M79869
$$ -150358 303306 1610021 1583293 -122532 -1963939 -2725365 -2694034 -2656016 -2649765 -2169896
36102b169896R31376M85569p76001j570677q07512Q79986J701245J051755L53630
$$ -2169896 -1238520 -752951 -1528952 -3099629 -3907141 -3027155 -1325910 -274155 79475
36093G9475Q66970J678095J135679m75170j397517j200696j156403j652690j319713
$$ 79475 946445 2624540 3760219 3285049 1887532 686836 -469567 -2122257 -3441970
36084c441970M27108J832445J191179n13510r45112L96094J827603J914465Q91532
$$ -3441970 -3014862 -1182417 8762 -504748 -1449860 -1053766 773837 2688302 3579834
36075C579834k02111o92831n46050k48902l87295q46063p80029Q6547P35625K26045
$$ 3579834 3377723 2684892 2138842 1889940 1502645 656582 -123447 -36900 698725 924770
36065I24770q03946r93979j46935P94916J235410J246169P63877k80966j242331
$$ 924770 120824 -873155 -1020090 -225174 1010236 2256405 3020282 2739316 1496985
36056A496985j394573j109099j178725j288600o46341J73133r3976r08829l55398
$$ 1496985 102412 -1006687 -2185412 -3474012 -4120353 -3947220 -4041196 -4950025 -5305423
36047e305423J486942K049879K97169j157804J28015K443348K295227m19242k384436
$$ -5305423 -3818481 -1768602 -1471433 -2629237 -2501222 -57874 2237353 1818111 -566325
36038e66325j640404K56790J125065Q48146L72070o5860n11042m01754O41741
$$ -566325 -2206729 -1949939 -824874 23272 395342 329482 -181560 -583314 58427
36029E8427J861287K166874J433626L24374o80717j430655j707299j344807n62141
$$ 58427 1919714 4086588 5520214 5844588 5163871 3733216 2025917 681110 118969
36020A18969K33916Q02530J025570Q39673M05341j8379m87221j178645j696397
$$ 118969 352885 1155415 2180985 3020658 3425999 3407620 2920399 1741754 45357
36011D5357j280891k3844Q73918N85558k46385n25412k11738k2337r2589Q2286
$$ 45357 -1235534 -1259378 -385460 200098 -46287 -571699 -783437 -805774 -898363 -816077
36001h16077N41141O71632K39210k32677l66060m93823r30099j261772r12544
$$ -816077 -274936 396696 635906 403229 37169 -456654 -1386753 -2648525 -3561069
35992c561069o8798N22009N34645L23614K12222P6173j51615o5124O22145J326333
$$ -3561069 -3629867 -3107858 -2573213 -2249599 -2037377 -1961204 -2112819 -2177943 -1555798 -229465
35982b29465J094854p2824j025072q65728k4189N09780N16398M74818N30173L40939
$$ -229465 865389 792565 -232507 -1098235 -1122424 -612644 -96246 378572 908745 1249684
35972A249684j51932n82271q07456r83671r68625m39120K92065M44754J175j14965
$$ 1249684 1097752 515481 -291975 -1275646 -2244271 -2683391 -2391326 -1946572 -1945397 -2060362
35962b060362N42564J229178J202253P44276L87115J2347m92886n51949J39151
$$ -2060362 -1517798 -288620 913633 1657909 2045024 2057371 1564485 1012536 1151687
35953A151687P12841L26753l75370k89954J70888l25449j631477j974210n27813
$$ 1151687 1864528 2191281 1815911 1525957 1696845 1371396 -260081 -2234291 -2762104
35944b762104J306716J798203R53027M2001m6716O46425J513137J709066P67703
$$ -2762104 -1455388 342815 1295842 1337843 1291127 1937552 3450689 5159755 5927458
35935E927458o28713j136974m61594J32410m67422j721703k283462j668797l71307
$$ 5927458 5298745 4161771 3700177 3832587 3365165 1643462 -640000 -2308797 -2680104
35926b680104J058944K176006K334293J208476m83336j518614j415621o60292
$$ -2680104 -1621160 554846 2889139 4097615 3614279 2095665 680044 19752
35918A9752Q7617M59449K99960k21108n58241m33093l30175o94301q76410J67500
$$ 19752 107369 566818 866778 645670 87429 -345664 -675839 -1370140 -2246550 -2079050
35908b079050K031477K725048R88286j847609l078541j614174Q34111J738451
$$ -2079050 -47573 2677475 3665761 1818152 -1260389 -2874563 -2040452 -302001
35900c02001N64020q11548m40410J434887K814864K290080L58496j463212k100804
$$ -302001 262019 -549529 -989939 444948 3259812 5549892 5908388 4445176 2344372
35891B344372j397894O1564J210010J195559K61936n39622p46355q89367j239619
$$ 2344372 946478 1008042 2218052 3413611 3675547 3135925 2389570 1500203 260584
35882B60584j164360l58777L26230K18000J2629M76984Q93276K71225o46404l53528
$$ 260584 -903776 -1262553 -936323 -718323 -705694 -228710 664566 935791 289387 -64141
35872f4141Q83935J340420N19218l69993o28297p79223r00814l84883K54040l38684
$$ -64141 819794 2160214 2679432 2309439 1681142 901919 1105 -383778 -129738 -468422
35862d68422j581834j047661J469156K710419P34196j660175j028835J326022
$$ -468422 -2050256 -3097917 -1628761 1081658 1815854 155679 -873156 452866
35854D52866J483790r48762k634763j958356p87633m63731J72034J590812J862674
$$ 452866 1936656 987894 -1646869 -3605225 -4392858 -4856589 -4684555 -3093743 -1231069
35845a231069Q84j765173j242707M10325Q92797M07846O15636J376232J216158
$$ -1231069 -1230185 -2995358 -4238065 -3827740 -2934943 -2527097 -1911461 -535229 680929
35836F80929K29327n7604N99743Q64361J97378m54467m57628k48948j67403p3557
$$ 680929 910256 852652 1452395 2316756 2514134 2059667 1602039 1353091 1185688 1112131
35826A112131k01852r10431j568446j193075j79657J79994j20171J44358J095246
$$ 1112131 910279 -152 -1568598 -2761673 -2941330 -2761336 -2881507 -2737149 -1641903
35817a641903J412162P05865K52771O83998Q46676r9688j194860j340903q43271
$$ -1641903 -229741 476124 728895 1412893 2259569 2159881 965021 -375882 -1219153
35808a219153k15434Q90517K294662K509839R19273p61696r04212m15185q51283
$$ -1219153 -1434587 -544070 1750592 4260431 5179704 4418008 3513796 3098611 2247328
35799B247328j490516o82093Q85944R76944n21067j345726l64970J060286J530162
$$ 2247328 756812 74719 960663 1937607 1416540 70814 -294156 766130 2296292
35790B296292J222611O23963k59842q82948l90340N07748k7874j879382k521078
$$ 2296292 3518903 4142866 3883024 3000076 2609736 3117484 3089610 1210228 -1310850
35781a310850p82694J128103R40988l40445m27900N64532Q03495L6309l07903
$$ -1310850 -2093544 -965441 -24453 -364898 -792798 -228266 575229 611538 303635
35772C03635J30270J72097n47534q35190M0684J240958J751891J527432Q08323
$$ 303635 433905 606002 58468 -776722 -736038 504920 2256811 3784243 4592566
35763D592566m06979j675580k046414j337786n72815n16236n57597K78096J785327
$$ 4592566 4185587 2510007 463593 -874193 -1447008 -1963244 -2520841 -2242745 -457418
35754d57418K711470K167303N11994r81752j241700m83309j14131j039122k216986
$$ -457418 2254052 4421355 4933349 3951597 2709897 2226588 2112457 1073335 -1143651
35745a143651j770437M03886K212317K004125O04227j10012J73561J99308n95553
$$ -1143651 -2914088 -2510202 -297885 1706240 2310467 2200455 2374016 2573324 1977771
35736A977771j153760m61320Q39755J236701L33195p01499p11161J9134K97101
$$ 1977771 824011 362691 1202446 2439147 2772342 2070843 1359682 1378816 1675917
35727A675917l29548j034706q71572O2705R13502J113649P29980Q3956m43170
$$ 1675917 1346369 311663 -559909 -497204 416298 1529947 2259927 2343883 1900713
35718A900713m10520K72732R36354P03907m07988j378091j321121m02662M93215
$$ 1900713 1490193 1762925 2699279 3403186 2995198 1617107 295986 -106676 386539
35709C86539O95464K53301k07950q4659N18020P76826J52329p61413r01505j64011
$$ 386539 1082003 1335304 1127354 1042695 1560715 2337541 2489870 1728457 826952 662941
35699F62941M71235L02630k77474n26443k64507K62387Q30305J130262P21802
$$ 662941 1134176 1436806 1159332 632889 368382 630769 1461074 2591336 3313138
35690C313138l88106j412138j455160l79273J153597K198283K022787O42322r05804
$$ 3313138 2925032 1512894 57734 -321539 832058 3030341 5053128 5695450 4789646
35681D789646j374190o67585J70288M99034P24509J037045P05111m82100j239565
$$ 4789646 3415456 2747871 2918159 3417193 4141702 5178747 5883858 5401758 4162193
35672D162193o48492l5009j111456k798847k246174P86310L009635K084453j59390
$$ 4162193 3513701 3478692 2367236 -431611 -2677785 -1891475 1118160 3202613 3043223
35663C043223o54401M95845Q08837l99376j240705n81553L07683J22491m41409
$$ 3043223 2388822 2884667 3693504 3294128 2053423 1471870 1779553 1902044 1460635
35654A460635j87278M76714L13401p03899j428021j180592l00889O30511J166347
$$ 1460635 1273357 1750071 2063472 1359573 -68448 -1249040 -1549929 -919418 246929
35645B46929Q59084k56043j133868o44933Q41925J642761Q21609n84895q31007
$$ 246929 1106013 849970 -283898 -928831 -86906 1555855 2377464 1792569 961562
35636I61562M22391J678737J265227p51686k480946k253032o03081M10065o5697
$$ 961562 1383953 3062690 4327917 3576231 1095285 -1157747 -1760828 -1350763 -1416460
35627a416460o49270l3763Q63543M40906p18825m99090J299384K275703R10516
$$ -1416460 -2065730 -2099493 -1235950 -795044 -1513869 -2012959 -713575 1562128 2472644
35618B472644j107121j308070J52999J093784N00623n15857p13408k00141K72783
$$ 2472644 1365523 57453 210452 1304236 1804859 1289002 575594 375453 648236
35609F48236M23922M44921N03967N65615M42627r295n70214p31502l41387J16020
$$ 648236 1072158 1517079 2021046 2586661 3029288 3019993 2449779 1718277 1376890 1492910
35599A492910J66514q0791k61052j68379M16200J579261K504621J786903o10330
$$ 1492910 1659424 1578633 1317581 1149202 1565402 3144663 5649284 7436187 6825857
35590F825857k556600k140515k74287N09773m38224j217105l84155R96329J102872
$$ 6825857 4269257 2128742 1854455 2364228 1926004 708899 324744 1321073 2423945
35581B423945m6688q96122o68263k07599m70274j092527j015484j32360M75957
$$ 2423945 2377257 1481135 812872 605273 134999 -957528 -1973012 -2105372 -1629415
35572a629415J24947m20491j51653N35165N07674j26266j85568M17965M13223
$$ -1629415 -1504468 -1924959 -2076612 -1541447 -1033773 -1160039 -1345607 -927642 -514419
35563e14419m84981q39796L2060P87918N07586L73346J192174J387054j38200
$$ -514419 -999400 -1839196 -1807136 -1019218 -511632 -138286 1053888 2440942 2302742
35554B302742j170402N56772K848115J742147k016099l564758j240384J110103
$$ 2302742 1132340 1689112 4537227 6279374 4263275 698517 -541867 568236
35546E68236L55401j534917j437819J44628R58281Q85819J076936J251015O41149
$$ 568236 923637 -611280 -2049099 -1904471 -946190 -60371 1016565 2267580 2908729
35537B908729M4404L95169O79755l46867j677696j619409n92108o6222K3518M12972
$$ 2908729 2953133 3348302 4028057 3681190 2003494 384085 -208023 -274245 -250727 162245
35527A62245L76109q76715j840639o92279J260543J207028o65306j532525n67499
$$ 162245 538354 -338361 -2179000 -2871279 -1610736 -403708 -1069014 -2601539 -3169038
35518c169038J48152m09380o79959K28397Q43613J52283m98829K08144J417736
$$ -3169038 -3020886 -3430266 -4110225 -3881828 -3038215 -2885932 -3384761 -3176617 -1758881
35509a758881J787038J491109J196135O63788l24330j081383j184623j159071
$$ -1758881 28157 1519266 2715401 3379189 3054859 1973476 788853 -370218
35501c70218j077329j01693J513781J771889k09981k273553j935767J96559J589770
$$ -370218 -1447547 -1549240 -35459 1736430 1526449 -747104 -2682871 -2486312 -896542
35492h96542J386482Q26433O42374J74075q22141j323815o57806K57063J45668
$$ -896542 489940 1316373 1958747 2132822 1310681 -13134 -670940 -413877 -268209
35483b68209p28162p51053Q82208K758111K626758K44888j980535j825334K4220
$$ -268209 -996371 -1747424 -865216 1892895 4519653 4764541 2784006 958672 982892
35474I82892J144266O22860m05214j092818j752064k202073j382641N61342J707457
$$ 982892 2127158 2750018 2344804 1251986 -500078 -2702151 -4084792 -3523450 -1815993
35465a815993J033969N1367M29696J447149J362545J75189o67367n47161j10355
$$ -1815993 -782024 -730657 -300961 1146188 2508733 2683922 2016555 1469394 1359039
35456A359039L5656k54627r99741j665925j088304Q89633K378305J520376q51698
$$ 1359039 1394695 1140068 140327 -1525598 -2613902 -1724269 654036 2174412 1322714
35447A322714k101953j074165Q36203J701864R64231n08598j239699l12613J384585
$$ 1322714 -779239 -1853404 -1017201 684663 1648894 1140296 -99403 -412016 972569
35438I72569J686656p1348j735150j209295M07947N92805n65886p56039L98160
$$ 972569 2659225 2587877 852727 -356568 51379 644184 78298 -677741 -279581
35429b79581O38250q30033j581496J10428K146728J649249o61695j728063p74731
$$ -279581 358669 -471364 -2052860 -1942432 204296 1853545 1191850 -536213 -1310944
35420a310944N0843n13285r81008J98580K042362K406489R19922o97217q68976
$$ -1310944 -1260101 -1773386 -2754394 -2555814 -513452 1893037 2812959 2115742 1246766
35411A246766K19166J214090J192125M78500Q0774M25593P71715J10332j388130
$$ 1246766 1465932 2680022 3872147 4350647 4431421 4857014 5628729 5739061 4350931
35402D350931k290920j543674J77812J217541Q33566k02316q23791q12115n16906
$$ 4350931 2060011 516337 694149 1911690 2745256 2542940 1719149 907034 390128
35393C90128j03168L96010O86716M91361N0871j58507p2411O6330K65884O62321
$$ 390128 286960 682970 1369686 1861047 1911918 1753411 1681000 1747330 2013214 2675535
35383B675535R71448P11419n0163p78904j254156j597048j589037q34455K62090
$$ 2675535 3646983 4358402 4308239 3529335 2275179 678131 -910906 -1745361 -1483271
35374a483271O00758j43110r17316o45570M09629J114384Q58258R1334k44849
$$ -1483271 -882513 -1025623 -1942939 -2588509 -2178880 -1064496 -206238 -114904 -359753
35365c59753L33055J192306J047838l87369j593140j035733N65891J119496J72319
$$ -359753 -26698 1165608 2213446 1826077 232937 -802796 -236905 882591 1054910
35356A054910o49077m18931j75436o75635q58218J82697J381011J420327Q75564
$$ 1054910 405833 -13098 -188534 -864169 -1722387 -1539690 -158679 1261648 2137212
35347B137212R16083J037521m858j790402k649478k040087q77226J11205Q48288
$$ 2137212 3053295 4090816 4085958 2295556 -353922 -2394009 -3271235 -3160030 -2311742
35338b311742J130738Q45703O06632Q81053J021463M70847J51347J038130K095738
$$ -2311742 -1181004 -335301 271331 1152384 2173847 2644694 2796041 3834171 5929909
35329E929909J512771n14717k089945k246477j459474j65993J148666J076868
$$ 5929909 7442680 6927963 4838018 2591541 1132067 966074 2114740 3191608
35321C191608r95198k776151j532076J475757K171921l63833k467180j454034
$$ 3191608 2196410 -579741 -2111817 -636060 1535861 1172028 -1295152 -2749186
35313b749186O88041R43488k74404o53337J93330R48670J172768J280524R08896
$$ -2749186 -2061145 -1117657 -1392061 -2045398 -1852068 -903398 269370 1549894 2458790
35304B458790n17709k111907k224668o34456J190315J785715Q99852m90170q85124
$$ 2458790 1941081 -170826 -2395494 -3029950 -1839635 -53920 845932 355762 -529362
35295e29362K14821J242457K98240j816406k209174j73048J489421P24911o24127
$$ -529362 -314541 927916 1226156 -590250 -2799424 -2972472 -1483051 -758140 -1382267
35286a382267L952J719222J889093M75083l47031l0218p9132q95183j109138l73861
$$ -1382267 -1378315 340907 2230000 2705083 2358052 2327834 2248702 1353519 244381 -129480
35276a29480k24772j361362k179633j128800R41183J952679J284934K88476L51404
$$ -129480 -354252 -1715614 -3895247 -5024047 -4082864 -2130185 -845251 -556775 -205371
35267b05371J071461P01817j406256l309307k535666M10516K276098J337297m36482
$$ -205371 866090 1567907 161651 -3147656 -5683322 -5272806 -2996708 -1659411 -2095893
35258b095893n71149N73437J315708J559833J958053J798245L16988j148497j022161
$$ -2095893 -2667042 -2093605 -777897 781936 2739989 4538234 4855222 3706725 2684564
35249B684564l53366r09019j561312q7582K194264J683300j555995l329122j646133
$$ 2684564 2331198 1422179 -139133 -226715 1967549 3650849 2094854 -1234268 -2880401
35240b880401N89044P38410K93928J234022K046601N67957j755024j904960p6141
$$ -2880401 -2291357 -1552947 -1259019 -24997 2021604 2589561 834537 -1070423 -1146564
35231a146564Q46255j60708j117381l46316J357744K137899J216610n16539j291337
$$ -1146564 -300309 -461017 -1578398 -1924714 -566970 1570929 2787539 2271000 979663
35222I79663j96416J383667J051507j274605k775621j500180R10801J740937Q77261
$$ 979663 783247 2166914 3218421 1943816 -831805 -2331985 -1421184 319753 1197014
35213A197014J24957J86394M32229O81967J063846Q58234m37441j572327j145296
$$ 1197014 1321971 1508365 1940594 2622561 3686407 4544641 4107200 2534873 1389577
35204A389577m8858j11923j001309r63289r5204k6278n47419K50586K088932K086198
$$ 1389577 1340719 1228796 227487 -735802 -831006 -857284 -1404703 -1154117 934815 3021013
35194C021013n96307k775725j740944Q50987J758895P14955k74587n04828o67287
$$ 3021013 2424706 -351019 -2091963 -1240976 517919 1232874 958287 453459 -213828
35185b13828m51922R85869K508160J802794r66053k821437k012511j78292N46510
$$ -213828 -665750 320119 2828279 4631073 3665020 843583 -1168928 -1347220 -800710
35176h00710M99557R85725J507574O86380q99857j116842M77479J796872J181196
$$ -800710 -301153 684572 2192146 2878526 1978669 861827 1339306 3136178 4317374
35167D317374m44610j189833o37736L52124J147285J404247N39700j363807k697178
$$ 4317374 3872764 2682931 2045195 2397319 3544604 4948851 5488551 4124744 1427566
35158A427566j981056j11114O99214J04494j22950P50713J149578l6574j390229
$$ 1427566 -553490 -664604 34610 139104 16154 766867 1916445 1879871 489642
35149D89642j144004J33063P35377M89832L55760L11285k76547p61979P0599J555835
$$ 489642 -654362 -521299 214078 703910 1059670 1370955 1094408 332429 403028 1958863
35139A958863J612766q5057j475844j189447l10135k32481n71077l86519J1991
$$ 1958863 3571629 3486572 2010728 821281 511146 278665 -292412 -678931 -666940
35130f66940j05575l84152j56981R8375m42101j212866q05887Q62840K215526
$$ -666940 -772515 -1156667 -1313648 -1215273 -1657374 -2870240 -3676127 -2813287 -597761
35121e97761K026526Q26669j2199L6819K64079j80225j022194r73724N13023J906576
$$ -597761 1428765 2255434 2243235 2280054 2544133 2363908 1341714 367990 881013 2787589
35111B787589J085018j605702l129596j519646J320403K038018K72448j185062
$$ 2787589 3872607 2266905 -862691 -2382337 -1061934 976084 1248532 63470
35103F3470n01025R25843R04310m99228j526108j323049o40882l10858j88663
$$ 63470 -437555 488288 1392598 893370 -632738 -1955787 -2596669 -2907527 -3096190
35094c096190K37510Q89431J078379L04403r68830j456724l83600J291640J667651
$$ -3096190 -2858680 -1969249 -890870 -586467 -1555297 -3012021 -3395621 -2103981 -436330
35085d36330K76718j111647q05821M15947M62708q70049j476210p8796J772312
$$ -436330 -159612 -1271259 -2077080 -1661133 -1198425 -2068474 -3544684 -3623480 -1851168
35076a851168J898137N47214k18524L93635J092161P74144K3224k10630j33387
$$ -1851168 46969 594183 375659 769294 1861455 2635599 2658823 2448193 2314806
35067B314806l99876p57706m43938M87212J144411R53175J72770o11840j001743
$$ 2314806 1914930 1157224 713286 1200498 2344909 3298084 3470854 2859014 1857271
35058A857271r36626p33678p61461q18439l06876O45301R68173J85568o10242
$$ 1857271 920645 186967 -574494 -1392933 -1699809 -1054508 -86335 99233 -511009
35049e11009k48833P49566J061058O27680M25635N51239J73274o68758r22471
$$ -511009 -759842 -10276 1050782 1678462 2104097 2655336 2828610 2159852 1237381
35040A237381m09174j83273n79176n82176K02517O57686J68403j18655P00320
$$ 1237381 828207 644934 65758 -516418 -313901 343785 512188 393533 1093853
35031A093853J503430Q80784n62380j274803j102589q29482l08297R34989J867169
$$ 1093853 2597283 3478067 2915687 1640884 538295 -291187 -599484 335505 2202674
35022B202674R68412j039051j674797k02680J341595J161995r2507q91137q95467
$$ 2202674 3171086 2132035 457238 254558 1596153 2758148 2665641 1774504 879037
35013H79037m50139N18757J791914K137596P37828j292717k110444j493712p88642
$$ 879037 428898 947655 2739569 4877165 5614993 4322276 2211832 718120 -70522
35004g0522o91235l67096Q69206K009074J385707r55212k802047k231106p6128
$$ -70522 -761757 -1128853 -259647 1749427 3135134 2179922 -622125 -2853231 -2929359
34995b929359J011503N4179r33394R1211K110245K501460R20024l03264K69756
$$ -2929359 -1917856 -1863677 -2797071 -2705860 -595615 1905845 2825869 2522605 2792361
34986B792361J255199Q27940o92747j766152j817489j251814l10833P63934J178408
$$ 2792361 4047560 4875500 4182753 2416601 599112 -652702 -963535 -199601 978807
34977I78807N00018l97689m87136j91847n92572j408614j189532M36083J958769
$$ 978807 1478825 1081136 594000 402153 -190419 -1599033 -2788565 -2352482 -393713
34968c93713J829839K97657r94802q05816N32513J516296J045842l41817j147398
$$ -393713 1436126 1733783 738981 -66835 465678 1981974 3027816 2685999 1538601
34959A538601q41638l48186l05893J3646J160862J952198R29406j196582k183184
$$ 1538601 696963 348777 42884 56530 1217392 3169590 4098996 2902414 719230
34950G19230j238133J42665M91876J12415J9635L10105L30220j94112q15174q71800
$$ 719230 -518903 -376238 115638 228053 247688 557793 888013 693901 -121273 -993073
34940i93073j40674P63837Q05908j75232r13704k26111J251261J857309J233599
$$ -993073 -1133747 -369910 435998 260766 -652938 -879049 372212 2229521 3463120
34931C463120O08354P10651P88257J54370n40293l72504L70660O06158r8752j104148
$$ 3463120 4071474 4782125 5570382 5724752 5184459 4811955 5182615 5788773 5690021 4585873
34921D585873j505777j086948n88527q72612j558077j140385P32118J961608N48542
$$ 4585873 3080096 1993148 1404621 532009 -1026068 -2166453 -1434335 527273 1075815
34912A075815k105274k561149n6654K466847K620383J414714O95248J80567r99341
$$ 1075815 -1029459 -3590608 -3647262 -1180415 1439968 2854682 3549930 3730497 2731156
34903B731156j836961j039224K48632k599j197258r08741J068727K241059J354816
$$ 2731156 894195 -145029 103603 101004 -1096254 -2004995 -936268 1304791 2659607
34894B659607K09068N56707J419978R89292m05413r84270l22256K07964m08284
$$ 2659607 2868675 3425382 4845360 5834652 5429239 4444969 4122713 4330677 3922393
34885C922393j543092j997678j488639o74340j51572J14213L96640O35646N93762
$$ 3922393 2379301 381623 -1107016 -1781356 -1932928 -1818715 -1422075 -786429 -192667
34876a92667M31167N75894R20759P97898P0519m61086k81949o2056n60159j299035
$$ -192667 238500 814394 1735153 2533051 2603570 2142484 1860535 1798479 1238320 -60715
34866f0715j319173o96942j66504L15767J261366K118138J575685l73298j998178
$$ -60715 -1379888 -2076830 -2243334 -1927567 -666201 1451937 3027622 2654324 656146
34857F56146j885379m10618J140835J895565J540339K61146r80789j062239p0990
$$ 656146 -1229233 -1639851 -499016 1396549 2936888 3198034 2217245 1155006 1084016
34848A084016P49942P20794L94126K08413k61009j069595j185796j0004J358376
$$ 1084016 1833958 2554752 2948878 3157291 2896282 1826687 640891 630887 1989263
34839A989263J481239N00360l72943o86852r35054j302430j347859q36337k2540
$$ 1989263 3470502 3970862 3597919 2911067 1976013 673583 -674276 -1510613 -1533153
34830a533153Q15106J439765J451290P20700j42738m17386j66572J04877L53981
$$ -1533153 -718047 721718 2173008 2893708 2750970 2333584 2167012 2271889 2625870
34821B625870P62033R08687K23045q09872j030038m04359k66267j144799j479040
$$ 2625870 3387903 4296590 4519635 3709763 2679725 2275366 2009099 864300 -614740
34812f14740K69244K815181L030093P3152k970041k777798j37228J224033q3550
$$ -614740 -345496 2469685 5499778 5572930 2602889 -174909 -312137 911896 828346
34803H28346j307647L7397K192741J813345p68161j937722k77905J511901J109599
$$ 828346 -479301 -441904 1750837 3564182 2796021 858299 580394 2092295 3201894
34794C201894L7138O38194J896319J112298j448285k662784j210363O42898N96338
$$ 3201894 3239032 3877226 5773545 6885843 5437558 2774774 1564411 2207309 2803647
34785B803647o28031j010461l40594M252m90471q48166l29958L82204J29156j104971
$$ 2803647 2175616 1165155 824561 828813 338342 -509824 -839782 -457578 -328422 -1433393
34775a433393j942517j059073J187643K849562K407574N02689q42310o30760J66209
$$ -1433393 -3375910 -4434983 -3247340 -397778 2009796 2512485 1670175 1039415 1205624
34766A205624K23671l57517m58988L53219J308824J544267J054997L62256k05312
$$ 1205624 1429295 1071778 612790 966009 2274833 3819100 4874097 5236353 5031041
34757E031041n24779m28055k0293M4167o12471j102867j82503J595083J936570
$$ 5031041 4506262 4078207 4057914 4102081 3489610 2386743 2204240 3799323 5735893
34748E735893j08837k370097k315352o02835J13951o72677r03421K44768R75977
$$ 5735893 5627056 3256959 941607 338772 452723 -219954 -1123375 -878607 97370
34739I7370K70491j16197J130861K105598O64828j653377j763700J9445N07831
$$ 97370 367861 251664 1382525 3488123 4152951 2499574 735874 755319 1263150
34730A263150j199835k457958j464170K32377P82215Q64070J738879K615306K040464
$$ 1263150 63315 -2394643 -3858813 -3626436 -2844221 -1980151 -241272 2374034 4414498
34721D414498N50550r8703L98415P17715n858j273480k143028k018821q50278
$$ 4414498 4965048 4866345 5264760 5982475 5976617 4703137 2560109 541288 -308990
34712c08990N86094J040770K65113l95538K30983J381332J427895K06325r54671
$$ -308990 277104 1317874 1582987 1187449 1418432 2799764 4227659 4433984 3479313
34703C479313j247614j145102j133696q87885m5781J012361J514559R83180m36068
$$ 3479313 2231699 1086597 -47099 -934984 -980765 31596 1546155 2529335 2093267
34694B093267j851302k038604o85772R27669J273614M54475j54655J3914J99480
$$ 2093267 241965 -1796639 -2482411 -1554742 -281128 173347 18692 32606 232086
34685B32086p546J29044R74860J483186P24782m55944n62779L43162Q64142L98314
$$ 232086 224540 353584 1328444 2811630 3536412 3080468 2517689 2860851 3724993 4123307
34675D123307k96760o22829q22931r09703l37385O77016Q61951j74106r46970
$$ 4123307 3826547 3203718 2380787 1471084 1133699 1810715 2672666 2498560 1551590
34666A551590k41170Q52220O18230m36285m31333O00071O09643r99504k136309
$$ 1551590 1310420 2162640 2780870 2344585 1913252 2513323 3122966 2123462 -12847
34657a2847j198884N45786J109122N79153J67443k2510l77861k09408R84727J655861
$$ -12847 -1211731 -665945 443177 1022330 1189773 1167263 789402 579994 1564721 3220582
34647C220582J45516k028663j649809J301927L101245J470020j326869k026190
$$ 3220582 3366098 1337435 -312374 989553 4090798 5560818 4233949 2207759
34639B207759p48015J28413k17352o57661o14718o61472q55866m13030P69552
$$ 2207759 1459744 1588157 1370805 713144 98426 -563046 -1418912 -1831942 -1062390
34630a062390J726479J803368J233291K13088j304856k575846k186600m7477J758968
$$ -1062390 664089 2467457 3700748 3913836 2608980 33134 -2153466 -2200943 -441975
34621d41975J276140o93806j500278j35802J487200J308348J4525j08316J346676
$$ -441975 834165 140359 -1359919 -1495721 -8521 1299827 1314352 1206036 2552712
34612B552712K302181J361560j51514m22214j6362p48002k415045k781667r26519
$$ 2552712 4854893 6216453 6064939 5642725 5626363 4878361 2463316 -318351 -1244870
34603a244870J294532J766335N92255p40302j380043j306666n38344O69324J389347
$$ -1244870 49662 1815997 2408252 1667950 287907 -1018759 -1557103 -887779 501568
34594E01568Q43181n26147j465973j259486k96343M54435L34710l34393m75526
$$ 501568 1344749 818602 -647371 -1906857 -2203200 -1748765 -1414055 -1748448 -2223974
34585b223974M18158J436593J478702Q91029O63610M41365q05274k238893j705262
$$ -2223974 -1805816 -369223 1109479 2000508 2664118 3105483 2300209 61316 -1643946
34576a643946O04146J672003J17256j498185p88928N95102N9253j162147r5977
$$ -1643946 -1039800 632203 749459 -748726 -1537654 -942552 -883299 -2045446 -2141423
34567b141423K329450K105174j262692l266488r29176K805751L522813J415744
$$ -2141423 188027 2293201 1030509 -2235979 -3165155 -359404 3163409 4579153
34559D579153L9416P08334J288066J03190j707046k221207j221980J27058Q83091
$$ 4579153 4618569 5326903 6614969 6718159 5011113 2789906 1567926 1694984 2578075
34550B578075Q30819J48857o84975j006864n66717R1577K36324j31660l58459
$$ 2578075 3408894 3557751 2872776 1865912 1299195 1390772 1627096 1495436 1136977
34541A136977j66421p9469m66443o76617Q3557J259467J429119M23983k70274
$$ 1136977 970556 891087 424644 -251973 -168416 1091051 2520170 2944153 2673879
34532B673879K01093O77382m1160r94705m49607J220518J907823Q60839m43618
$$ 2673879 2874972 3552354 3511194 2516489 2066882 3287400 5195223 6056062 5612444
34523E612444p60841o51944r70631j331171j052461m55010j51449Q9060P00730
$$ 5612444 4851603 4199659 3229028 1897857 845396 390386 238937 327997 1028727
34514A028727J196474P82729k73026r11595p56758l95935k03654J85835R27235
$$ 1028727 2225201 3007930 2734904 1823309 1066551 670616 466962 652797 1580032
34505A580032J259417M26531j017519j600199p61883L86610O21896L36896P91327
$$ 1580032 2839449 3265980 2248461 648262 -113621 272989 894885 1231781 2023108
34496B023108J906100K101065O61255j013537j341758o95289m97804r91589j225268
$$ 2023108 3929208 6030273 6691528 5677991 4336233 3640944 3143140 2151551 926283
34487I26283q03543k96686p0059Q9325K28340J64214Q3482K24458J77102m10023
$$ 926283 122740 -173946 -244005 -154680 73660 237874 321356 545814 722916 312893
34477C12893p21121K60441J808627K037631O19172o19816k83078Q04111J049777
$$ 312893 -408228 -147787 1660840 3698471 4317643 3697827 3414749 4218860 5268637
34468E268637J63775r84467j651172j615348r55973n2394N87451P57875M83588
$$ 5268637 5432412 4447945 2796773 1181425 225452 173058 760509 1518384 2001972
34459B001972k43719r98119p10538Q95492K131542J213806r64299j851987r81376
$$ 2001972 1758253 760134 49596 945088 3076630 4290436 3326137 1474150 492774
34450D92774l81107q87192p18352J095433K459796J382135o38405q18466O79504
$$ 492774 111667 -775525 -1493877 -398444 2061352 3443487 2805082 1986616 2666120
34441B666120J325980L19451n00353J49333J144011R03397m09861j424617j327964
$$ 2666120 3992100 4311551 3811198 3960531 5104542 6007939 5598078 4173461 2845497
34432B845497m41535M50884Q98770J030405J089186Q49149o1068j249345j734956
$$ 2845497 2403962 2854846 3753616 4784021 5873207 6722356 6661288 5411943 3676987
34423C676987j251391n29325k3713N75806J167508Q72013m24597j433249j274498
$$ 3676987 2425596 1896271 1872558 2448364 3615872 4487885 4063288 2630039 1355541
34414A355541o78994l93415J89540J487942K242012J308465j86979l98172M20001
$$ 1355541 676547 283132 472672 1960614 4202626 5511091 5324112 4925940 5345941
34405E345941O19400k3947l10117K3739Q3591k69207l87636n89366j717581k868903
$$ 5345941 5965341 5941394 5631277 5655016 5738607 5469400 5081764 4492398 2774817 -94086
34395i4086j952601R07992K796106J819756m28120j429859j034631o54808n26427
$$ -94086 -2046687 -1138695 1657411 3477167 3049047 1619188 584557 -70251 -596678
34386e96678K92966J693981K089007N71857j571774k176999p07370J106098J334074
$$ -596678 -303712 1390269 3479276 4051133 2479359 302360 -405010 701088 2035162
34377B035162J66380n28584J10426Q27611L51961o47284q52315m57888m27953
$$ 2035162 2201542 1672958 1783384 2610995 2962956 2315672 1463357 1005469 577516
34368E77516l98276O61227K039459J793910q7347j216345k47857J145257Q83022
$$ 577516 179240 840467 2879926 4673836 4586489 3370144 3122287 4267544 5150566
34359E150566n04984r28089J83040J295692R19464p07074k026202j766868k32823
$$ 5150566 4645582 3717493 3900533 5196225 6115689 5408615 3382413 1615545 1382722
34350A382722R55997P21670j47539k46841K99712K42091m20065k10265J239367
$$ 1382722 2338719 3060389 2912850 2666009 2965721 3207812 2787747 2577482 3816849
34341C816849K109820R05101j294400k300758j621072n95414l28793n94123n65948
$$ 3816849 5926669 6831770 5537370 3236612 1615540 1020126 691333 97210 -468738
34332d68738J35212J096425J521035J150623O61755O32981M98197m23861j231992
$$ -468738 -333526 762899 2283934 3434557 4096312 4729293 5227490 4803629 3571637
34323C571637m32903J339625J612595l11333k079401j719117l57779M4275j59825
$$ 3571637 3138734 4478359 6090954 5779621 3700220 1981103 1623324 1667599 1507774
34314A507774M47380J324160P60109q95581j353560J03783J417977P48768r63012
$$ 1507774 1955154 3279314 4039423 3143842 1790282 1894065 3312042 4060810 3097798
34305C097798j407352N3686J688468J508840l91776j813398j005003R55344J309255
$$ 3097798 1690446 1744132 3432600 4941440 4549664 2736266 1731263 2686607 3995862
34296C995862n81822k008290n65096K262728K940599O06070k040990k463702j017728
$$ 3995862 3414040 1405750 840654 3103382 6043981 6650051 4609061 2145359 1127631
34287A127631L93716P68463L94470p7214j72519K08089P06071R56432J046156
$$ 1127631 1521347 2289810 2684280 2607066 2434547 2642636 3348707 4305139 5351295
34278E351295J036184M56823q36041j766890j246969J6926L51256l85901p50062
$$ 5351295 6387479 6844302 6008261 4241371 2994402 3011328 3362584 2976683 2226621
34269B226621k10993J12922l64982o67785k18580l5675p69508j155619k24J526546
$$ 2226621 2015628 2128550 1763568 1095783 877203 841528 72020 -1083599 -1083823 442723
34259D42723J389903k49635j246664m36011J151810J953952J464009J85629q94104
$$ 442723 1832626 1582991 336327 -99684 1052126 3006078 4470087 4655716 3761612
34250C761612q34458K69962R83006J91241j206266j416610k73172P29258P67828
$$ 3761612 2927154 3197116 4180122 4371363 3165097 1748487 1475315 2204573 2972401
34241B972401N09763N09296M20293J58383K37478M43800j62794j264029j139106
$$ 2972401 3482164 3991460 4411753 4570136 4807614 5251414 5088620 3824591 2685485
34232B685485M80402J359083R8844j337830n73813J272791J304255n36071j592962
$$ 2685485 3165887 4524970 4623814 3285984 2712171 3984962 5289217 4753146 3160184
34223C160184q98478k40093m99598j67705J360702J992749K86723j787240j631639
$$ 3160184 2261706 2021613 1522015 1354310 2715012 4707761 4994484 3207244 1575605
34214A575605K05171J271344Q35232K2344n42799r21725n50534Q93039J911460
$$ 1575605 1780776 3052120 3887352 3909696 3366897 2445172 1894638 2787677 4699137
34205D699137Q70318j119240j465042q9355M80262p04286j467226j08639J849230
$$ 4699137 5569455 4450215 2985173 2895818 3376080 2671794 1204568 1095929 2945159
34196B945159K003823M19508r38278r31016k821R57985J313139P96652j48967
$$ 2945159 4948982 5368490 4430212 3499196 3496375 4454360 5767499 6564151 6415184
34187F415184n80341j39685N48265P98006M81827l18383j274848j434970k12771
$$ 6415184 5834843 5695158 6243423 7041429 7523256 7204873 5930025 4495055 4282284
34178D282284J171967R10675m86507n24136J385947K634150J278510r93964j593302
$$ 4282284 5454251 6364926 5878419 5354283 6740230 9374380 10652890 9658926 8065624
34169H065624q02867n64643r87392o87521K60042L80004m62574p72816N4858R93531
$$ 8065624 7262757 6698114 5710722 5023201 5283243 5663247 5200673 4427857 4482715 5476246
34159E476246J302971J277408Q78412m61566k218358k708901j332632M83954J179181
$$ 5476246 6779217 8056625 8935037 8473471 6255113 3546212 2213580 2697534 3876715
34150C876715P22212m5250n39202m53174K25081P92341M87452j49498J94727J401016
$$ 3876715 4598927 4553677 4014475 3561301 3786382 4578723 5066175 4916677 5111404 6512420
34140F512420J694655K56027j380825j468443l34032N58555P22952N43700k7983
$$ 6512420 8207075 8463102 7082277 5613834 5279802 5838357 6561309 7105009 7077026
34131G077026j139345j903987j198935M56071J251980N76610j38328L98806J439595
$$ 7077026 5937681 4033694 2834759 3290830 4542810 5119420 4981092 5379898 6819493
34122F819493J422494L47947l21057M7351L71261l06714j232697j160377m11156
$$ 6819493 8241987 8589934 8268877 8316228 8687489 8380775 7148078 5987701 5576545
34113E576545l75790j184433j364114j27167J408230J959763J736240J383513
$$ 5576545 5200755 4016322 2652208 2525041 3933271 5893034 7629274 9012787
34105I012787N61782r75661j908796q59467J097445J449364k08582j613769j197853
$$ 9012787 9574569 8598908 6690112 5830645 6928090 8377454 8168872 6555103 5357250
34096E357250m2205L44498L29763Q68150J390347P60535n18145q92354k15334
$$ 5357250 5315045 5659543 5989306 6857456 8247803 9008338 8490193 7597839 7382505
34087G382505J01552n70969j174209p87111L92K01354j39303m04067m55550l78048
$$ 7382505 7484057 6913088 5738879 4951768 4952160 5153514 5014211 4610144 4154594 3776546
34077C776546J62463J318137K245653J922256O05555m55933o67968m97837l18972
$$ 3776546 3939009 5257146 7502799 9425055 10030610 9574677 8906709 8408872 8089900
34068H089900J0152K81978o6225o51669j55212J560223K557672J232181j286149
$$ 8089900 8100052 8382030 8315805 7664136 7508924 9069147 11626819 12859000 11572851
34059A1572851k439401j349626O10824J807939J622346K21768j536739k226725
$$ 11572851 9133450 7783824 8394648 10202587 11824933 12046701 10509962 8283237
34051H283237j150801O49495J654451J587530Q69681n40497k154406k086231M47657
$$ 8283237 7132436 7781931 9436382 11023912 11893593 11353096 9198690 7112459 7560116
34042G560116K781480J877502r13546j564601M18604J441023r4588j450853o72285
$$ 7560116 10341596 12219098 11305552 9740951 10159555 11600578 11505990 10055137 9382852
34033I382852K49516m31035q49291O78289K022079Q77663r38571n95306Q62931
$$ 9382852 9632368 9201333 8352042 9030331 11052410 11930073 10991502 10396196 11259127
34024A1259127O84145o57271q22358j33984m47383r36195M57932K351170J419302
$$ 11259127 11943272 11286001 10463643 10329659 9882276 8946081 9404013 11755183 13174485
34015A3174485j795539l206965j410436Q31596J637297K080800K547072J519982
$$ 13174485 11378946 8171981 6761545 7593141 9230438 11311238 13858310 15378292
34007A5378292o93898j210736P71761K303463J442011R8809J60123L00513q48608
$$ 15378292 14684394 13473658 14245419 16548882 17990893 18089702 18249825 18550338 17701730
33998A7701730j517338J91039K465622K147631m75164k088491r36442J255948
$$ 17701730 16184392 16375431 18841053 20988684 20513520 18425029 17488587 18744535
33990A8744535J845304L10958j446186j381159J93976R66788L6681m20833J431197
$$ 18744535 20589839 20900797 19454611 18073452 18267428 19234216 19270897 18850064 20281261
33981B0281261L587667K905392J37681j225780m62825m052n49630k01377J123731
$$ 20281261 23868928 26774320 26912001 25686221 25223396 25219344 24669714 24468337 25592068
33972B5592068J016094o43336p86378J416547K703861J247542l12937L15984J396872
$$ 25592068 26608162 25964826 25178448 26594995 29298856 30546398 30233461 30549445 31946317
33963C1946317R41016K90697J067702K071984K037305K153684L185753L395243
$$ 31946317 32887333 33178030 34245732 36317716 38355021 40508705 43694458 47089701
33955D7089701J875353O17498R75490J651265K142468L926301O278889O018329
$$ 47089701 48965054 49582552 50558042 52209307 54351775 58278076 64556965 70575294
33947G0575294L642873L832894P272251Q905353P418911P996462J1498536J1542361
$$ 70575294 74218167 78051061 85323312 94228665 101647576 109644038 121142574 132684935
33939A32684935Q766365J4256125K6181991J7106060l3183012r7816638j21232021
$$ 132684935 141451300 155707425 181889416 198995476 165812464 67995826 -53236195
33932e3236195q2219658j8326202K0373524K3349488J4338964J1593053J2379147
$$ -53236195 -135455853 -153782055 -133408531 -110059043 -95720079 -84127026 -71747879
33925g1747879R149020K147850n051487j0430140j1714403p384630o57967L199322
$$ -71747879 -62598859 -60451009 -65502496 -75932636 -87647039 -95031669 -95689636 -92490314
33917i2490314L612356M015146N456233N943909N223037N078253N309749M016917
$$ -92490314 -88877958 -84862812 -79406579 -73462670 -68239633 -63161380 -57851631 -53834714
33909e3834714J610449M45957Q24996J089811J094724J898813K685996J744066
$$ -53834714 -52224265 -51778308 -50953312 -49863501 -48768777 -46869964 -44183968 -42439902
33901d2439902j4779j45140J197722J756712J304329J610831K587638K237484
$$ -42439902 -42454681 -42599821 -41402099 -39645387 -38341058 -36730227 -34142589 -31905105
33893c1905105N91856Q5564J452113K481467J661626K41902k51413j71096m30127
$$ -31905105 -31313249 -31227685 -29775572 -27294105 -25632479 -25390577 -25641990 -25813086 -26243213
33884b6243213q53413p11316K84872J817101K872975K210437J9686j623916j270196
$$ -26243213 -27096626 -27807942 -27523070 -25705969 -22832994 -20622557 -20602871 -22226787 -23496983
33875b3496983m6280L79667M09229J112595J656612O77314q55988q93005L11657
$$ -23496983 -23543263 -23163596 -22754367 -21641772 -19985160 -19307846 -20163834 -21056839 -20745182
33866b0745182P66662J20790k05831K16343N77352Q49713J376665J047222j106822
$$ -20745182 -19978520 -19857730 -20063561 -19847218 -19269866 -18420153 -17043488 -15996266 -17103088
33857a7103088k988291j543672K226709L947498K056804k26657j15841J012983
$$ -17103088 -20091379 -21635051 -19408342 -15460844 -13404040 -13630697 -13746538 -12733555
33849a2733555P51330m44322o48001L27026J184067J227923O11730l46262r15478
$$ -12733555 -11982225 -12426547 -13074548 -12747522 -11563455 -10335532 -9723802 -10070064 -10985542
33840a0985542k15111J293120J845458Q26049j92356J34788Q54886L20985j263945
$$ -10985542 -11200653 -9907533 -8062075 -7236026 -7428382 -7293594 -6438708 -6117723 -7381668
33831g381668k280435j964232j016604l18724j0602K49748P05754J223267J456015
$$ -7381668 -9662103 -11626335 -12642939 -12961663 -12972265 -12722517 -12016763 -10793496 -9337481
33822i337481J306574R74813M22036n44519j279310n16395J463168K155340k4450
$$ -9337481 -8030907 -7056094 -6634058 -7178577 -8457887 -8974282 -7511114 -5355774 -5380224
33813e380224k918781l029742j58913K577255L050699K040268Q40906m63213j713745
$$ -5380224 -8299005 -11328747 -11487660 -8910405 -5859706 -3819438 -2978532 -3441745 -5155490
33804e155490j958999j029661j26419j6430j39010o3759k24095o41099n75772
$$ -5155490 -7114489 -8144150 -8270569 -8286999 -8426009 -8489768 -8713863 -9354962 -9930734
33795i930734l4087N8128k67711J94012J473001J797279L01183j445712j748956
$$ -9930734 -9964821 -9906693 -10174404 -9980392 -8507391 -6710112 -6408929 -7854641 -9603597
33786i603597r85167l30902Q7793M63516K24576q08538j368229l50934J377996
$$ -9603597 -10588764 -10919666 -10831873 -10368357 -10143781 -10952319 -12320548 -12671482 -11293486
33777a1293486K107605J515384O76003M60451Q39020J236099R75365q359o70327
$$ -11293486 -9185881 -7670497 -6994494 -6534043 -5695023 -4458924 -3483559 -3491918 -4162245
33768d162245p1545Q40796K36086j537596j932473n8766J605347P68640j367512
$$ -4162245 -4233790 -3392994 -3156908 -4694504 -6626977 -6685743 -5080396 -4311756 -5679268
33759e679268k154952j204339l5830O07677R03598M49421j037859k121845j059310
$$ -5679268 -7834220 -9038559 -9074389 -8466712 -7563114 -7113693 -8151552 -10273397 -11332707
33750a1332707J336853K322490Q59924j135983j492899k38337J051665J209102
$$ -11332707 -9995854 -7673364 -6813440 -7949423 -9442322 -9680659 -8628994 -7419892
33742g419892L45021m95563l42911N88283J034035M01385k72775J30007J049152
$$ -7419892 -7074871 -7570434 -7913345 -7325062 -6291027 -5889642 -6162417 -6032410 -4983258
33733d983258J151283L40682m67237j048784j813732k353146j717592j84970Q24574
$$ -4983258 -3831975 -3491293 -3958530 -5007314 -6821046 -9174192 -10891784 -11076754 -10252180
33724a0252180Q26856P77479J160919J117232J32613q04439o89733k9797K01400
$$ -10252180 -9425324 -8647845 -7486926 -6369694 -6237081 -7041520 -7731253 -7761050 -7559650
33715g559650K29056Q18127J521777J052241o23887j885044j540309k67158O36657
$$ -7559650 -7330594 -6512467 -4990690 -3938449 -4562336 -6447380 -7987689 -8254847 -7618190
33706g618190J025980J497025J848871J256358j08199r48734p08974l73495p52734
$$ -7618190 -6592210 -5095185 -3246314 -1989956 -2098155 -3046889 -3755863 -4129358 -4882092
33697d882092j091617l99698P56799J093206O20480M09983P10920P70802L92294
$$ -4882092 -5973709 -6373407 -5616608 -4523402 -3902922 -3492939 -2782019 -2011217 -1618923
33688a618923J92494K58704l0398o85495r83214q33307q62229r69544l75324O26860
$$ -1618923 -1426429 -1167725 -1198123 -1883618 -2866832 -3700139 -4562368 -5531912 -5907236 -5280376
33678e280376P35344n3833j28871R51932J386485R1526j221652o85382O62169
$$ -5280376 -4545032 -4598865 -4727736 -3775804 -2389319 -2297793 -3519445 -4204827 -3542658
33669c542658O00615o62983r95138J24147R43462L69955n47297n88592j54009
$$ -3542658 -2942043 -3605026 -4600164 -4476017 -3532555 -3162600 -3709897 -4298489 -4452498
33660d452498k54104q21762r39987k26267P25486J179684J122219J099497J247602
$$ -4452498 -4706602 -5528364 -6468351 -6694618 -5969132 -4789448 -3667229 -2567732 -1320130
33651a320130R02597l34819j505834j252391J27437P73503k08708j481712j364752
$$ -1320130 -417533 -752352 -2258186 -3510577 -3383140 -2609637 -2818345 -4300057 -5664809
33642e664809O5741J495857K017120J476927J53305j060890j052785M2113O24955
$$ -5664809 -5599068 -4103211 -2086091 -609164 -455859 -1516749 -2569534 -2527421 -1902466
33633a902466k41888j407242j300503j56067N15956Q799j013380j483184p62345
$$ -1902466 -2144354 -3551596 -4852099 -5008166 -4492210 -4483411 -5496791 -6979975 -7742320
33624g742320Q32604J871430J147648m49033p78950L76676Q71313k57560j077719
$$ -7742320 -6909716 -5038286 -3890638 -4339671 -5118621 -4741945 -3870632 -4128192 -5205911
33615e205911q6740J096070N36077o09898j94830J092303J050417r2464k87622
$$ -5205911 -5292651 -4196581 -3660504 -4270402 -4465232 -3372929 -2322512 -2414976 -2702598
33606b702598N24023M71978o80241j186279n27935J1115Q1341O01477J164163
$$ -2702598 -2178575 -1706597 -2386838 -3573117 -4101052 -4089937 -4008596 -3407119 -2242956
33597b242956K45885j488020j313316J174258K915266J928210N7787m55741l73997
$$ -2242956 -1997071 -3485091 -4798407 -3624149 -708883 1219327 1277114 821373 447376
33588D47376j294644k397575j856603n589J201243R48313k9789r26881j223158
$$ 447376 -847268 -3244843 -5101446 -5107035 -3905792 -2957479 -2987268 -3914149 -5137307
33579e137307m75566Q20221J086637k41310j464986r15341N01931P21476l29587
$$ -5137307 -5612873 -4792652 -3706015 -3947325 -5412311 -6327652 -5825721 -5104245 -5433832
33570e433832q66583j51705N97202L31577l45236l33232L61220Q22422N44896
$$ -5433832 -6300415 -6452120 -5854918 -5523341 -5868577 -6201809 -5840589 -5018167 -4473271
33561d473271J5142k4308L77749M31011j70154o19520j71184O00283O46713J15721
$$ -4473271 -4458129 -4482437 -4104688 -3673677 -3843831 -4463351 -4634535 -4034252 -3387539 -3271818
33551c271818m6113J41261j94243r58352j013832j25591O30352P24947Q02517
$$ -3271818 -3317931 -3176670 -3370913 -4329265 -5343097 -5468688 -4838336 -4113389 -3310872
33542c310872J044073O38185n36787j408892j495149j424573j152091K00203J927479
$$ -3310872 -2266799 -1628614 -2165401 -3574293 -5069442 -6494015 -7646106 -7445903 -5518424
33533e518424J689733p17308k065392j81316K552978K666736N86946p67651q16439
$$ -5518424 -3828691 -4545999 -6611391 -6792707 -4239729 -1572993 -986047 -1753698 -2570137
33524b570137j322310k348515j822648N97504K363139J659181k08665j100557
$$ -2570137 -3892447 -6240962 -8063610 -7466106 -5102967 -3443786 -3652451 -4753008
33516d753008q08609m01498k40414J47131R45505J603853J265911l56620k140416
$$ -4753008 -5561617 -5963115 -6203529 -6056398 -5110893 -3507040 -2241129 -2597749 -4738165
33507d738165k153649k5583J983929J652995j14598o63009M16401R35767j33664
$$ -4738165 -6891814 -6917397 -4933468 -3280473 -3395071 -4058080 -3641679 -2705912 -2839576
33498b839576j025974j83556J242849J304609J14203p47615o41065k04162P3692
$$ -2839576 -3865550 -4049106 -2806257 -1501648 -1387445 -2135060 -2776125 -2980287 -2906595
33489b906595K86036M17739K39224k40187q34625j406953j585076q21728O49940
$$ -2906595 -2620559 -2202820 -1963596 -2203783 -3038408 -4445361 -6030437 -6852165 -6202225
33480f202225J532616R51025k48722n79460O2026M73355J21590j05700N48157
$$ -6202225 -4669609 -3718584 -3967306 -4546766 -4484740 -4011385 -3889795 -3995495 -3447338
33471c447338J371104J129863j45205j155391j059674m76103m67513j046540j242602
$$ -3447338 -2076234 -946371 -1091576 -2246967 -3306641 -3782744 -4250257 -5296797 -6539399
33462f539399m86803O47459J207145R29164L03535j38857k90047l06723k14642
$$ -6539399 -7026202 -6378743 -5171598 -4242434 -3938899 -4077756 -4367803 -4674526 -4889168
33453d889168K25700J152255K080553K098644R33568m75735r95636o37252k43386
$$ -4889168 -4663468 -3511213 -1430660 667984 1601552 1125817 130181 -507071 -750457
33444g50457j39965k977J54998M5938J01743R74430J850306R85470j424654k747220
$$ -750457 -890422 -893399 -738401 -692463 -590720 383710 2234016 3219486 1794832 -952388
33434i52388j480620M02814L67051r44507j068345K56124J025257N19958J97128
$$ -952388 -2433008 -2030194 -1663143 -2607650 -3675995 -3419871 -2394614 -1874656 -1677528
33425a677528P38279P48668o77834k169264k079421p34056N05016J098568J083360
$$ -1677528 -939249 -190581 -868415 -3037679 -5117100 -5851156 -5346140 -4247572 -3164212
33416c164212K24046j203354j773512n79379J106213J324426J63244n15660J00237
$$ -3164212 -2940166 -4143520 -5917032 -6496411 -5390198 -4065772 -3902528 -4418188 -4317951
33407d317951Q22564N74436n2947o3680L06747K54763l7845K79642J101297J229155
$$ -4317951 -3495387 -2920951 -2973898 -3037578 -2730831 -2476068 -2513913 -2234271 -1132974 96181
33397I6181R0775j319767j693602r78124j79617n1865m75340p38208n766J902263
$$ 96181 186956 -1132811 -2826413 -3804537 -3984154 -4036019 -4511359 -5249567 -5255333 -3353070
33387c353070L628728L034468n3983k657039j911687R03596J806216l01522k094729
$$ -3353070 275658 3310126 3256143 599104 -1312583 -408987 1397229 1095707 -999022
33378i99022r20174J222732R40358j346288k326030q47470R88249J479839J128308
$$ -999022 -1919196 -696464 243894 -1102394 -3428424 -4275894 -3287645 -1807806 -679498
33369f79498N29824o75263j925946j498171M80642J156604j015644l323795k267283
$$ -679498 -149674 -824937 -2750883 -4249054 -3768412 -2611808 -3627452 -6951247 -9218530
33360i218530J347491L453266K270533O3821p72514o44523p66541o35956N93728
$$ -9218530 -7871039 -4417773 -2147240 -2083419 -2855933 -3500456 -4266997 -4902953 -4309225
33351d309225J767568J124746n53062o19060J356429K494274P03939k041991k380958
$$ -4309225 -2541657 -1416911 -1969973 -2589033 -1232604 1261670 1965609 -76382 -2457340
33342b457340k98131J107401K43802r84033l67283J445442K169241R34177j139384
$$ -2457340 -2755471 -1648070 -1404268 -2388301 -2755584 -1310142 859099 1793276 653892
33333F53892k552522k511858j079155P22752J419745N52410p35107j102454m13969
$$ 653892 -1898630 -4410488 -5489643 -4766891 -3347146 -2794736 -3529843 -4632297 -5046266
33324e046266O77298J588110J664907L88663j381730j639024J09094J668246J104413
$$ -5046266 -4368968 -2780858 -1115951 -727288 -2109018 -3748042 -3638948 -1970702 -866289
33315h66289m16555n91882L67847M11824o89883r86867L04074J502746J047388
$$ -866289 -1282844 -1874726 -1506879 -1095055 -1784938 -2771805 -2467731 -964985 82403
33306H2403n42192j832950k011779q97461R75107J995426R02697j084275j338049
$$ 82403 -459789 -2292739 -4304518 -5201979 -4226872 -2231446 -1328749 -2413024 -3751073
33297c751073N27540J947210J017528j034692j931268j191788K00622J470644
$$ -3751073 -3223533 -1276323 -258795 -1293487 -3224755 -4416543 -4215921 -2745277
33289b745277K140016J679769L43774n59386k79029L10156J11662o08295r01512
$$ -2745277 -605261 1074508 1418282 858896 579867 890023 1001685 393390 -508122
33280e08122n76134j36844q184m40974j404121k078925j418901K90935J513389
$$ -508122 -1084256 -1221100 -1229284 -1670258 -3074379 -5153304 -6572205 -6281270 -4767881
33271d767881J608015J635176K322361K605955J279351r77433k361138k024699
$$ -4767881 -3159866 -1524690 797671 3403626 4682977 3705544 1344406 -680293
33263f80293n59743Q52109J095584j90209j878202k161803p11889Q55918J138841
$$ -680293 -1240036 -387927 707657 517448 -1360754 -3522557 -4234446 -3378528 -2239687
33254b239687M97950k4990j06787J19964M80270L70590o91146j690457r56894
$$ -2239687 -1741737 -1766727 -1873514 -1753550 -1273280 -902690 -1593836 -3284293 -4241187
33245d241187J063445J844387M39307j033633p53877J86444J36004l19597M1439
$$ -4241187 -3177742 -1333355 -894048 -1927681 -2681558 -2495114 -2359110 -2678707 -2637268
33236b637268N63797J03566n84398j85112O83692N76814k58623o21667n73042
$$ -2637268 -2073471 -1969905 -2554303 -2739415 -2055723 -1478909 -1737532 -2359199 -2932241
33227b932241q19659r44053l12387L65049M02021P19467J891589K222336L85121
$$ -2932241 -3751900 -4695953 -5008340 -4643291 -4241270 -3521803 -1630214 592122 977243
33218I77243j635730j296933K84998L07105q17535m35630J340841J826612O10281
$$ 977243 -658487 -1955420 -1670422 -1363317 -2180852 -2616482 -1275641 550971 1161252
33209A161252r0026R3187o78035j955096r40970K039468K875434K66926j753481
$$ 1161252 1071226 1164413 486378 -1468718 -2409688 -370220 2505214 2772140 1018659
33200A018659l94675J335725Q30k351937j833322P36076J472531k40353j477068
$$ 1018659 623984 1959709 1960539 -391398 -2224720 -1488644 -16113 -256466 -1733534
33191a733534q85974j10062l68850r67741j270313j439800j174916m344J257941
$$ -1733534 -2619508 -2729570 -3098420 -4066161 -5336474 -6776274 -7951190 -7955534 -6697593
33182f697593J407431R00091J014801J457276R64539j65308m84493l3972j43841
$$ -6697593 -5290162 -4390071 -3375270 -1917994 -953455 -1118763 -1603256 -1637228 -1781069
33173a781069p12428k26628J287445J873594Q05199k21238N5980N63190K7806
$$ -1781069 -2493497 -2720125 -1432680 440914 1246113 1024875 1080855 1644045 1671851
33164A671851q69306r63178p56341j374784k254656j665402N78792K384585J859582
$$ 1671851 802545 -160633 -916974 -2291758 -4546414 -6211816 -5633024 -3248439 -1388857
33155a388857k40255j280050Q9961K212571K462635O43229p99699j86280J153769
$$ -1388857 -1629112 -2909162 -2819201 -606630 1856005 2499234 1699535 1513255 2667024
33146B667024R86897o72744j975899k011777j489964j050084o10278l16496m82704
$$ 2667024 3653921 2981177 1005278 -1006499 -2496463 -3546547 -4156825 -4473321 -4956025
33137d956025m78631O93371K432488K782679J178154n71049p88705p1968K6001
$$ -4956025 -5434656 -4741285 -2308797 473882 1652036 1080987 292282 220314 246315
33128B46315o64940j033701m45288N99927J219003R20571n4906q09500o38816
$$ 246315 -418625 -1452326 -1897614 -1297687 -78684 841887 786981 -22519 -661335
33119f61335J4531J05773m12047m90106K42290P49856K08963p45578j134431r53755
$$ -661335 -646804 -541031 -953078 -1443184 -1200894 -451038 -242075 -987653 -2122084 -3075839
33109c075839n40521K99488J462039J872900R55674j09617o1860L25037m23122
$$ -3075839 -3616360 -3316872 -1854833 18067 973741 864124 802264 1127301 704179
33100G04179j655885j305210O55308J790968P87627p48377j086360r14622j529971
$$ 704179 -951706 -2256916 -1601608 189360 976987 228610 -857750 -1772372 -3302343
33091c302343k186828j327278N59659J469512Q29926o8211l83586m80456l26702
$$ -3302343 -5489171 -6816449 -6256790 -4787278 -3957352 -4025563 -4409149 -4889605 -5216307
33082e216307P56387K232242K271756N16065q61157j48252J368612J430874J17051
$$ -5216307 -4459920 -2227678 44078 560143 -301014 -449266 919346 2350220 2467271
33073B467271p33381n51850m26948p85024p51812m3834L13168k74073r35787p23189
$$ 2467271 1733890 1182040 755092 -29932 -781744 -825578 -512410 -786483 -1722270 -2445459
33063b445459Q4033O51603O21508o492j041927j675733r44160P59212J658602
$$ -2445459 -2361426 -1709823 -1088315 -1094807 -2136734 -3812467 -4756627 -3997415 -2338813
33054b338813Q21577n55106r07354l68134j9574K1066L85439Q52487M94697n85701
$$ -2338813 -1517236 -2072342 -2979696 -3347830 -3367404 -3346338 -2960899 -2108412 -1613715 -2199416
33044b199416j024092p2946J278537J582534O77705l64971o49463k96293L6891
$$ -2199416 -3223508 -3296454 -2017917 -435383 242322 -122649 -772112 -1068405 -1031514
33035a031514Q7732K00413O24624R36750N65279k42395o11865l25071j87736p12356
$$ -1031514 -943782 -743369 -118745 818005 1383284 1140889 529024 203953 16217 -696139
33025f96139j144669n34097O84160J071935P8788j204989j351874j77217J166215
$$ -696139 -1840808 -2374905 -1690745 -618810 -540022 -1745011 -3096885 -3274102 -2107887
33016b107887J417019M37699o63479o93064K91261J037741O18177m61377r56361
$$ -2107887 -690868 -253169 -916648 -1609712 -1318451 -280710 337467 -123910 -1080271
33007a080271l84792N60666R35538N09242j53497l46847L3892L65317M7480o65350
$$ -1080271 -1465063 -904397 31141 540383 386886 40039 73931 439248 486728 -178622
32997a78622r15587l65636L27515L27638l94667j045248p84828M57395J728628
$$ -178622 -1094209 -1459845 -1132330 -804692 -1199359 -2244607 -3029435 -2572040 -843412
32988h43412J811056O01420n72596n35471K51325N34591J08221k73108m03822
$$ -843412 967644 1569064 996468 460997 712322 1246913 1355134 1082026 678204
32979F78204o61567p60847r2469P01771K93189r76513j262906k16237L15558o01741
$$ 678204 16637 -744210 -836679 -134908 158281 -818232 -2081138 -2297375 -1981817 -2583558
32969b583558j394122p24873L35456M72924M02066J062579J459722N25868n56420
$$ -2583558 -3977680 -4702553 -4367097 -3894173 -3492107 -2429528 -969806 -443938 -1000358
32960a000358l22458K13445n73028j653056r36502R03427J389422L68469j00924
$$ -1000358 -1322816 -1109371 -1682399 -3335455 -4271957 -3368530 -1979108 -1610639 -1711563
32951a711563L59805P7310j118897j413610n09020k36128r39345o28535J147671
$$ -1711563 -1351758 -1274448 -2393345 -3806955 -4315975 -4552103 -5491448 -6119983 -4972312
32942d972312J907217L04575j438909j090978K87263O72931L10661L72516M89048
$$ -4972312 -3065095 -2760520 -4199429 -5290407 -5003144 -4330213 -4019552 -3647036 -3157988
32933c157988m7022l68171M09142J258870J018132N44273R34788J185888M3084
$$ -3157988 -3205010 -3573181 -3164039 -1905169 -887037 -342764 592024 1777912 1820996
32924A820996j279203r11278L33466K99086p21730n98067O77493Q17192p69207
$$ 1820996 541793 -369485 -36019 263067 -458663 -1056730 -379237 437955 -331252
32915c31252j795919p06888J049435J468882P24356J91901K42707L10829K01915
$$ -331252 -2127171 -2834059 -1784624 -315742 408614 600515 843222 1154051 1355966
32906A355966J61896J00323l98242j346046k000816j404068M51294K022074J594798
$$ 1355966 1517862 1618185 1219943 -126103 -2126919 -3530987 -3079693 -1057619 537179
32897E37179l90157j492628m83035R02343O33008n57034o26468L36073M71765
$$ 537179 147022 -1345606 -1828641 -926298 -293290 -850324 -1476792 -1140719 -668954
32888f68954n50337j063146k95148N64307O04768M28802N45881M16258j52886
$$ -668954 -1219291 -2282437 -2577585 -2013278 -1408510 -979708 -433827 -17569 -170455
32879a70455l44413J01726J66937p05212j460012r43228M93033J650035J801798
$$ -170455 -514868 -413142 -246205 -951417 -2411429 -3354657 -2861624 -1211589 590209
32870E90209Q30393q76640k146854j796100k54724P18186M73539L31210J301715
$$ 590209 1420602 543962 -1602892 -3398992 -3653716 -2935530 -2461991 -2130781 -829066
32861h29066K292183J635433n56907k563785k909032j405623Q62984K070410J084762
$$ -829066 1463117 3098550 2541643 -22142 -2931174 -4336797 -3473813 -1403403 -318641
32852c18641j041637j927522o85640J121870J743135J174536K94104n13479j042609
$$ -318641 -1360278 -3287800 -3973440 -2851570 -1108435 66101 360205 -153274 -1195883
32843a195883q88702k69979m6686k38318P8898P89941N19099p09682q22601Q26292
$$ -1195883 -2084585 -2354564 -2401250 -2639568 -2560670 -1770729 -1251630 -1961312 -2783913 -1957621
32833a957621J682913j48549k451342k078708J68043J075183J83396j43719Q13716
$$ -1957621 -274708 -423257 -2874599 -4953307 -4785264 -3710081 -3526685 -3670404 -2856688
32824b856688J312582Q12497Q00727J390969O47960j605676k664110j189085M77008
$$ -2856688 -1544106 -731609 69118 1460087 2108047 502371 -2161739 -3350824 -2873816
32815b873816K07122m98194N69456K335941K245117M58599o56809l16370J06589
$$ -2873816 -2666694 -3164888 -2595432 -259491 1985626 2444225 1787416 1471046 1577635
32806A577635j88514n68605o80303q75583r08224r9124J093701J355920M84985
$$ 1577635 1389121 820516 140213 -735370 -1643594 -1742718 -649017 706903 1191888
32797A191888m38281q41313j033017q06073M76953K069256K021501O558j659606
$$ 1191888 753607 -87706 -1120723 -1926796 -1449843 619413 2640914 2647472 987866
32788I87866r81511R32767J373032m05040k412866k520255p91376R10437J062891
$$ 987866 6355 939122 2312154 1907114 -505752 -3026007 -3817383 -2906946 -1844055
32779a844055k5565p40294p1050J212090J552086N56252n67514m97836P86372
$$ -1844055 -1869620 -2609914 -2680964 -1468874 83212 639464 71950 -425886 360486
32770C60486K110739K180696O11607j584110k586997j448378P75365K062661J537375
$$ 360486 2471225 4651921 5263528 3679418 1092421 -355957 419408 2482069 4019444
32761D019444L1155j213054j617816j206180l92981J07155j9870j03122N51962
$$ 4019444 4050599 2837545 1219729 13549 -379432 -272277 -292147 -395269 156693
32752A56693J311184R80626j83971p04119k66906k14866j123093j631037o81639
$$ 156693 1467877 2448503 2264532 1560413 1293507 1078641 -44452 -1675489 -2357128
32743b357128O40701Q23988J81627j07564j60199r04201k092951k448750j488747
$$ -2357128 -1716427 -892439 -710812 -818376 -978575 -1882776 -3975727 -6424477 -7913224
32734g913224J14752J634521K516663K046640K77248j092133m07870J472677K037744
$$ -7913224 -7798472 -6163951 -3647288 -1600648 -1323400 -2415533 -2823403 -1350726 687018
32725F87018N51981r83817p07169P35834J412140O36496n14533o83831K84957
$$ 687018 1238999 255182 -451987 283847 1695987 2332483 1817950 1134119 1419076
32716A419076J158369O49722q42670j465753n24580J30530j278761l323390k957813
$$ 1419076 2577445 3227167 2384497 918744 394164 524694 -754067 -4077457 -7035270
32707g035270o36K367402K049767O63473O35798J671065J751539L54800j064268
$$ -7035270 -7035906 -4668504 -2618737 -1955264 -1319466 351599 2103138 2457938 1393670
32698A393670j207512k05065R48955J310759N97657n04825r36528m47496K81859
$$ 1393670 186158 -18907 930048 2240807 2838464 2333639 1397111 949615 1231474
32689A231474O99838O96746m9132j658777k827482j776149R15045K240368O37288
$$ 1231474 1931312 2628058 2578926 920149 -1907333 -3683482 -2768437 -528069 109219
32680A09219j758309k121114o40195N16107O09557O14168R00952Q07048K94550
$$ 109219 -1649090 -3770204 -4410399 -3894292 -3284735 -2670567 -1769615 -962567 -668017
32671f68017J79082O03546P29369J06843p46652j212836j178084q37311n00199
$$ -668017 -488935 114611 843980 950823 204171 -1008665 -2186749 -3024060 -3524259
32662c524259l16020J66179J424483K608147K073661M187j172067k30986P88302
$$ -3524259 -3840279 -3674100 -2249617 358530 2432191 2436378 1264311 1033325 1821627
32653A821627j93836j791409j397087M20398P87903q49902k053999j300854K38194
$$ 1821627 1627791 -163618 -1560705 -1140307 -352404 -1202306 -3256305 -4557159 -4318965
32644d318965J091165J137762N30015o81505j487592p28720P52582R93030P4366
$$ -4318965 -3227800 -2090038 -1560023 -2241528 -3729120 -4457840 -3705258 -2712228 -2637862
32635b637862l3388J077473J695630J184286P64124O01299o35725k444814k200775
$$ -2637862 -2671250 -1593777 101853 1286139 2050263 2651562 2015837 -428977 -2629752
32626b629752L88970J992305O79287j114683q78025P3787k60215p08986M29100
$$ -2629752 -2240782 -248477 430810 -683873 -1561898 -1488111 -1748326 -2457312 -2028212
32617b028212J618936O94467r88657q82657J60462k88901j411456n69897J494191
$$ -2028212 -409276 285191 -703466 -1586123 -1425661 -1714562 -3126018 -3695915 -2201724
32608b201724J566990l34344q65641P94693J583335r6441j923163j859075r38532
$$ -2201724 -634734 -969078 -1834719 -1040026 543309 446868 -1476295 -3335370 -4273902
32599d273902l78010M31430J379472O97111j424169j762926R19875L026575J229440
$$ -4273902 -4651912 -4220482 -2841010 -2143899 -3568068 -5330994 -4411119 -1384544 -155104
32590a55104k310834l131931p65570J554468J965676J404025Q96432N18475N52716
$$ -155104 -2465938 -5597869 -6363439 -4808971 -2843295 -1439270 -542838 -24363 528353
32581E28353J084098R54015n63179j823865j023319N53011L35256j185953j180471
$$ 528353 1612451 2566466 2003287 179422 -843897 -290886 44370 -1141583 -2322054
32572b322054O82648J613567L62479r19920n22530L10532K22396J79644J060269
$$ -2322054 -1639406 -25839 336640 -583280 -1105810 -795278 -572882 -393238 667031
32563F67031J352699k48277j916056j163449J041359J524209l19935j810139j117463
$$ 667031 2019730 1771453 -144603 -1308052 -266693 1257516 937581 -872558 -1990021
32554a990021M09318P41686q701l34250M11244J527097J961475J081565q99917
$$ -1990021 -1580703 -839017 -847718 -1181968 -770724 756373 2717848 3799413 2899496
32545B899496k711667k879288j377042J03207J04646q27676r73963K54475J564800
$$ 2899496 187829 -2691459 -4068501 -3965294 -3860648 -4688324 -5662287 -5407812 -3843012
32536c843012J432614j7767j165822q20869M31097J126246Q74985O49880R95430
$$ -3843012 -2410398 -2428165 -3593987 -4414856 -3983759 -2857513 -1982528 -1332648 -337218
32527c37218R93948j69239j487695j362402j26260L40017m07341o33655O35805
$$ -337218 656730 487491 -1000204 -2362606 -2488866 -2148849 -2556190 -3189845 -2554040
32518b554040J756821R41785q08547j125777J62355R51247J84325p63195m85686
$$ -2554040 -797219 144566 -663981 -1789758 -1627403 -676156 -491831 -1255026 -1740712
32509a740712L74140L70427n77041j294786j013294p0847P27600Q94594N73450
$$ -1740712 -1366572 -996145 -1573186 -2867972 -3881266 -3952113 -3224513 -2329919 -1756469
32500a756469L09277L30586J86161m39332q65961k82509P34593Q25567L2827j17692
$$ -1756469 -1447192 -1116606 -930445 -1369777 -2235738 -2518247 -1783654 -958087 -925260 -1042952
32490a042952Q56092J413775M25223r53902j092564k26111N11906J167854K197641
$$ -1042952 -186860 1226915 1652138 698236 -394328 -620439 -108533 1059321 3256962
32481C256962K558780Q48114j964627l196908k040813m72246j74090n30487m30280
$$ 3256962 5815742 6663856 4699229 1502321 -538492 -1010738 -1184828 -1715315 -2145595
32472b145595j94330m96983q04364k99841N60505P25705J75323k58134k36433
$$ -2145595 -2339925 -2836908 -3641272 -3941113 -3380608 -2654903 -2479580 -2737714 -2974147
32463b974147r2323j5151O0183M2450p3675J29770Q45159J380383R59933m0532
$$ -2974147 -3066470 -3081621 -3021438 -2978988 -3052663 -2922893 -2077734 -697351 262582 222050
32453B22050m84902j2094N91874N80422R7104l16226m75984n24295m76117j24324
$$ 222050 -262852 -274946 316928 897350 994454 678228 202244 -322051 -798168 -922492
32443i22492O01075J275629J160773n63j426903j945293j254894r6689Q64777
$$ -922492 -321417 954212 2114985 2114422 687519 -1257774 -2512668 -2609357 -1744580
32434a744580J627889K094842J620370J4902j634569k010310j117832p5086L51039
$$ -1744580 -116691 1978151 3598521 3613423 1978854 -31456 -1149288 -1224374 -873335
32425h73335K67792j958k74735l15134l7056J69966k1943j82688K60526Q80848
$$ -873335 -605543 -607501 -882236 -1197370 -1234426 -1064460 -1086403 -1269091 -1008565 -127717
32415a27717O95950k31069p07256k03586L21879m2766p17957n59982L43077P55359
$$ -127717 568233 337164 -370092 -573678 -251799 -294565 -1012522 -1572504 -1229427 -474068
32405d74068N0600q70016o28078R64848K472198K172648m125k100657k212150
$$ -474068 -423468 -1293484 -1921562 -956714 1515484 3688132 3684007 1583350 -628800
32396f28800q01814o8706q90772j600469n24924J394297J865549N07837p43243
$$ -628800 -1430614 -1499320 -2390092 -3990561 -4515485 -3121188 -1255639 -747802 -1491045
32387a491045m50907O13429R79392M12090l64919r11652j203098j153822p75771
$$ -1491045 -1941952 -1328523 -349131 62959 -301960 -1213612 -2416710 -3570532 -4346303
32378d346303l95312j50572K85321J009799J482936J334559R55005P11316L08407
$$ -4346303 -4741615 -4892187 -4606866 -3597067 -2114131 -779572 175433 886749 1195156
32369A195156l79587p02279l56358j50738m70441r2975J716442K950404J189140
$$ 1195156 815569 113290 -243068 -393806 -864247 -957222 759220 3709624 4898764
32360D898764k222108l241017p78940J680002J235480n32076p03969M85087Q89098
$$ 4898764 2676656 -564361 -1343301 336701 1572181 1040105 336136 821223 1710321
32351A710321K88651M615j32705j288969k604379j789861J032227K842803J768985
$$ 1710321 1998972 2003587 1870882 581913 -2022466 -3812327 -2780100 62703 1831688
32342A831688o40306j968611j802082j146822o36513l21552q6413M06891J253872
$$ 1831688 1191382 -777229 -2579311 -3726133 -4362646 -4684198 -4770611 -4363720 -3109848
32333c109848J603125O13132q83534j173812j53957O60514O32594N50600N86419
$$ -3109848 -1506723 -893591 -1777125 -2950937 -3104894 -2444380 -1811786 -1261186 -674767
32324f74767J209p73699k94052J054845J124194j92286k76778J676966K725334
$$ -674767 -673558 -1447257 -1741309 -686464 437730 245444 -31334 1645632 4370966
32315D370966R26629j176343p37431O24805j37947k046555j883369R7489P19228
$$ 4370966 5297595 4121252 3383821 4008626 3870679 1824124 -59245 38244 757472
32306G57472n60046j083363N150M89026n45865j062375L4038R36078L63643k40667
$$ 757472 197426 -885937 -880787 -391761 -937626 -2000001 -1965963 -1029885 -666242 -906909
32296i06909L54967R07600K42980m78219l2669N58439N5949o28690k14180N03669
$$ -906909 -551942 355658 598638 120419 87750 646189 702138 73448 -140732 362937
32286C62937J51326p13923p72717m22848q64633j589911j031881O80473J622541
$$ 362937 514263 -199660 -972377 -1395225 -2259858 -3849769 -4881650 -4201177 -2578636
32277b578636P46993q17510j263741P430J909962K574575J195111p38122j002472
$$ -2578636 -1831643 -2649153 -3912894 -3905464 -1995502 579073 1774184 1036062 33590
32268C3590K91716P38837o56785j822596r51033N74150N79390l20429o6148J134590
$$ 33590 325306 1064143 407358 -1415238 -2366271 -1792121 -1212731 -1533160 -1599308 -464718
32258d64718J245803J3761o12331K63955J211632Q67093l50994j405761j913745
$$ -464718 781085 794846 182515 446470 1658102 2525195 2174201 768440 -1145305
32249a145305j812747j099222k40649K16308M88405R91621J245593O07071k98829
$$ -1145305 -2958052 -4057274 -4297923 -4081615 -3593210 -2601589 -1355996 -748925 -1047754
32240a047754l72510R7880R136m67441k19575O01286P23786Q4508p0205M47861
$$ -1047754 -1420264 -1322384 -1313248 -1780689 -2000264 -1398978 -675192 -590684 -660889 -213028
32230b13028M45432k83952m59689K67307N40599l17815j168779j091978o07322
$$ -213028 232404 -51548 -511237 -243930 296669 -21146 -1189925 -2281903 -2889225
32221b889225j24608P28859J427693N50235j426172j825273J99544J830460P74653
$$ -2889225 -3013833 -2284974 -857281 -307046 -1733218 -3558491 -3358947 -1528487 -753834
32212g53834j083862p37692J263438K132258J356091P21376P25804J69066r61702
$$ -753834 -1837696 -2575388 -1311950 820308 2176399 2897775 3623579 3792645 2830943
32203B830943j181961k50457L61382M0394k28180J9681P5642j52917J03051N44325
$$ 2830943 1648982 1398525 1759907 1800301 1572121 1591802 1667444 1514527 1617578 2161903
32193B161903j13972j553573j665831J21789J529859P05815j083274j500020l07096
$$ 2161903 2047931 494358 -1171473 -1049684 480175 1185990 102716 -1397304 -1704400
32184a704400J037111J648894J517346N68131r71114j934530j369843O3561R14706
$$ -1704400 -667289 981605 2498951 3067082 2095968 161438 -1208405 -1144844 -230138
32175b30138P27347J31057k89937l41084L271L50505M1739p04792o39615O33368
$$ -230138 497209 628266 338329 -2755 516 351021 392760 -312032 -951647 -318279
32165c18279J598239Q68162o38806j103440o50060q84720j860585j630315O51407
$$ -318279 1279960 2148122 1509316 405876 -244184 -1128904 -2989489 -4619804 -3968397
32156c968397K961874K846900N66247j349497j214333J32730P48883k9188j041916
$$ -3968397 -1006523 1840377 2406624 1057127 -157206 -24476 724407 695219 -346697
32147c46697r94646j54538J48919m82403r07897j57660J102522J492985O84963
$$ -346697 -1341343 -1495881 -1346962 -1829365 -2737262 -2894922 -1792400 -299415 385548
32138C85548m82084j117758q25001K56631J187073P41487q70140j650164m09590
$$ 385548 -96536 -1214294 -2039295 -1782664 -595591 145896 -724244 -2374408 -2783998
32129b783998J204460R59536n01410p01310N56074Q58351o13991j421743K39408
$$ -2783998 -1579538 -620002 -1121412 -1822722 -1266648 -408297 -1022288 -2444031 -2204623
32120b204623K438029K342230L80969p66114k19874M64978J90706m74729r60786
$$ -2204623 233406 2575636 2956605 2190491 1970617 2435595 2626301 2151572 1190786
32111A190786j474626j770587r87495O34990J445548O63411l08110Q7045J202716
$$ 1190786 -283840 -2054427 -3041922 -2406932 -961384 -297973 -606083 -519038 683678
32102F83678J158397l67496j695272j539664o27986l58996p02160m24835Q36492
$$ 683678 1842075 1474579 -220693 -1760357 -2388343 -2747339 -3449499 -3874334 -3037842
32093c037842J843664J499477M50611J11545O01708P34188o0802r44821j045120
$$ -3037842 -1194178 305299 755910 867455 1469163 2203351 2142549 1197728 152608
32084A52608n96265k64626k05648k96308n05351n23666J47927J191123J444946
$$ 152608 -443657 -708283 -913931 -1210239 -1715590 -2239256 -2091329 -900206 544740
32075E44740N48830l17168j10953O03969P48606K84399l10519r98476j428624
$$ 544740 1093570 776402 665449 1269418 2018024 2302423 1991904 993428 -435196
32066d35196n28870J539493K353784L19716k321482k222565J13038J240508L32345
$$ -435196 -964066 575427 2929211 3248927 927445 -1295120 -1182082 58426 390771
32057C90771J06839J567000J801287j006587l843778l085264N8884J611341O49745
$$ 390771 497610 2064610 3865897 2859310 -984468 -4069732 -4010848 -2399507 -1749762
32048a749762l78549j66358J53998J428K95614R91150O50458o79699q56966Q87269
$$ -1749762 -2128311 -2294669 -2140671 -2139243 -1843629 -852479 -202021 -881720 -1738686 -851417
32038h51417K273342J362133l99451m57744J034501J836029J110571R0732l99846
$$ -851417 1421925 2784058 2384607 1926863 2961364 4797393 5907964 5998696 5598850
32029E598850r57023j867540k173918j216992J23430N93685J92159j51720J0641
$$ 5598850 4641827 2774287 600369 -616623 -493193 100492 292651 140931 151572
32020A51572L10183L49484J68579j5733j15241k64807q01292j833437k573713
$$ 151572 461755 811239 979818 964085 848844 584037 -217255 -2050692 -4624405
32011d624405j707801Q46070L045211K728825M13781j195086p05691L99236L70515
$$ -4624405 -6332206 -5486136 -2440925 287900 701681 -493405 -1199096 -799860 -429345
32002d29345j92052K65775J420621J565294M37237m47167l20750j35089n91422
$$ -429345 -621397 -355622 1064999 2630293 3067530 2620363 2299613 2164524 1573102
31993A573102r48445n36817J2192o3923m80117p25232q79688p78369L43623K275448
$$ 1573102 624657 87840 100032 36109 -444008 -1169240 -2048928 -2827297 -2483674 -208226
31983b08226L152510J771820l73326r22011J58843Q11414k4047j136678r65569
$$ -208226 2944284 4716104 4342778 3420767 3579610 4391024 4366977 3230299 2264730
31974B264730M10505J522938J116649o00471k048652j913022p81030l50724q96893
$$ 2264730 2675235 4198173 5314822 4714351 2665699 752677 -28353 -379077 -1275970
31965a275970r61198j05965m3857j643631k708388r24339K363966L881328L012134
$$ -1275970 -2237168 -2343133 -2386990 -4030621 -6739009 -7663348 -5299382 -1418054 1594080
31956A594080J901861J470077L75281j770898l052141k110864j84564P89080M52134
$$ 1594080 3495941 4966018 5341299 3570401 518260 -1592604 -1777168 -988088 -535954
31947e35954m05076j051058q97433K35241J378365J231842M1753o81901m14654
$$ -535954 -941030 -1992088 -2889521 -2654280 -1275915 -44073 -2320 -684221 -1098875
31938a098875k5093L8918J32739J9531p89675j304381j26628J613321J256536
$$ -1098875 -1123968 -1085050 -952311 -932780 -1722455 -3026836 -3153464 -1540143 -283607
31929b83607r94201j878653j85641J373132Q67395J56054R77313J463448m17915
$$ -283607 -1277808 -3156461 -3342102 -1968970 -1101575 -945521 31792 1495240 1077325
31920A077325k768293k536325k69072J296366J601286J817452J608655k7803j770637
$$ 1077325 -1690968 -4227293 -4496365 -3199999 -1598713 218739 1827394 1799591 28954
31911B8954j407191M02542J061426J11638p71823j136998j767506j973071m34395
$$ 28954 -1378237 -975695 85731 197369 -574454 -1711452 -3478958 -5452029 -5886424
31902e886424J603517J629610J98515K00738J778648K018282J92321r06736K5764
$$ -5886424 -4282907 -2653297 -2454782 -2254044 -475396 1542886 1735207 828471 854235
31893H54235N90761q04828k031853j075082N03018M70687m15107k64536O17593
$$ 854235 1444996 640168 -1391685 -2466767 -1963749 -1493062 -1908169 -2172705 -1555112
31884a555112P65439J97549j38843o9403L84266J579337K686555J622248j617877
$$ -1555112 -789673 -592124 -730967 -800370 -416104 1163233 3849788 5472036 3854159
31875C854159l721420k329909M99771J484348P37880M17584N70414l00257j602914
$$ 3854159 132739 -2197170 -1697399 -213051 524829 942413 1512827 1212570 -390344
31866c90344j125902J041105K187579R84873p59350j033085k60286j07120j029628
$$ -390344 -1516246 -475141 1712438 2697311 1937961 904876 644590 537470 -492158
31857d92158j909297j527108M3988J393499J300264K63790k59342q4206l38571
$$ -492158 -2401455 -3928563 -3884575 -2491076 -1190812 -927022 -1186364 -1270570 -1609141
31848a609141j076133q20797P63947J894760J488765P26817M44660m43274k024949
$$ -1609141 -2685274 -3506071 -2742124 -847364 641401 1368218 1812878 1369604 -655345
31839f55345j779942J314746L718226J931770j926635l128649j257130K67465
$$ -655345 -2435287 -1120541 2597685 4529455 2602820 -525829 -1782959 -1515494
31831a515494L82192J129740K481145J620339j652872l512534j791515R08855
$$ -1515494 -1133302 -3562 2477583 4097922 2445050 -1067484 -2858999 -1950144
31823a950144J671955J178070J013800M78457j234986k417465j336314N93902
$$ -1950144 -278189 899881 1913681 2392138 1157152 -1260313 -2596627 -2002725
31815b002725Q64973l33435q52592l2297Q48015Q41423J58195p44767j357097
$$ -2002725 -1137752 -1471187 -2323779 -2356076 -1508061 -666638 -508443 -1253210 -2610307
31806b610307q96963P72323K365449K312153M33638j937949l001689j652622J328752
$$ -2610307 -3507270 -2734947 -369498 1942655 2376293 438344 -2563345 -4215967 -2887215
31797b887215L250104K085876q48387k409348j742520p69001n31793J38325J593394
$$ -2887215 362889 2448765 1600378 -808970 -2551490 -3320491 -3852284 -3713959 -2120565
31788b120565K011774N42516q83776o72961l2012l63325o21681L95287J304838
$$ -2120565 -108791 433725 -450051 -1123012 -1155024 -1518349 -2140030 -1744743 -439905
31779d39905L60714j304170j372748M2472J039162J027088P55986L33881l88037
$$ -439905 -79191 -1383361 -2756109 -2713637 -1674475 -647387 108599 442480 54443
31770E4443m92440N65012J228988j5506j800739j732488j50430O74855L17893
$$ 54443 -437997 127015 1356003 1340497 -460242 -2192730 -2343160 -1668305 -1350412
31761a350412K83195P88070M23742r66167j753391j142532q4492N93813R58637
$$ -1350412 -1067217 -279147 144595 -821572 -2574963 -3717495 -3801987 -3208174 -2249537
31752b249537Q57538q173r28858q90166k15997J56462M44258J195125J544369
$$ -2249537 -1391999 -1400172 -2329030 -3219196 -3435193 -3278731 -2834473 -1639348 -94979
31743i4979N23129p34869n68438K70115l2292r17412m73992Q33608R17922P6584
$$ -94979 428150 -306719 -875157 -605042 -637334 -1554746 -2028738 -1195130 -277208 -200624
31733b00624M44450J562116O55607k147144l118263o66888K121684K279274P56976
$$ -200624 243826 1805942 2461549 314405 -2803858 -3470746 -1349062 930212 1687188
31724A687188l05974p83953j083701n06377Q22558J044011m60472j626530r35498
$$ 1687188 1381214 597261 -486440 -992817 -170259 873752 413280 -1213250 -2148748
31715b148748L99508R91977J319715J678484J031960m32227o82392M72935M34707
$$ -2148748 -1749240 -757263 562452 2240936 3272896 2840669 2158277 2631212 3065919
31706C065919j525819k420729p62026M65541q22996j671880O38654L134240J916638
$$ 3065919 1540100 -880629 -1642655 -1177114 -2000110 -3671990 -3033336 100904 2017542
31697B017542r47187q99560J343531J545145l34319n37474J229741J351662q08854
$$ 2017542 1070355 170795 1514326 3059471 2725152 2187678 3417419 4769081 3960227
31688C960227j745952l27829L84403q08538j005306R80482J876790k52965k179245
$$ 3960227 2214275 1886446 2270849 1462311 457005 1437487 3314277 3061312 882067
31679H82067p64304J840266J838478l88973j687569j108109j15205N68627J269690
$$ 882067 117763 1958029 3796507 3407534 1719965 611856 496651 1065278 2334968
31670B334968J564687P32322o55632j433361j414422r93697k71213L18515j07203
$$ 2334968 3899655 4631977 3976345 2542984 1128562 134865 -136348 182167 74964
31661G4964j251972j467049l09785N28942P3563k24367Q06796J756747J042059
$$ 74964 -1177008 -2644057 -2953842 -2424900 -2351337 -2575704 -1768908 -12161 1029898
31652A029898k71464l37554L43953Q9012r01661j091190l78709N574j88001j50339
$$ 1029898 758434 420880 764833 853845 -47816 -1139006 -1517715 -1512141 -1700142 -1850481
31642a850481J42872n8522o59254p61133j40540O14569J060759R05871j84446
$$ -1850481 -1707609 -1766131 -2425385 -3186518 -3327058 -2712489 -1651730 -745859 -930305
31633i30305j591262j565092M42900K252940J513570j007097k491394j747771
$$ -930305 -2521567 -4086659 -3643759 -1390819 122751 -884346 -3375740 -5123511
31625e123511K1248J490030K260539K046503P98921m69231o81946l31622n53852
$$ -5123511 -5102263 -3612233 -1351694 694809 1493730 1024499 342553 10931 -542921
31616e42921j027281n96164M63134Q53533O44645J004723J613993Q07894j315545
$$ -542921 -1570202 -2166366 -1703232 -849699 -205054 799669 2413662 3221556 1906011
31607A906011k389800j243680L34715M66714j41774J21759J011128J086667J44273
$$ 1906011 -483789 -1727469 -1392754 -926040 -1067814 -946055 65073 1151740 1296013
31598A296013p19371r57461j015243j108820p92408J52782J241474J853121J763123
$$ 1296013 576642 -380819 -1396062 -2504882 -3297290 -3144508 -1903034 -49913 1713210
31589A713210J091253J76936m72381n09569j18314K08966L09053M54294O63387
$$ 1713210 2804463 2981399 2509018 1999449 1881135 2090101 2399154 2853448 3516835
31580C516835K99159j057514k429009k083294J08671J883996J302737m02791l60650
$$ 3516835 3815994 2758480 329471 -1753823 -1645152 238844 1541581 1138790 778140
31571G78140J725554K926464J216690j706633k883885j743416J06676J323132
$$ 778140 2503694 5430158 6646848 4940215 2056330 312914 419590 1742722
31563A742722J437979K14038j753296k594881j168064J010269J479685K1504j421379
$$ 1742722 3180701 3394739 1641443 -953438 -2121502 -1111233 368452 389956 -1031423
31554a031423j484317m37133R74520K043677J889732M37426p70918l76405P07554
$$ -1031423 -2515740 -2952873 -1978353 65324 1955056 2392482 1621564 1245159 1952713
31545A952713P42715k7041j53214J12117o85268k068684j879445M9512J259879
$$ 1952713 2695428 2668387 2515173 2627290 1942022 -126662 -2006107 -1956595 -696716
31536f96716L98730r71607j152638m89955J94198R97081J618854Q98594j004702
$$ -696716 -297986 -1269593 -2422231 -2912186 -2717988 -1720907 -102053 796541 -208161
31527b08161k012602j063532K86995N16300L41538P68303J001313J57939p55249
$$ -208161 -2220763 -3284295 -2997300 -2481000 -2139462 -1371159 -369846 -211907 -967156
31518i67156n87309j73028o52300j121038j93189J300304J503426N23147o3839
$$ -967156 -1554465 -1727493 -2379793 -3500831 -3694020 -2393716 -890290 -367143 -430982
31509d30982R661k76122q75640o64730L05889O84347J40664p6895O85351J364377
$$ -430982 -421321 -697443 -1573083 -2237813 -1931924 -1247577 -1106913 -1183808 -498457 865920
31499H65920Q27789n31454j443452j271476m73164M9416o3067j88439L92393J180138
$$ 865920 1693709 1162255 -281197 -1552673 -2025837 -1976421 -2039488 -2227927 -1835534 -655396
31489f55396R47271k24501p36399M9648O64806l8140q97439m65472M10778M7097
$$ -655396 291875 67374 -669025 -619377 45429 7289 -890150 -1355622 -944844 -897747
31479h97747j087914j070779L63569J551219J481445P23203n7810p14826q76172
$$ -897747 -1985661 -3056440 -2692871 -1141652 339793 1062996 1005186 290360 -585812
31470e85812k45043M92441N33514L33970N80424N19810o92886j714505o13097
$$ -585812 -830855 -338414 195100 529070 1109494 1629304 936418 -778087 -1391184
31461a391184J620704K014943J91589r90707j6178J082328L70851r35842r61519
$$ -1391184 229520 2244463 2436052 1445345 1429167 2511495 2882346 1946504 984985
31452I84985l88029q41254j694296j064362P93425J539250J89100j465489j409719
$$ 984985 596956 -244298 -1938594 -3002956 -2209531 -670281 -481181 -1946670 -3356389
31443c356389l7089O31640k31802j171002m41737J510363K522228J671176M40727
$$ -3356389 -3393478 -2761838 -2993640 -4164642 -4606379 -3096016 -573788 1097388 1538115
31434A538115K58301L70019m05024j228682p26855J35900n80023k066263j570677
$$ 1538115 1796416 2166435 1761411 532729 -194126 -58226 -638249 -2704512 -4275189
31425d275189R32439K242740R46193m52969N7291P19673n50448k255315j783214
$$ -4275189 -3342750 -1100010 -153817 -606786 -549495 170178 -380270 -2635585 -4418799
31416d418799K52182J249816Q06694N85577R11956N66932l99046n11533M08082
$$ -4418799 -4166617 -2916801 -2110107 -1524530 -612574 -45642 -444688 -956221 -548139
31407e48139Q72839L28366j17602Q0831K9258p33257j322528j116543p06218n90596
$$ -548139 324700 653066 535464 616295 645553 -87704 -1410232 -2526775 -3232993 -3823589
31397c823589k97428N28840J325837J523437J294693R21884L21059l87120o99580
$$ -3823589 -4121017 -3592177 -2266340 -742903 551790 1473674 1794733 1407613 708033
31388G08033n35270m67486q12587j144126r58805k47518O85629J398780J392351
$$ 708033 172763 -294723 -1107310 -2251436 -3210241 -3457759 -2772130 -1373350 19001
31379A9001O92478J70421M72971Q92545L24941q56727j149649j96177O00696J02545
$$ 19001 711479 881900 1354871 2247416 2572357 1715630 565981 369804 970500 1073045
31369A073045j046183j447465o59279N89419J260654P93291m10224j160869o88292
$$ 1073045 26862 -1420603 -2079882 -1490463 -229809 563482 153258 -1007611 -1695903
31360a695903M23066J112615J275321J364545J055543k18942j580643j331270
$$ -1695903 -1272837 -160222 1115099 2479644 3535187 3316245 1735602 404332
31352D04332M20278J482189N87082r02633j171957l82261J94578K35909K42856
$$ 404332 824610 2306799 2893881 1991248 819291 437030 631608 867517 1110373
31343A110373K36309r9233n26163o55098p97029j374413j849113j275008K16388
$$ 1110373 1346682 1247449 721286 66188 -730841 -2105254 -3954367 -5229375 -5012987
31334e012987J329429J049780k71428j218406n88005J247190K313020J207676
$$ -5012987 -3683558 -2633778 -2905206 -4123612 -4711617 -3464427 -1151407 56269
31326E6269p08903o62936J609483L023135J315448j646112k518110j124912j12745
$$ 56269 -652634 -1315570 293913 3317048 4632496 2986384 468274 -656638 -769383
31317g69383o19350r25736K78620J628190J141612r50122k563946k169236j40156
$$ -769383 -1388733 -2314469 -2035849 -407659 733953 -216169 -2780115 -4949351 -5089507
31308e089507J714340J687527p9572j368988l41978J868679K381918M83395j411178
$$ -5089507 -3375167 -1687640 -1767212 -3136200 -3478178 -1609499 772419 1255814 -155364
31299a55364j281525j30303R4236m85179m87766R5204J48260k82758k1084J013696
$$ -155364 -1436889 -1567192 -1472956 -1958135 -2445901 -2350697 -2202437 -2485195 -2506279 -1492583
31289a492583J504460R02435J92488N3846j50535q70888j318412q57295k34336
$$ -1492583 11877 914312 1106800 1160646 1010111 139223 -1179189 -2036484 -2270820
31280b270820l14764n64981l0590Q81116R20118p3871r89552j051005n18728J53500
$$ -2270820 -2585584 -3150565 -3181155 -2300039 -1379921 -1453792 -2443344 -3494349 -4013077 -3859577
31270c859577Q01685J102396O33864l24903p97246j97642J066665K102522K133388
$$ -3859577 -3057892 -1955496 -1321632 -1646535 -2443781 -2641423 -1574758 527764 2661152
31261B661152Q46643j045652j855232o66211J048886R32314r91001k150803j063453
$$ 2661152 3507795 2462143 606911 -59300 989586 1921900 930899 -1219904 -2283357
$$ [...]
##END NTUPLES=NMR SPECTRUM
##END=
