##TITLE=31Pdec_LY-TMF-12.70.3
 D2O, 24 sc
 4.3.2020
##JCAMPDX= 6.0         $$ Bruker NMR JCAMP-DX V2.0
##DATA TYPE= NMR SPECTRUM
##DATA CLASS= NTUPLES
##ORIGIN= UXNMR, Bruker Analytische Messtechnik GmbH
##OWNER= root
$$ XWIN-NMR		Version 3.5
$$ Wed Mar  4 14:40:29 2020 Russian Standard Time (UT+4h)  she@DPX200
##.OBSERVE FREQUENCY= 81.013821
##.OBSERVE NUCLEUS= ^31P
##.ACQUISITION MODE= SIMULTANEOUS
##.ACQUISITION SCHEME= undefined
##.AVERAGES= 24
##.DIGITISER RES= 17
##SPECTROMETER/DATA SYSTEM= spect
##.PULSE SEQUENCE= zgpg30
##.SOLVENT NAME= CDCl3
##.SHIFT REFERENCE= (INTERNAL, CDCl3, 0, 182.463)
##AUDIT TRAIL= $$ (NUMBER, WHEN, WHO, WHERE, WHAT)
$$ ##TITLE= Audit trail, XWIN-NMR		Version 3.5
$$ ##JCAMPDX= 5.01
$$ ##ORIGIN= Bruker BioSpin GmbH
$$ ##OWNER= she
$$ F:/spectra/data/she/nmr/P31/1/pdata/1/auditp.txt
$$ ##AUDIT TRAIL=  $$ (NUMBER, WHEN, WHO, WHERE, WHAT)
(   1,<2020-03-04 14:39:42.53 +0400>,<she>,<DPX200>,
      <created by zg, POWCHK disabled, PULCHK disabled
       configuration hash MD5:
       00 E9 B6 7A A2 85 ED C7 34 08 36 98 17 FE 4E 26
       data hash MD5: 32K
       DC 85 87 BC C9 23 40 5C FC 67 C6 FC F6 8E C1 AB>)
(   2,<2020-03-04 14:39:45.01 +0400>,<she>,<DPX200>,
      <Start of raw data processing
       efp BC_mod = 2 LB = 1 FT_mod = 6 PKNL = 1 PHC0 = -1320.203 PHC1 = 73.8017 SI = 64K 
       data hash MD5: 64K
       6A 13 C2 B8 56 73 40 58 75 12 76 5F AF 3A F1 D0>)
(   3,<2020-03-04 14:39:57.98 +0400>,<she>,<DPX200>,
      <pk PHC0 = -4.878914 PHC1 = 0 
       data hash MD5: 64K
       01 A7 36 36 75 3F 81 0A 54 36 05 F7 AD AD 25 F3>)
(   4,<2020-03-04 14:40:00.64 +0400>,<she>,<DPX200>,
      <abs ABSG = 5 
       data hash MD5: 64K
       A8 91 14 7C 1F A9 94 14 8B 7A 84 78 C0 D2 7D 77>)
$$ ##END=
$$ 
$$ hash MD5
$$ D1 3E E9 4C E3 3D 25 69 D0 2B 44 E1 71 97 A2 66
##$RELAX= 
##$RELAX= 
##$RELAX= 
##$RELAX= 
##$RELAX= 
##$RELAX= 
##$RELAX= 
##$RELAX= 
$$ Bruker specific parameters
$$ --------------------------
##$DU= <F:/spectra>
##$EXPNO= 1
##$NAME= <P31>
##$PROCNO= 1
##$TYPE= <nmr>
##$USER= <she>
##$AMP= (0..31)
100 100 100 100 100 100 100 100 100 100 100 100 100 100 100 100 100 100 
100 100 100 100 100 100 100 100 100 100 100 100 100 100 
##$AQSEQ= 0
##$AQ_mod= 1
##$AUNM= <au_zg>
##$AUTOPOS= <>
##$BF1= 81.014009
##$BF2= 200.13
##$BF3= 200.13
##$BF4= 200.13
##$BF5= 200.13
##$BF6= 200.13
##$BF7= 200.13
##$BF8= 200.13
##$BYTORDA= 1
##$CFDGTYP= 0
##$CFRGTYP= 5
##$CHEMSTR= <none>
##$CNST= (0..31)
1 1 145 1 1 1 1 1 1 1 1 1 1 1 1 1 1 1 1 1 1 1 1 1 1 1 1 1 1 1 1 1 
##$CPDPRG= <waltz16>
##$CPDPRG1= <>
##$CPDPRG2= <waltz16>
##$CPDPRG3= <>
##$CPDPRG4= <mlev>
##$CPDPRG5= <mlev>
##$CPDPRG6= <mlev>
##$CPDPRG7= <mlev>
##$CPDPRG8= <mlev>
##$CPDPRGB= <>
##$CPDPRGT= <>
##$D= (0..31)
0 1 0 0 0 0 0 0 0 0 0 0.03 2e-05 3e-06 0 0 0 0 0 0 0 0 0 0 0 0 0 0 0 0 
0 0 
##$DATE= 1583318382
##$DBL= (0..7)
120 120 120 11 120 120 24 19 
##$DBP= (0..7)
150 150 150 150 150 150 150 150 
##$DBP07= 0
##$DBPNAM0= <>
##$DBPNAM1= <>
##$DBPNAM2= <>
$$ [...]
##$SUBNAM3= <"">
##$SUBNAM4= <"">
##$SUBNAM5= <"">
##$SUBNAM6= <"">
##$SUBNAM7= <"">
##$SUBNAM8= <"">
##$SUBNAM9= <"">
##$SW= 369.568048894756
##$SWIBOX= (0..15)
0 1 3 0 0 0 0 0 0 0 0 0 0 0 0 0 
##$SW_h= 29940.119760479
##$TD= 32768
##$TD0= 1
##$TE= 0
##$TE2= 300
##$TE3= 300
##$TEG= 300
##$TL= (0..7)
0 120 53 12 22 120 120 120 
##$TP= (0..7)
150 150 150 150 150 150 150 150 
##$TP07= 0
##$TPNAME0= <>
##$TPNAME1= <>
##$TPNAME2= <>
##$TPNAME3= <>
##$TPNAME4= <>
##$TPNAME5= <>
##$TPNAME6= <>
##$TPNAME7= <>
##$TPOAL= (0..7)
0.5 0.5 0.5 0.5 0.5 0.5 0.5 0.5 
##$TPOFFS= (0..7)
0 0 0 0 0 0 0 0 
##$TUNHIN= 0
##$TUNHOUT= 0
##$TUNXOUT= 0
##$USERA1= <user>
##$USERA2= <user>
##$USERA3= <user>
##$USERA4= <user>
##$USERA5= <user>
##$V9= 5
##$VALIST= <valist>
##$VCLIST= <CCCCCCCCCCCCCCC>
##$VD= 0
##$VDLIST= <DDDDDDDDDDDDDDD>
##$VPLIST= <PPPPPPPPPPPPPPP>
##$VTLIST= <TTTTTTTTTTTTTTT>
##$WBST= 1024
##$WBSW= 4
##$XGAIN= (0..3)
0 0 0 0 
##$XL= 0
##$YL= 0
##$YMAX_a= 9309
##$YMIN_a= -14075
##$ZGOPTNS= <>
##$ZL1= 120
##$ZL2= 120
##$ZL3= 120
##$ZL4= 120
##$ABSF1= 182.463
##$ABSF2= -187.1042
##$ABSG= 5
##$ABSL= 3
##$ALPHA= 0
##$AQORDER= 0
##$ASSFAC= 0
##$ASSFACI= 0
##$ASSFACX= 0
##$ASSWID= 0
##$AUNMP= <proc_1d>
##$AZFE= 0.1
##$AZFW= 0.5
##$BCFW= 0
##$BC_mod= 2
##$BYTORDP= 0
##$COROFFS= 0
##$CY= -3
##$DATMOD= 1
##$DC= 0
##$DFILT= <>
##$DTYPP= 0
##$F1P= 0
##$F2P= 0
##$FCOR= 1
##$FTSIZE= 65536
##$FT_mod= 6
##$GAMMA= 0
##$GB= 0
##$INTBC= 1
##$INTSCL= 5.30512e-09
##$ISEN= 30
##$LB= 1
##$LEV0= 0
##$LPBIN= 0
##$MAXI= 10000
##$MC2= 0
##$MEAN= 0
##$ME_mod= 0
##$MI= 50
##$NCOEF= 0
##$NC_proc= -5
##$NLEV= 6
##$NOISF1= 182.463
##$NOISF2= 159.3651
##$NSP= 0
##$NTH_PI= 0
##$NZP= 0
##$OFFSET= 182.463
##$PC= 4
##$PHC0= -1325.082
##$PHC1= 73.8017
##$PH_mod= 1
##$PKNL= yes
##$PPARMOD= 0
##$PSCAL= 0
##$PSIGN= 0
##$REVERSE= no
##$SF= 81.0140089999434
##$SI= 65536
##$SIGF1= 159.3651
##$SIGF2= -187.1042
##$SINO= 113.3802
##$SIOLD= 16384
##$SREGLST= <1H.CDCl3>
##$SSB= 0
##$STSI= 65536
##$STSR= 0
##$SW_p= 29940.119760479
##$SYMM= 0
##$S_DEV= 0
##$TDeff= 32768
##$TDoff= 0
##$TI= <>
##$TILT= no
##$TM1= 0
##$TM2= 0
##$TOPLEV= 0
##$USERP1= <user>
##$USERP2= <user>
##$USERP3= <user>
##$USERP4= <user>
##$USERP5= <user>
##$WDW= 1
##$XDIM= 65536
##$YMAX_p= 375629377
##$YMIN_p= -14824510
$$ End of Bruker specific parameters
$$ ---------------------------------
##NTUPLES= NMR SPECTRUM
##VAR_NAME=  FREQUENCY,     SPECTRUM/REAL,   SPECTRUM/IMAG
##SYMBOL=    X,             R,               I
##VAR_TYPE=  INDEPENDENT,   DEPENDENT,       DEPENDENT
##VAR_FORM=  AFFN,          ASDF,            ASDF
##VAR_DIM=   65536,         65536,           65536
##UNITS=     HZ,            ARBITRARY UNITS, ARBITRARY UNITS
##FACTOR=    0.456856943014862, 1,           1
##FIRST=     14782.0589164792, 0,            0
##LAST=      -15158.0608439998, 0,           0
##MIN=       -15158.0608439998, -14824510,   0
##MAX=       14782.0589164792, 375629377,    0
$$ Real data points
##PAGE= N=1
##DATA TABLE= (X++(R..R)), XYDATA
$$ [...]
##PAGE= N=2
##DATA TABLE= (X++(I..I)), XYDATA
$$ plain form
36738 2818832 2371433 2025339 1522278 951472 717370 917830 1109512 835847 167122
36729 167122 -468398 -820167 -913849 -713672 -84443 791944 1324746 1118493 444053 -156047
36719 -156047 -490590 -627483 -465415 92812 692996 834510 596280 491424 607195 558305
36709 558305 377902 649772 1430074 1827829 1211734 185301 -279298 -100154 245283
36700 245283 738284 1553788 2161501 1795370 735513 87028 241094 569513 742422
36691 742422 1187419 1886236 1917397 906937 -80901 -15560 559296 513395 4974 116891
36681 116891 965346 1500577 1200619 725612 635885 590671 277005 123957 433550 628442
36671 628442 179539 -316945 103881 1277871 2066034 1898568 1338553 1039817 914103
$$ packed form
36738B818832m47399l46094n03061n70806k34102K00460J91682k73665o68725
36729A67122o35520l51769r3682K00177O29229Q76387N32802k06253o74440o00100
36719a56047l34543j36893J62068N58227O00184J41514k38230j04856J15771m8890
36709E58305j80403K71870P80302L97755o16095j026433m64599J79144L45437
36700B45283M93001Q15504O07713l66131j059857o48485J54066L28419J72909
36691G42422M44997O98817L1161j010460r87838O5341N74856m5901n08421J11917
36681A16891Q48455N35231k99958m75007q9727m5214l13666j53048L09593J94892
36671F28442m48903m96484M20826J173990P88163j67466n60015k98736j25714
$$ plain form
36662 914103 617212 246493 99094 99100 -48899 -271492 -128074 540672 1276404 1500025
36652 1500025 1207786 970850 1252842 1906039 2410157 2440594 2054339 1470282 921789 658116
36642 658116 787710 1089224 1253148 1351261 1749783 2464509 2963215 2814996 2227141 1693103
36632 1693103 1394468 1232023 1161411 1128514 887999 301743 -295399 -410493 -14562 469573
36622 469573 715304 701090 474638 97666 -201877 -191724 33055 191534 275915 542014
36612 542014 1039695 1478261 1595710 1402508 1078420 876980 1032315 1444429 1580404 1065590
36602 1065590 241824 -283896 -461663 -625332 -702215 -354934 149580 109171 -429548 -582830
36592 -582830 -44096 365812 88503 -170945 383378 1278091 1593630 1539585 2010197 2868946
$$ packed form
36662I14103k96891l70719j47399Oj47999k22593J43418O68746P35732K23621
36652A500025k92239k36936K81992O53197N04118L0437l86255n84057n48493k63673
36642F58116J29594L01514J63924R8113L98522P14726M98706j48219n87855n34038
36632A693103k98635j62445p0612l2897k40515n86256n97142j15094L95931M84135
36622D69573K45731j4214k26452l76972k99543J0153K24779J58479Q4381K66099
36612E42014M97681M38566J17449j93202l24088k01440J55335M12114J35975n14814
36602A065590q23766n25720j77767j63669p6883L47281N04514m0409n38719j53282
36592e82830N38734M09908k77309k59448N54323Q94713L15539n4045M70612Q58749
$$ plain form
36582 2868946 2959809 1920393 845867 793094 1524580 2172575 2380737 2257100 1842589
36573 1842589 1298739 1211893 1996658 3125385 3531582 2802350 1556436 614199 189598
36564 189598 22503 -57152 -9604 119560 138372 36824 130629 648322 1290844 1503512
36554 1503512 1208884 956298 1200135 1718461 1996100 1951324 1940561 2158968 2393933 2368801
36544 2368801 2033788 1488202 883847 471320 506306 987095 1603672 2006741 2052587 1813938
36534 1813938 1480598 1228482 1063323 834785 516915 355733 528318 749910 516133
36525 516133 -239740 -987309 -1176679 -786764 -222398 163596 338423 494804 810539 1288951
36515 1288951 1791674 2204022 2527301 2809791 3058741 3220491 3159114 2707600 1922900 1230617
$$ packed form
36582B868946R0863j039416j074526n2773P31486O47995K08162j23637m14511
36573A842589n43850q6846P84765J128727M06197p29232j245914r42237m24601
36564A89598j67095p9655M7548J29164J8812j01548R3805N17693O42522K12668
36554A503512k94628k52586K43837N18326K77639m4776j0763K18407K34965k5132
36544B368801l35013n45586o04355m12527L4986M80789O16577M03069M5846k38649
36534A813938l33340k52116j65159k28538l17870j61182J72585K21592k33777
36525E16133p55873p47569j89370L89915N64366L85994J74827J56381L15735M78412
36515A288951N02723M12348L23279K82490K48950J61750o1377m51514p84700o92283
$$ plain form
36505 1230617 1015136 1078141 910774 550214 601130 1180325 1513841 1109049 718285 1323023
36495 1323023 2532826 2958576 2108749 988221 679381 1179283 1910527 2571717 3023156
36486 3023156 3000384 2537025 2227589 2499307 2945099 2924080 2557751 2511135 2877750 2917764
36476 2917764 2082516 852330 225446 551257 1187936 1344237 994335 728702 841838
36467 841838 993229 892870 851308 1234654 1706525 1595555 879982 197574 -101387 -270967
36457 -270967 -458265 -367162 87130 397348 160278 -283586 -312959 227224 1100779 2114014
36447 2114014 3029529 3371423 2847573 1830582 1002914 632535 529876 527240 571297 469117
36437 469117 37967 -461785 -481966 70305 568295 386497 -271248 -521634 197113 1461594
$$ packed form
36505A230617k15481O3005j67367l60560N0916N79195L33516m04792l90764O04738
36495A323023J209803M25750q49827j120528l08840M99902P31244O61190M51439
36486C023156k2772m63359l09436K71718M45792k1019l66329m6616L66615M0014
36476B917764q35248j230186o26884L25811O36679J56301l49902k65633J13136
36467H41838J51391j00359m1562L83346M71871j10970p15573o82408k98961j69580
36457b70967j87298R1103M54292L10218k37070m43864k9373N40183Q73555J013235
36447B114014R15515L41894n23850j016991q27668l70379j02659k636M4057j02180
36437D69117m31150m99752k0181N52271M97990j81798o57745k50386P18747J264481
$$ plain form
36427 1461594 2350125 2477103 2247743 2076935 1826194 1318875 939197 1097351 1377324
36418 1377324 1001661 85596 -424310 -204843 -61096 -588498 -1150590 -837945 128636
36409 128636 688744 353016 -287520 -346416 457699 1568923 2061271 1575838 870888 993718
36399 993718 1840735 2241937 1689647 1086269 1275096 1741591 1535278 681584 -210977 -1006601
36389 -1006601 -1689243 -1663627 -629672 403802 327079 -274684 -6677 965457 1137912
36380 1137912 244863 -256004 306609 665726 -152630 -1076327 -720007 382546 736883
36371 736883 228684 -22273 310865 398451 -112335 -425758 120630 1076742 1643646 1761122
36361 1761122 1918255 2218241 2123782 1159689 -364270 -1508970 -1619091 -933179 -163255
$$ packed form
36427A461594Q88531J26978k29360j70808k50741n07319l79678J58154K79973
36418A377324l75663r16065n09906K19467J43747n27402n62092L12645R66581
36409A28636N60108l35728o40536n8896Q04115J111224M92348m85433p04950J22830
36399I93718Q47017M01202n52290o03378J88827M66495k06313q53694q92561p95624
36389a006601o82642K5616J033955J033474p6723o01763K68007R72134J72455
36380A137912q93049n00867N62613L59117q18356r23697L56320J102553L54337
36371G36883n08199k50957L33138Q7586n10786l13423N46388R56112N66904J17476
36361A761122J57133K99986r4459r64093j523959j144700j10121O85912P69924
$$ plain form
36352 -163255 272080 269338 -347583 -1507166 -2309316 -1729741 -137008 840116 414605 -315325
36342 -315325 -88036 671988 728521 81486 -90402 740038 1846584 2457624 2524161 2181484
36332 2181484 1432584 633530 429805 832492 1064303 702997 318335 527085 1022221
36323 1022221 1117035 807037 652582 858229 1085145 1092160 1013126 953956 778972 444349
36313 444349 180729 124622 28246 -385914 -925308 -1094445 -753035 -314333 -187792 -272882
36303 -272882 -180847 237909 789445 1169161 1074679 340488 -676694 -1090968 -402405 699769
36293 699769 1063873 583071 282964 829098 1756163 2433760 2896685 3195264 2812586 1571328
36283 1571328 436133 383926 903743 713356 -243853 -652478 272251 1767690 2641457
$$ packed form
36352a63255M35335k742o16921j159583q02150N79575J592733R77124m25511p29930
36342c15325K27289P60024N6533o47035j71888Q30440J106546O11040O6537l42677
36332B181484p48900p99054k03725M02687K31811l61306l84662K08750M95136
36323A022221R4814l09998j54455K05647K26916P015p9034n9170j74984l34623
36313D44349k63620n6107r6376m14160n39394j69137L41410M38702J26541q5090
36303b72882R2035M18756N51536L79716r4482p34191j017182m14274O88563J102174
36293F99769L64104m80802l00107N46134R27065O77597M62925K98579l82678j241258
36283A571328j135195n2207N19817j90387r57209m08625R24729J495439Q73767
$$ plain form
36274 2641457 2540723 1855351 1185149 1216610 2293716 3633451 3701943 1985664 -151480
36265 -151480 -983603 -353601 521051 771706 650429 736761 1136718 1621829 2029433 2262497
36255 2262497 2200725 1858294 1463902 1179152 833247 159986 -695888 -1162045 -904968 -302265
36245 -302265 97419 444747 1337233 2608931 3129907 2311123 1159354 1040267 1819750
36236 1819750 2182328 1585657 848405 742238 1026627 1162072 1088220 924812 684467 652618
36226 652618 1285979 2342682 2891848 2608842 2238437 2307688 2329490 1934887 1777915 2369328
36216 2369328 2920645 2515736 1688135 1513398 1741291 1365033 679054 1018326 2378185
36207 2378185 3029641 2003466 443846 -249941 -303290 -624318 -1076113 -888292 -129131
$$ packed form
36274B641457j00734o85372o70202L1461J077106J339735O8492j716279k137144
36265a51480q32123O30002Q74652K50655j21277Q6332L99957M85111M07604K33064
36255B262497o1772l42431l94392k84750l45905o73261q55874m66157K57077O02703
36245c02265L99684L47328Q92486J271698N20976q18784j151769j19087P79483
36236A819750L62578n96671p37252j06167K84389J35445p3852j63408k40345l1849
36226F52618O33361J056703N49166k83006l70405O9251K1802l94603j56972N91413
36216B369328N51317m04909q27601j74737K27893l76258o85979L39272J359859
36207B378185O51456j026175j559620o93787n3349l21028m51795J87821P59161
$$ plain form
36198 -129131 398068 401914 277516 251133 227179 367869 989177 1844464 2227330 1920351
36188 1920351 1465277 1334551 1343011 1109761 695817 473865 594999 880943 1157609 1426578
36178 1426578 1649769 1599377 1192765 908665 1420924 2568814 3132297 2189712 432302
36169 432302 -601657 -495193 -253739 -511227 -499837 605772 2205106 3008194 2681701
36160 2681701 1853546 896921 -281393 -1419370 -1880909 -1560937 -1015847 -566628 21219
36151 21219 833125 1477096 1676989 1616322 1510267 1374650 1335270 1550452 1676748 1097698
36141 1097698 -57239 -797189 -512277 301893 918284 1292689 1641557 1823803 1808752
36132 1808752 2145439 3145364 4038375 3832473 2753853 1948748 1898413 2036809 1925299
$$ packed form
36198a29131N27199L846j24398k6383k3954J40690O21308Q55287L82866l06979
36188A920351m55074j30726Q460k33250m13944k21952J21134K85944K76666K68969
36178A426578K23191n0392m06612k84100N12259J147890N63483r42585j757410
36169D32302j033959J06464K41454k57488J1390J105609J599334Q03088l26493
36160B681701q28155r56625j178314j137977m61539L19972N45090M49219N87847
36151B1219Q11906O43971J99893o0667j06055j35617l9380K15182J26296n79050
36141A097698j154937p39950K84912Q14170O16391L74405L48868J82246j5051
36132A808752L36687R99925Q93011k05902j078620q05105n0335J38396j11510
$$ plain form
36123 1925299 1840398 1955631 1812555 1081601 240867 -3400 428451 1105353 1665073 1867807
36113 1867807 1443217 425871 -520882 -628325 99793 871315 1020578 694254 550622
36104 550622 931451 1419844 1203203 -86258 -1851991 -2929995 -2598341 -1197878 220398
36095 220398 777509 360624 -413476 -705432 -85442 1145609 2234320 2591824 2159772
36086 2159772 1333161 708556 770591 1477801 2136083 2017308 1195638 474716 418499 816391
36076 816391 1200152 1401494 1342219 800117 -131135 -751323 -529046 84380 262867 68825
36066 68825 373485 1502220 2720192 3271879 3218906 2894568 2212823 1097038 86737
36057 86737 -196316 67754 208312 101427 212284 644250 885760 688329 538183 896249
$$ packed form
36123A925299q4901J15233j43076p30954q40734k44267M31851O76902N59720K02734
36113A867807m24590j017346r46753j07443P28118P71522J49263l26324j43632
36104E50622L80829M88393k16641j289461j765733j078004L31654J400463J418276
36095B20398N57111m16885p74100k91956O19990J231051J088711L57504m32052
36086B159772q26611o24605O2035P07210O58282j18775q21670p20922n6217L97892
36076H16391L83761K01342n9275n42102r31252o20188K22277O13426J78487j94042
36066F8825L04660J128735J217972N51687n2973l24338o81745j115785j010301
36057H6737k83053K64070J40558j06885J10857M31966K41510j97431j50146L58066
$$ plain form
36047 896249 1464877 1623632 1224225 549456 -165089 -678961 -508598 625968 2161186
36038 2161186 3041068 2776052 1756639 558676 -540733 -1328198 -1564773 -1359651 -1086863
36029 -1086863 -669102 441067 2138588 3165259 2472656 715548 -422580 -237543 446877
36020 446877 688643 528516 473570 636000 806936 902114 957795 1017235 1240320 1729665
36010 1729665 2072720 1589624 347303 -601106 -408248 590320 1507716 2001192 2188769
36001 2188769 1988128 1314647 630540 466722 525401 64616 -843156 -1246664 -627826 473042
35991 473042 1332174 1791412 1833081 1186191 -66700 -1050769 -974965 -186054 282815 108447
35981 108447 19531 636422 1458124 1380344 124447 -1190483 -1159896 274788 1669279
$$ packed form
36047H96249N68628J58755l99407o74769p14545n13872J70363J134566J535218
36038B161186Q79882k65016j019413j197963j099409p87465k36575K05122K72788
36029a086863M17761J110169J697521J026671o92603j757108j138128J85037O84420
36020D46877K41766j60127n4946J62430J70936R5178N5681N9440K23085M89345
36010A729665L43055m83096j242321r48409J92858R98568R17396M93476J87577
36001B188769k00641o73481o84107j63818N8679m60785r07772m03508O18838J100868
35991D73042Q59132M59238M1669o46890j252891r84069P5804P88911M68869j74368
35981A08447q8916O16891Q21702p7780j255897j314930L0587J434684J394491
$$ plain form
35972 1669279 1759856 941184 608411 1300750 2193733 2396406 1960786 1381747 850912 439521
35962 439521 386867 653203 675935 139166 -435421 -434727 -58979 160955 299181 672126
35952 672126 925558 526538 3361 482410 1794913 2269893 1012107 -645264 -862312
35943 -862312 272351 1131693 1000656 904008 1837316 3227749 3741194 3007952 1868457
35934 1868457 1163168 919271 754540 541219 398428 345534 330470 500035 1080450 1915503
35924 1915503 2402952 2068470 1061065 -43508 -774982 -981031 -727755 -237904 194323
35915 194323 460752 703387 917921 716186 -128830 -1048428 -1115241 -170997 961191 1535485
35905 1535485 1701907 2044449 2730476 3452476 3886627 3842417 3211694 2158468 1185139
$$ packed form
35972A669279R0577q18672l32773O92339Q92983K02673m35620n79039n30835m11391
35962D39521n2654K66336K2732n36769n74587O94L75748K19934J38226L72945
35952F72126K53432l99020n23177M79049J312503M74980j257786j657371k17048
35943h62312J134663Q59342j31037r6648R33308J390433N13445p33242j139495
35934A868457p05289k43897j64731k13321j42791n2894j5064J69565N80415Q35053
35924A915503M87449l34482j007405j104573p31474k06049K53276M89851M32227
35915A94323K66429K42635K14534k01735q45016r19598o6813R44244J132188N74294
35905A535485J66422L42542O86027P22000M34151m4210o30723j053226r73329
$$ plain form
35896 1185139 640207 294006 -246986 -850210 -995314 -529080 151440 679943 1060606
35887 1060606 1343241 1374538 1082179 719248 615018 878034 1473513 2331647 3187370 3585892
35877 3585892 3360211 2944088 2879457 3099395 3065356 2618635 2262520 2375800 2499086 1847709
35867 1847709 447641 -706868 -784301 -52862 576280 663509 516118 526363 740649 1101604
35857 1101604 1582998 1878959 1456184 307932 -692145 -647196 357609 1507857 2271409
35848 2271409 2648237 2626385 2096781 1359576 1048105 1318641 1639866 1619055 1519034 1666944
35838 1666944 1871894 1822656 1600906 1353640 899239 198974 -174829 304745 1262561 1890040
35828 1890040 2047111 2147725 2114452 1393990 144160 -526726 63833 1244781 1908908
$$ packed form
35896A185139n44932l46201n40992o03224j45104M66234O80520N28503L80663
35887A060606K82635L1297k92359l62931j04230K63016N95479Q58134Q55723L98522
35877C585892k25681m16123o4631K19938l4039m46721l56115J13280J23286o51377
35867A847709j400068j154509p7433P31439O29142Q7229j47391J0245K14286L60955
35857A101604M81394K95961m22775j148252j000077M4949J004805J150248P63552
35848B271409L76828k1852n29604p37205l11471K70536L21225k0811j00021J47910
35838A666944K04950m9238k21750k47266m54401p00265l73803M79574R57816O27479
35828A890040J57071J00614l3273p20462j249830o70886N90559J180948O64127
$$ plain form
35819 1908908 1800510 1419757 1164165 1116310 1278189 1451239 1199142 459242 -121176 -5493
35809 -5493 407276 414667 149198 285127 793282 920720 468106 153714 423601 751072
35799 751072 578602 226298 267368 570500 631180 438145 317181 213342 -134924 -457543
35789 -457543 -141769 796829 1590298 1725200 1521723 1483379 1543963 1276844 534483 -416054
35779 -416054 -1180096 -1431979 -1040114 -249342 399683 560282 419531 408682 680350 1025655
35769 1025655 1222749 1299495 1452433 1779376 2098823 2083945 1678962 1304268 1422991 1933345
35759 1933345 2293048 2268042 2156681 2132264 1844875 1036047 138045 -263334 -287535 -471775
35749 -471775 -793271 -708243 -196508 22472 -395409 -810641 -601945 -162926 -207339 -529846
$$ packed form
35819A908908j08398l80753k55592m7855J61879J73050k52097p39900n80418J15683
35809e493M12769P391k65469J35929N08155J27438m52614l14392K69887L27471
35799G51072j72470l52304M1070L03132O0680j93035j20964j03839l48266l22619
35789d57543L15774R38598P93469J34902k03477l8344O0584k67119p42361r50537
35779d16054p64042k51883L91865P90772O49025J60599j40751j0849K71668L45305
35769A025655J97094P6746J52938L26943L19447j4878m04983l74694J18723N10354
35759A933345L59703k5006j11361k4417k87389q08828q98002m01379k4201j84240
35749d71775l21496Q5028N11735K18980m17881m15232K08696M39019m4413l22507
$$ plain form
35739 -529846 -351347 251577 240100 -820331 -1903398 -1753573 -454844 811229 1264210
35730 1264210 1175706 1130162 1235621 1241062 1058910 896601 976938 1281569 1567274 1615661
35720 1615661 1472778 1377928 1414715 1354070 962217 369368 -13304 102175 644764 1250189
35710 1250189 1467278 1054583 237902 -436044 -621164 -391105 120910 921743 1748928
35701 1748928 1943097 1288209 624341 867487 1605911 1586696 636435 54107 709318 1756040
35691 1756040 1967799 1540515 1568017 2212699 2515008 1917784 972018 382250 169642 29611
35681 29611 -145158 -381095 -724318 -974576 -801722 -336185 -131674 -305993 -277865 298592
35671 298592 882103 803013 233330 -153227 -163405 -118067 -89892 251509 1001701 1742161
$$ packed form
35739e29846J78499O02924j1477j060431j083067J49825J298729J266073M52981
35730A264210q8504m5544J05459N441j82152j62309Q0337L04631K85705M8387
35720A615661j42883r4850L6787o0645l91853n92849l82672J15479N42589O05425
35710A250189K17089m12695q16681o73946j85120K30059N12015Q00833Q27185
35701A748928J94169o54888o63868K43146P38424j9215r50261n82328O55211J046722
35691A756040K11759m27284K7502O44682L02309n97224r45766n89768k12608j40031
35681B9611j74769k35937l43223k50258J72854M65537K04511j74319K8128N76457
35671B98592N83511p9090n69683l86557j0178M5338K8175L41401P50192P40460
$$ plain form
35661 1742161 2043497 1918223 1661297 1481807 1365319 1120755 553862 -240714 -818322
35652 -818322 -825512 -429579 -56645 212483 636251 1202802 1436478 1017505 348451 257550
35642 257550 1184209 2733012 3962763 4121703 3258194 2162573 1601176 1604050 1612430 1231276
35632 1231276 585019 -26250 -470136 -688632 -596335 -260433 87334 426837 1071257 2138431
35622 2138431 3134824 3419087 2934258 2127869 1297801 484297 -64612 43821 607750
35613 607750 738211 -37500 -982756 -1037822 -259087 313103 198369 123446 823470 1841695
35603 1841695 2104263 1351359 394306 78779 518766 1287214 1820298 1622577 663626
35594 663626 -270837 -195796 810678 1476731 874060 -371146 -939638 -532025 -42052
$$ packed form
35661A742161L01336j25274k56926j79490j16488k44564n66893p94576n77608
35652h18322p190L95933L72934K69128M23768N66551K33676m18973o69054r0901
35642B57550R26659J548803J229751J58940q63509j095621n61397K874Q380l81154
35632A231276o46257o11269m43886k18496R2297L35902L47767L39503O44420J067174
35622B138431R96393K84263m84829q06389q30068q13504n48909J08433N63929
35613F07750J30461p75711r45256n5066P78735N72190j14734p4923P00024J018225
35603A841695K62568p52904r57053l15527M39987P68448N33084j97721r58951
35594F63626r34463P5041J006474O66053o02671j245206n68492M07613M89973
$$ plain form
35585 -42052 -181076 -675099 -928969 -820642 -535079 -117948 385260 655302 416084 -65680
35575 -65680 -162036 364713 987323 922999 17635 -965741 -1104357 -392597 218566 69264
35565 69264 -270589 203074 1439128 2357746 2356657 1963376 1737547 1398488 625940 -22731
35555 -22731 139735 732379 804422 301898 71381 432285 715036 417466 -57211 -184149
35545 -184149 -107332 -195480 -396656 -510406 -626590 -835125 -909401 -702782 -455700 -290618
35535 -290618 151750 1066240 1885358 1909490 1219338 409987 -236979 -691597 -642675 178723
35525 178723 1312745 1970031 2018308 1862907 1535134 797740 65095 139043 856033 1070744
35515 1070744 361094 -278738 15981 737488 1056962 1229644 1963158 3007929 3460658
$$ packed form
35585d2052j39024m94023k53870J08327K85563M17131N03208K70042k39218m81764
35575f5680r6356N26749O22610o4324r05364r83376j38616P11760O11163j49302
35565F9264l39853M73663J236054R18618j089l93281k25829l39059p72548o48671
35555b2731J62466N92644P2043n02524k30517L60904K82751k97570m74677j26938
35545a84149P6817q8148k01176j13750j16184k08535p4276K06619K47082J65082
35535b90618M42368R14490Q19118K4132o90152q09351o46966m54618M8922Q21398
35525A78723J134022O57286M8277j55401l27773p37394p32645P3948P16990K14711
35515A070744p09650o39832K94719P21507L19474J72682P33514J044771M52729
$$ plain form
35506 3460658 3157448 2783797 2758228 2877976 2972331 3080836 3012842 2500574 1813322 1522887
35496 1522887 1630263 1562945 1015825 151110 -920328 -2039951 -2435930 -1265466 1020118
35487 1020118 2743650 2831206 1858290 959308 508028 340973 480418 937054 1341162
35478 1341162 1423740 1452624 1660212 1707874 1295342 839086 887814 1235691 1278054 931690
35468 931690 537244 129308 -492873 -1155812 -1443756 -1317618 -1026876 -592793 22584 470517
35458 470517 439006 329772 754630 1501328 1818855 1639143 1609102 1898013 1960804 1668165
35448 1668165 1674465 2296971 2954547 3204583 3464476 4075319 4432869 3844576 2685395 1889193
35438 1889193 1686373 1611071 1441450 1339343 1222620 745685 -96139 -889165 -1288329 -1149457
$$ packed form
35506C460658l03210l73651k5569J19748R4355J08505o7994n12268o87252k90435
35496A522887J07376o7318n47120q64715j071438j119623l95979J170464K285584
35487A020118J723532Q7556r72916q98982m51280j67055J39445M56636M04108
35478A341162Q2578K8884K07588M7662m12532m56256M8728L47877M2363l46364
35468I31690l94446m07936o22181o62939k87944J26138K90742M34083O15377M47933
35458D70517l1511j09234M24858P46698L17527j79712l0041K88911O2791k92639
35448A668165O300O22506O57576K50036K59893O10843L57550n88293j159181p96202
35438A889193k02820p5302j69621j02107j16723m76935q41824p93026l99164J38872
$$ plain form
35428 -1149457 -354044 972097 2203418 2705557 2480545 1895393 1063066 106272 -301136
35419 -301136 427435 1689838 2195588 1692854 1261008 1634640 2213703 2209010 1841852 1697099
35409 1697099 1644234 1264722 810664 822602 1133653 1134620 797915 572677 439912 6943
35399 6943 -517448 -444326 185845 529150 351448 471872 1283880 1864655 1395124 614592
35389 614592 746173 1526882 1607232 749481 282826 1089504 2310284 2662681 2156558 1709492
35379 1709492 1655419 1518724 1000188 370758 -84936 -349429 -330757 168615 953809 1385114
35369 1385114 1107463 529818 316556 612284 1009082 1123650 951682 704683 508663
35360 508663 309673 -2225 -390732 -589907 -304643 433326 1167313 1381678 1001738 503303
$$ packed form
35428a149457P95413J326141J231321N02139k25012n85152q32327r56794m07408
35419c01136P28571J262403N05750n02734m31846L73632N79063m693l67158j44753
35409A697099n2865l79512m54058J1938L11051R67l36705k25238j32765m32969
35399F943n24391P3122O30171L43305j77702J20424Q12008N80775m69531p80532
35389F14592J31581P80709Q0350q57751m66655Q06678J220780L52397n06123m47066
35379A709492n4073j36695n18536o29430m55694k64493J8672M99372P85194M31305
35369A385114k77651n77645k13262K95728L96798J14568j71968k46999j96020
35360E08663j98990l11898l88507j99175K85264P37969P33987K14365l79940m98435
$$ plain form
35350 503303 484557 1076758 1762855 1849816 1174701 262567 -287094 -417773 -420940 -278260
35340 -278260 366423 1453142 2146713 1645411 207622 -1030071 -1268392 -731279 -85201
35331 -85201 397365 803206 1022666 726908 -82128 -877350 -1123047 -792719 -283834 -10505
35321 -10505 -147801 -523689 -625850 12795 1209109 2147205 2271854 1932771 1807515 1944112
35311 1944112 1872623 1488140 1175696 1063660 870767 672467 1051983 2052561 2673761
35302 2673761 2097109 928322 413606 705694 802439 162797 -538692 -525173 -9281 295395
35292 295395 227445 218594 575602 1168051 1665231 1758796 1339053 768097 762036 1588687 2516092
35281 2516092 2542929 1692318 1083129 1514497 2404012 2519309 1520859 288847 -263815
$$ packed form
35350E03303j8746N92201O86097Q6961o75115r12134n49661j30679l167J42680
35340b78260O44683J086719O93571n01302j437789j237693k38321N37113O46078
35331h5201M82566M05841K19460k95758q09036p95222k45697L30328N08885K73329
35321a0505j37296l75888j02161O38645J196314R38096J24649l39083j25256J36597
35311A944112p1489l84483l12444j12036j92893j98300L79516J000578O21200
35302B673761n76652j168787n14716K92088R6745o39642p01489J3519N15892L04676
35292B95395o7950q851L57008N92449M97180R3565m19743n70956o061Q26651R27405
35281B516092K6837q50611o09189M31368Q89515J15297r98450j232012n52662
$$ plain form
35272 -263815 -198800 -153584 -352473 -466660 -290696 -50831 38517 129848 470704 1033211
35262 1033211 1567944 1824641 1643238 1092288 589622 541004 755084 658218 264578 337822
35252 337822 1159993 1734486 965044 -694696 -1612502 -964859 376752 1040349 607304
35243 607304 -290553 -789773 -478949 369059 1073444 1259420 1228918 1355285 1408670 1045740
35233 1045740 686970 1049546 1841890 1859755 603512 -1024422 -1921141 -1908072 -1366901
35224 -1366901 -593524 66501 252245 255132 858390 1971586 2305553 1149373 -372880
35215 -372880 -770823 -216307 -24586 -640182 -1322912 -1531248 -1423422 -1081485 -365092 401497
35205 401497 601161 313859 261410 671380 1053270 1173770 1324863 1478681 1152226 391191
$$ packed form
35272b63815O5015M5216j98889j14187J75964K39865Q9348R1331L40856N62507
35262A033211N34733K56697j81403n50950n02666m8618K14080r6866l93640P3244
35252C37822Q22171N74493p69442j659740r17806O47643J341611O63597m33045
35243F07304q97857m99220L10824Q48008P04385J85976l0502J26367N3385l62930
35233A045740l58770L62576P92344J7865j256243j627934q96719J3069N41171
35224a366901P73377O60025J85744K887O03258J113196L33967j156180j522253
35215c72880l97943N54516J91721o15596o82730k08336J07826L41937P16393P66589
35205D01497J99664k87302n2449M09970L81890J20500J51093J53818l26455p61035
$$ plain form
35195 391191 -49365 131891 344280 254545 436413 1253347 1937179 1594980 546813 -153222
35185 -153222 -132004 100936 67848 -225523 -527862 -470390 288139 1494361 2157527 1584910
35175 1584910 344313 -414243 -385603 -182397 -149627 65674 664448 1180840 1146011 740385
35165 740385 433915 344337 283434 192395 231709 548700 1116097 1713588 2051403 2100682
35155 2100682 2279002 2985633 3899604 4148238 3385075 2330688 1924639 2248981 2688139
35146 2688139 2874528 2904993 2738247 2099143 1197519 894792 1647572 2684769 2850334
35137 2850334 2089533 1456854 1637208 2118802 2078758 1515057 1038597 904064 791366 424329
35127 424329 -73255 -460568 -663389 -722378 -734318 -889408 -1309656 -1778161 -1859274 -1405768
$$ packed form
35195C91191m40556J81256K12389q9735J81868Q16934O83832l42199j048167p00035
35185a53222K1218K32940l3088k93371l02339N7472P58529J206222O63166n72617
35175A584910j240597p58556K8640K03206L2770K15301N98774N16392l4829m05626
35165G40385l06470q9578o0903r1039L9314L16991N67397N97491L37815M9279
35155B100682J78320P06631R13971K48634p63163j054387m06049L24342M39158
35146B688139J86389L0465j66746o39104r01624l02727P52780J037197J65565
35137B850334p60801o32679J80354M81594m0044n63701m76460j34533j12698l67037
35127D24329m97584l87313k02821n8989j1940j55090m20248m68505q1113M53506
$$ plain form
35117 -1405768 -784677 -464993 -469460 -383004 65550 546589 460842 -191843 -557554 82968
35107 82968 1225257 1625287 947367 245160 457363 1115067 1197230 728850 607961 1058137
35097 1058137 1244609 584107 -378315 -740681 -299793 539292 1457399 2382437 3167737
35088 3167737 3483527 3081861 2116427 1170509 779774 805292 579445 -78429 -426748 126855
35078 126855 965420 1058059 552864 632647 1788983 3164373 3766081 3481151 2686913 1731939
35068 1731939 1115578 1323863 2046109 2288514 1684295 979306 838241 989194 1045617 1301998
35058 1301998 2005500 2589287 2457137 1975337 1902345 2289519 2651490 2772340 2665096 2196391
35048 2196391 1420700 808861 508261 -39365 -1040276 -1610680 -1009530 42415 350524
$$ packed form
35117a405768O21091L19684m467Q6456M48554M81039q5747o52685l65711O40522
35107H2968J142289M00030o77920p02207K12203O57704Q2163m68380j20889M50176
35097A058137J86472o60502r62422l62366M40888Q39085R18107R25038P85300
35088C167737L15790m01666r65434r45918l90735K5518k25847o57874l48319N53603
35078A26855Q38565R2639n05195P9783J156336J375390O01708k84930p94238r54974
35068A731939o16361K08285P22246K42405o04219p04989j41065J50953N6423K56381
35058A301998P03502N83787j32150m81800p2992L87174L61971J20850j07244m68705
35048B196391p75691o11839l00600n47626j000911n70404O01150J051945L08109
$$ plain form
35039 350524 11536 25258 595041 1086558 1355001 1758430 2021393 1489053 517705 232330
35029 232330 769469 1108166 846278 742022 1135949 1269988 772943 491827 1056253 1762624
35019 1762624 1756063 1329990 1148148 1065719 695181 398531 714607 1370043 1782157 2028142
35009 2028142 2416216 2590388 2034996 1121449 706308 900044 1077306 942895 813370
35000 813370 964757 1374350 1957216 2459483 2377432 1635201 1032679 1270466 1829093 1669615
34990 1669615 797713 156876 97811 44194 -220496 -34417 982237 2132496 2522234
34981 2522234 2110044 1448023 919334 636545 616103 662554 471092 130951 94719 408705
34971 408705 530009 257149 236564 997207 1976416 2182164 1522673 807350 606653 781301
$$ packed form
35039C50524l38988J3722N69783M91517K68443M03429K62963n32340r71348k85375
35029B32330N37139L38697k61888j04256L93927J34039m97045k81116N64426P06371
35019A762624o561m26073j81842q2429l70538k96650L16076O55436M12114K45985
35009B028142L88074J74172n55392r13547m15141J93736J77262j34411j29525
35000H13370J51387M09593N82866N02267q2051p42231o02522K37787N58627j59478
34990A669615q71902o40837n9065n3617k64690J86079J016654J150259L89738
34981B522234m12190o62021n28689k82789k0442M6451j91462l40141l6232L13986
34971D08705J21304k72860k0585P60643R79209K05748o59491p15323k00697J74648
$$ plain form
34961 781301 1083774 1546444 2124260 2480283 2370279 1927421 1433501 1099540 1134222 1640908
34951 1640908 2282256 2421240 1867987 1213980 1129223 1530760 1760728 1447805 854690 421511
34941 421511 296522 380701 580864 876001 1228309 1504169 1490195 1088811 574150 473758
34931 473758 991454 1700758 2065448 2083683 2061721 1963653 1559915 1134055 1294668 1933998
34921 1933998 2161250 1630296 1131557 1280795 1420355 727141 -229906 -239368 562074 789261
34911 789261 -36646 -756735 -418707 318138 325422 -340143 -734143 -353363 578687 1643829
34901 1643829 2343173 2155847 1217986 541373 836804 1522693 1663499 1438393 1701985
34892 1701985 2412827 2662525 2208385 1769783 1611617 1053433 -120516 -896794 -494243
$$ packed form
34961G81301L02473M62670N77816L56023j10004m42858m93920l33961L4682N06686
34951A640908O41348J38984n53253o54007q4757M01537K29968l12923n93115m33179
34941D21511j24989Q4179K00163K95137L52308K75860j3974m01384n14661j00392
34931D73758N17696P09304L64690J8235k1962r8068m03738m25860J60613O39330
34921A933998K27252n30954m98739J49238J39560o93214r57047r462Q01442K27187
34911G89261q25907p20089L38028P36845P284o65565l94000L80780R32050J065142
34901A643829O99344j87326r37861o76613K95431O85889J40806k25106K63592
34892A701985P10842K49698m54140m38602j58166n58184j173949p76278M02551
$$ plain form
34883 -494243 285987 192347 -562805 -655431 303070 1213314 1132262 472557 130568 218615
34873 218615 326594 501965 1120517 1947045 2174430 1590994 1030947 1264946 1936348 2108793
34863 2108793 1522888 711766 86396 -389408 -644017 -383456 257468 637938 544848 601948
34853 601948 1295985 2152672 2452304 2272813 2124265 1946003 1315747 454290 110613 412086
34843 412086 671757 523710 477420 1010059 1746822 1983024 1608106 1147003 1157169 1763303
34833 1763303 2466786 2360626 1035131 -619068 -1123434 -140524 1175343 1838494 2208349
34824 2208349 2929235 3535826 3120468 1940589 1276614 1768214 2791485 3500587 3653432
34815 3653432 3317990 2588539 1845052 1608514 1845791 1966379 1707333 1435374 1393698 1341205
$$ packed form
34883d94243P80230r3640p55152r2626R58501R10244q1052o59705l41989Q8047
34873B18615J07979J75371O18552Q26528K27385n83436n60047K33999O71402J72445
34863B108793n85905q11122o25370m75804k54609K60561O40924L80470r3090N7100
34853F01948O94037Q56687K99632j79491j48548j78262o30256q61457l43677L01473
34843D12086K59671j48047m6290N32639P36763K36202l74918m61103J0166O06134
34833A763303P03483j06160j325495j654199n04366R82910J315867O63151L69855
34824B208349P20886O06591m15358j179879o63975M91600J023271P09102J52845
34815C653432l35442p29451p43487k36538K37277J20588k59046k71959m1676n2493
$$ plain form
34805 1341205 1207393 1336719 1666215 1478468 611893 136931 934536 2218448 2550175
34796 2550175 1907363 1512382 1785633 1855361 1291132 923759 1332875 1730533 1260538 466168
34786 466168 371426 778610 707020 136900 928 481042 606787 -126486 -848896 -612020
34776 -612020 241313 717559 622598 624892 1160411 1940956 2467414 2531368 2223259 1815603
34766 1815603 1638995 1796332 1999691 1870066 1339550 627944 -16830 -364546 -180282
34757 -180282 547433 1420874 1910330 1805398 1289259 703436 394463 625165 1391467 2366881
34747 2366881 3141222 3415803 2958080 1718852 216862 -570151 -158688 755205 1008756
34738 1008756 321922 -465684 -499720 170408 904832 1341875 1652260 2035659 2271304 1988335
$$ packed form
34805A341205j33812J29326L29496j87747q66575m74962P97605J283912L31727
34796B550175o42812l94981K73251O9728n64229l67373M09116L97658m69995p94370
34786D66168r4742M07184p1590n70120j35972M80114J25745p33273p22410K36876
34776f12020Q53333M76246r4961K294N35519P80545N26458O3954l08109m07656
34766A815603j76608J57337K03359j29625n30516p11606o44774l47716J84264
34757a80282P27715Q73441M89456j04932n16139n85823l08973K30702P66302R75414
34747B366881P74341K74581m57723j239228j501990p87013M11463R13893K53551
34738A008756o86834p87606l4036O70128P34424M37043L10385L83399K35645k82969
$$ plain form
34728 1988335 1354418 1147334 1787323 2514003 2170117 882607 200179 1136831 2782507
34719 2782507 3550936 3225706 2815484 2735818 2325274 1260812 346703 445375 1410827 2543744
34709 2543744 3428627 3831737 3431053 2326279 1378674 1344861 1910787 2187572 1974914
34700 1974914 1915648 2464287 3280965 3719654 3487866 2760388 2004541 1732621 2068714 2509173
34690 2509173 2464513 2085523 2128383 2851205 3510135 3315963 2556823 2255696 2823145 3598545
34680 3598545 3836750 3620959 3437391 3249368 2614107 1644826 1191738 1791016 2897701
34671 2897701 3556421 3520349 3267665 3149602 3073389 2965819 2978887 3103732 3048081 2718510
34661 2718510 2465633 2603813 2959225 3121589 2913134 2414402 1786767 1307880 1323877 1852779
$$ packed form
34728A988335o33917k07084O39989P26680l43886j287510o82428R36652J645676
34719B782507P68429l25230m10222p9666m10544j064462r14109R8672R65452J132917
34709B543744Q84883M03110m00684j104774r47605l3813N65926K76785k12658
34700A974914n9266N48639Q16678M38689k31788p27478p55847k71920L36093M40459
34690B509173m4660l78990M2860P22822O58930j94172p59140l01127N67449P75400
34680C598545K38205k15791j83568j88023o35261r69281m53088N99278J106685
34671B897701O58720l6072k52684j18063p6213j07570J3068J24845n5651l29571
34661B718510k52877J38180L55412J62364k08455m98732o27635m78887J5997N28902
$$ plain form
34651 1852779 2422327 2621418 2643913 2914889 3319058 3297935 2743571 2266077 2321965 2516431
34641 2516431 2209281 1549528 1345754 1926267 2693613 3017174 3065399 3345838 3803153 3955466
34631 3955466 3731791 3490554 3193612 2310362 836223 -255183 -94707 990748 2001511
34622 2001511 2505719 2744567 2793863 2393673 1611403 1002305 943160 1269769 1672546 2000053
34612 2000053 2079760 1727996 1137436 861324 1198961 1888140 2526705 2958260 3103601 2784707
34602 2784707 1966750 948577 129840 -261086 -175835 265745 757223 1042323 1191303
34593 1191303 1372184 1413638 1002029 302002 -90697 115297 665082 1287816 1933908 2399343
34583 2399343 2352502 1980051 1996520 2665332 3368363 3549115 3535137 3908080 4520774 4742112
$$ packed form
34651A852779N69548J99091K2495K70976M04169k1123n54364m77494N5888J94466
34641B516431l07150o59753k03774N80513P67346L23561M8225K80439M57315J52313
34631C955466k23675k41237k96942q83250j474139j091406J60476J085455J010763
34622B001511N04208K38848M9296m00190p82270o09098n9145L26609M02777L27507
34612B000053P9707l51764n90560k76112L37637O89179O38565M31555J45341l18894
34602B784707q17957j018173q18737l90926Q5251M41580M91478K85100J48980
34593A191303J80881M1454m11609p00027l92699K05994N49785O22734O46092M65435
34583B399343m6841l72451J6469O68812P03031J80752j3978L72943O12694K21338
$$ plain form
34573 4742112 4357397 3633805 2739129 1727650 1001440 1158865 2242873 3501605 4027540
34564 4027540 3489584 2292571 1199528 724055 734601 731381 563614 632494 1249678 2084079
34554 2084079 2501162 2278324 1785057 1588200 1971680 2656659 2970917 2570856 1971201
34545 1971201 1952933 2477013 2762166 2488759 2184040 2185456 2063727 1572255 1383006 2123995
34535 2123995 3227594 3551887 2860572 2011992 1882857 2613405 3640859 4032834 3178263
34526 3178263 1625979 770854 1196379 1914838 1864665 1409284 1429602 1670183 1292618 625185
34516 625185 851173 1990656 2652912 2078664 1129816 773179 728709 295227 -380661 -632095
34506 -632095 -297998 230649 624726 816194 884051 1036030 1398345 1681669 1464099 891307
$$ packed form
34573D742112l84715p23592q94676j011479p26210J57425J084008J258732N25935
34564D027540n37956j197013j093043m75473J0546l220j67767O8880O17184Q34401
34554B084079M17083k22838m93267j96857L83480O84979L14258m00061n99655
34545A971201j8268N24080K85153k73407l04719J416j21729m91472j89249P40989
34535B123995J103599L24293o91315q48580j29135P30548J027454L91975q54571
34526C178263j552284q55125M25525P18459n0173m55381K0318K40581l77565o67433
34516F25185K25988J139483O62256n74248r48848l56637m4470m33482o75888k51434
34506f32095L34097N28647L94077J91468O7857J51979L62315K83324k17570n72792
$$ plain form
34496 891307 580756 741000 984522 1119255 1404089 1795642 1722787 1018832 388150 449719
34486 449719 897042 1118768 1133539 1358546 1861093 2359473 2641595 2564189 2000893 1202455
34476 1202455 820555 1131648 1604016 1672203 1545438 1749081 2248412 2623227 2827750 3134227
34466 3134227 3454468 3312574 2504982 1380877 498139 293559 905034 1927188 2533568
34457 2533568 2315307 1870704 2057814 2746886 2909396 2034082 879847 532908 1126445
34448 1126445 1875787 2143849 2034424 1945985 1948848 1858632 1736835 1939665 2561805 3112707
34438 3112707 3022981 2365993 1794926 1781624 2185890 2609081 2890635 3114518 3323903 3433767
34428 3433767 3394649 3324686 3410459 3641640 3711440 3352561 2768659 2472252 2623171 2836304
$$ packed form
34496H91307l10551J60244K43522J34733K84834L91553p2855p03955o30682O1569
34486D49719M47323K21726J4771K25007N02547M98380K82122p7406n63296p98438
34476A202455l81900L11093M72368O8187j26765K03643M99331L74815K04523L06477
34466C134227L20241j41894q07592j124105q82738k04580O11475J022154O06380
34457B533568k18261m44603J87110O89072J62510q75314j154235l46939N93537
34448A126445P49342K68062j09425q8439K863r0216j21797K02830O22140N50902
34438C112707q9726o56988n71067j3302M04266M23191K81554K23883K09385J09864
34428C433767l9118o9963Q5773K31181O9800l58879n83902k96407J50919K13133
$$ plain form
34418 2836304 2746237 2349522 1629526 444883 -802754 -1039936 227977 2007304 2957669
34409 2957669 3052708 3205760 3611428 3607951 3056758 2593733 2349851 1658994 442084 -245593
34399 -245593 352025 1618548 2533693 2927475 3173001 3359310 3393192 3311240 2972151 2085909
34389 2085909 1006976 700098 1338553 1798082 1293141 653857 1008982 1958496 2258433
34380 2258433 1838648 1827128 2669878 3419486 3119594 2043117 1243726 1383351 2186980
34371 2186980 2766017 2497076 1763013 1552260 2112987 2538062 2118927 1482382 1669823
34362 1669823 2602251 3318452 3381676 3161030 2963549 2788632 2804873 3201814 3638672 3657018
34352 3657018 3566476 4066008 4995441 5348028 4655199 3576822 2954736 2989480 3487979 4169430
$$ packed form
34418B836304r0067l96715p19996j184643j247637k37182J267913J779327R50365
34409B957669R5039J53052M05668l477n51193m63025k43882o90857j216910o87677
34399b45593N97618J266523R15145L93782K45526J86309L3882q1952l39089q86242
34389B085909j078933l06878O38455M59529n04941o39284L55125R49514K99937
34380B258433m19785j1520Q42750P49608k99892j076477p99391J39625Q03629
34371B186980N79037k68941p34063k10753N60727M25075m19135o36545J87441
34362A669823R32428P16201O3224k20646j97481j74917J6241L96941M36858J8346
34352C657018r0542M99532R29433L52587o92829j078377o22086L4744M98499O81451
$$ plain form
34342 4169430 4481917 3834173 2410360 1260280 1219007 2062475 2941877 3315687 3255685
34333 3255685 3115243 3100706 3079051 2803223 2347936 2045832 1857000 1300896 403296 148147
34323 148147 1314993 3286565 4763168 5295727 5291504 4904061 3997345 3016320 2708046
34314 2708046 2915344 2750285 2108415 1884362 2399262 2745364 2189799 1242200 745840
34305 745840 786014 1136448 1966107 3314060 4471012 4689016 4132633 3496350 3061156
34296 3061156 2737886 2659702 3022701 3533495 3656968 3370418 3196052 3501343 4119731 4635394
34286 4635394 4773092 4546042 4218372 4083998 4189916 4364584 4506411 4623993 4604559 4271595
34276 4271595 3739174 3381484 3348933 3400344 3277089 2962693 2578492 2351207 2615699 3418019
$$ packed form
34342D169430L12487o47744j423813j150080m1273Q43468Q79402L73810o0002
34333C255685j40442j4537k1655k75828m55287l02104j88832n56104q97600k55149
34323A48147J166846J971572J476603N32559m223l87443r06716r81025l08274
34314B708046K07298j65059o41870k24053N14900L46102n55565r47599m96360
34305G45840M0174L50434Q29659J347953J156952K18004n56383o36283m35194
34296C061156l23270p8184L62999N10794J23473k86550j74366L05291O18388N15663
34286D635394J37698k27050l27670j34374J05918J74668J41827J17582j9434l32964
34276D271595n32421l57690l2551N1411j23255l14396l84201k27285K64492Q02320
$$ plain form
34266 3418019 4186033 4315209 4017536 3962632 4125889 3808970 2933220 2406958 2819884 3577679
34256 3577679 3853196 3694633 3583087 3503986 3177573 2788195 2771135 3113367 3435607 3555443
34246 3555443 3497986 3218321 2797557 2633979 2918621 3171518 2849604 2213796 2013244 2426769
34236 2426769 2892696 2965159 2803285 2741004 2821647 2889735 2812464 2491245 1918839 1347871
34226 1347871 1206074 1701194 2572872 3301928 3579018 3603257 3887541 4651869 5442279 5557327
34216 5557327 4872663 4002287 3578559 3625099 3735336 3599743 3204443 2741271 2487151 2586731
34206 2586731 2833074 2865567 2682563 2697865 3138695 3659545 3787704 3545681 3350160 3400122
34196 3400122 3465256 3327646 3194504 3448166 4025077 4351770 4125333 3888113 4337402 5192362
$$ packed form
34266C418019P68014J29176k97673n4904J63257l16919q75750n26262M12926P57795
34256C577679K75517j58563j11546p9101l26413l89378j7060L42232L22240J19836
34246C555443n7457k79665m20764j63578K84642K52897l21914o35808k00552M13525
34236B426769M65927P2463j61874o2281Q0643O8088p7271l21219n72406n70968
34226A347871j41797M95120Q71678P29056K77090K4239K84284P64328P90410J15048
34216E557327o84664q70376m23728M6540J10237j35593l95300m63172k54120R9580
34206B586731K46343L2493j83004J5302M40830N20850J28159k42023j95521M9962
34196C400122O5134j37610j33142K53662N76911L26693k26437k37220M49289Q54960
$$ plain form
34186 5192362 5473029 5030247 4913140 5731590 6524395 6090587 4768808 3868789 3820419
34177 3820419 4022038 4187798 4564946 4902006 4511198 3526143 2917953 3010165 3097863 2834453
34167 2834453 2840385 3484553 4143693 4230796 4002023 3799237 3456331 3082911 3488520 5023137
34157 5023137 6708627 7287737 6620587 5507052 4720490 4677600 5363880 6083638 5973193
34148 5973193 5182910 4745188 4900122 4644825 3553152 2819297 3524201 4955240 5818945
34139 5818945 6164910 6750401 7292111 6931808 5991873 5649311 5964919 5758467 4634053
34130 4634053 3769702 4211923 5410617 6042302 5618482 4736110 4145338 4041651 4150190
34121 4150190 4224987 4359000 4732809 5159670 5242649 5050516 5165806 5843060 6585085 6828767
$$ packed form
34186E192362K80667m42782j17107Q18450P92805m33808j321779r00019m8370
34177C820419K01619J65760L77148L37060l90808r85055o08190R2212Q7698k63410
34167B834453N932O44168O59140Q7103k28773k02786l42906l73420M05609J534617
34157E023137J685490N79110o67150j113535p86562m2890O86280P19758j10445
34148E973193p90283m37722J54934k55297j091673p33855P04904J431039Q63705
34139E818945L45965N85491N41710l60303r39935l42562L15608k06452j124414
34130D634053q64351M42221J198694O31685m23820q82372n90772j03687J08539
34121D150190P4797J34013L73809M26861Q2979j92133J15290O77254P42025K43682
$$ plain form
34111 6828767 6594179 6190005 5793912 5622943 5947282 6560702 6785216 6382122 5924511
34102 5924511 5930367 6218190 6453386 6677800 6934589 7033036 7016483 7156803 7238512 6721298
34092 6721298 5862956 5611199 6035252 6109738 5560385 5522750 6590059 7615478 7483858
34083 7483858 6787002 6600852 6809816 6863266 7035772 7638822 8068131 7932350 8017805 8802982
34073 8802982 9234235 8483273 7669912 8099502 8960456 8709657 7707250 7383463 7665453
34064 7665453 7444745 6910430 7127928 7786087 7668586 7060066 7395234 8653577 9336702
34055 9336702 9029510 8821125 9094784 9012435 8394925 8110516 8341211 8336837 8092706 8421534
34045 8421534 9180454 9280687 8640718 8291311 8408536 8155566 7609511 7795885 8540608
$$ packed form
34111F828767k34588m04174l96093j70969L24339O13420K24514m03094m57611
34102E924511N856K87823K35196K24414K56789R8447j6553J40320Q1709n17214
34092F721298q58342k51757M24053P4486n49353l7635J067309J025419j31620
34083G483858o96856j86150K08964N3450J72506O03050M29309j35781Q5455P85177
34073H802982M31253p50962q13361M29590Q60954k50799j002407l23787K81990
34064G665453k20708n34315K17498O58159j17501o08520L35168J258343O83125
34055I336702l07192k08385K73659q2349o17510k84409K30695m374k44131L28828
34045H421534P58920J00233o39969l49407J17225k52970n46055J86374P44723
$$ plain form
34036 8540608 8388702 7117157 6313172 6884616 7889887 8440356 8942567 9786071 10472670
34027 10472670 10715100 10941403 11239779 11196755 11009348 11270583 11597679 11128058 10329257
34018 10329257 10450877 11244894 11306384 10658044 10718303 11617884 12007945 11783222 12382620 13872636
34008 13872636 14370642 13168129 11967809 12113685 12871491 13325727 13770779 14350625 14401533
33999 14401533 13909574 13674756 13603645 12950920 12422360 13548244 15777858 16926295 16718000
33990 16718000 16942841 17929623 18182382 17795369 18544007 20061340 19879467 18065203 17645804
33981 17645804 19349937 20273080 19142589 18413651 19454851 20264641 19960196 20827788 23593363
33972 23593363 25373829 24888183 24951122 27061041 28438869 27464396 27004168 29023193 31029754
$$ packed form
34036H540608j51906j271545q03985N71444J005271N50469N02211Q43504O86599
34027A0472670K42430K26303K98376m3024j87407K61235L27096m69621p98801
34018A0329257J21620P94017O1490o48340O0259Q99581L90061k24723N99398J490016
34008A3872636M98006j202513j200320J45876P57806M54236M45052N79846N0908
33999A4401533m91959k34818p1111o52725n28560J125884K229614J148437k08295
33990A6718000K24841R86782K52759l87013P48638J517333j81873j814264m19399
33981A7645804J704133R23143j130491p28938J041200Q09790l04445Q67592K765575
33972B3593363J780466m85646O2939K109919J377828r74473m60228K019025K006561
$$ plain form
33963 31029754 31380758 32704155 36198799 38248586 37059601 36791216 40296389 43836318
33955 43836318 44247145 44954144 49037900 53036308 54089661 56160560 62059102 67008688
33947 67008688 68125117 71675853 81586679 90428449 93090169 98353233 112683557 125419580
33939 125419580 129556690 142589118 175731734 190330516 126668649 -13111461 -147040769
33932 -147040769 -199355014 -177877559 -143605469 -129777814 -123549069 -110753637 -98927112
33925 -98927112 -94847552 -90621580 -80950078 -73156989 -71893501 -70253795 -63370946 -57043998
33917 -57043998 -56015350 -55616224 -51619666 -47896247 -47877826 -47645289 -43722840 -39655484 -38948095
33908 -38948095 -38700360 -35837973 -33049755 -33110829 -33335191 -30958956 -28573285 -29079325 -30209573
$$ packed form
33963C1029754L51004J323397L494644K049787j188985k68385L505173L539929
33955D3836318M10827P06999M083756L998408J053353K070899N898542M949586
33947F7008688J116429L550736R910826Q841770K661720N263064J4330324J2736023
33939A25419580M137110J3032428L3142616J4598782o3661867j39780110j33929308
33932a47040769n2314245K1477455L4272090J3827655O228745J2795432J1826525
33925i8927112M079560M225972R671502P793089J263488J639706O882849O326948
33917e7043998J028648L99126L996558L723419J8421K32537L922449M067356P07389
33908c8948095K47735K862387K788218o1074k24362K376235K385671n06040j130248
$$ plain form
33899 -30209573 -29026132 -27328435 -27762667 -28668714 -27467724 -25486996 -25012640 -24951605 -23567763
33890 -23567763 -22263248 -22645215 -22982560 -21468901 -19920777 -20340135 -20827278 -18963353 -16481675
33881 -16481675 -16429040 -18100454 -18858991 -18788763 -19487543 -20197765 -19216107 -17562809 -17346993
33872 -17346993 -17834066 -16854356 -14885670 -14084642 -14334443 -13872339 -12989333 -13514267 -15121477
33863 -15121477 -15530805 -14192230 -12804409 -12326634 -12167254 -12155601 -12778971 -13565206 -13478351
33854 -13478351 -12741102 -12307125 -12029373 -11340807 -11014720 -12022963 -13343621 -13258342 -12225453
33845 -12225453 -12048145 -12728162 -12692070 -11780625 -11382713 -11688314 -11389357 -10281763 -9739172
33836 -9739172 -10239507 -10639935 -10368365 -10286522 -10812192 -11018704 -10237895 -9032474 -8062311
$$ packed form
33899c0209573J183441J697697m34232r06047J200990J980728M74356O1035J383842
33890b3567763J304515l81967l37345J513659J548124m19358m87143J863925K481678
33881a6481675N2635j671414p58537P0228o98780p10222R81658J653298K15816
33872a7346993m87073R79710J968686Q01028k49801M62104Q83006n24934j607210
33863a5121477m09328J338575J387821M77775J59380J1653o23370p86235Q6855
33854a3478351P37249M33977K77752O88566L26087j008243j320658Q5279J032889
33845a2225453J77308o80017L6092R11445L97912l05601K98957J107594N42591
33836i739172n00335m00428K71570Q1843n25670k06512P80809J205421R70163
$$ plain form
33827 -8062311 -7330877 -6898001 -7028492 -7368646 -7223742 -6798442 -6911511 -7458947 -7540575 -7166987
33817 -7166987 -7382015 -8510857 -9678889 -10275095 -10546223 -10555263 -9959591 -9121315 -9054618 -9824037
33807 -9824037 -10221712 -9519290 -8455872 -8002069 -8097184 -8103207 -7760815 -7302894 -7151000 -7601332
33797 -7601332 -8313108 -8333522 -7325045 -6375641 -6634523 -7544166 -7607760 -6600036 -5676044
33788 -5676044 -5462717 -5482423 -5452661 -5677463 -5997364 -5794050 -5306193 -5554266 -6618417 -7338621
33778 -7338621 -7122191 -6709653 -6663232 -6439324 -5622689 -4868773 -4844366 -5222443 -5433323 -5509450
33768 -5509450 -5547740 -5243519 -4623688 -4377645 -4775329 -5064564 -4628166 -3971128 -3865593 -4254021
33758 -4254021 -4721731 -5350110 -6302624 -7147271 -7386280 -7205744 -7013344 -6710102 -6113774
$$ packed form
33827h062311P31434M32876j30491l40154J44904M25300j13069n47436q1628L73588
33817g166987k15028j128842j168032n96206k71128r040N95672Q38276O6697p69419
33807i824037l97675P02422J063418M53803r5115o023L42392M57921J51894m50332
33797g601332p11776k0414J008477R49404k58882r09643o3594J007724R23992
33788e676044K13327j9706K9762k24802l19901K03314M87857k48073j064151p20204
33778g338621K16430M12538M6421K23908Q16635P53916K4407l78077k10880p6127
33768e509450l8290L04221O19831K46043l97684k89235M36398O57038J05535l88428
33758d254021m67710o28379r52514q44647k39009J80536J92400L03242N96328
$$ plain form
33749 -6113774 -5614900 -5625047 -5757190 -5371102 -4660825 -4369413 -4571867 -4595494 -4204219 -4066409
33739 -4066409 -4742607 -5774980 -6206315 -5707695 -4789484 -4020279 -3464237 -3007583 -2858855
33730 -2858855 -3296125 -4017806 -4267866 -3784154 -3181331 -3106059 -3430505 -3673916 -3816343 -4151907
33720 -4151907 -4614749 -4821056 -4610332 -4076683 -3321253 -2667212 -2738014 -3642653 -4442706 -4263372
33710 -4263372 -3641943 -3789297 -4692718 -5101470 -4460063 -3672843 -3627662 -4046825 -4295027 -4358095
33700 -4358095 -4392133 -4126601 -3456582 -3014684 -3397739 -4221689 -4601422 -4293955 -3816723 -3639982
33690 -3639982 -3724839 -3739378 -3430350 -2896303 -2597525 -2836490 -3223009 -3136281 -2780782 -3094030
33680 -3094030 -4298358 -5250684 -4814118 -3388433 -2423431 -2680195 -3570653 -4096106 -3924085
$$ packed form
33749f113774M98874j0147j32143L86088P10277K91412k02454k3627L91275J37810
33739d066409o76198j032373m31335M98620R18211P69205N56042M56654J48728
33730b858855m37270p21681k50060M83712O02823P5272l24446k43411j42427l35564
33720d151907m62842k06307K10724N33649P55430O54041p0802r04639q00053J79334
33710d263372O21429j47354r03421m08752O41407P87220M5181m19163k48202o3068
33700d358095l4038K65532O70019M41898l83055q23950l79733L07467M77232J76741
33690c639982q4857j4539L09028N34047K98778k38965l86519Q6728L55499l13248
33680c094030j204328r52326M36566J425685R65002k56764q90458n25453J72021
$$ plain form
33671 -3924085 -3512867 -3493458 -3984193 -4431038 -4232911 -3530070 -3080857 -3300836 -3832691 -4218162
33661 -4218162 -4505005 -4869933 -5097958 -4910598 -4506305 -4272266 -4138618 -3709373 -2966405
33652 -2966405 -2387977 -2317046 -2564400 -2742357 -2735617 -2722308 -2917810 -3428794 -4205054 -4934940
33642 -4934940 -5064134 -4220633 -2757194 -1616776 -1376273 -1608009 -1571484 -1351736 -1679780
33633 -1679780 -2621282 -3255757 -2992987 -2446949 -2445092 -2826549 -2923445 -2687406 -2548386 -2597317
33623 -2597317 -2717022 -3087950 -3674260 -3663943 -2508248 -1172283 -1101356 -2113997 -2672776
33614 -2672776 -2242898 -1887467 -2232181 -2396608 -1666746 -883115 -1133161 -2025856 -2366697
33605 -2366697 -1920298 -1455358 -1394902 -1361261 -984050 -493049 -442946 -1131877 -2221611 -2874545
$$ packed form
33671c924085M11218J9409m90735m46845J98127P02841M49213k19979n31855l85471
33661d218162k86843l64928k28025J87360M04293K34039J33648M29245P42968
33652b966405N78428P0931k47354j77957O740J3309j95502n10984p76260p29886
33642d934940j29194Q43501J463439J140418K40503k31736L6525K19748l28044
33633a679780r41502o34475K62770N46038J857l81457r6896K36039J39020m8931
33623b597317j19705l70928n86310J0317J155695J335965P0927j012641n58779
33614b672776M29878L55431l44714j64427P29862P83631k50046q92695l40841
33605b366697M46399M64940O0456L3641L77211M91001N0103o88931j089734o52934
$$ plain form
33595 -2874545 -2559838 -1737196 -1319763 -1518957 -1828573 -2069467 -2583002 -3312611 -3681714
33586 -3681714 -3627094 -3738209 -4044838 -3780588 -2832524 -2239426 -2545152 -2820411 -2229040 -1470662
33576 -1470662 -1557732 -2120045 -2192360 -1902129 -2004968 -2346962 -2230794 -1904613 -2211948 -2958611
33566 -2958611 -3090898 -2506934 -2275650 -2829515 -3245443 -2754795 -1861440 -1401661 -1372470 -1303204
33556 -1303204 -1151278 -1246076 -1733804 -2483154 -3249319 -3702320 -3604142 -3106842 -2574723 -2092818
33546 -2092818 -1560718 -1248544 -1656679 -2649303 -3314999 -3052094 -2363138 -2125735 -2341319
33537 -2341319 -2143792 -1085278 51425 92926 -1016362 -2037885 -1964497 -1247492 -1011811
33528 -1011811 -1441945 -1753658 -1621612 -1635967 -2153234 -2670778 -2753991 -2704145 -2814867 -2820638
$$ packed form
33595b874545L14707Q22642M17433j99194l09616k40894n13535p29609l69103
33586c681714N4620j11115l06629K64250R48064N93098l05726k75259N91371P58378
33576a470662q7070n62313p2315K90231j02839l41994J16168L26181l07335p46663
33566b958611j32287N83964K31284n53865m15928M90648Q93355M59779K9191O9266
33556a303204J51926r4798m87728p49350p66165m53001R8178M97300N32119M81905
33546b092818N32100L12174m08135r92624o65696K62905O88956K37403k15584
33537b341319J97527J058514J136703M1501j109288j021523P3388P17005K35681
33528a011811m30134l11713J32046j4355n17267n17544q3213M9846j10722n771
$$ plain form
33518 -2820638 -2618992 -2633671 -2854363 -2546707 -1698361 -1591113 -2818278 -3875999 -3210389
33509 -3210389 -1690247 -1241265 -1753647 -1483965 -242045 146626 -1134727 -2573878 -2769232
33500 -2769232 -2296718 -2136640 -1901719 -950248 -11576 -242316 -1402740 -2235454 -2181195
33491 -2181195 -1696278 -1298041 -1233074 -1732072 -2711119 -3460225 -3363453 -2706489 -2171918 -1866223
33481 -1866223 -1498985 -1200360 -1424265 -2205337 -3136330 -3930670 -4451075 -4396264 -3620448 -2685707
33471 -2685707 -2466209 -3133137 -3986013 -4329201 -4128391 -3778578 -3587192 -3565535 -3495671 -3168724
33461 -3168724 -2683949 -2409849 -2502986 -2658786 -2564610 -2382860 -2459342 -2710017 -2693017 -2268973
33451 -2268973 -1828835 -1769501 -2005101 -2165010 -2135274 -2187318 -2537464 -2971637 -3124763 -3044477
$$ packed form
33518b820638K01646j4679k20692L07656Q48346J07248j227165j057721O65610
33509c210389J520142M48982n12382K69682J241920L88671j281353j439151j95354
33500b769232M72514J60078K34921R51471R38672k30740j160424q32714N4259
33491b181195M84917L98237O4967m98998r79047p49106R6772O56964N34571L05695
33481a866223L67238K98625k23905p81072r30993p94340n20405N4811P75816R34741
33471b685707K19498o66928q52876l43188K00810L49813J91386K1657O9864L26947
33461c168724M84775K74100r3137j55800R4176J81750p6482k50675J7000M24044
33451b268973M40138N9334k35600j59909K9736n2044l50146m34173j53126Q0286
$$ plain form
33441 -3044477 -3098703 -3236204 -2845129 -1721214 -702740 -701339 -1413425 -1794301 -1663958 -1883173
33431 -1883173 -2808104 -3566640 -3319027 -2404886 -1628436 -1095634 -517167 -155485 -567451
33422 -567451 -1573047 -2287541 -2252954 -1933395 -1936729 -2223984 -2336453 -2093384 -1750635 -1551615
33412 -1551615 -1402899 -1140740 -972949 -1327952 -2163140 -2765203 -2530433 -1671726 -799692
33403 -799692 -121181 439738 648782 217846 -518475 -979482 -1285484 -1927115 -2549220 -2203921
33393 -2203921 -1018082 -375729 -934661 -1646099 -1475970 -961316 -1066161 -1494942 -1371066
33384 -1371066 -831638 -617152 -636384 -344541 -154986 -942512 -2265999 -2663206 -1889002
33375 -1889002 -1325829 -1726771 -2041095 -1282768 -281901 -451656 -1698229 -2782213 -3222925
$$ packed form
33441c044477n4226j37501L91075J123915J018474J401p12086l80876J30343k19215
33431a883173r24931p58536K47613R14141P76450N32802N78467L61682m11966
33422e67451j005596p14494L4587L19559l334k87255j12469K43069L42749J99020
33412a551615J48716K62159J67791l55003q35188o02063K34770Q58707Q72034
33403g99692O78511N60919K09044m30936p36321m61007l06002o41631o22105L45299
33393b203921J185839O42353n58932p11438J70129N14654j04845m28781J23876
33384a371066N39428K14486j9232K91843J89555p87526j323487l97207P74204
33375a889002N63173m00942l14324P58327J000867j69755j246573j083984m40712
$$ plain form
33366 -3222925 -3592133 -4104787 -4142625 -3419430 -2674491 -2702921 -3248336 -3381697 -2736011 -1941994
33356 -1941994 -1869148 -2668684 -3587033 -3639224 -2506933 -843075 343553 623289 392757
33347 392757 219726 198481 137027 132232 506872 1153009 1424689 972835 333068 257672
33337 257672 672184 796067 242862 -521028 -907200 -913112 -880464 -929730 -929029 -785744 -514189
33326 -514189 -178532 46981 -70680 -538442 -1037409 -1241119 -1135951 -986462 -1112215 -1655097
33316 -1655097 -2358093 -2661854 -2316158 -1774259 -1583163 -1558932 -1184747 -728280 -1098581 -2392190
33306 -2392190 -3461789 -3397001 -2696342 -2402647 -2729414 -3200453 -3568573 -3812707 -3636536
33297 -3636536 -2788096 -1671872 -963059 -768445 -704579 -544074 -239025 343386 1060551
$$ packed form
33366c222925l69208n12654l7838P23195P44939k8430n45415j33361O45686P94017
33356a941994P2846p99536r18349n2191J132291J663858J186628K79736k30532
33347C92757j73031k1245o1454m795L74640O46137K71680m51854o39767p5396
33337B57672M14512J23883n53205p63890l86172n912L2648m9266P01J43285K71555
33326e14189L35657K25513j17661m67762m98967k03710J05168J49489j25753n42882
33316a655097p02996l03761L45696N41899J91096K4231L74185M56467l70301j293609
33306b392190j069599O4788P00659K93695l26767m71039l68120k44134J76171
33297c636536Q48440J116224P08813J94614O3866J60505L05049N82411P17165
$$ plain form
33288 1060551 1236469 523799 -307395 -321632 92260 -300144 -1668815 -2747295 -2542178
33279 -2542178 -1444875 -333276 523083 1176411 1388394 964431 259799 -212575 -416340
33270 -416340 -615259 -803912 -729182 -372951 -83191 -194204 -648716 -1023626 -937792 -437350
33260 -437350 130302 610471 1097648 1404081 977878 -273524 -1554287 -2116068 -2191351
33251 -2191351 -2335503 -2308597 -1573952 -644562 -752809 -2030748 -3073114 -2704347 -1374189
33242 -1374189 -395269 -470402 -1340920 -2256863 -2419098 -1538203 -323726 100113 -454802
33233 -454802 -1044430 -980202 -681801 -755375 -985927 -851729 -424248 -81108 182566 448424
33223 448424 280303 -772316 -2237503 -2997841 -2550385 -1520961 -877227 -956103 -1305878
$$ packed form
33288A060551J75918p12670q31194j4237M13892l92404j368671j078480K05117
33279b542178J097303J111599Q56359O53328K11983m23963p04632m72374k03765
33270d16340j98919j88653P4730L56231K89760j11013m54512l74910Q5834N00442
33260d37350N67652M80169M87177L06433m26203j251402j280763n61781p5283
33251b191351j44152K6906P34645R29390j08247j277939j042366L68767J330158
33242a374189R78920p5133q70518r15943j62235Q80895J214477M23839n54915
33233d54802n89628O4228K98401p3574k30552J34198M27481L43140K63674K65858
33223D48424j68121j052619j465187p60338M47456J029424O43734p8876l49775
$$ plain form
33214 -1305878 -1293887 -839441 -519297 -794966 -1288816 -1270600 -777947 -579254 -927725 -1158993
33204 -1158993 -856988 -594348 -952076 -1533236 -1658447 -1425001 -1279644 -1073498 -460020
33195 -460020 148818 19042 -686252 -1074489 -878819 -759438 -1173588 -1755937 -1994615 -1832097
33185 -1832097 -1430526 -990493 -956187 -1709589 -2810903 -3209161 -2566580 -1789808 -1816809 -2389083
33175 -2389083 -2564194 -2080819 -1596686 -1680187 -2090072 -2143180 -1496234 -470377 253381 244510
33165 244510 -272490 -656378 -559916 -292088 -353893 -768385 -1125656 -1234726 -1386276 -1815655
33155 -1815655 -2179744 -1898448 -944767 48900 542854 631526 666453 648246 312271 -362817
33145 -362817 -1080123 -1574321 -1746646 -1564899 -1155234 -876620 -925157 -960070 -533187 212982
$$ packed form
33214a305878J1991M54446L20144k75669m93850J8216M92653J98693l48471k31268
33204a158993L02005K62640l57728n81160j25211K33446J45357K06146O13478
33195d60020O08838j29776p05294l88237J95670J19381m14150n82349k38678J62518
33185a832097M01571M40033L4306p53402j101314l98258O42581P76772k7001n72274
33175b389083j75111M83375M84133q3501m09885n3108O46946J025857P23758q871
33165B44510n17000l83888R6462K67828o1805m14492l57271j09070j51550m29379
33155a815655l64089K81296R53681R93667M93954Q8672L4927j8207l35975o75088
33145c62817p17306m94198j72325J81747M09665K78614m8537l4913M26883P46169
$$ plain form
33135 212982 746481 930591 1027659 995291 492915 -348236 -910474 -1003348 -1036090 -1099183
33125 -1099183 -766336 -142225 -106852 -920188 -1549651 -1223436 -793248 -1483682 -2927127
33116 -2927127 -3638630 -3063845 -1968905 -1018378 -189874 394089 236184 -658985 -1587796
33107 -1587796 -2100146 -2403274 -2650412 -2614106 -2283744 -2026774 -1894309 -1477092 -715771 -145836
33097 -145836 -37419 3912 227782 234933 -268332 -851043 -1020301 -960150 -1044990 -1089199 -723881
33086 -723881 -186670 -51686 -309349 -337621 183030 833675 1087470 1018765 1121514 1538510
33076 1538510 1728103 1047704 -391911 -1686830 -2059717 -1600919 -924635 -377683 73331
33067 73331 419665 558319 568787 616478 674394 743908 1147206 2018728 2646829 2052594
$$ packed form
33135B12982N33499J84110R7068l2368n02376q41151n62238r2874l2742o3093
33125a099183L32847O24111L5373q13336o29463L26215M30188o90434j443445
33116b927127p11503N74785J094940R50527Q28504N83963j57905q95169r28811
33107a587796n12350l03128k47138L6306L30362K56970J32465M17217P61321N69935
33097a45836J08417M1331K23870P151n03265n82711j69258O0151q4840m4209L65318
33086g23881N37211J34984k57663k8272N20651O50645K53795o8705J02749M16996
33076A538510J89593o80399j439615j294919l72887M58798O76284N46952M51014
33067G3331L46334J38654J0468M7691N7916O9514M03298Q71522O28101n94235
$$ plain form
33057 2052594 296302 -1443284 -2210256 -2095627 -1660321 -1254464 -1108836 -1387373 -1807127
33048 -1807127 -1779378 -1231328 -754860 -711254 -808424 -822870 -1016785 -1430116 -1475731 -818158
33038 -818158 -87787 -103191 -807710 -1535367 -1946591 -2151287 -2222995 -2114134 -1854953 -1507452
33028 -1507452 -1180277 -1234949 -1946582 -2738302 -2479855 -992124 461570 739102 158257
33019 158257 -358588 -678329 -1121971 -1457237 -1331534 -1235354 -1880258 -2880420 -3153744 -2493889
33009 -2493889 -1713326 -1322120 -1085587 -858261 -838235 -926329 -759561 -452299 -451598 -684485
32999 -684485 -764423 -937704 -1708194 -2552988 -2329682 -1153352 -468786 -833071 -1075050 -368218
32989 -368218 301584 -172431 -1085672 -1080973 -389217 -370140 -1243568 -1789153 -1271389 -357091
$$ packed form
33057B052594j756292j739586p66972J14629M35306M05857J45628k78537m19754
33048a807127K7749N48050M76468M3606r7170j4446j93915m13331m5615O57573
33038h18158P30371j5404p04519p27657m11224k04696p1708J08861K59181L47501
33028a507452L27175n4672p11633p91720K58447J487731J453694K77532n80845
33019A58257n16845l19741m43642l35266J25703R6180o44904j000162k73324O59855
33009b493889P80563L91206K36533K27326K0026q8094J66768L07262P01k32887
32999f84485p9938j73281p70490q44794K23306J176330O84566l64285k41979P06832
32989c68218O69802m74015r13241M699O91756J9077q73428n45585N17764R14298
$$ plain form
32979 -357091 80606 -4432 -299179 -738664 -1243015 -1510782 -1460767 -1394197 -1430488 -1237951
32969 -1237951 -607886 120765 525443 657160 818615 1046903 1151577 1109896 1092578 1123335
32959 1123335 980295 514076 -104357 -592508 -939983 -1389661 -1988733 -2380296 -2236741
32950 -2236741 -1720435 -1221902 -796585 -274822 175228 160496 -221938 -410539 -276018 -292845
32940 -292845 -532436 -314944 564659 1090311 410511 -670484 -732347 116804 447016 -224500
32930 -224500 -795046 -534845 -310902 -1074936 -2182755 -2263958 -1167376 -56903 111303
32921 111303 -611176 -1623810 -2246887 -1919248 -723844 331735 273792 -605641 -1145761
32912 -1145761 -907668 -571963 -653548 -731709 -369393 9478 -160016 -527834 -271688 661983
$$ packed form
32979c57091M37697q5038k94747m39485n04351k67767N0015O6570l6291J92537
32969a237951O30065P28651M04678J31717J61455K28288J04674m1681j7318L0757
32959A123335j43040m66219o18433m88151l47475m49678n99072l91563J43555
32950b236741N16306M98533M25317N21763M50050j4732l82434j88601J34521j6827
32940b92845k39591K17492Q79603N25652o79800j080995o1863Q49151L30212o71516
32930b24500n70546K60201K23943p64034j107819q1203J096582J110473J68206
32921A11303p22479j012634o23077L27639J195404J055579n7943q79433n40120
32912a145761K38093L35705q1585p8161L62316L78871j69494l67818K56146R33671
$$ plain form
32902 661983 1482416 1627512 1252501 647574 -144161 -919637 -1132713 -538612 332101 761645
32892 761645 701918 663091 885869 1048066 820640 354381 50176 49898 129789 11418 -355292
32881 -355292 -794381 -1087785 -1109480 -808356 -182890 579437 998876 656863 -176845 -569958
32871 -569958 37962 969435 951548 -335143 -1810406 -2260542 -1615457 -696705 -137052
32862 -137052 -22887 -304852 -924324 -1532771 -1629849 -1151710 -569925 -284806 -259582 -377815
32852 -377815 -761635 -1451616 -2057708 -2086221 -1512026 -769859 -240910 61101 354974 796646
32842 796646 1268977 1412053 1029352 529038 647368 1486217 2120713 1572402 12522
32833 12522 -1447255 -2082667 -2175195 -2267779 -2361433 -2140622 -1609609 -1113382 -878460 -815581
$$ packed form
32902F61983Q20433J45096l75011o04927p91735p75476k13076N94101Q70713M29544
32892G61645n9727l8827K22778J62197k27426m66259l04205k78P9891j18371l66710
32881c55292m39089k93404k1695L01124O25466P62327M19439l42013q33708l93113
32871e69958O07920R31473j7887j286691j475263m50136O45085R18752N59653
32862a37052J14165k81965o19472o08447r7078M78139N81785K85119K5224j18233
32852c77815l83820o89981o06092k8513N74195P42167N28949L02011K93873M41672
32842G96646M72331J43076l82701n00314J18330Q38849O34496n48311j559880
32833A2522j459777o35412r2528r2584r3654K20811N31013M96227K34922O2879
$$ plain form
32823 -815581 -704137 -411446 -36939 67229 -373072 -1072260 -1325164 -890245 -465378 -901172
32813 -901172 -2100702 -3114448 -3243076 -2611975 -1691385 -773941 -57678 276318 393977
32804 393977 825337 1734409 2424470 2036832 637527 -837148 -1686837 -2010281 -2069337
32795 -2069337 -1666492 -614319 500933 680760 -262704 -1337863 -1512712 -892330 -385175
32786 -385175 -432319 -617511 -557366 -575331 -1131835 -1981522 -2405887 -2129036 -1516924 -913459
32776 -913459 -295659 306777 561809 310043 -69466 -140472 -31188 -194566 -682802 -1059045
32766 -1059045 -1013337 -706244 -440518 -311276 -311612 -510119 -901765 -1240700 -1271734 -1104454
32756 -1104454 -1150503 -1610052 -2147745 -2234992 -1813328 -1447770 -1681347 -2336056 -2678929 -2277682
$$ packed form
32823h15581J11444K92691L74507J04168m40301o99188k52904M34919M24867m35794
32813i01172j199530j013746j28628O31101R20590R17444P16263L33996J17659
32804C93977M31360R09072O90061l87638j399305j474675q49689l23444n9056
32795b069337M02845J052173J115252J79827r43464j075159j74849O20382N07155
32786c85175m7144j85192O0145j7965n56504q49687m24365K76851O12112O03465
32776i13459O17800O02436K55032k51766l79509p1006J09284j63378m88236l76243
32766a059045M5708L07093K65726J29242l36j98507l91646l38935l1034J67280
32756a104454m6049m59549n37693q7247M21664L65558k33577o54709l42873M01247
$$ plain form
32746 -2277682 -1431918 -686078 -233473 -14586 -83749 -465314 -808334 -674903 -194511 16664
32736 16664 -292980 -667190 -673893 -588890 -971854 -1790960 -2394026 -2308522 -1736294 -1223924
32726 -1223924 -1104773 -1340274 -1711376 -2033307 -2234234 -2287155 -2116422 -1687840 -1214236 -1061899
32716 -1061899 -1298371 -1532948 -1444541 -1268361 -1392334 -1612834 -1324612 -523173 -48500 -491095
32706 -491095 -1273146 -1309516 -387207 603219 769171 103886 -778584 -1365302 -1496288 -1214677
32696 -1214677 -696236 -262570 -244305 -758747 -1602159 -2302503 -2364478 -1699881 -854016 -550682
32686 -550682 -892096 -1249616 -1111870 -772338 -884342 -1540837 -2203986 -2491860 -2589521 -2746788
32676 -2746788 -2747834 -2200085 -1202676 -408461 -356009 -898012 -1401709 -1466276 -1306609 -1353004
$$ packed form
32746b277682Q45764P45840M52605K18887o9163l81565l43020J33431M80392K11175
32736A6664l09644l74210o703Q5003l82964q19106o03066Q5504N72228N12370
32726a223924J19151k35501l71102l21931k00927n2921J70733M28582M73604J52337
32716a061899k36472k34577Q8407J76180j23973k20500K88222Q01439M74673m42595
32706d91095p82051l6370R22309R90426J65952o65285q82470n86718j30986K81611
32696a214677N18441M33666J8265n14442q43412p00344o1975O64597Q45865L03334
32686e50682l41414l57520J37746L39532j12004o56495o63149k87874r7661j57267
32676b746788j046N47749R97409P94215N2452n42003n03697o4567J59667m6395
$$ plain form
32666 -1353004 -1602188 -1625844 -1262862 -982779 -1303129 -2049902 -2535449 -2376365 -1791234 -1142929
32656 -1142929 -580342 -154768 134087 521787 1285209 2171034 2435391 1747421 687318
32647 687318 -3304 -307345 -614404 -853971 -620343 -80908 -35310 -834710 -1776955 -1941814
32637 -1941814 -1290829 -563278 -310559 -463205 -781926 -1262177 -1878930 -2232466 -1845230
32628 -1845230 -823444 103711 382823 231665 163997 149644 -254458 -966455 -1195438 -474282
32618 -474282 630295 1262041 1320879 1251329 1145038 748563 213586 87245 464806 789122
32608 789122 675640 394419 330288 478352 711122 1034352 1266358 943518 -46703 -1096512
32598 -1096512 -1531199 -1340764 -937328 -543555 -230343 -223317 -657528 -1223730 -1523661 -1624091
$$ packed form
32666a353004k49184k3656L62982K80083l20350p46773m85547J59084N85131O48305
32656a142929N62587M25574K88855L87700P63422Q85825K64357o87970j060103
32647F87318o90622l04041l07059k39567K33628N39435M5598p99400r42245j64859
32637a941814O50985P27551K52719j52646l18721m80251o16753l53536L87236
32628a845230J021786R27155K79112j51158o7668j4353m04102p11997k28983P21156
32618d74282J104577O31746N8838o9550j06291l96475n34977j26341L77561L24316
32608G89122j13482k81221o4131J48064K32770L23230K32006l22840r90221j049809
32598a096512m34687J90435M03436L93773L13212P026m34211n66202k99931j00430
$$ plain form
32588 -1624091 -1843124 -2171258 -2348149 -2322601 -2146773 -1619179 -647498 151389 -61779 -1173751
32578 -1173751 -2096924 -2126622 -1724177 -1669601 -1990514 -2129733 -1755783 -992107 -159377 325302
32568 325302 86943 -741867 -1390795 -1185006 -279732 650093 1251731 1634527 1846694 1722999
32558 1722999 1271064 782318 458005 238249 69766 32203 108408 126895 52383 58651
32548 58651 179491 173435 -72413 -282430 -224042 -192026 -681005 -1618483 -2286436 -2103416
32538 -2103416 -1226997 -262659 374145 595038 353765 -381452 -1311066 -1792385 -1433340
32529 -1433340 -633850 -294400 -894883 -1951328 -2458447 -1858426 -566940 441553 585970
32520 585970 217152 130239 546691 820849 352855 -453444 -592833 200652 1018314 887519
$$ packed form
32588a624091k19033l28134j76891K5548J75828N27594R71681P98887k13168j111972
32578a173751r23173k9698M02445N4576l20913j39219L73950P63676Q32730M84679
32568C25302k38359q28810o48928K05789R05274R29825O01638L82796K12167j23695
32558A722999m51935m88746l24313k19756j68483l7563P6205J8487p4512O268
32548E8651J20840o056k45848k10017N8388L2016m88979r37478o67953J83020
32538b103416Q76419R64338O36804K20893k41273p35217r29614m81319L59045
32529a433340P99490L39450o00483j056445n07119O00021J291486J008493J44417
32520E85970l68818q6913M16452K74158m67994q06299j39389P93485Q17662j30795
$$ plain form
32510 887519 -98730 -1073709 -1460610 -1327372 -948466 -525024 -232194 -65519 314115 1126050
32500 1126050 1903075 1892219 1048743 97881 -461392 -816063 -1157002 -1230193 -924973 -677318
32490 -677318 -792340 -900637 -636017 -335538 -403580 -455350 85488 872465 1032839 501053
32480 501053 19317 -116606 -300471 -541780 -263270 486671 684441 -190480 -1181689 -1088913
32470 -1088913 -27775 963915 1330956 1265310 1009048 654114 331829 -56630 -963809
32461 -963809 -2382199 -3286202 -2701140 -1094340 111761 264260 -65104 -209097 -136664
32452 -136664 -62248 -122736 -501868 -1165891 -1484376 -888439 90157 297354 -435341 -1051160
32442 -1051160 -804254 -112117 392088 702752 920870 798385 349194 132253 369675
$$ packed form
32510H87519r86249r74979l86901J33238L78906M23442K92830J66675L79634Q11935
32500A126050P77025j0856q43476r50862n59273l54671l40939p3191L05220K47655
32490f77318j15022j08297K64620L00479o8042n1770N40838P86977J60374n31786
32480E01053m81736j35923j83865k41309K78510P49941J97770q74921r91209R2776
32470a088913J061138R91690L67041o5646k56262l54934l22285l88459r07179
32461i63809j418390r04003N85062J606800J206101J52499l29364j43993P2433
32452a36664P4416o0488l79132o64023l18485N95937R78596K07197p32695o15819
32442a051160K46906O92137N04205L10664K18118j22485m49191k16941K37422
$$ plain form
32433 369675 505655 163051 -242207 -403500 -757001 -1475675 -1729672 -935248 13203 -110166
32423 -110166 -1069272 -1712755 -1826135 -2098880 -2542291 -2426662 -1833758 -1811382 -2612657 -3063113
32413 -3063113 -2278133 -986632 -462144 -924271 -1667173 -2126033 -2136073 -1627471 -743704
32404 -743704 5893 212720 -10082 -363852 -790135 -1267732 -1576420 -1619908 -1632177 -1717063
32394 -1717063 -1555041 -962941 -388793 -372828 -761868 -937268 -688243 -435499 -634229 -1273229
32384 -1273229 -1950763 -2243847 -2038961 -1597074 -1200279 -752948 7772 925883 1482542
32375 1482542 1536355 1513002 1659137 1655956 1296660 969900 983648 944046 443612 -79400
32365 -79400 53389 586193 619544 -28327 -625793 -758443 -868451 -1279897 -1517851 -1152849
$$ packed form
32433C69675J35980l42604m05258j61293l53501p18674k53997P94424R48451j23369
32423a10166r59106o43483j13380k72745m43411J15629N92904K2376q01275m50456
32413c063113P84980J291501N24488m62127p42902m58860j0040N08602Q83767
32404g43704P49597K06827k22802l53770m26283m77597l08688m3488j2269q4886
32394a717063J62022N92100N74148J5965l89040j75400K49025K52744j98730o39000
32384a273229o77534k93084K04886M41887L96795M47331P60720R18111N56659
32375A482542N3813k3353J46135l181l59296l26760J3748l9602n00434n23012
32365g9400J32789N32804L3351o47871n97466j32650j10008m11446k37954L65002
$$ plain form
32355 -1152849 -710598 -1010018 -1873084 -2202635 -1363920 31973 855064 601347 -345680
32346 -345680 -1289421 -1781786 -1748933 -1363521 -883855 -497500 -230803 -21452 142336 233332
32336 233332 300946 404380 395027 -4049 -742610 -1275933 -1114338 -419609 201594 372517
32326 372517 129883 -384551 -974114 -1231310 -883703 -337212 -317272 -855196 -1226274 -1080087
32316 -1080087 -942531 -1231725 -1495039 -1227310 -820861 -890940 -1106308 -661796 269565 573235
32306 573235 -201984 -1166890 -1321138 -721100 -14976 553877 1103568 1464651 1224135 389763
32296 389763 -426524 -623890 -245365 98038 -91509 -649020 -965538 -742002 -295701 -15255
32286 -15255 135411 253950 22719 -799719 -1607330 -1449961 -421708 193073 -492667 -1824811
$$ packed form
32355a152849M42251k99420q63066l29551Q38715J395893Q23091k53717r47027
32346c45680r43741m92365L2853L85412M79666L86355K66697K09351J63788R0996
32336B33332O7614J03434r353l99076p38561n33323J61595O94729O21203J70923
32326C72517k42634n14434n89563k57196L47607N46491J9940n37924l71078J46187
32316a080087J37556k89194k63314K67729M06449p0079k15368M44512R31361L03670
32306E73235p75219r64906j54248O00038P06124N68853N49691L61083k40516q34372
32296C89763q16287j97366L78525L43403j89547n57511l16518K23536M46301K80446
32286a5255J50666J18539k31231q22438q07611J57369J028253O14781o85740j332144
$$ plain form
32276 -1824811 -2501232 -2135980 -1388363 -875240 -618504 -493109 -578393 -845901 -907439 -418942
32266 -418942 379816 796232 411566 -462953 -1161752 -1394882 -1393185 -1355339 -1116732 -583586
32256 -583586 -159760 -313945 -877590 -1221713 -1071410 -703354 -366261 -1382 402761 672689
32246 672689 801321 995328 1250213 1340329 1350945 1672516 2257073 2470505 2023810 1498851
32236 1498851 1519957 1897881 2068186 1902826 1544884 895235 -74548 -845593 -897978 -502884
32226 -502884 -286788 -220451 201087 899566 1167666 739055 144981 -138849 -200479 -170106
32216 -170106 94936 503962 560571 100946 -308786 -117709 496310 1022655 1293035 1366319
32206 1366319 1177387 791699 649552 1001151 1349091 1031522 217533 -260578 -40433
$$ packed form
32276a824811o76421L65252P47617N13123K56736J25395q5284k67508o1538M88497
32266d18942P98758M16416l84666q74519o98799k33130J697L7846K38607N33146
32256e83586M23826j54185n63645l44123J50303L68056L37093L64879M04143K69928
32246F72689J28632J94007K54885R0116J0616L21571N84557K13432m46695n24959
32236A498851K1106L77924J70305j65360l57942o49649r69783p71045n2385L95094
32226e02884K16096O6337M21538O98479K68100m28611n94074k83830o1630L0373
32216a70106K65042M09026N6609m59625m09732J91077O14019N26345K70380P3284
32206A366319j88932l85688j42147L51599L47940l17569q13989m78111K20145
$$ plain form
32197 -40433 365855 399079 184946 204300 592131 1075658 1432165 1713412 2028132 2302269
32187 2302269 2341344 2053544 1506591 776523 -97679 -911142 -1253291 -967395 -540315 -610769
32177 -610769 -1057879 -1073807 -335234 429056 442266 -13113 -84761 358366 638342 369969
32167 369969 -105556 -503680 -1088936 -2045294 -2928731 -3219432 -3037390 -2824427 -2588048 -1992683
32157 -1992683 -1082812 -381525 -200849 -267393 -181371 67997 244146 293211 380698 585580
32147 585580 779186 817587 690210 427855 12926 -492594 -832247 -773396 -438755 -197933
32137 -197933 -159745 -27296 376481 722536 635621 312802 223128 312384 92331 -428732
32127 -428732 -573712 -59258 376765 -62537 -1077358 -1709527 -1663571 -1489446 -1546312 -1532155
$$ packed form
32197d0433M06288L3224k14133J9354L87831M83527L56507K81247L14720K74137
32187B302269L9075k87800n46953p30068q74202q13463l42149K85896M27080p0454
32177f10769m47110j5928P38573P64290J3210m55379p1648M43127K79976k68373
32167C69969m75525l98124n85256r56358q83437k90701J82042K12963K36379N95365
32157a992683R09871P01287J80676o6544Q6022K49368J76149M9065Q7487K04882
32147E85580J93606L8401j27377k62355m14929n05520l39653N8851L34641K40822
32137a97933L8188J32449M03777L46055q6915l22819q9674Q9256k20053n21063
32127d28732j44980N14454M36023m39302j014821o32169M5956J74125n6866J4157
$$ plain form
32117 -1532155 -1193964 -856778 -905457 -1171182 -1192764 -827471 -322044 23717 45754 -246415
32107 -246415 -634001 -849720 -889380 -959226 -1038654 -817041 -237466 238536 186798 -233992
32097 -233992 -588999 -762804 -909230 -1033705 -1027768 -980650 -1050417 -1079566 -695651 214107
32087 214107 1385961 2446723 3040791 2889843 2133357 1464618 1444234 1758740 1686107 1230886
32077 1230886 1120592 1579979 1878255 1463395 866366 891227 1383120 1476702 806336 -176946
32067 -176946 -960353 -1435722 -1655759 -1686136 -1727881 -1895407 -1870287 -1309676 -612256 -611064
32057 -611064 -1320838 -1701410 -1076376 -144617 25686 -515067 -915601 -998163 -1424146 -2343035
32047 -2343035 -2848189 -2204266 -912115 -4996 202467 66478 -265706 -927458 -1665450
$$ packed form
32117a532155L38191L37186m8679k65725k1582L65293N05427L45761K2037k92169
32107b46415l87586k15719l9660o9846p9428K21613N79575M76002n1738m20790
32097b33992l55007j73805j46426j24475N937M7118o9767k9149L83915R09758
32087B14107J171854J060762N94068j50948p56486o68739k0384L14506p2633m55221
32077A230886j10294M59387K98276m14860n97029K4861M91893R3582o70366r83282
32067a76946p83407m75369k20037l0377m1745j67526K5120N60611O97420J192
32057f11064p09774l80572O25034R31759J70303n40753m00534q2562m25983r18889
32047b343035n05154O43923J292151R07119K07463j35989l32184o61752p37992
$$ plain form
32038 -1665450 -1853921 -1310401 -551002 -72419 145133 245121 109696 -301914 -612871 -436239
32028 -436239 84534 486555 583668 539220 474062 329305 74132 -214489 -464006 -617066
32018 -617066 -604100 -488973 -535878 -911356 -1403887 -1644625 -1505292 -1082247 -464497 187566
32008 187566 505484 265203 -186241 -273692 38644 249818 134242 64074 335706 634101
31998 634101 512928 95826 -101809 106544 420171 587296 763247 1212117 1838803 2202462
31988 2202462 1999306 1412739 865752 466539 -71423 -844327 -1357954 -1040663 -46919
31979 -46919 829369 1069415 918827 885609 1085188 1259426 1192078 883436 444728 -699
31969 -699 -344302 -485580 -298924 282606 1020107 1357577 921584 -38409 -939875 -1459356
$$ packed form
32038a665450j88471N43520P59399M78583K17552R9988j35425m11610l10957J76632
32028d36239N20773M02021R7113m4448o5158j44757k55173k88621k49517j53060
32018f17066J2966J15127m6905l75478m92531k40738J39333M23045O17750O52063
32008A87566L17918k40281m51444q7451L12336K11174j15576p0168K71632K98395
31998F34101j21173m17102j97635K08353L13627J67125J75951M48870O26686L63659
31988B202462k03156n86567n46987l99213n37962p72904n13627L17291R93744
31979d6919Q76288K40046j50588l3218J99579J74238o7348l08642m38708m45427
31969f99l43603j41278J86656N81530P37501L37470m35993r59993r01466n19481
$$ plain form
31959 -1459356 -1557280 -1163447 -346922 343693 331349 -195507 -540943 -557779 -744015 -1207045
31949 -1207045 -1360404 -926034 -417409 -217761 15935 512469 774312 495733 319094
31940 319094 808167 1327779 961376 44555 -329103 -21379 68155 -506724 -1271663 -1833509
31930 -1833509 -2263617 -2399327 -1847842 -918748 -553577 -1020477 -1592959 -1809712 -2069731
31921 -2069731 -2588511 -2801278 -2406281 -2062221 -2311250 -2632320 -2391326 -1987927 -2086131 -2293395
31911 -2293395 -1715414 -512502 196099 -80195 -682799 -946210 -990180 -1157165 -1384751
31902 -1384751 -1456082 -1362987 -1141875 -729712 -181863 293026 637603 952918 1127309 861895
31892 861895 210956 -299448 -314848 -88166 -31043 -125121 -98205 1781 -218088 -921931
$$ packed form
31959a459356r7924L93833Q16525O90615j2344n26856l45436j6836j86236m63030
31949a207045j53359M34370N08625J99648K33696M96534K61843k78579j76639
31940C19094M89073N19612l66403r16821l73658L07724Q9534n74879p64939n61846
31930a833509m30108j35710N51485R29094L65171m66900n72482k16753k60019
31921b069731n18780k12767L94997L44060k49029l21070K40994M03399r8204k07264
31911b293395N77981J202912P08601k76294o02604k63411m3970j66985k27586
31902a384751p1331R3095K21112M12163N47849M74889L44577L15315J74391k65414
31892H61895o50939n10404j5400K26682N7123r4078K6916R9986k19869p03843
$$ plain form
31882 -921931 -1691065 -1891898 -1380132 -760327 -831455 -1710555 -2617829 -2680276 -1869914 -949359
31872 -949359 -549347 -586761 -644560 -610410 -704148 -1028748 -1355552 -1361875 -939660 -260368 367522
31861 367522 704106 727086 589674 399071 113367 -233611 -322835 143410 892088 1198307
31851 1198307 778056 228411 209948 529959 646475 816446 1768820 3123540 3295647
31842 3295647 1648847 -221268 -391917 869536 1711027 1369435 792445 692465 573048
31833 573048 78854 -146292 316827 772965 585357 196356 80428 -283752 -1286886
31824 -1286886 -1987077 -1408809 -335526 -275722 -1096573 -1334931 -679890 -384391 -1009924
31815 -1009924 -1499552 -1092856 -616348 -965149 -1569040 -1454589 -854335 -593011 -613877 -351668
$$ packed form
31882i21931p69134k00833N11766O19805p1128q79100r07274o2447Q10362R20555
31872i49359M00012l7414n7799L4150r3738l24600l26804o323M22215O79292O27890
31861C67522L36584K2980j37412j90603k85704l46978q9224M66245P48678L06219
31851A198307m20251n49645j8463L20011J16516J69971R52374J354720J72107
31842C295647j646800j870115j70649J261453Q41491l41592n76990r9980j19417
31833E73048m94194k25146M63119M56138j87608l89001j15928l64180j003134
31824a286886p00191N78268J073283N9804q20851k38358O55041K95499o25533
31815a009924m89628M06696M76508l48801o03891J14451O00254K61324k0866K62209
$$ plain form
31805 -351668 -70505 -518474 -1419486 -1573264 -622014 357955 415089 10187 181244 1019959
31795 1019959 1663785 1540467 960505 441223 290 -568664 -1062754 -1032986 -569767 -382792
31785 -382792 -808006 -1182623 -722482 276103 782603 469305 43667 61021 209665 95297
31775 95297 -14863 240367 586857 552488 199374 -158103 -565342 -1130979 -1459998 -1071248
31765 -1071248 -167497 640845 1165865 1555936 1637421 1138375 439959 244007 475887 385873
31755 385873 -135775 -266324 405009 1119087 1080699 651101 738092 1469687 2149987 2255914
31745 2255914 1886115 1391105 1064393 1104378 1486719 1943275 2302537 2638950 2862133 2546332
31735 2546332 1586209 671826 561055 1096898 1482715 1337651 907757 416248 -108811
$$ packed form
31805c51668K81163m47969r01012j53778R51250R79969N7134m04902J71057Q38715
31795A019959O43826j23318n79962n19282m40933n68954m94090K9768M63219J86975
31785c82792m25214l74617M60141R98585N06500l13298m25638J7354J48644j14368
31775I5297j10160K55230L46490l4369l53114l57477m07239n65637l29019L88750
31765a071248R03751Q08342N25020L90071Q1485m99046o98416j95952K31880r0014
31755C85873n21648j30549O71333P14078l8388m29598Q6991P31595O80300J05927
31745B255914l69799m95010l26712L9985L82341M56556L59262L36413K23183l15801
31735B546332r60123r14383j10771N35843L85817j45064m29894m91509n25059
$$ plain form
31726 -108811 -423224 -209053 294747 472666 248852 130466 201753 -90863 -799659 -999317
31716 -999317 -124692 901277 752725 -491428 -1528616 -1616573 -1250938 -1053871 -923660
31707 -923660 -629492 -537062 -1194162 -2512055 -3765280 -4269438 -3866554 -2918492 -1974272
31698 -1974272 -1294489 -641022 292278 1293879 1808379 1683344 1303630 889958 168540
31689 168540 -997412 -2090279 -2443992 -2003927 -1267027 -707624 -535614 -729690 -973799
31680 -973799 -828345 -316303 -53678 -383385 -683495 -115006 1102125 1807708 1339339
31671 1339339 279477 -398039 -439301 -291284 -319755 -416035 -317545 -90268 -170640 -848458
31661 -848458 -1741855 -2051453 -1484997 -627049 -117930 179683 720535 1284712 1149461 222414
$$ packed form
31726a08811l14413K14171N03800J77919k23814j18386P1287k92616p08796j99658
31716i99317Q74625J025969j48552j244153j037188q7957L65635J97067J30211
31707i23660K94168R2430o57100j317893j253225n04158M02884R48062R44220
31698a974272O79783O53467R33300J001601N14500j25035l79714m13672p21418
31689A68540j165952j092867l53713M40065P36900N59403J72010j94076k44109
31680i73799J45454N12042K62625l29707l00110N68489J217131P05583m68369
31671A339339j059862o77516m1262J48017k8471r6280R8490K27277q0372o77818
31661h48458q93397l09598N66456Q57948N09119K97613N40852N64177j35251r27047
$$ plain form
31651 222414 -690076 -927272 -741571 -793755 -1307752 -1925958 -2050708 -1236160 330548 1653524
31641 1653524 1744467 764298 -164405 -404778 -414953 -708124 -1028274 -1065605 -1215975 -1847567
31631 -1847567 -2377029 -1996544 -1005931 -485695 -750363 -1016727 -657816 65598 738075
31622 738075 1459911 2339329 2889414 2533573 1506393 750937 855057 1352313 1250345
31613 1250345 220951 -940263 -1256803 -816840 -574686 -854573 -796013 228112 1357634
31604 1357634 1312197 284951 -344743 -87068 77055 -573307 -1383360 -1534485 -1338955
31595 -1338955 -1444588 -1538144 -943356 -58057 5614 -847419 -1435234 -1006709 -260102 -190380
31585 -190380 -670084 -839732 -449724 -72867 -123900 -339881 -347270 -228598 -249403 -347787
$$ packed form
31651B22414r12490k37196J85701n2184n13997o18206j24750Q14548J566708J322976
31641A653524R0943r80169r28703k40373j0175k93171l20150l7331j50370o31592
31631a847567n29462L80485R90613N20236k64668k66364L58911P23414O72477
31622G38075P21836Q79418N50085l55841j027180p55456J04120M97256j01968
31613A250345j029394j161214l16540M39963K42154k79887N8560J024125J129522
31604A357634m5437j027246o29694K57675J64123o50362q10053j51125J95530
31595a338955j05633r3556N94788Q85299O3671q53033n87815M28525P46607O9722
31585a90380m79704j69648L90008L76857n1033k15981p389J18672k0805r8384
$$ plain form
31575 -347787 -252395 17984 130259 -33725 -118270 222279 726925 706978 -123455 -1218653
31565 -1218653 -1773439 -1601122 -1202609 -975883 -674530 123131 1217626 1865194 1685527
31556 1685527 1110711 751217 679637 658661 718120 964002 1032701 456306 -392515 -480911
31546 -480911 473780 1457512 1468688 767677 245244 100007 -75248 -257225 49030 885097
31536 885097 1663694 1971618 1908718 1639053 1274181 1169970 1557709 1836619 1119488 -320959
31526 -320959 -1082940 -495720 448813 561003 -12654 -449036 -681861 -1223526 -2020764 -2453938
31516 -2453938 -2281266 -1797156 -1213792 -594887 -227370 -333763 -541140 -329378 123385
31507 123385 246181 73268 151374 549582 810460 854333 1013405 1117422 571757 -427192
$$ packed form
31575c47787R5392K70379J12275j63984q4545L40549N04646j9947q30433j095198
31565a218653n54786J72317L98513K26726L01353P97661J094495O47568j79667
31556A685527n74816l59494p1580k0976N9459K45882O8699n76395q48821q8396
31546d80911R54691R83732J1176p01011n22433j45237j75255j81977L06255Q36067
31536H85097P78597L07924o2900k69665l64872j04211L87739K78910p17131j440447
31526c20959p61981N87220R44533J12190n73657m36382k32825n41665p97238m33174
31516b453938J72672M84110N83364O18905L67517j06393k07377K11762M52763
31507A23385J22796j72913P8106L98208K60878M3873J59072J04017n45665r98949
$$ plain form
31497 -427192 -824852 -299580 108147 -400635 -1107176 -955838 -189552 256564 391074 959972
31487 959972 1890059 2232529 1743411 1326272 1511379 1509366 447109 -1139130 -1825774 -1027714
31477 -1027714 414072 1248561 947250 -107319 -1128759 -1551596 -1424003 -1268448 -1441246
31468 -1441246 -1690367 -1526568 -948843 -493500 -485184 -533487 -46675 859814 1304257 632361
31458 632361 -731015 -1676829 -1599748 -901652 -259050 239896 908699 1647907 1830171 1088827
31448 1088827 -182328 -1331545 -2119637 -2568481 -2429535 -1370757 250670 1314777 980554
31439 980554 -415761 -1785846 -2440174 -2495319 -2280503 -1837142 -1153779 -501363 -211694
31430 -211694 -293625 -528794 -823980 -1223514 -1675366 -2043019 -2281852 -2361612 -2112433 -1469681
$$ packed form
31497d27192l97660N25272M07727n08782p06541J51338P66286M46116J34510N68898
31487I59972R30087L42470m89118m17139J85107k013j062257j586239o86644P98060
31477a027714J441786Q34489l01311j054569j021440m22837J27593J55555j72798
31468a441246k49121J63799N77725M55343Q316m8303M86812R06489M44443o71896
31458F32361j363376r45814P7081O98096O42602M98946O68803P39208J82264p41344
31448A088827j271155j149217p88092m48844J38946J058778J621427J064107l34223
31439I80554j396315j370085o54328n5145K14816M43361O83363O52416K89669
31430b11694q1931k35169k95186l99534m51852l67653k38833p9760K49179O42752
$$ plain form
31420 -1469681 -820997 -719251 -1188765 -1688302 -1873934 -1995914 -2312919 -2503049 -2062450
31411 -2062450 -1094264 -287000 -121706 -387850 -520190 -228256 258667 500466 388929
31402 388929 321554 675649 1182943 1179553 534108 -114733 -248797 -130635 -234283 -482229
31392 -482229 -548715 -530945 -699400 -859206 -627700 -150481 145227 323021 682675 893031
31382 893031 338272 -656291 -996596 -428390 100012 38348 35156 530529 748383 68090
31372 68090 -638755 -303399 502687 481535 -162893 -22401 1167329 2129199 2155064 2004377
31362 2004377 2220444 2065588 955809 -292184 -653934 -381820 -275559 -279755 81070
31353 81070 501705 328361 -192321 -259688 91124 64346 -490346 -827032 -560527 -181846
$$ packed form
31420a469681O48684J01746m69514m99537j85632j21980l17005j90130M40599
31411b062450R68186Q07264J65294k66144j32340K91934M86923K41799j11537
31402C88929o7375L54095N07294l390o45445o48841j34064J18162j03648k47946
31392d82229o6486J7770j68455j59806K31506M77219K95708J77794L59654K10356
31382H93031n54759r94563l40305N68206N28402o1664l192M95373K17854o80293
31372F8090p06845L35356Q06086k1152o44428J40492J189730R61870K5865j50687
31362B004377K16067j54856j109779j247993l61750K72114J06261m196L60825
31353H1070M20635j73344n20682o7367L50812k6778n54692l36686K66505L78681
$$ plain form
31343 -181846 -96330 -42595 211711 375954 206634 -90567 -367025 -792427 -1249040 -1131947
31333 -1131947 -244764 668572 828678 400228 47559 -30308 -16400 167479 687282 1195279
31323 1195279 1134782 595353 211331 195751 120190 -223941 -370904 122029 985921 1585162
31313 1585162 1632026 1250170 588962 -274300 -1162139 -1813616 -2076441 -1982588 -1728543 -1651333
31303 -1651333 -2018281 -2649676 -2904762 -2286964 -1013701 186116 766911 694228 221616
31294 221616 -338645 -619328 -321556 455306 1154522 1213155 546493 -444676 -1216074 -1379577
31284 -1379577 -890714 -155274 178482 -193767 -852080 -1064808 -599189 64487 337445
31275 337445 126294 -203894 -221809 305199 1255510 2067574 2076738 1261017 491886 657143
$$ packed form
31343a81846Q5516N3735K54306J64243j69320k97201k76458m25402m56613J17093
31333a131947Q87183R13336J60106m28450l52669p7867J3908J83879N19803N07997
31323A195279o0497n39429l84022j5580p5561l44131j46963M92933Q63892N99241
31313A585162M6864l81856o61208q63262q87839o51477k62825R3853K54045P7210
31303a651333l66948o31395k55086O17798J273263J199817N80795p2683m72612
31294B21616n60261k80683K97772P76862O99216N8633o66662r91169p71398j63503
31284a379577M88863P35440L33756l72249o58313k12728M65619O63676K72958
31275C37445k11151l30188j7915N27008R50311Q12064R164q15721p69131J65257
$$ plain form
31265 657143 1565599 2111949 1607552 571994 6150 215006 699612 1003378 1166217
31256 1166217 1273704 1041101 238382 -682249 -891419 -222655 500274 452633 -184779 -606813
31246 -606813 -529196 -367347 -337784 -130877 272991 224381 -559531 -1159552 -496544 1077327
31236 1077327 2129838 2021704 1492120 1242982 950163 177143 -595491 -646227 -179008
31227 -179008 30695 -144456 -160088 120657 182169 -179520 -415839 -102065 322619 179758
31217 179758 -424494 -728521 -381608 73111 -84849 -819576 -1358570 -1101069 -285641 374719
31207 374719 551357 485861 356113 -59130 -806737 -1290874 -945075 -168513 90594 -284647
31197 -284647 -350789 439343 1240829 912185 -313906 -1055615 -600815 274520 504694 72404
$$ packed form
31265F57143R08456N46350n04397j035558n65844K08856M84606L03766J62839
31256A166217J07487k32603q02719r20631k09170O68764P22929m7641o37412m22034
31246f06813P7617J61849K9563K06907M03868m8610p83912o00021O63008J573871
31236A077327J052511j08134n29584k49138k92819p73020p72634n0736M67219
31227a79008K09703j75151j5632K80745O1512l61689k36319L13774M24684j42861
31217A79758o04252l04027L46913M54719j57960p34727n38994K57501Q15428O60360
31207C74719J76638o5496j29748m15243p47607m84137L45799P76562K59107l75241
31197b84647o6142P90132Q01486l28644j226091p41709M54800Q75335K30174m32290
$$ plain form
31187 72404 -299615 -314166 -325558 -567034 -769402 -651119 -345911 -169596 -276304 -677878
31177 -677878 -1258777 -1587110 -1106768 126460 1203804 1314162 753913 494633 852078
31168 852078 1174198 911433 370629 116349 142785 84881 -105897 -216936 -311413 -658666
31158 -658666 -1132056 -1189914 -652430 -133718 -381458 -1329221 -2107576 -2022388 -1292170 -677638
31148 -677638 -546615 -585465 -421927 -160009 -71378 -65459 129992 423019 459645 229275
31138 229275 82186 108871 30153 -166275 -63330 419602 659431 205385 -395840 -224310
31128 -224310 788217 1787368 2028546 1501935 593184 -392670 -1257644 -1769474 -1678565 -895270
31118 -895270 261141 1056162 936185 218595 -239032 -203880 -330931 -969199 -1423974 -1036176
$$ packed form
31187G2404l72019j4551j1392k41476k02368J18283L05208J76315j06708m01574
31177f77878n80899l28333M80342J233228J077344J10358n60249k59280L57445
31168H52078L22120k62765n40804k54280K6436n7904j90778j11039r4477l47253
31158f58666m73390n7858N37484N18712k47740r47763p78355Q5188P30218O14532
31148f77638J31023l8850J63538K61918Q8631N919J95451K93027L6626k30370
31138B29275j47089K6685p8718j96428J02945M82932K39829m54046o01225J71530
31128b24310J012527R99151K41178n26611r08751r85854q64974n11830R0909P83295
31118h95270J156411P95021j19977p17590m57627L5152j27051o38268m54775L87798
$$ plain form
31108 -1036176 -377326 -492276 -1335197 -1902797 -1722796 -1260629 -921993 -624007 -436959
$$ packed form
31108a036176O58850j14950q42921n67600J80001M62167L38636K97986J87048
$$ [...]
##END NTUPLES=NMR SPECTRUM
##END=
