##TITLE=31Pdec_LY-TMF-12.5.R.t
 D2O, 24 sc
 3.3.2020
##JCAMPDX= 6.0         $$ Bruker NMR JCAMP-DX V2.0
##DATA TYPE= NMR SPECTRUM
##DATA CLASS= NTUPLES
##ORIGIN= UXNMR, Bruker Analytische Messtechnik GmbH
##OWNER= root
$$ XWIN-NMR		Version 3.5
$$ Tue Mar  3 14:04:11 2020 Russian Standard Time (UT+4h)  she@DPX200
##.OBSERVE FREQUENCY= 81.013821
##.OBSERVE NUCLEUS= ^31P
##.ACQUISITION MODE= SIMULTANEOUS
##.ACQUISITION SCHEME= undefined
##.AVERAGES= 24
##.DIGITISER RES= 17
##SPECTROMETER/DATA SYSTEM= spect
##.PULSE SEQUENCE= zgpg30
##.SOLVENT NAME= CDCl3
##.SHIFT REFERENCE= (INTERNAL, CDCl3, 0, 182.463)
##AUDIT TRAIL= $$ (NUMBER, WHEN, WHO, WHERE, WHAT)
$$ ##TITLE= Audit trail, XWIN-NMR		Version 3.5
$$ ##JCAMPDX= 5.01
$$ ##ORIGIN= Bruker BioSpin GmbH
$$ ##OWNER= she
$$ F:/spectra/data/she/nmr/P31/1/pdata/1/auditp.txt
$$ ##AUDIT TRAIL=  $$ (NUMBER, WHEN, WHO, WHERE, WHAT)
(   1,<2020-03-03 14:03:04.43 +0400>,<she>,<DPX200>,
      <created by zg, POWCHK disabled, PULCHK disabled
       configuration hash MD5:
       00 E9 B6 7A A2 85 ED C7 34 08 36 98 17 FE 4E 26
       data hash MD5: 32K
       BF 27 4A A3 54 8E 9B 6C AD 23 59 B1 68 D5 10 5A>)
(   2,<2020-03-03 14:03:07.15 +0400>,<she>,<DPX200>,
      <Start of raw data processing
       efp BC_mod = 2 LB = 1 FT_mod = 6 PKNL = 1 PHC0 = -1336.51 PHC1 = 126.4017 SI = 64K 
       data hash MD5: 64K
       1C BC DD C8 90 B8 06 0E C1 4D A2 FA C3 D6 AD 92>)
(   3,<2020-03-03 14:03:22.71 +0400>,<she>,<DPX200>,
      <pk PHC0 = -10.49564 PHC1 = 0 
       data hash MD5: 64K
       15 86 ED 19 2D CA 09 28 11 43 4F 3D 6F D2 3D 6F>)
(   4,<2020-03-03 14:03:28.31 +0400>,<she>,<DPX200>,
      <abs ABSG = 5 
       data hash MD5: 64K
       BD AD DF 93 65 85 6F AB 1B D8 59 AD D7 31 65 45>)
$$ ##END=
$$ 
$$ hash MD5
$$ 87 1D CB BA B6 70 12 2F EC 32 3F 75 C9 CE A3 EB
##$RELAX= 
##$RELAX= 
##$RELAX= 
##$RELAX= 
##$RELAX= 
##$RELAX= 
##$RELAX= 
##$RELAX= 
$$ Bruker specific parameters
$$ --------------------------
##$DU= <F:/spectra>
##$EXPNO= 1
##$NAME= <P31>
##$PROCNO= 1
##$TYPE= <nmr>
##$USER= <she>
##$AMP= (0..31)
100 100 100 100 100 100 100 100 100 100 100 100 100 100 100 100 100 100 
100 100 100 100 100 100 100 100 100 100 100 100 100 100 
##$AQSEQ= 0
##$AQ_mod= 1
##$AUNM= <au_zg>
##$AUTOPOS= <>
##$BF1= 81.014009
##$BF2= 200.13
##$BF3= 200.13
##$BF4= 200.13
##$BF5= 200.13
##$BF6= 200.13
##$BF7= 200.13
##$BF8= 200.13
##$BYTORDA= 1
##$CFDGTYP= 0
##$CFRGTYP= 5
##$CHEMSTR= <none>
##$CNST= (0..31)
1 1 145 1 1 1 1 1 1 1 1 1 1 1 1 1 1 1 1 1 1 1 1 1 1 1 1 1 1 1 1 1 
##$CPDPRG= <waltz16>
##$CPDPRG1= <>
##$CPDPRG2= <waltz16>
##$CPDPRG3= <>
##$CPDPRG4= <mlev>
##$CPDPRG5= <mlev>
##$CPDPRG6= <mlev>
##$CPDPRG7= <mlev>
##$CPDPRG8= <mlev>
##$CPDPRGB= <>
##$CPDPRGT= <>
##$D= (0..31)
0 1 0 0 0 0 0 0 0 0 0 0.03 2e-05 3e-06 0 0 0 0 0 0 0 0 0 0 0 0 0 0 0 0 
0 0 
##$DATE= 1583229783
##$DBL= (0..7)
120 120 120 11 120 120 24 19 
##$DBP= (0..7)
150 150 150 150 150 150 150 150 
##$DBP07= 0
##$DBPNAM0= <>
##$DBPNAM1= <>
##$DBPNAM2= <>
$$ [...]
##$SUBNAM3= <"">
##$SUBNAM4= <"">
##$SUBNAM5= <"">
##$SUBNAM6= <"">
##$SUBNAM7= <"">
##$SUBNAM8= <"">
##$SUBNAM9= <"">
##$SW= 369.568048894756
##$SWIBOX= (0..15)
0 1 3 0 0 0 0 0 0 0 0 0 0 0 0 0 
##$SW_h= 29940.119760479
##$TD= 32768
##$TD0= 1
##$TE= 0
##$TE2= 300
##$TE3= 300
##$TEG= 300
##$TL= (0..7)
0 120 53 12 22 120 120 120 
##$TP= (0..7)
150 150 150 150 150 150 150 150 
##$TP07= 0
##$TPNAME0= <>
##$TPNAME1= <>
##$TPNAME2= <>
##$TPNAME3= <>
##$TPNAME4= <>
##$TPNAME5= <>
##$TPNAME6= <>
##$TPNAME7= <>
##$TPOAL= (0..7)
0.5 0.5 0.5 0.5 0.5 0.5 0.5 0.5 
##$TPOFFS= (0..7)
0 0 0 0 0 0 0 0 
##$TUNHIN= 0
##$TUNHOUT= 0
##$TUNXOUT= 0
##$USERA1= <user>
##$USERA2= <user>
##$USERA3= <user>
##$USERA4= <user>
##$USERA5= <user>
##$V9= 5
##$VALIST= <valist>
##$VCLIST= <CCCCCCCCCCCCCCC>
##$VD= 0
##$VDLIST= <DDDDDDDDDDDDDDD>
##$VPLIST= <PPPPPPPPPPPPPPP>
##$VTLIST= <TTTTTTTTTTTTTTT>
##$WBST= 1024
##$WBSW= 4
##$XGAIN= (0..3)
0 0 0 0 
##$XL= 0
##$YL= 0
##$YMAX_a= 7940
##$YMIN_a= -8444
##$ZGOPTNS= <>
##$ZL1= 120
##$ZL2= 120
##$ZL3= 120
##$ZL4= 120
##$ABSF1= 182.463
##$ABSF2= -187.1042
##$ABSG= 5
##$ABSL= 3
##$ALPHA= 0
##$AQORDER= 0
##$ASSFAC= 0
##$ASSFACI= 0
##$ASSFACX= 0
##$ASSWID= 0
##$AUNMP= <proc_1d>
##$AZFE= 0.1
##$AZFW= 0.5
##$BCFW= 0
##$BC_mod= 2
##$BYTORDP= 0
##$COROFFS= 0
##$CY= -3
##$DATMOD= 1
##$DC= 0
##$DFILT= <>
##$DTYPP= 0
##$F1P= 0
##$F2P= 0
##$FCOR= 1
##$FTSIZE= 65536
##$FT_mod= 6
##$GAMMA= 0
##$GB= 0
##$INTBC= 1
##$INTSCL= 5.30512e-09
##$ISEN= 30
##$LB= 1
##$LEV0= 0
##$LPBIN= 0
##$MAXI= 10000
##$MC2= 0
##$MEAN= 0
##$ME_mod= 0
##$MI= 50
##$NCOEF= 0
##$NC_proc= -5
##$NLEV= 6
##$NOISF1= 182.463
##$NOISF2= 159.3651
##$NSP= 0
##$NTH_PI= 0
##$NZP= 0
##$OFFSET= 182.463
##$PC= 4
##$PHC0= -1347.006
##$PHC1= 126.4017
##$PH_mod= 1
##$PKNL= yes
##$PPARMOD= 0
##$PSCAL= 0
##$PSIGN= 0
##$REVERSE= no
##$SF= 81.0140089999434
##$SI= 65536
##$SIGF1= 159.3651
##$SIGF2= -187.1042
##$SINO= 113.3802
##$SIOLD= 16384
##$SREGLST= <1H.CDCl3>
##$SSB= 0
##$STSI= 65536
##$STSR= 0
##$SW_p= 29940.119760479
##$SYMM= 0
##$S_DEV= 0
##$TDeff= 32768
##$TDoff= 0
##$TI= <>
##$TILT= no
##$TM1= 0
##$TM2= 0
##$TOPLEV= 0
##$USERP1= <user>
##$USERP2= <user>
##$USERP3= <user>
##$USERP4= <user>
##$USERP5= <user>
##$WDW= 1
##$XDIM= 65536
##$YMAX_p= 361848076
##$YMIN_p= -22154968
$$ End of Bruker specific parameters
$$ ---------------------------------
##NTUPLES= NMR SPECTRUM
##VAR_NAME=  FREQUENCY,     SPECTRUM/REAL,   SPECTRUM/IMAG
##SYMBOL=    X,             R,               I
##VAR_TYPE=  INDEPENDENT,   DEPENDENT,       DEPENDENT
##VAR_FORM=  AFFN,          ASDF,            ASDF
##VAR_DIM=   65536,         65536,           65536
##UNITS=     HZ,            ARBITRARY UNITS, ARBITRARY UNITS
##FACTOR=    0.456856943014862, 1,           1
##FIRST=     14782.0589164792, 0,            0
##LAST=      -15158.0608439998, 0,           0
##MIN=       -15158.0608439998, -22154968,   0
##MAX=       14782.0589164792, 361848076,    0
$$ Real data points
##PAGE= N=1
##DATA TABLE= (X++(R..R)), XYDATA
$$ [...]
##PAGE= N=2
##DATA TABLE= (X++(I..I)), XYDATA
38934 -323776 294642 677519 591187 467719 520302 432559 115545 -24389 109327 1066
38924 1066 -544155 -903020 -623049 -221777 -297948 -435325 145322 1231463 1852073 1701975
38914 1701975 1409404 1342784 1049221 190349 -691817 -871444 -483071 -300077 -585115 -661507
38904 -661507 190250 1676868 2662746 2416698 1382888 506081 93487 -210652 -524890
38895 -524890 -504996 -109594 147154 60703 180340 835362 1287070 609847 -906876 -2022723
38885 -2022723 -2084152 -1573741 -1159888 -939196 -779154 -773483 -1028869 -1374878 -1543555 -1403124
38875 -1403124 -902051 -56710 877983 1450495 1351655 626495 -379714 -1120364 -1069864 -197654
38865 -197654 833389 1263449 1004956 564834 334637 300799 322072 274073 6114 -426208
38855 -426208 -605007 -305999 -50849 -460267 -1134910 -989808 159052 1192250 1236790
38846 1236790 813262 829422 1094998 692260 -505973 -1581650 -1840906 -1596734 -1477845
38837 -1477845 -1540786 -1457643 -1241415 -1285768 -1687696 -1933491 -1517436 -691585 -227820 -402480
38827 -402480 -632704 -365725 74226 8407 -493074 -684680 -304567 -5072 -428566 -1358769
38817 -1358769 -2021557 -1832986 -715561 848121 1916708 1805210 954512 519546 808364
38808 808364 830474 -122406 -1198565 -1093275 99838 1089048 1140182 675409 269903 68008
38798 68008 257939 1104757 2191222 2503347 1733370 780817 466469 438474 2187 -550755
38788 -550755 -300656 877500 2074909 2519151 2309763 1914226 1545509 1237891 1034050
38779 1034050 812662 300619 -458382 -953898 -831328 -404156 -195564 -188875 8400 350723
38769 350723 273965 -397898 -965064 -688135 165480 619311 278017 -186358 3655 692026
38759 692026 1022812 472570 -687602 -1830871 -2516386 -2606035 -2197992 -1599483 -1168453
38750 -1168453 -1026468 -1011589 -963078 -902566 -850226 -638210 -96786 642183 1213056 1411191
38740 1411191 1408688 1536718 1907897 2279647 2276285 1767064 1049848 611141 642630 839857
38730 839857 768281 391206 95114 167652 403854 342393 -191189 -888837 -1241322 -904903
38720 -904903 104242 1345837 2089107 1799063 666430 -491547 -1005012 -906112 -618531
38711 -618531 -359128 -144626 -186128 -778610 -1734851 -2368525 -2257183 -1709075 -1245637 -932345
38701 -932345 -550644 -174777 -105638 -275103 -150220 642949 1853453 2845107 3112894 2577818
38691 2577818 1660335 1097991 1337898 1955466 1997173 1125450 127800 -15191 685786 1364577
38681 1364577 1433617 1089960 731380 431132 192340 247926 708953 1164755 1056772 404334
38671 404334 -157802 -95014 483980 1016772 1046058 568114 -28343 -328809 -277624 -198731
38661 -198731 -399940 -842123 -1253834 -1406326 -1157036 -462954 387946 787155 456434 -23950
38651 -23950 205169 1195876 2157686 2515885 2436127 2172580 1571381 612700 -130750 -142721
38641 -142721 312713 671502 926339 1363830 1728786 1446863 637802 127341 288246 525830
38631 525830 171944 -647416 -1315058 -1435653 -985063 -197929 392505 235984 -536666 -1048171
38621 -1048171 -690746 109567 549240 546303 647800 1031121 1223410 880704 332911 126181
38611 126181 332632 547306 402483 -101707 -683158 -1028310 -970765 -543530 72666 666329
38601 666329 1116811 1419120 1546553 1320903 601946 -318126 -771228 -426379 248756 582881
38591 582881 582789 754652 1163096 1297078 946579 553209 458201 453172 425967 760233 1516429
38580 1516429 1824507 898665 -696586 -1624586 -1440854 -877106 -563642 -352444 -26979
38571 -26979 170419 63385 -82527 -113793 -348242 -914910 -1231075 -733815 180493 605016
38561 605016 416856 466801 1300120 2223054 2096678 845223 -365029 -580485 -229125
38552 -229125 -407626 -1283977 -1901402 -1630180 -1033496 -855709 -850361 -384190 272017 274831
38542 274831 -300013 -384186 427047 1121297 688645 -459543 -1145466 -968437 -494063 -229013
38532 -229013 -101598 147049 616124 1267530 1864159 1915081 1087763 -268239 -1282761
38523 -1282761 -1315168 -460576 551757 840251 25392 -1306085 -1997624 -1501913 -494167
38514 -494167 -11041 -212442 -405715 -91852 552560 1181199 1696952 2029154 1952094 1394721
38504 1394721 692563 308908 382437 626485 637762 347299 178449 547673 1147858 1147325
38494 1147325 373679 -229555 101141 694192 377383 -641943 -1012250 -397585 -60423
38485 -60423 -756151 -1317843 -370540 1464237 2385105 1941130 1368681 1513522 1787893 1486934
38475 1486934 937831 722717 653444 271643 -226900 -320328 -51231 73411 -163935 -600197
38465 -600197 -1125390 -1633618 -1731104 -1127946 -262247 74622 -234703 -547632 -465653 -320674
38455 -320674 -477533 -749778 -848103 -899433 -1058728 -980477 -218968 1024029 2029987 2353394
38445 2353394 2083398 1440333 602775 -70854 -181444 155226 294737 -122038 -621794
38436 -621794 -468341 385202 1215069 1355987 872038 351699 175229 100916 -366838 -1211507
38426 -1211507 -1698208 -1183004 -47240 585614 200209 -463446 -434377 199735 570205
38417 570205 366635 153323 256920 122001 -745784 -1761258 -1885917 -1008339 34239
38408 34239 753126 1538437 2670938 3536199 3367143 2340900 1347919 893095 778699
38399 778699 738212 771477 804368 582016 102241 -275807 -375289 -469915 -756839 -931505
38389 -931505 -635833 -47461 376008 552914 759440 1054192 1154206 911464 536956 252010
38379 252010 36307 -129754 -60879 341470 752752 676903 58037 -560765 -601826 -86950
38369 -86950 413470 432099 54730 -315241 -459181 -467704 -515628 -722436 -1109431 -1427777
38359 -1427777 -1161412 -98975 1143708 1656365 1354193 1037757 1182521 1292783 812201
38350 812201 47469 -394187 -570949 -872324 -1092422 -712898 29465 256262 -279822 -820464
38340 -820464 -685568 -17619 799779 1747126 2773438 3382009 3163165 2431289 1895929
38331 1895929 1887060 2184397 2401607 2312709 1996307 1792290 1887169 1927696 1432635 597551
38321 597551 131429 184052 120080 -368070 -675436 -299833 271671 376985 279402 610919
38311 610919 1149561 1108925 444830 -83563 -149445 -246390 -672629 -945289 -582599 125234
38301 125234 514978 343054 -92442 -329944 -100702 382909 439834 -370052 -1476600 -1742325
38291 -1742325 -868221 133357 175824 -603397 -1156975 -845662 -50842 379008 -8818
38282 -8818 -875515 -1378290 -983789 -114219 235401 -327045 -1076549 -1075464 -325778 338909
38272 338909 357666 34163 16866 523414 1203546 1564824 1378782 750372 -63653 -836357
38262 -836357 -1387856 -1529926 -1151973 -414726 251859 462782 206852 -152400 -210569 81331
38252 81331 291354 -143234 -1294467 -2494963 -2880378 -2232595 -1169730 -457867 -258009
38243 -258009 -151832 155987 335996 -196205 -1374981 -2198450 -1708314 -231078 834157
38234 834157 684707 99514 312485 1293865 1852332 1333215 446303 204763 670464 1132573
38224 1132573 1103464 702217 282246 73168 125164 352477 626952 885492 1047803 874905
38214 874905 212112 -568732 -756828 -154975 578011 730394 422372 345750 807611 1417286
38204 1417286 1653942 1392882 862034 388333 259404 570799 1055545 1221294 830365
38195 830365 194619 -143204 -8938 280209 445591 668949 1210668 1756076 1649637 913312
38185 913312 488375 1051581 2014579 2268609 1619458 802958 280136 -145054 -500696 -352268
38175 -352268 364626 981029 995019 738465 739657 991140 1275259 1644561 2098476 2334464
38165 2334464 2317337 2484736 2799452 2309885 525835 -1366593 -1770349 -807552 6778
38156 6778 73985 377254 1623666 2984251 3298886 2615242 1813658 1349795 1087236 947064
38146 947064 1037994 1318899 1580862 1621781 1226346 326910 -563637 -571000 450966 1477866
38136 1477866 1487608 716900 156911 108117 -18234 -552809 -986532 -708955 222369 1252863
38126 1252863 1845403 1671768 745068 -389169 -968497 -805192 -470682 -450549 -488980 -165923
38116 -165923 215798 -51596 -938236 -1503074 -1078864 -117299 504691 608621 627909 655840
38106 655840 281006 -522511 -973012 -373183 902280 1772172 1699662 1189191 1018396 1303073
38096 1303073 1475291 1030986 144082 -474917 -316831 370142 865335 804840 519409 474923
38086 474923 660797 760447 680052 564310 438226 221243 43103 167648 590625 1043464
38076 1043464 1384132 1603960 1435712 448900 -1239885 -2722251 -3078201 -2254299 -1032997
38067 -1032997 -330452 -595649 -1577510 -2491850 -2676611 -2252920 -1880822 -1760945 -1314190
38058 -1314190 -118085 1310331 2143167 2305791 2333046 2383317 2073772 1290819 506665
38049 506665 94843 -149847 -541665 -975638 -1190580 -1237673 -1321811 -1383486 -1214399 -897628
38039 -897628 -771891 -916022 -943752 -445383 504255 1412496 1895499 2000633 1937591 1610723
38029 1610723 689179 -744299 -1904069 -2043713 -1407772 -996340 -1296194 -1712471 -1505776
38020 -1505776 -822582 -320321 -101906 329916 1140770 1846014 2051517 1938325 1763658
38011 1763658 1396664 719062 64177 -200373 -221936 -317649 -336875 67686 666770 768983
38001 768983 161115 -582370 -830791 -485598 234268 1068651 1604286 1427216 711798 238142
37991 238142 478171 1003576 1099280 597146 -200243 -970739 -1329965 -829202 374683 1195771
37981 1195771 698884 -650946 -1498002 -1246558 -506056 25837 283423 314443 -90949
37972 -90949 -841662 -1270509 -923920 -200129 224809 238397 162393 136839 93410 116775 386821
37961 386821 822807 1063309 778320 -50927 -970957 -1195867 -327419 966307 1498003
37952 1498003 995466 436874 645418 1172973 1094256 347779 -382172 -682156 -575405 -26214
37942 -26214 898937 1579833 1385304 599914 58205 -58697 -253937 -606798 -579086 -52508
37932 -52508 390706 506106 793119 1451675 1805486 1332038 513086 25463 -235448 -628512
37922 -628512 -904598 -691264 -314246 -240228 -125252 592622 1457494 1469831 719989 389706
37912 389706 934664 1371634 818693 -226829 -803444 -906720 -1172996 -1618429 -1566497 -716164
37902 -716164 395059 1037997 956872 384563 -216830 -384525 68665 901001 1674487 2107523
37892 2107523 2134263 1808619 1333177 1004277 904244 795245 519139 308496 441049 758770
37882 758770 827205 466054 -111980 -549339 -528138 59102 854903 1210752 920557 482918
37872 482918 312921 159145 -167665 -53743 1010422 2155790 1964759 549012 -465476
37863 -465476 -276946 93580 -285656 -687057 -102152 889053 992686 271472 -124651 42023
37853 42023 -115212 -811969 -1081211 -454733 140663 -152419 -765249 -620971 303303 1147833
37843 1147833 1404666 1196328 664475 -135172 -852255 -1028354 -710232 -434401 -580168
37834 -580168 -1049166 -1506644 -1614194 -1133641 -196500 547873 429117 -507447 -1493008 -1814168
37824 -1814168 -1424393 -786848 -327675 -119858 22083 237931 446160 508581 500752 626888
37814 626888 851936 870959 545411 111882 -195853 -456136 -760806 -877186 -555529 -22216
37804 -22216 204480 -29155 -330220 -257626 210724 735318 978628 878329 640388 466173
37794 466173 307779 17167 -299769 -352546 -138851 5591 -26119 85146 442741 561462
37784 561462 108867 -387475 -236946 264876 189637 -543265 -894506 -170916 990336 1559930
37774 1559930 1429759 1189962 1054437 779909 482747 716484 1547156 2173116 1837699
37765 1837699 747973 -277316 -794207 -958403 -958367 -743654 -356476 -68761 18507 188715
37755 188715 685597 1320777 1733035 1803308 1562252 945077 -13102 -929677 -1396202 -1412059
37745 -1412059 -1184906 -761145 -298965 -373090 -1275790 -2175322 -1860885 -411137 783461
37736 783461 919315 760982 1225971 1876131 1623560 359114 -967988 -1570783 -1406783
37727 -1406783 -796785 -127113 231610 239677 242463 329696 41027 -801294 -1470418 -1217351
37717 -1217351 -324804 454387 1028354 1654106 1973266 1484516 709130 680850 1355356 1726550
37707 1726550 1527766 1523987 1939847 1975927 1348991 1000557 1546516 2142623 1774929 779477
37697 779477 140674 -3388 -183585 -460366 -431204 -84514 169424 155446 24338 -93775
37687 -93775 -41294 432441 1185227 1500558 938355 22231 -448985 -402420 -269695 -196510
37677 -196510 -101354 -115919 -266375 -77125 737429 1478051 1211913 197474 -263870 552648
37667 552648 1974373 2782252 2360212 1018637 -329527 -851141 -568109 -316922 -579494
37658 -579494 -747784 -142766 692131 627656 -355538 -1121446 -1024730 -612727 -518559 -586572
37648 -586572 -437607 -140637 60941 105975 -65459 -470426 -686280 -193047 652118 765010
37638 765010 -145903 -959636 -578050 660398 1594234 1692595 1229345 511943 -243853 -539771
37628 -539771 71600 1264898 2155227 2272409 1858878 1245260 491004 -250473 -534619
37619 -534619 -101750 713619 1318367 1507117 1616698 2088192 2971833 3846243 4172272 3721614
37609 3721614 2702637 1563451 741337 494161 757514 1126419 1152765 758491 277017
37600 277017 73254 234615 617404 1012269 1225095 1174893 989345 871711 826779 663551
37590 663551 323988 59875 181896 702031 1295059 1616273 1668869 1809806 2249295 2583659
37580 2583659 2150744 966221 -91487 -313609 12900 203401 154308 99861 -219311
37571 -219311 -1212817 -2324885 -2263661 -668654 1220716 1992477 1570715 892140 641835
37562 641835 835962 1250700 1679689 1904430 1790772 1346676 555895 -590332 -1769852
37553 -1769852 -2401009 -2248684 -1648938 -996276 -401065 22777 49651 -245451 -465381 -502941
37543 -502941 -620835 -726208 -319103 467984 639183 -230879 -1142457 -1063910 -436341 -279285
37533 -279285 -432622 64470 1209433 1983687 1973175 1756023 1599557 1074892 275092 152523
37523 152523 1055539 1980924 1996420 1551232 1607439 2180275 2562791 2457898 2068054 1468803
37513 1468803 687417 95330 -35917 -102963 -526764 -798290 -89497 1249318 1811813
37504 1811813 1000254 -128635 -348235 152028 323338 -133387 -534632 -381404 55734
37495 55734 399386 713989 1109268 1339999 1207593 970281 897316 730087 152223 -413747
37485 -413747 -202945 663210 1110442 590355 -52408 255659 1286097 1858271 1470783
37476 1470783 829127 746180 1196626 1652563 1823064 1762368 1586500 1370291 1150234 871115
37466 871115 479280 130125 103772 456403 944558 1316612 1483046 1435401 1263465 1219674
37456 1219674 1448124 1658711 1417477 772512 230286 105822 299715 705910 1315566
37447 1315566 1843525 1856850 1490505 1438666 1913188 2189617 1619874 569701 -166553 -411575
37437 -411575 -471290 -378733 336 355013 178569 -425015 -822464 -727256 -429231 -181298
37427 -181298 56834 257971 311123 426413 961885 1734684 2086789 1786727 1290409 947091
37417 947091 605908 293726 573194 1689377 2884235 3181995 2537372 1663964 1028773
37408 1028773 609902 413655 542879 776225 689108 303641 155530 588143 1337392 1898503
37398 1898503 1976681 1538644 796726 233743 279431 816766 1293047 1408412 1391268 1540677
37388 1540677 1889293 2416607 3104800 3538496 2968101 1245898 -641903 -1510467 -1257383
37379 -1257383 -717090 -417348 -119133 376629 643843 217994 -624604 -1100400 -816353
37370 -816353 -167563 105268 -403815 -1439080 -2268297 -2239065 -1297817 9225 1059411
37361 1059411 1635086 1918784 2167951 2463847 2671058 2567802 2087036 1456882 1005646
37352 1005646 821135 743744 697991 803439 1066366 1210130 1030197 763483 839285 1291979
37342 1291979 1635869 1367117 475454 -551035 -1124424 -949728 -143569 911687 1770765
37333 1770765 2033658 1470175 271402 -869719 -1214253 -631043 349905 1144575 1531146
37324 1531146 1460362 900009 136939 -154516 378206 1148418 1181940 262313 -856521 -1380363
37314 -1380363 -1238105 -859719 -565379 -343482 8366 675155 1603309 2417684 2711257
37305 2711257 2430719 1810042 1002577 76686 -687249 -937607 -770954 -658468 -684635 -354039
37295 -354039 519221 1207831 883356 -266514 -1300417 -1705566 -1689332 -1399538 -652913
37286 -652913 339881 717467 -23434 -1182943 -1572346 -836370 408937 1489191 2102361
37277 2102361 2003841 1089519 -12509 -199739 755244 1633053 1132436 -531852 -1985932
37268 -1985932 -2367119 -1937889 -1201934 -277143 688196 1249070 1200085 847782 439577 -122412
37258 -122412 -657980 -467973 686083 1902151 2176692 1739691 1548279 1734618 1518165
37249 1518165 639689 -92870 40267 754688 1359615 1605526 1513934 961903 10041 -732800
37239 -732800 -656562 79925 747592 940389 963823 1362095 2224806 2933515 2634934 1200189
37229 1200189 -345754 -780450 -112375 482787 302170 24105 581477 1767817 2610288
37220 2610288 2686867 2347191 1911340 1425079 1096381 1202642 1490933 1322916 558215 -256804
37210 -256804 -707724 -955235 -1161362 -1034047 -303641 737542 1542943 1905176 1941326 1712300
37200 1712300 1175145 399841 -402346 -997584 -1162030 -759497 59388 887690 1449638
37191 1449638 1829521 2199683 2508901 2615964 2563068 2497677 2426590 2233214 1838898 1185637
37181 1185637 220813 -846513 -1413408 -991319 105668 916413 839918 251705 -68654
37172 -68654 95399 286670 100004 -354771 -762813 -1025288 -1176686 -1159252 -978091 -888474
37162 -888474 -1035637 -989704 -133112 1359694 2404989 2207337 1237469 583839 563237 538224
37152 538224 78023 -350303 -152893 407756 529085 3464 -503222 -413415 -41168 -113292
37142 -113292 -715379 -1135637 -791101 41300 607964 557759 180580 -88061 -86783 118280
37132 118280 385868 530193 453096 352297 577335 1156099 1672575 1755448 1475984 1079288
37122 1079288 547777 -254085 -1094734 -1400213 -901951 -73483 284376 -87907 -577774
37113 -577774 -355341 683481 1810990 2323009 2219147 1899065 1575568 1358370 1540530
37104 1540530 2178346 2608518 2145652 1195631 815273 1089079 945569 -86390 -1007578
37095 -1007578 -881022 -265378 -218386 -671283 -871236 -810274 -972241 -1062081 -344373 857907
37085 857907 1331914 781507 255289 497186 1006713 1151441 1154541 1404356 1676957 1696333
37075 1696333 1753932 2122644 2419080 2150599 1464116 874874 646907 784412 1174225 1454204
37065 1454204 1286664 1013696 1374408 2295981 2776281 2354432 1776333 1644271 1412394
37056 1412394 551919 -231497 -29940 753805 1105776 1032316 1223171 1505900 1018901 -203395
37046 -203395 -1119095 -1205894 -949015 -726308 -342164 159233 315880 142225 180768 397459
37036 397459 87114 -748999 -1018938 -116344 1064304 1386983 968573 663733 685822 558136
37026 558136 76599 -383520 -374031 218540 1076987 1575992 1377494 1018446 1315520 2032735
37016 2032735 1969422 753643 -368194 -190434 831660 1451219 1375217 1117945 705508
37007 705508 -229131 -1294092 -1505432 -699636 188348 392520 21852 -594915 -1366455
36998 -1366455 -1976174 -1786142 -647829 738928 1625650 1932557 1953626 1866162 1812841 1992061
36988 1992061 2337008 2459052 2148828 1600846 1015800 426896 48615 212584 684694
36979 684694 655159 -159955 -941813 -817637 -34531 513133 563486 611444 974129 1441301
36969 1441301 1804258 2085360 2197179 1956390 1538982 1391649 1558025 1602073 1358040 1207708
36959 1207708 1343658 1301181 653160 -256203 -774594 -810956 -692034 -422248 228435 992996
36949 992996 1214777 827324 557224 887689 1441264 1748737 1987618 2394469 2510464 1791484
36939 1791484 612235 -185844 -526747 -953616 -1368355 -1037096 -38693 462624 -80028
36930 -80028 -671891 -310432 485808 644785 249842 103161 146664 -337653 -1214551 -1550040
36920 -1550040 -1164188 -825846 -801295 -558602 -151691 -407563 -1185380 -978122 783324
36911 783324 2394629 2168115 978943 921725 2117160 2651198 1541908 58793 -228858
36902 -228858 670418 1768344 2476103 2753304 2677892 2492145 2560740 2846134 2861063 2402175
36892 2402175 1820723 1362934 861931 335223 188248 454593 539347 196341 52741 525590
36882 525590 880099 228934 -980803 -1464523 -915788 -342693 -487247 -824104 -543186
36873 -543186 170191 493575 279523 291782 1038596 1933362 2026915 1295323 630697 545672
36863 545672 542776 95888 -399794 -346704 -118611 -520929 -1270377 -1185627 -81547 698555
36853 698555 170666 -893261 -1184552 -594719 132688 707391 1194174 1203436 394292 -507096
36843 -507096 -386360 626333 1285941 1021146 543448 544152 831361 1054519 1307736 1558311
36833 1558311 1306807 370733 -621158 -1034125 -1014094 -1012318 -1003037 -656718 67933 921711
36823 921711 1669446 2107792 2112161 1915737 1962774 2243512 2207463 1606817 944069 732883
36813 732883 791528 699203 513936 519893 596980 399489 -17262 -229615 -23626 395851
36803 395851 677844 573335 74030 -502024 -770400 -759617 -823664 -972658 -780340 -191178
36793 -191178 165953 -97761 -435819 -174039 429666 608285 261642 4297 204263 635273
36783 635273 1010308 1264160 1343305 1259561 1318103 1760670 2206463 2000551 1167078 497983
36773 497983 577926 1150134 1559533 1434807 810903 -64620 -856625 -1276801 -1223603 -744008
36763 -744008 39194 844523 1303198 1355924 1349452 1462246 1337177 679299 -99732 -378597
36753 -378597 -239840 -269398 -571556 -646755 -260316 189800 277607 -3121 -492521 -1063539
36743 -1063539 -1439443 -1270882 -564321 285889 930298 1205548 951423 190638 -555096
36734 -555096 -719166 -513838 -700631 -1429690 -1962192 -1799097 -1446366 -1609499 -2091194 -2049028
36724 -2049028 -1180937 -195814 -35366 -823629 -1711738 -1817098 -1238909 -864896 -1125111
36715 -1125111 -1430140 -1159298 -649206 -594041 -917561 -1023071 -837652 -731266 -636568 -224355
36705 -224355 187201 -31002 -596379 -564761 102764 427669 94404 -39231 474695 896450
36695 896450 730324 630336 1014651 1018879 -21803 -1086185 -831649 265011 557550 -355341
36685 -355341 -1204198 -929787 153273 1111238 1381631 925568 120811 -419764 -417832 -218954
36675 -218954 -135561 107153 723693 1143456 675599 -445265 -1370246 -1627231 -1152888 135469
36665 135469 1964273 3377774 3682175 3277262 2719482 1646578 -236876 -1832831 -1846207
36656 -1846207 -871907 -613618 -1222919 -1193201 53432 1323014 1729531 1821732 2061128
36647 2061128 1897835 1162496 794561 1241946 1603511 1390438 1657958 3095087 4354874
36638 4354874 3882246 2361795 1629390 1893609 1833327 1036101 521102 851332 1350912
36629 1350912 1453289 1454245 1533122 1192569 207877 -726699 -832912 -180416 547792 789892
36619 789892 471340 82862 398818 1600415 2731693 2638850 1415041 250471 -120887
36610 -120887 -70799 -144663 -331506 -491085 -744375 -1117885 -1425680 -1744405 -2322415 -2765744
36600 -2765744 -2141333 -386057 1133241 1151621 63532 -740794 -644587 -136223 308340
36591 308340 772558 1320828 1660230 1634792 1533142 1609485 1635744 1220365 410082 -246282
36581 -246282 -226630 404203 946432 684928 -326610 -1242805 -1377436 -1005082 -907842 -1274832
36571 -1274832 -1522105 -1216486 -641409 -230938 51937 368877 456688 30083 -462297 -186138
36561 -186138 889493 1781227 1735470 1154963 902431 1141278 1407403 1516057 1727926 2084265
36551 2084265 2212981 1907851 1383562 798030 10380 -938136 -1534455 -1343285 -591221
36542 -591221 94180 338579 199846 -70613 -196636 -15105 302520 334756 -83267 -642577
36532 -642577 -1034222 -1346003 -1703002 -1820267 -1347537 -500388 81861 66055 -307297 -612121
36522 -612121 -587878 -204423 282860 414753 13439 -451763 -315909 484197 1366019 1808764
36512 1808764 1781824 1512788 1197205 972465 870463 757709 556533 459120 636920 865994
36502 865994 836358 719917 925367 1323079 1299876 690419 81985 -16405 214605 381761
36492 381761 463821 588769 683088 731288 988253 1511843 1839912 1601870 1152597 1081371
36482 1081371 1314212 1265489 773451 325470 329592 636283 864817 813703 460291 -91649
36472 -91649 -544924 -582093 -229902 163133 369059 475106 608458 732139 780187 746447
36462 746447 568346 168079 -315466 -583780 -545189 -362228 -55770 599651 1588978 2381480
36452 2381480 2473439 2045621 1751880 1892357 2072702 1746614 932631 279765 410308 1217761
36442 1217761 1920872 1920102 1457777 1177161 1179006 1003682 574269 522656 1249438 2206823
36432 2206823 2611336 2424959 2049516 1486438 600695 -70720 229724 1209564 1683091
36423 1683091 1199197 567894 435182 346461 -164422 -507187 32948 1001668 1457336 1464197
36413 1464197 1787935 2380787 2360952 1498179 594095 194386 -44378 -392666 -443843 35295
36403 35295 496866 458955 282534 475411 794401 717052 366757 269373 459858 455633 -31677
36392 -31677 -831013 -1584802 -1901608 -1496217 -600958 21649 -88399 -496698 -531829 -213605
36382 -213605 -16306 -16915 95878 352141 469426 396239 313163 177070 -150820 -366250
36372 -366250 77879 1148811 2098129 2234813 1473637 176489 -1102000 -1768194 -1597909
36363 -1597909 -1027066 -643950 -472899 -191251 136859 165836 -6114 65643 348685 349471
36353 349471 34907 -41769 266177 369518 -46849 -411244 -151555 379244 409279 -203209
36343 -203209 -901254 -1147057 -862541 -388958 -241050 -646276 -1198816 -1295071 -951118 -721889
36333 -721889 -788561 -765652 -519887 -417784 -523862 -381221 50634 126340 -317505 -471527
36323 -471527 62173 351026 -420754 -1426148 -1354915 -490006 -208032 -715845 -808478 28240
36313 28240 719552 281759 -727320 -1082112 -446279 532652 1150665 1196582 950721 932134
36303 932134 1339403 1683562 1407260 789973 583593 818903 863065 729105 1222185 2403804
36293 2403804 3055307 2402937 1399340 1340867 1997050 2213399 1771544 1388079 1200887
36284 1200887 640627 -144038 -64296 1272016 2751041 3184113 2758204 2398377 2309529
36275 2309529 1941021 1081787 237153 -64309 165671 540114 708954 620751 584209 961603
36265 961603 1624729 1957398 1666832 1273417 1354461 1602590 1285117 494335 137665 557987
36255 557987 966525 629016 -70021 -284694 127524 724631 1285307 1735061 1628095 628868
36245 628868 -591195 -870212 -82301 687634 670232 255126 27199 -104204 -271996 -18333
36235 -18333 893628 1665473 1379568 349998 -309703 -187001 230382 623914 1123657 1541876
36225 1541876 1330961 538389 -29222 101980 534382 842312 1203340 1753688 2006110
36216 2006110 1533439 783237 594547 1156195 1941472 2475820 2721953 2829408 2863405 2722249
36206 2722249 2158235 1084275 -13922 -336320 327781 1332325 2043325 2464183 2647476
36197 2647476 2164080 883215 -243974 -166238 710890 957978 105528 -840934 -1058412
36188 -1058412 -965687 -1077128 -819438 535374 2363363 3217927 2686037 1738596 1207174
36179 1207174 853609 229415 -384492 -457963 -87604 228788 395079 711006 1204969 1509261
36169 1509261 1402933 1062176 748390 605841 768041 1266478 1770914 1813023 1397168 1051489
36159 1051489 1152887 1541613 1906666 2127374 2055641 1457518 523311 3509 368185 1127298
36149 1127298 1433148 1085319 488786 -62800 -481213 -534973 -122311 218570 -195102 -1168654
36139 -1168654 -1800710 -1740781 -1548303 -1637993 -1627521 -1064077 -131138 774954 1583074 2216198
36129 2216198 2273877 1589406 701709 263299 302985 500481 805148 1294986 1772778 2001515
36119 2001515 2016842 1753462 818313 -739217 -1876780 -1621231 -451001 245752 -243
36110 -243 -331090 -14723 610216 905881 853168 785706 829822 1062673 1723764 2751417
36100 2751417 3424780 2960628 1369026 -545970 -1896148 -2259737 -1782082 -998805 -437720
36091 -437720 -218963 -106376 74220 292443 531464 773378 768634 318919 -102911 362912
36081 362912 1701117 2614734 1981864 371866 -577006 -165613 672437 772568 176135
36072 176135 -211223 37937 450921 519679 438881 676224 1118188 1148616 582949 17281
36062 17281 10905 366170 610161 776927 1121098 1361588 990835 250257 -28033 371191
36052 371191 828142 1030952 1380841 1890809 1728049 586444 -387820 -40453 1066514
36043 1066514 1473399 918182 423800 521517 643693 353482 9791 -74604 -133785 -248969
36033 -248969 -38543 552780 958903 884272 712677 648151 331051 -184140 -43356 1013450
36023 1013450 1725159 821992 -1106846 -2340603 -2230754 -1575852 -1074749 -655487 -374033
36014 -374033 -717909 -1576782 -1882180 -894452 747989 1769307 1597477 592085 -581058
36005 -581058 -1344361 -1348982 -718626 -5043 398688 642562 1038174 1559759 1959825 2134053
35995 2134053 2117137 1913999 1570087 1261870 1138683 1181654 1281004 1304767 1138788 911866
35985 911866 1037216 1571683 1683079 507642 -1382959 -2268955 -1421672 -95688 214439
35976 214439 -325340 -601510 -457144 -688890 -1449183 -1891447 -1492286 -687706 36396 773509
35966 773509 1569768 1957094 1589881 813456 214441 46074 363265 1194829 2219272
35957 2219272 2745103 2436345 1709076 1061576 391695 -606296 -1685574 -2180432 -1791496
35948 -1791496 -899297 -155281 33918 -277554 -689137 -834806 -695470 -451291 -150518
35939 -150518 211750 444206 410408 393381 673262 889328 555924 125074 544825 1616417
35929 1616417 1948504 1023433 131131 427417 1143184 877132 -167066 -624206 -162965
35920 -162965 208305 -104895 -565243 -640401 -494983 -349221 -162005 -158773 -727639 -1583496
35910 -1583496 -1950192 -1753101 -1664011 -1773204 -1330185 -174925 727047 773040 668847 1118687
35900 1118687 1550932 1120791 216228 -121627 205990 377535 -8998 -529879 -710914
35891 -710914 -461249 100182 604957 469545 -368716 -1031854 -719969 150717 594699 510451
35881 510451 547531 752268 463821 -382082 -925752 -644163 -27173 345274 561595 808100
35871 808100 836252 538278 405595 821016 1380607 1471379 1120268 758541 518276 283991
35861 283991 117868 103415 32185 -231481 -303917 251817 1164373 1698327 1589410 1239951
35851 1239951 1019385 873696 681712 529664 473537 378192 170612 10247 56089 226136
35841 226136 285871 70256 -392183 -865729 -1076058 -1030522 -1042979 -1234092 -1202779 -569160
35831 -569160 284962 526635 -37602 -686830 -744201 -307511 203787 677005 1061855 1011363
35821 1011363 426111 48569 716788 2049137 2651985 1849093 524904 -113647 -6125
35812 -6125 70781 -191014 -367710 -174339 129203 293796 463151 796388 1153367 1397445
35802 1397445 1664386 2083406 2503972 2704890 2599071 2057681 922058 -486131 -1256185
35793 -1256185 -815199 236536 771176 540738 366020 875009 1677089 2079430 2101498
35784 2101498 2261818 2596568 2457691 1401010 -47684 -752171 -89547 1350509 2273017
35775 2273017 1982785 1136806 998831 1929492 2917595 2801439 1671829 670496 508704
35766 508704 706109 493658 12167 75117 842965 1367004 788248 -416548 -944623 -305599
35756 -305599 659338 1012153 843905 786269 942991 944017 742225 602958 396712 -310946
35746 -310946 -1352227 -1895843 -1580045 -1033687 -875654 -833276 -395098 220702 451607 357243
35736 357243 430173 646595 480785 -172190 -800609 -1059506 -1100585 -1015054 -583780 217666
35726 217666 1025917 1626996 2174591 2660733 2726786 2308614 1942634 2045152 2345901 2430686
35716 2430686 2375587 2367840 2153034 1462768 644974 200288 -69482 -725334 -1607594 -1852849
35706 -1852849 -1114762 -133380 150095 -398781 -1156556 -1396659 -765544 467794 1466593
35697 1466593 1529855 924157 630087 1089470 1655999 1566875 1008901 777383 1163095 1656287
35687 1656287 1660647 1140408 583671 540406 1118808 1793365 1886481 1392630 1043349 1300219
35677 1300219 1618597 1152689 -39053 -1039909 -1246159 -913850 -466707 131821 981731
35668 981731 1665770 1593135 837819 223453 458528 1382231 2172800 2192848 1525162 741556
35658 741556 299203 213727 201404 18352 -273410 -249329 567889 2120046 3604275 4165802
35648 4165802 3820091 3351787 3254445 3207769 2763505 2039738 1389341 846013 375410 261290
35638 261290 634866 949417 647631 140234 299557 1049430 1367033 811872 111196 -117075
35628 -117075 -294127 -935052 -1584464 -1541265 -1090451 -1049862 -1378403 -1233987 -399095 307154
35618 307154 286383 23381 254861 887580 1300239 1314816 1237918 1130516 718683 125491
35608 125491 84798 1044508 2415695 3200412 3208548 3097611 3182652 2881802 1728676 363815
35598 363815 -184611 80573 251288 15316 106787 960783 1788226 1629800 729943 106025
35588 106025 135050 376976 595515 1070238 1813874 2274659 2136549 1842185 1923146 2192997
35578 2192997 2024665 1244866 400975 159631 630956 1317026 1686832 1772611 2057580 2676977
35568 2676977 3001450 2393009 1235664 679223 1255258 2233165 2590949 2204271 1707633
35559 1707633 1490718 1326705 929080 440574 238216 492020 1057892 1680977 2171261
35550 2171261 2418688 2364117 2032963 1555213 1031909 359657 -640047 -1781294 -2380664
35541 -2380664 -1872295 -560235 535061 710291 269661 48803 414300 940056 1029386
35532 1029386 655550 370615 617057 1157987 1315909 769656 -36933 -355265 116503
35523 116503 1008678 1650663 1569705 827997 57178 -11899 713368 1535679 1738089 1329269
35513 1329269 818683 531007 491703 708857 1061496 1102219 569823 -6355 105106 645383
35503 645383 541963 -522443 -1506913 -1410088 -610407 -239227 -705040 -1448237 -1801485 -1475509
35493 -1475509 -452899 958212 2071814 2373664 2080733 1743036 1455852 963959 365542
35484 365542 55695 -14023 -340549 -986721 -1318339 -907667 -181458 197199 176970 120372
35474 120372 73384 -242893 -804769 -1132094 -870313 -220844 362280 716401 1035833 1475663
35464 1475663 1871354 1910033 1503416 916083 540922 591385 969012 1342608 1394547 1132858
35454 1132858 961474 1266276 1895680 2268775 2098868 1769476 1800935 2158947 2366605 2155866
35444 2155866 1686938 1184286 699056 293754 183912 533867 1202459 1760268 1760947 1117574
35434 1117574 319214 94495 619258 1193798 1013049 156481 -566656 -709568 -638372 -770439
35424 -770439 -863973 -424410 487737 1272865 1507527 1308715 1019787 825696 728667 694438
35414 694438 710962 758308 752757 535663 24712 -558718 -747765 -267359 646885 1476120
35404 1476120 1871377 1766119 1217275 413528 -237715 -383114 -153220 -27494 -171084
35395 -171084 -219795 105726 527377 673798 698488 940085 1171700 864975 248778 365696
35385 365696 1708711 3400327 4264763 4246392 4090253 3984349 3435141 2447118 1850844
35376 1850844 2115982 2605996 2522650 2010126 1726801 1753142 1602867 1089150 520645 108986
35366 108986 -229200 -469172 -425108 -191922 -136801 -276207 -117390 595649 1324783 1297000
35356 1297000 473688 -353494 -417026 285072 1121883 1544241 1563528 1548343 1668601 1694132
35346 1694132 1378771 881646 648270 935664 1599826 2316294 2860565 3159488 3193499 2942983
35336 2942983 2468237 2034675 2015274 2486098 3007688 3092183 2843884 2745647 2802156 2466510
35326 2466510 1632763 1042047 1190086 1405617 774419 -397919 -942907 -484170 227688
35317 227688 671375 1200095 1977997 2269940 1526552 495266 346394 1013901 1303983
35308 1303983 641551 -103881 177467 1391923 2496843 2925949 3161842 3741699 4182586
35299 4182586 3470998 1584995 -107089 -339052 602515 1445950 1607986 1561138 1670993
35290 1670993 1586376 1042532 486183 420226 679363 842588 902466 1021734 1043401 807958
35280 807958 622084 812624 1074121 887612 396998 193254 318749 206815 -327939 -746405
35270 -746405 -649411 -357960 -292353 -310291 -123080 43334 -206488 -616659 -420332 611520
35260 611520 1730501 2044437 1483244 679042 133492 -123837 -155855 133278 715314 1250311
35250 1250311 1434341 1306670 997165 468083 -169342 -423866 -46494 357903 41980
35241 41980 -645653 -562967 550802 1592498 1667840 1266371 1215204 1248795 574789 -632242
35231 -632242 -1372389 -1264206 -843605 -475435 4793 433442 156539 -848114 -1550539
35222 -1550539 -1129698 22788 1111450 2044811 2960721 3238678 2112372 199546 -649523
35213 -649523 553616 2654173 3665554 2965691 1671355 1040931 1112368 1078823 572052
35204 572052 124842 377014 1177077 1719012 1477007 758923 267380 282905 433495 209639
35194 209639 -465659 -1230709 -1718564 -1852817 -1742634 -1478955 -1153661 -941394 -940533 -945253
35184 -945253 -573031 335687 1560588 2680526 3201023 2633210 922222 -1085208 -2099070
35175 -2099070 -1657191 -601416 41773 259018 651946 1230710 1356840 808128 160166
35166 160166 -32846 174820 540601 1037105 1516947 1518230 891994 287437 502660 1489931
35156 1489931 2414171 2638476 2309671 1960784 1814825 1597194 943096 -94789 -1017759
35147 -1017759 -1416557 -1402324 -1303874 -1091435 -496299 346750 906286 1037996 1223452 1748118
35137 1748118 2157853 1948586 1346592 894007 648885 400252 344898 794494 1365565 1284818
35127 1284818 559782 62707 240475 489034 195156 -256729 -84427 725376 1457682
35118 1457682 1636158 1392992 993416 510786 -2310 -410131 -635926 -678107 -508491 -164171
35108 -164171 158022 352834 626723 1158303 1673919 1755282 1479853 1297962 1308897 1191194
35098 1191194 907256 865794 1158302 1239923 764352 195357 50287 -7630 -617097 -1532947
35088 -1532947 -1797717 -1088564 -148451 293111 379943 624820 1094849 1491234 1648814 1558603
35078 1558603 1183265 637123 326243 514747 887726 910691 544424 256641 343613 573911
35068 573911 586371 381366 243433 290284 304107 99171 -53202 378663 1458646 2515565
35058 2515565 2877769 2646851 2348077 2062332 1552283 1136841 1542482 2649089 3282311
35049 3282311 2763974 1853358 1448414 1139616 65370 -1372195 -1904897 -1306309 -630213
35040 -630213 -461714 -179538 661114 1362667 1199422 647508 669814 1281621 1603967 1089278
35030 1089278 83758 -690217 -779581 -262926 338226 588925 737120 1423737 2627896
35021 2627896 3443769 3264777 2629712 2376888 2476839 2361656 1980831 1736234 1622357 1260047
35011 1260047 711729 491026 711909 896601 712100 312176 -82494 -321023 -22254
35002 -22254 1112320 2515950 3045669 2385259 1497162 1301693 1568994 1608478 1398731 1329088
34992 1329088 1300833 912752 317413 113204 438312 844471 1057364 1203323 1240131 867531
34982 867531 206699 -77297 339650 970395 1297626 1509224 1965728 2384127 2225235 1683262
34972 1683262 1581099 2229534 2964480 2993615 2281663 1413746 934683 1013861 1436844 1685692
34962 1685692 1288399 363419 -346697 -213099 636291 1576144 2187347 2463156 2502372 2354769
34952 2354769 2153472 2097300 2205421 2243227 1955389 1307565 526429 -24035 -85223 257452
34942 257452 640846 823838 914853 1092862 1269879 1232476 984257 703596 456843 217742
34932 217742 106263 313975 784808 1224039 1450298 1521375 1508341 1386368 1187422 1043141
34922 1043141 1025094 1119577 1370876 1843117 2403772 2725714 2542726 1794494 617230 -583315
34912 -583315 -1158500 -693116 470005 1461598 1733171 1467855 1145294 1004764 1030712 1166977
34902 1166977 1334074 1374997 1146856 657399 127122 -55626 372284 1115836 1405083 844750
34892 844750 6557 -236069 191441 649052 864821 1256232 2052011 2762364 2855108 2456770
34882 2456770 2011515 1643543 1254206 957360 1007573 1412397 1873165 2041933 1763972 1240048
34872 1240048 963346 1232047 1727289 1899846 1732026 1676441 1870398 1974544 1838178 1689274
34862 1689274 1539986 1102630 517988 428933 995673 1562454 1688018 1734732 1958146 1869546
34852 1869546 1203987 712191 1067201 1620054 1286499 231050 -423580 -314882 -168996
34843 -168996 -441066 -633728 -155152 888249 1926623 2407072 2029259 1052541 324391
34834 324391 450341 1014587 1157037 734058 269639 -20820 -357254 -656198 -513723 50908
34824 50908 622190 1193975 2134379 3243151 3681959 3108048 2190516 1730969 1839512 2163769
34814 2163769 2361780 2171414 1534090 778816 231085 -306874 -1123182 -1814915 -1726702 -1062650
34804 -1062650 -621886 -425047 334556 1801034 3020473 3337950 3177129 3006008 2609417
34795 2609417 1963849 1754849 2228742 2461600 1698029 682609 697158 1807831 2942540
34786 2942540 3258461 2654706 1418220 183594 -199201 406355 1016976 844607 551674
34777 551674 1260815 2726832 3602227 3326941 2616110 2064042 1407849 462143 -212171
34768 -212171 -101061 457505 766879 638686 355922 103929 -150881 -361860 -306619 157225
34758 157225 819520 1174948 895213 278752 1596 313114 769454 924448 900622 994745
34748 994745 1137131 1161813 1229190 1462144 1498179 1016094 455930 527168 1122796 1417183
34738 1417183 1035435 453677 147117 -12665 -281038 -489793 -301673 290147 958330
34729 958330 1337932 1208810 608522 -102870 -445812 -199081 462056 1165638 1630314 1872576
34719 1872576 2171797 2617899 2681571 1674510 -157670 -1507722 -1388800 -240765 790332
34710 790332 1240206 1424454 1583120 1697170 1920833 2419615 2890803 2951523 2857326 3065728
34700 3065728 3246410 2681175 1647138 1319703 2022714 2626197 2216747 1435455 1388662
34691 1388662 1942502 2052125 1422488 883902 1125222 1832694 2304916 2373979 2356748 2364116
34681 2364116 2070310 1248995 310454 16374 590719 1368294 1561706 1189820 898371
34672 898371 963099 923877 306259 -658250 -1229829 -895343 185401 1308893 1778367 1492005
34662 1492005 978622 737786 711869 625036 563130 780259 1136260 1284715 1310355 1556398
34652 1556398 1866094 1734053 1304514 1388214 2155306 2610542 1940750 749286 243584
34643 243584 654474 1251314 1631798 2092567 2712641 2937936 2411902 1612421 1225632 1283215
34633 1283215 1371709 1400597 1597885 1833520 1573270 711403 -53500 -54255 492995 933123
34623 933123 1152807 1465001 1689177 1221761 187715 -361582 137481 912707 1051590
34614 1051590 842103 1063237 1506887 1329218 640102 541908 1446863 2411112 2493108 1891975
34604 1891975 1284095 806187 305779 26876 329529 969022 1237567 794218 9786
34595 9786 -504469 -503432 -225269 22719 301083 826831 1278788 851193 -520727 -1498275
34585 -1498275 -771812 1069867 2113587 1588715 690877 691862 1353086 1812142 2047309 2541936
34575 2541936 3124461 3124596 2437987 1680352 1406670 1710894 2398950 3051164 3126126 2520351
34565 2520351 1878508 1913165 2573533 3246772 3521851 3340035 2701231 1780344 1141515 1246273
34555 1246273 1789610 2003233 1594114 970512 593588 550673 788514 1347931 2226044 3238183
34545 3238183 4095028 4500342 4249078 3421934 2436481 1750788 1554548 1787967 2268044
34536 2268044 2705071 2858110 2832656 2958265 3216349 3143260 2557794 2009887 2107114 2667271
34526 2667271 2989737 2806403 2504627 2436199 2409745 2000692 1185796 546454 776531 1899328
34516 1899328 3086935 3508312 3225139 2828337 2349206 1295004 -123939 -754675 -48933
34507 -48933 934780 901614 148656 48196 980215 1846650 1743814 1162323 1092764 1601192
34497 1601192 1903380 1577399 1117324 1201605 1790893 2248486 2232984 2068014 2080694 2007861
34487 2007861 1514328 991597 1152829 1910403 2417818 2331549 2230510 2499289 2607042 2013920
34477 2013920 1136258 792940 1167915 1890335 2715541 3539586 4067787 4023477 3495915 2757131
34467 2757131 2036948 1683947 2019673 2730741 3008103 2646873 2346670 2552749 2808568
34458 2808568 2730987 2680880 2814355 2513044 1649572 1341722 2259785 3172014 2627537 1262701
34448 1262701 751661 1069887 717461 -557230 -1227670 -382410 1111173 2231685 3003304
34439 3003304 3554500 3448220 2637204 1876174 1538173 1105202 388394 110564 624407
34430 624407 1156797 1090668 997900 1554623 2300283 2393789 1950699 1755000 2088033 2548940
34420 2548940 2688422 2320207 1575807 981582 1010330 1345390 1220568 644541 430970 777728
34410 777728 872410 357411 60417 583296 1239671 1259244 1074877 1433006 2101766 2531157
34400 2531157 2990241 3850169 4424464 3866498 2764529 2469515 3070567 3376333 2863150
34391 2863150 2355119 2591091 3234253 3622747 3616574 3389675 3113368 3092557 3544627 4031718
34381 4031718 3770132 2743702 1903781 1996384 2715489 3260497 3227438 2690669 1899738 1251435
34371 1251435 1184175 1691104 2116477 1760820 657995 -403567 -617489 122004 1191003
34362 1191003 1900728 2138223 2215594 2181967 1707748 795548 115787 236138 874578 1379479
34352 1379479 1647088 2030650 2592057 3060429 3372395 3593285 3407965 2472986 1344164
34343 1344164 1200973 2300154 3447766 3536921 2968187 2812164 3069851 2810884 1942712
34334 1942712 1650813 2586563 3588467 3147567 1598724 716205 1268389 2181450 2362261
34325 2362261 2111472 2064384 1859225 959328 6587 34424 780328 1162231 1200321 1942281
34315 1942281 3388991 4082787 3264023 2025885 1585855 1654915 1432330 1105191 1237929
34306 1237929 1543666 1489423 1498562 2298378 3486152 4006925 3858906 4075511 4958356 5490569
34296 5490569 4848365 3596111 2883762 3026036 3357774 3207969 2641135 2292752 2655465
34287 2655465 3605348 4656900 5513875 6067533 6006475 5064033 3778677 3287012 3952691
34278 3952691 4789802 4723915 3900770 3233390 3145985 3335066 3379640 3073936 2509964 2211002
34268 2211002 2709288 3657028 4007679 3462455 2897611 2844369 2604360 1709691 1138190 1834390
34258 1834390 2965323 3157497 2755909 3140811 4229309 4520793 3588027 2699165 2662417
34249 2662417 2714754 2093303 1262154 892313 839450 857079 1275593 2218333 3012012 3107001
34239 3107001 2884169 2929598 3159348 3231182 3217409 3328901 3492956 3635155 3857251 4007056
34229 4007056 3683056 2987399 2594756 2732596 2851988 2719128 2975255 3992089 4962132
34220 4962132 4933490 4172675 3690687 3866728 4343343 4906568 5577893 5989056 5526314 4216736
34210 4216736 2883086 2270553 2407903 2890131 3416047 3919355 4416123 4859383 5071118
34201 5071118 4832357 4141273 3349381 2916446 2976931 3179113 3049207 2619175 2578301 3484956
34191 3484956 4841982 5462094 4939385 4153610 3929963 3922726 3547898 3298229 3942386 4795292
34181 4795292 4242611 2150085 419493 634080 2230413 3656191 4395485 4972630 5607843
34172 5607843 5888966 5596062 5054225 4584806 4092059 3353975 2518688 2164222 2763165
34163 2763165 4015812 4923590 4809625 4094321 3688152 3800645 3852514 3462555 2959306
34154 2959306 2878153 3379341 4159422 4633746 4412657 3931832 4184314 5330871 6181556
34145 6181556 5831041 5124347 5371083 6224610 6333223 5705182 5633693 6297293 6376551 5455937
34135 5455937 4890171 5487161 6064897 5384109 4037960 3244515 3072392 3116902 3700020
34126 3700020 4944348 5690100 4953329 3751289 3879256 5351064 6592411 6831779 6718682
34117 6718682 6681888 6280092 5450269 5011173 5378912 5808423 5516962 4824511 4583001 4969976
34107 4969976 5413610 5461866 5248756 5120251 5121682 5042036 4896100 5070977 5747268 6384205
34097 6384205 6243558 5388831 4646307 4516934 4688729 4758923 4814091 5016927 5189572 5171860
34087 5171860 5141239 5252734 5364772 5383778 5468406 5660930 5732444 5602371 5522736 5709368
34077 5709368 6157362 6801847 7400182 7414357 6681754 6035918 6405291 7403985 7809530 7388196
34067 7388196 7094095 7378296 7579610 7291613 7076808 7361965 7766400 8012151 8414779
34058 8414779 8989374 9131573 8665530 8203125 8092809 8073681 8236679 9084986 10322742
34049 10322742 10900510 10584368 10110539 9604220 8526540 7422594 7677065 9001216 9369616
34040 9369616 8266084 7665233 8662227 9541735 8760826 7575308 7782681 8829245 9215181
34031 9215181 9064349 9239955 9451183 9252086 9452458 10577044 11415140 11053942 10762813
34022 10762813 11799658 13021055 12929856 12409285 12916661 13560942 12733163 11276290 11180242
34013 11180242 12264107 12965601 13349924 14463461 15668301 15538385 14602449 14404534 14699430
34004 14699430 14369169 14121890 15266143 16746064 16568773 15352652 15227336 16033642 16011527
33995 16011527 15472554 16131565 17378817 17051314 15589354 15532546 16969178 17402525 16294938
33986 16294938 15869538 17008627 18079414 18337569 18931186 19990860 20146979 19448806 19527396
33977 19527396 20564537 21279674 21871496 23559914 25469504 25712091 25240677 26574077 29036976
33968 29036976 29652857 28474710 28346447 29599821 29968220 29617745 31009504 33828933 35467608
33959 35467608 36321361 38870080 42042612 42926737 43297470 47044973 51968007 52773802 51599144
33950 51599144 55483809 63510541 68063105 69510679 76267197 88444658 96761258 100995161
33942 100995161 111765018 128651754 138082219 142296785 163029507 195304623 184459586
33935 184459586 86323261 -61304223 -166567657 -183848480 -151958631 -128310153 -123016266
33928 -123016266 -115005710 -99690388 -90227615 -88471038 -83641726 -74054122 -68283239 -67519264
33920 -67519264 -64472873 -58321844 -55600842 -56824778 -55457375 -50245067 -46912900 -47128877
33912 -47128877 -46223548 -42653982 -40289354 -40246166 -39001667 -35845017 -34435974 -35605941
33904 -35605941 -35633313 -33016603 -30566682 -29582767 -28004690 -25509907 -24636503 -25549373 -25127204
33895 -25127204 -22587515 -20933054 -21503275 -21940745 -20906153 -20185205 -20707326 -20818886 -19913748
33886 -19913748 -19689858 -20475329 -20257446 -18657136 -18002781 -19108030 -19729671 -18633407 -17570131
33877 -17570131 -17703572 -17537782 -16037976 -14636725 -14487177 -14594007 -14173788 -14144147 -14883765
33868 -14883765 -15144226 -14467738 -14125652 -14511517 -14212610 -12793338 -11863660 -12242228 -12673226
33859 -12673226 -12441582 -12530890 -13047885 -12399765 -10447366 -9602555 -11087060 -12774516 -12605685
33850 -12605685 -11647641 -11742753 -12386573 -12125150 -11202925 -10719860 -10642403 -10458365 -10445767 -10751120
33840 -10751120 -10587293 -9697704 -9151046 -9463082 -9567035 -8863219 -8466866 -9063315 -9444894
33831 -9444894 -8746746 -8220075 -8986128 -9848111 -9361047 -8459054 -8821003 -9938868 -10077112
33822 -10077112 -9177991 -8643870 -8928947 -9332079 -9638893 -10146372 -10471443 -9971565 -9024016
33813 -9024016 -8502243 -8371898 -8036229 -7559285 -7334820 -7104590 -6511543 -6055415 -6314857
33804 -6314857 -6800401 -6732894 -6350643 -6300815 -6398580 -6203303 -6179430 -6990716 -8166040 -8721591
33794 -8721591 -8656852 -8654265 -8750463 -8480209 -7936514 -7568243 -7294568 -6843291 -6544565 -6790287
33784 -6790287 -7167920 -7113526 -6901311 -6972140 -6867010 -5967257 -4783755 -4329491 -4622749 -4937323
33774 -4937323 -5115709 -5490155 -5913139 -6057829 -6322136 -7209021 -8091685 -7849398 -6590904
33765 -6590904 -5573441 -5472501 -5792383 -5918090 -5725534 -5204284 -4470422 -4146379 -4808458
33756 -4808458 -6035223 -6796185 -6730284 -6298477 -5830249 -5241727 -4596625 -4159747 -3948718
33747 -3948718 -3868974 -4097256 -4692421 -5131137 -4939811 -4457601 -4255507 -4227326 -4067051 -4138118
33737 -4138118 -4860345 -5670552 -5724143 -5298227 -5293337 -5590594 -5239600 -4236934 -3736666 -4249267
33727 -4249267 -4873798 -4749644 -4220965 -4018144 -4117862 -4027287 -3659920 -3399635 -3567531 -4112695
33717 -4112695 -4649205 -4728674 -4259906 -3585783 -2999735 -2492134 -2200300 -2577482 -3647389
33708 -3647389 -4639195 -4968894 -5032279 -5341995 -5531144 -5118923 -4626310 -4776099 -5066973 -4458778
33698 -4458778 -3208286 -2646063 -3174006 -3832403 -3980052 -4096153 -4592320 -4998440 -4807922
33689 -4807922 -4237594 -3737748 -3468121 -3497387 -3805897 -3970784 -3625657 -3276442 -3759788 -4835390
33679 -4835390 -5346585 -4936523 -4497540 -4620354 -4749780 -4384432 -4025315 -4217964 -4541780
33670 -4541780 -4357303 -3884744 -3723740 -3776521 -3457234 -2768302 -2510893 -3362527 -5011913
33661 -5011913 -6249449 -5993631 -4438930 -3026066 -2913528 -3706626 -4190418 -3968244 -3589034
33652 -3589034 -3343597 -3007386 -2746930 -3119382 -3932234 -4194249 -3600764 -3076652 -3344816
33643 -3344816 -3854071 -3715973 -2948407 -2187453 -1789810 -1773714 -2109972 -2572035 -2738670 -2505446
33633 -2505446 -2176672 -1895209 -1562083 -1403536 -1819641 -2500863 -2617931 -2172751 -2153285 -2921369
33623 -2921369 -3507181 -3128941 -2408239 -2286242 -2605644 -2650190 -2386027 -2290696 -2510174 -2951191
33613 -2951191 -3658936 -4406796 -4520592 -3822875 -3121306 -3051992 -3159165 -2912364 -2806070 -3394192
33603 -3394192 -3948951 -3343799 -1849833 -849039 -1023067 -1909822 -2978348 -4007712 -4583108
33594 -4583108 -4367669 -3849587 -3815083 -4138683 -4063932 -3550057 -3259963 -3294253 -3120168 -2798164
33584 -2798164 -3023561 -3724432 -3882436 -3191587 -2713828 -3245239 -4064182 -4106249 -3562704 -3411450
33574 -3411450 -3914233 -4454529 -4543340 -4223511 -3661606 -2992755 -2495754 -2401032 -2534225 -2511900
33564 -2511900 -2248850 -2000797 -2005619 -2331930 -2943037 -3629558 -3991118 -3789449 -3302556 -3096390
33554 -3096390 -3416963 -3940596 -4130149 -3759034 -3103176 -2667285 -2702900 -2994538 -3152378 -3052904
33544 -3052904 -2903633 -2967463 -3375765 -4115918 -4974981 -5533534 -5458489 -4832570 -4028172 -3288984
33534 -3288984 -2638857 -2152608 -2023206 -2277676 -2623277 -2682511 -2322134 -1769791 -1459176 -1644111
33524 -1644111 -2086723 -2331906 -2400137 -2843043 -3813823 -4507824 -4099478 -2954069 -2184350
33515 -2184350 -2112141 -1995438 -1385165 -870698 -1070266 -1623372 -1794898 -1552060 -1362930 -1293867
33505 -1293867 -1065088 -846895 -1218333 -2218254 -3085872 -3233279 -2999448 -3050899 -3344184 -3168566
33495 -3168566 -2180199 -976138 -456070 -836609 -1547484 -2023857 -2296101 -2677999 -3128652
33486 -3128652 -3238765 -2815227 -2191919 -1872612 -2060165 -2607511 -3196780 -3420440 -2937141
33477 -2937141 -1849817 -822290 -496771 -782590 -1001659 -781658 -484083 -595814 -1031787
33468 -1031787 -1375023 -1586749 -2016309 -2741378 -3381685 -3689449 -3855980 -3978818 -3697419
33459 -3697419 -2822306 -1968141 -1920012 -2507675 -2797422 -2454980 -2208784 -2670169 -3309023 -3102863
33449 -3102863 -1836724 -274025 705503 659909 -491519 -2452805 -4359060 -5105584 -4235069
33440 -4235069 -2431278 -974919 -649243 -1124819 -1418604 -1045154 -639689 -1162087 -2486494
33431 -2486494 -3273125 -2553001 -1033766 -311428 -975605 -2043045 -2246244 -1374622 -231852
33422 -231852 307252 -11316 -782053 -1374848 -1536790 -1626458 -2089112 -2724040 -2799094 -2015422
33412 -2015422 -1044798 -850690 -1654789 -2826289 -3650583 -3894188 -3669036 -3147255 -2587628
33403 -2587628 -2324285 -2390143 -2325914 -1783553 -1254057 -1638489 -2931720 -3933452 -3709846
33394 -3709846 -2836249 -2535250 -2954361 -3150341 -2631511 -1951731 -1655680 -1578640 -1510774 -1665882
33384 -1665882 -2016160 -1981313 -1364618 -833079 -805068 -664539 53435 488920 -331302 -1646728
33374 -1646728 -1748778 -469813 534649 177801 -715059 -912870 -436594 -5257 191357
33365 191357 253240 -206782 -1567197 -3219925 -4002499 -3573753 -2668267 -1993199 -1550356
33356 -1550356 -1172308 -1049839 -1318308 -1567104 -1314938 -803750 -738237 -1170323 -1242980 -405740
33346 -405740 619785 730005 4491 -446190 -159500 111615 -208098 -534961 -173307
33337 -173307 475585 616788 366035 364869 509251 137673 -698579 -1212339 -1121787 -939676
33327 -939676 -946603 -826441 -519561 -553002 -1201927 -2025645 -2504826 -2532171 -2139361 -1433120
33317 -1433120 -935821 -1225592 -2037691 -2466727 -2245764 -2033264 -2234871 -2422600 -2224837
33308 -2224837 -1911948 -1735297 -1550504 -1455364 -1855159 -2473023 -2344216 -1365615 -754525 -1219761
33298 -1219761 -1799055 -1502709 -1036514 -1582430 -2677088 -2790507 -1570935 -89508 900046
33289 900046 1540096 1766520 1049576 -446904 -1587859 -1651157 -1232395 -1341480 -2117621
33280 -2117621 -2757886 -2412025 -1063708 243743 248286 -1129104 -2572030 -3001323 -2884953
33271 -2884953 -3214435 -3781806 -3573611 -2523929 -1608000 -1253709 -919876 -397869 -299069
33262 -299069 -870195 -1386150 -1202428 -562478 26729 397570 376386 -259204 -1083698 -1201893
33252 -1201893 -574165 -219193 -575276 -696737 175278 1243204 1331093 591521 -88911
33243 -88911 -692361 -1739867 -2753518 -2523130 -1014916 227402 -27670 -1310471 -2328781
33234 -2328781 -2460020 -1928019 -1165936 -598255 -646411 -1331436 -1980667 -1791797 -751214
33225 -751214 257672 345919 -494744 -1478294 -1962902 -2149547 -2659168 -3491993 -3831583 -3140813
33215 -3140813 -2101651 -1958043 -3002793 -4207438 -4441303 -3640424 -2595260 -1964952 -1824928
33206 -1824928 -1955294 -2165990 -2316049 -2288101 -2075028 -1809990 -1668070 -1774595 -2141743 -2552643
33196 -2552643 -2562066 -1877191 -830216 -203172 -358912 -767009 -705595 -229009 33485 -72789
33186 -72789 -37184 336094 485049 39325 -441900 -338240 -85756 -598909 -1834261 -2812226
33176 -2812226 -3013096 -2873687 -2795635 -2545122 -1946744 -1388034 -1180621 -1059380 -814380 -856152
33166 -856152 -1565545 -2513015 -2956645 -2845324 -2728117 -2829214 -2794006 -2351817 -1769258 -1527410
33156 -1527410 -1779070 -2186429 -2230559 -1761758 -1238424 -1189508 -1468851 -1465370 -1100853 -1013472
33146 -1013472 -1497228 -1926196 -1717489 -1257241 -1207196 -1398579 -1225194 -775253 -654736 -858226
33136 -858226 -779405 -371070 -330870 -878349 -1217308 -679282 259667 647874 277970 -320132
33126 -320132 -810906 -1403084 -2300689 -3212240 -3545844 -2991304 -1870721 -890362 -490582
33117 -490582 -513110 -591782 -665362 -869156 -1161840 -1458008 -1931602 -2673028 -3201633 -2981024
33107 -2981024 -2382921 -2370544 -3095557 -3625401 -3353253 -2819168 -2627335 -2401766 -1611428 -755062
33097 -755062 -723261 -1378529 -1802150 -1744508 -1763978 -1958733 -1697666 -862125 -274693 -381302
33087 -381302 -451929 177753 840541 460774 -728561 -1436147 -1149514 -720741 -945708 -1432951
33077 -1432951 -1341737 -641101 -38098 63242 -36526 50229 211647 34919 -609658 -1382345
33067 -1382345 -1870727 -2035854 -2123453 -2174587 -1899515 -1196691 -513208 -327577 -461680 -409456
33057 -409456 -280354 -751435 -1888307 -2699383 -2358473 -1361392 -825004 -984994 -1160522
33048 -1160522 -1074270 -1328490 -2322884 -3383941 -3449064 -2307662 -817027 -59718 -473928
33039 -473928 -1603584 -2523578 -2668386 -2329761 -2165659 -2272096 -2124280 -1463111 -720861
33030 -720861 -353531 -245525 -102013 27952 37025 144699 474130 584623 33815 -822405
33020 -822405 -1243894 -1193757 -1310685 -1785231 -2008418 -1579410 -1016982 -1044065 -1603670 -2058438
33010 -2058438 -2108656 -2043656 -2165197 -2358654 -2303693 -1871730 -1218380 -604643 -213585 -95842
33000 -95842 -200362 -397356 -513950 -484678 -505046 -870551 -1550955 -2088639 -2090472 -1678303
32990 -1678303 -1258923 -1000466 -779341 -502029 -184471 178949 508341 493763 -86408 -945401
32980 -945401 -1529450 -1643811 -1507747 -1279715 -959659 -711682 -777027 -1019116 -1039163 -806625
32970 -806625 -681366 -765981 -820142 -898984 -1362940 -2021348 -2031220 -1071760 69373 573405
32960 573405 572115 488548 150508 -634212 -1282825 -1217123 -942607 -1266256 -1852747 -1822163
32950 -1822163 -1517140 -2157661 -3634469 -4251553 -3219087 -1941284 -1935239 -2714167 -2879703
32941 -2879703 -2312810 -1908103 -1799360 -1351215 -656682 -595401 -1307866 -1853682 -1656744 -1229183
32931 -1229183 -1113339 -1077685 -835192 -716284 -1044369 -1482872 -1562338 -1341776 -1067291 -706070
32921 -706070 -337050 -474859 -1368428 -2371912 -2661582 -2296155 -1966248 -1955174 -1977529 -1852965
32911 -1852965 -1696742 -1534041 -1295972 -1124762 -1173283 -1227757 -1054152 -936296 -1255434 -1723402
32901 -1723402 -1762525 -1491712 -1461508 -1482019 -794111 400079 741331 -395930 -1824087
32892 -1824087 -2133133 -1550764 -1299334 -1724982 -2121173 -2064316 -1855750 -1703683 -1406841 -958500
32882 -958500 -706198 -759820 -859129 -932159 -1176499 -1467807 -1324359 -705217 -301776 -705745
32872 -705745 -1650695 -2349437 -2326065 -1761935 -1277345 -1442649 -2197687 -2719213 -2240014 -1052917
32862 -1052917 -280132 -562130 -1432391 -2099737 -2302052 -2143277 -1658109 -1001230 -675725
32853 -675725 -1034531 -1715008 -2003029 -1706550 -1354590 -1544345 -2298200 -3061455 -3243156 -2802498
32843 -2802498 -2288632 -2177161 -2280792 -2109156 -1682972 -1481090 -1565573 -1391658 -720697 -126734
32833 -126734 -213103 -810271 -1350403 -1575854 -1455462 -900962 -100829 338015 207140 208866
32823 208866 917284 1643904 1272566 -10963 -871976 -707162 -312335 -463721 -880437
32814 -880437 -1052550 -1147817 -1408331 -1414036 -802608 -194043 -452891 -1294316 -1578919 -987820
32804 -987820 -498959 -933067 -1778353 -1962173 -1319974 -701854 -779426 -1285914 -1542445 -1370675
32794 -1370675 -1212101 -1443032 -1831564 -1810453 -1212813 -546667 -437868 -912364 -1412987 -1509565
32784 -1509565 -1365120 -1380084 -1570931 -1576128 -1256478 -996328 -1245064 -1918693 -2450986 -2371346
32774 -2371346 -1675876 -712952 76431 343139 45677 -417868 -510637 -124543 311845 397041
32764 397041 222365 95865 -588 -373878 -1080266 -1709864 -1813263 -1395091 -866443 -554093
32754 -554093 -360109 30050 634727 1025467 808739 129014 -529415 -954495 -1313637 -1686058
32744 -1686058 -1901370 -1943034 -2075443 -2346007 -2377118 -1973286 -1548220 -1536770 -1724431 -1657477
32734 -1657477 -1427831 -1445421 -1610104 -1394157 -739874 -211347 -135313 -209445 -176880 -300059
32724 -300059 -813663 -1388151 -1587013 -1540567 -1702697 -2108447 -2312823 -2047541 -1582735 -1323254
32714 -1323254 -1246499 -928290 -146994 673654 848835 310106 -202698 -78049 327541 226899
32704 226899 -419435 -867078 -715532 -400726 -362734 -356002 19595 591848 896457 843106
32694 843106 631209 260567 -380364 -1082031 -1435487 -1352891 -1108885 -908309 -758457 -743832
32684 -743832 -1047571 -1595519 -1968518 -1863192 -1517288 -1488551 -1963276 -2382808 -1955238 -644532
32674 -644532 562898 683150 -84575 -606759 -231374 528625 837124 530699 846
32665 846 -436342 -659921 -617953 -520665 -862026 -1806441 -2791055 -3155383 -2937639 -2639872
32655 -2639872 -2479925 -2376353 -2432310 -2825807 -3304570 -3352070 -2857728 -2171950 -1557431 -1056337
32645 -1056337 -806058 -914005 -1016290 -542349 470833 1310403 1418895 855097 -67708
32636 -67708 -1043855 -1628058 -1470471 -888236 -612532 -756020 -652235 11471 600391 522251
32626 522251 157739 169672 389052 136575 -654239 -1394371 -1769893 -1981097 -2073993 -1763516
32616 -1763516 -1102496 -727659 -1122532 -2001981 -2677343 -2749272 -2263759 -1508523 -913406 -892202
32606 -892202 -1452270 -2050491 -2073487 -1426183 -522602 180106 463686 314543 -91620 -374759
32596 -374759 -206221 302463 645718 469642 -81409 -659885 -1139164 -1533049 -1686656 -1398618
32586 -1398618 -816524 -377967 -316872 -515058 -847941 -1296999 -1664090 -1665559 -1501685 -1776222
32576 -1776222 -2484463 -2679554 -1774115 -659136 -628877 -1482394 -1785388 -1045054 -432851
32567 -432851 -902319 -1686577 -1529886 -651501 -382473 -1153854 -1937029 -1795660 -1114197 -892341
32557 -892341 -1361018 -1764718 -1319247 -68309 1175185 1595629 1082044 202861 -478280
32548 -478280 -894830 -1207613 -1317923 -988125 -354868 56935 -78136 -531696 -845473 -805694
32538 -805694 -498518 -96578 227151 278793 -42911 -568692 -940116 -986129 -938686 -1094531
32528 -1094531 -1283734 -963164 7993 974815 1190209 715852 224752 66195 58670 149971
32518 149971 583559 1193393 1196147 148459 -1326338 -2234094 -2305563 -1971315 -1580359 -1168309
32508 -1168309 -792253 -565735 -428336 -282896 -280961 -616485 -1128184 -1429237 -1332155 -890849
32498 -890849 -228014 369829 431335 -234254 -1222979 -2000172 -2431081 -2563478 -2311896 -1826547
32488 -1826547 -1719350 -2266334 -2748842 -2330706 -1306267 -684853 -768239 -981969 -918937 -639169
32478 -639169 -108232 631164 832385 -230153 -1832992 -2330304 -1357172 -291534 -185695
32469 -185695 -551099 -726669 -1040659 -1700316 -1771784 -468124 1419661 2528567 2648001
32460 2648001 2377869 1820132 826639 -63827 -228463 -78273 -378881 -896143 -966431 -951986
32450 -951986 -1672542 -2693748 -2782807 -2001559 -1700251 -2271209 -2573196 -1995068 -1455439 -1664467
32440 -1664467 -1891751 -1374377 -650115 -444747 -356441 192484 636244 165395 -767862 -1153133
32430 -1153133 -1135045 -1684639 -2788924 -3263432 -2447097 -1026341 16916 416186 371744
32421 371744 55877 -316404 -456787 -325113 -151828 -48042 64039 117673 -95877 -515218
32411 -515218 -739836 -474667 154864 721815 795305 287215 -317604 -353632 151730 366721
32401 366721 -223648 -1035055 -1258386 -1058741 -1146432 -1497424 -1443425 -922840 -646954 -892706
32391 -892706 -1051913 -669027 -110100 181764 364592 662537 782235 419198 -108178 -271827
32381 -271827 -75392 58693 -110463 -509339 -960511 -1223458 -1103442 -793261 -793025 -1223188
32371 -1223188 -1581546 -1473353 -1152608 -962788 -716770 -175040 270456 88958 -442363
32362 -442363 -526481 -39783 274452 -63987 -573394 -530304 53768 516011 349083 -359909
32352 -359909 -1140641 -1542542 -1396236 -894874 -486809 -595382 -1296956 -2174623 -2567707 -2164169
32342 -2164169 -1358173 -813084 -664466 -468518 -13906 248989 -134028 -916237 -1509997
32333 -1509997 -1762772 -1895193 -1873584 -1422858 -651067 -130294 -213880 -635120 -905574 -821896
32323 -821896 -484722 -77007 270622 561245 891021 1177012 1040313 238106 -867749
32314 -867749 -1590550 -1632000 -1244566 -798717 -540233 -640773 -1020503 -1190654 -793350 -266393
32304 -266393 -366334 -989437 -1190530 -611079 -142822 -677898 -1787108 -2277876 -1694117 -613531
32294 -613531 325499 1027760 1583611 1866670 1659554 900702 -265422 -1494043 -2332113
32285 -2332113 -2544656 -2368058 -2274684 -2478323 -2749685 -2651117 -1916606 -775653 36594 -141886
32275 -141886 -1152586 -2093318 -2298494 -1952627 -1556692 -1191911 -665012 -39648 428121
32266 428121 667744 718173 516665 164682 104879 522451 849534 479034 -262989 -589342
32256 -589342 -545751 -950645 -1970891 -2689446 -2456050 -1871584 -1870067 -2405527 -2689430 -2374899
32246 -2374899 -1892658 -1767122 -2064452 -2429255 -2350036 -1537711 -332094 449828 370092 -105305
32236 -105305 -221429 145187 512392 512309 171856 -364324 -924161 -1168768 -808765 -20825
32226 -20825 680247 1013337 1073303 929484 489709 -138070 -535806 -453294 -161210 -134027
32216 -134027 -549378 -1229904 -1862758 -2087620 -1583181 -396327 835008 1276386 662460
32207 662460 -431099 -1193797 -1413010 -1573158 -2102518 -2700173 -2637868 -1710635 -600570
32198 -600570 -132301 -386127 -807321 -1020973 -1135890 -1247861 -1110975 -552656 112329 445480
32188 445480 487130 601937 795827 653071 69358 -408658 -303941 56430 -11273 -529053
32178 -529053 -832679 -595131 -304340 -473367 -879156 -1020437 -957923 -1121280 -1456205 -1389717
32168 -1389717 -686950 197945 770342 1026481 1133513 1009792 537879 -88136 -522488
32159 -522488 -601382 -358337 36725 197131 -269375 -1193936 -1813585 -1641341 -1078099 -780018
32149 -780018 -723082 -415917 155120 409705 9582 -723266 -1313520 -1588890 -1509521 -1007818
32139 -1007818 -224118 467512 910110 1322872 1770639 1821615 1110599 7106 -743645
32130 -743645 -993960 -1346503 -2191940 -2969171 -2732996 -1339985 283712 1133005 1104528
32121 1104528 814289 706293 721120 740874 845849 957305 667058 -221882 -1252308 -1777418
32111 -1777418 -1695171 -1386753 -1106706 -825099 -534713 -276080 63488 516206 648990 -43992
32101 -43992 -1274457 -2022127 -1702017 -853558 -400299 -574822 -876480 -815039 -364075 173425
32091 173425 482229 468052 284063 61529 -307228 -853225 -1108739 -523240 607396 1221783
32081 1221783 796032 12524 -288989 -281724 -657450 -1376120 -1683296 -1226135 -437517 167126
32071 167126 419802 206579 -566129 -1539525 -2043267 -1915099 -1669090 -1632189 -1487491 -995546
32061 -995546 -565691 -588949 -685520 -261180 514652 990942 1098152 1347057 1766775 1662180
32051 1662180 703197 -429233 -922997 -847469 -790235 -885953 -790730 -383961 98708 528436
32041 528436 928823 1115395 861196 438207 388298 643752 523266 -148557 -603065 -285645
32031 -285645 145258 -311209 -1472836 -2111287 -1559090 -485691 56301 -184501 -646133
32022 -646133 -757257 -522094 -456164 -996689 -1884874 -2299376 -1828280 -1054705 -803945 -1096666
32012 -1096666 -1394127 -1604297 -2051598 -2532846 -2340219 -1428853 -680174 -616106 -654945 -161714
32002 -161714 516176 753818 764068 1154478 1744020 1702768 772365 -370590 -975760 -904521
31992 -904521 -494614 -225731 -459878 -1064007 -1378843 -990187 -368703 -248703 -569809 -668346
31982 -668346 -389583 -239296 -368857 -219403 502866 1168902 1041974 324430 -124958 102184
31972 102184 595993 788908 587770 264913 -5596 -266020 -474383 -371471 112429 486834
31962 486834 180339 -580550 -913271 -522848 -199136 -608278 -1173690 -894777 142125
31953 142125 968973 1214752 1365124 1561999 1245585 307761 -389755 -214011 279101 210106
31943 210106 -404311 -967747 -1346475 -1830464 -2342496 -2463861 -2187596 -1969551 -1947365 -1693460
31933 -1693460 -979753 -339862 -465666 -1211812 -1631433 -1141140 -340616 -282928 -1017833 -1438712
31923 -1438712 -836803 -14146 -212255 -1312671 -1967480 -1447689 -464924 17125 -65430
31914 -65430 -281514 -509871 -812364 -1053515 -1155286 -1287106 -1378691 -949094 98039 1033800
31904 1033800 1238761 1087983 1230622 1444939 1052480 181734 -327053 -242772 -267365 -856762
31894 -856762 -1491567 -1477904 -915917 -472200 -550021 -1027924 -1558060 -1807586 -1581656 -1014415
31884 -1014415 -583746 -691387 -1182946 -1440608 -1055857 -311567 202799 430096 916164
31875 916164 1797485 2169926 1130501 -750689 -1886172 -1724869 -1397137 -1874592 -2463643
31866 -2463643 -1991593 -743289 -32050 -169828 -129041 677101 1436148 1220792 353613
31857 353613 -190073 -213407 -385245 -1053363 -1625829 -1336450 -284795 607965 637318 21681
31847 21681 -562189 -851381 -1029797 -1109458 -908218 -650832 -835759 -1255570 -963295 273224
31837 273224 1263825 908677 -230676 -827869 -763214 -1048791 -2005921 -2757451 -2675817 -2233388
31827 -2233388 -2047462 -1990778 -1746269 -1545143 -1779482 -2283782 -2458156 -1921744 -856637
31818 -856637 106042 347594 -98718 -455187 -91912 681388 1143013 1136960 883423 223592
31808 223592 -986682 -1998437 -1864784 -977049 -661422 -1148038 -1321719 -771951 -507115
31799 -507115 -945348 -800834 839713 2648471 2770811 1499156 637171 781227 901226
31790 901226 406176 -22508 137449 365168 84452 -492433 -941405 -1216868 -1271063 -814078
31780 -814078 121591 944480 1190793 979623 543133 -167582 -1116080 -1919427 -2300328 -2408237
31770 -2408237 -2399494 -2109466 -1490401 -1003854 -1137480 -1736554 -2198812 -2206226 -1937412 -1666151
31760 -1666151 -1509115 -1560797 -1913214 -2382868 -2475149 -1911848 -1136617 -988280 -1734371 -2637885
31750 -2637885 -2698203 -1687373 -226337 980309 1590054 1425619 446517 -871001 -1630337
31741 -1630337 -1395288 -724007 -510600 -988837 -1635259 -1842750 -1435138 -715243 -247739
31732 -247739 -407207 -927977 -1107395 -648363 -49571 53708 -348297 -807068 -1082996 -1318280
31722 -1318280 -1680184 -2066598 -2100932 -1412879 -161854 792148 699155 -100727 -579439 -415723
31712 -415723 -214702 -215743 188857 1180622 1815108 1395101 656463 620940 1020898 961151
31702 961151 520048 451685 716496 595423 44362 -309137 -403960 -751625 -1226381 -1082844
31692 -1082844 -305705 215618 65904 -203462 -154877 12729 221873 711911 1214716 1038624
31682 1038624 328038 161771 977300 1937123 2299458 2343387 2413318 2155296 1399493 806548
31672 806548 859413 1052344 792068 285734 -124462 -606292 -1101718 -919617 76077 816704
31662 816704 530416 -35147 29286 156938 -644618 -1883896 -2243435 -1647321 -1143637 -1036537
31652 -1036537 -687083 -65822 47038 -444349 -659099 -216216 237984 272994 259525 370162
31642 370162 149400 -482412 -866260 -716251 -574483 -682075 -482118 131735 174568 -946580
31632 -946580 -2241604 -2466022 -1928249 -1842271 -2354435 -2416314 -1496274 -345510 95787 -221895
31622 -221895 -682911 -776929 -480591 -219575 -477730 -1177238 -1599709 -1250827 -538666 -147845
31612 -147845 -73100 92649 230111 -62681 -440302 -95689 760278 838198 -288736 -1229309
31602 -1229309 -626763 842812 1429182 746974 -6296 -80391 -45521 -371005 -395016 593261
31592 593261 2115724 3118314 3221830 2678846 1674818 479198 -182390 162349 900457
31583 900457 1082737 807179 925218 1477309 1485402 470488 -813837 -1507655 -1641422 -1595910
31573 -1595910 -1385086 -1029084 -961332 -1437612 -2031033 -2251673 -2205905 -2144850 -1863575 -1130968
31563 -1130968 -294035 127127 98325 -159597 -629146 -1214455 -1506453 -1435155 -1627950 -2399066
31553 -2399066 -2917484 -2268077 -895522 13215 237200 491117 914254 864751 266625
31544 266625 -109208 12917 -24576 -488578 -638362 -40576 548997 406057 32618 196222
31534 196222 528022 190001 -554304 -653024 13925 416770 25976 -403899 -161551 174593
31524 174593 -434039 -1855164 -2778135 -2314780 -1021414 -148576 -267785 -925926 -1425368
31515 -1425368 -1555148 -1524027 -1481554 -1309060 -796509 83077 1023893 1512264 1275861 660913
31505 660913 340558 542522 820182 739719 465099 368656 377571 163419 -194741 -249545
31495 -249545 118280 476475 384778 -158797 -840955 -1286617 -1166664 -389602 696820 1495390
31485 1495390 1620991 1105443 287796 -334941 -381095 4463 226014 15631 -179036 4427
31475 4427 50030 -757940 -2099291 -2835760 -2427411 -1440863 -677068 -502776 -1004231 -1957605
31465 -1957605 -2547806 -1995075 -711055 -28639 -510327 -1332869 -1633503 -1540099 -1423120
31456 -1423120 -1108262 -527631 -277393 -655833 -868229 -176980 724329 594213 -429176
31447 -429176 -921761 -137806 1147736 1875325 1869063 1519147 1082110 703536 601794 812289
31437 812289 1034307 981151 659674 191427 -359889 -867984 -1135476 -1142632 -1068144 -952734
31427 -952734 -594322 61401 638630 674891 185861 -298926 -304700 91730 427308 452271
31417 452271 363573 376812 341999 58215 -242316 -146043 286321 568479 481789 242076
31407 242076 -36788 -462576 -821054 -560971 350595 1101662 970869 180867 -524695 -744686
31397 -744686 -539627 -145279 56291 -289679 -987399 -1351905 -1100903 -666452 -312611 329811
31387 329811 1324035 1808624 1125605 -52592 -622548 -555713 -538430 -594278 -237230 260696
31377 260696 12400 -1028672 -1871356 -1917599 -1601255 -1390205 -1111897 -595232 -128169 115728
31367 115728 399245 824456 1063975 1001416 1011952 1295518 1516870 1370123 906290 108605
31357 108605 -1122138 -2283631 -2418605 -1446766 -597745 -886366 -1789612 -2133985 -1741420
31348 -1741420 -1372436 -1409163 -1488063 -1337130 -1178859 -1203083 -1258255 -1247526 -1359480 -1662831
31338 -1662831 -1786881 -1286707 -223762 806933 1244345 1075940 738149 565035 504821
31329 504821 428359 447183 671479 863496 712455 360805 266761 585205 1070122 1540637
31319 1540637 1986567 2196669 1779275 695444 -607993 -1695308 -2421645 -2697549 -2417564
31310 -2417564 -1721242 -947556 -290247 129760 -47467 -1066419 -2366983 -2892535 -2244563
31301 -2244563 -1011081 89886 766314 856577 318833 -304766 -275296 205020 110761 -813576
31291 -813576 -1539885 -1316225 -715668 -447582 -169821 554193 1053041 529508 -431837 -678667
31281 -678667 -378322 -689744 -1730219 -2289234 -1690888 -650295 30598 439396 754745
31272 754745 548783 -395524 -1354896 -1550304 -1272994 -1379670 -1942553 -2114834 -1329917 -92245
31262 -92245 621049 489769 140703 281822 713710 501495 -770721 -2271745 -2797455
31253 -2797455 -2134177 -1103641 -408932 -1154 377558 588981 306580 -475518 -1361000
31244 -1361000 -1843885 -1656400 -1024805 -568843 -716515 -1224933 -1468697 -1100652 -195048
31235 -195048 1059421 2390227 3274391 3244507 2446917 1555167 1086236 1065114 1267463 1422564
31225 1422564 1270478 846197 624377 924752 1302736 1117968 610664 654472 1363571 1777724
31215 1777724 1233049 268325 -295908 -482101 -748599 -1037672 -987415 -733905 -716751 -845728
31205 -845728 -607749 400 335777 49443 -417624 -523406 -348819 -323736 -568828 -857559
31195 -857559 -1019711 -1035615 -846013 -421101 -11625 4759 -362954 -630572 -444436 -62224
31185 -62224 3826 -354890 -840771 -1249821 -1548826 -1513542 -852957 142651 637685 295268
31175 295268 -180141 -1879 621416 956032 916973 974463 1067652 567607 -519119 -1225837
31165 -1225837 -961759 -441463 -634171 -1300466 -1365178 -536726 245301 96428 -703292 -1208208
31155 -1208208 -1027536 -619448 -478838 -454351 -69771 682198 1201595 1003953 315319 -267784
31145 -267784 -525325 -689525 -839368 -655138 17965 658982 486739 -629751 -1929575
31136 -1929575 -2524262 -2260129 -1686034 -1275740 -965851 -541077 -129749 38517 145829
31127 145829 519816 894125 585364 -398731 -1092553 -830137 -184098 -81035 -484673 -675557
31117 -675557 -462634 -285960 -316610 -305186 -258512 -430612 -621173 -324540 314165 526993
31107 526993 82112 -431653 -710222 -1182869 -1929200 -2102120 -1144288 174088 775028
31098 775028 780249 1101806 1887890 2322681 1885620 977088 207467 -252394 -434566 -254667
31088 -254667 264101 770748 883663 614563 352645 429537 719742 720375 124768 -753310
31078 -753310 -1339305 -1509202 -1602952 -1764663 -1751162 -1485558 -1256532 -1154870 -874865 -390426
31068 -390426 -239253 -669778 -1050337 -733838 -91663 -28222 -766427 -1753256 -2499216 -2830597
31058 -2830597 -2543835 -1606952 -655028 -508662 -1080946 -1415744 -978090 -312794 -179148
31049 -179148 -542667 -768621 -498283 -6627 194247 -67187 -423303 -371858 89972 448219
31039 448219 426327 395789 677844 819340 194482 -857984 -1253451 -625968 66924 -299341
31029 -299341 -1652861 -2801549 -2678722 -1388220 -140982 -112793 -1201657 -2093269 -1799173
31020 -1799173 -806762 -261700 -391757 -493454 -273170 -238454 -638435 -954345 -827471 -709778
31010 -709778 -1073783 -1603542 -1757721 -1648473 -1732813 -1977995 -1975498 -1681589 -1415180 -1167476
31000 -1167476 -500368 713929 1858687 2145826 1482565 570645 137025 188457 145712
30991 145712 -347449 -1022207 -1481613 -1730478 -1899246 -1797706 -1261589 -690996 -600257 -775958
30981 -775958 -617115 -265514 -546406 -1649231 -2734407 -3131961 -3074012 -2859320 -2215059
30972 -2215059 -1101291 -301181 -389108 -751382 -487833 230295 567137 335493 -982
30963 -982 -273575 -626925 -873117 -754060 -612768 -876691 -1129488 -720220 -49868 -57774
30953 -57774 -571585 -543518 22883 -68787 -1054550 -1519431 -616058 516995 621013 262105
30943 262105 540290 976973 400965 -753792 -903896 131570 812684 266484 -635960
30934 -635960 -989223 -1117697 -1456444 -1517257 -908555 -321866 -436543 -655627 -87075 792312
30924 792312 708654 -409527 -1218484 -846832 32217 339315 -5371 -297287 -152811 126863
30914 126863 113917 -192674 -397241 -183844 286889 578955 624730 883914 1622068 2344795
30904 2344795 2385103 1838343 1384053 1294250 1206548 874337 516997 289842 -9722 -463756
30894 -463756 -755319 -654512 -383682 -240380 -234430 -345333 -738744 -1410186 -1936704 -1890352
30884 -1890352 -1264871 -334995 554273 920630 383191 -743270 -1591336 -1791646 -1815298
30875 -1815298 -1916304 -1517879 -340274 646868 493636 -31392 624043 2298635 3054706
30866 3054706 1960250 498736 351211 916015 318222 -1705149 -3357284 -3248418 -2075011
30857 -2075011 -1346060 -1352040 -1249734 -719531 -493961 -1041185 -1566061 -1009907 337380 1081223
30847 1081223 638553 72090 547519 1620985 1868846 934140 22135 214546 1064612
30838 1064612 1323607 607461 -220257 -230330 449080 864762 424659 -426465 -866837 -806558
30828 -806558 -860328 -1179301 -992453 216398 1649037 2099909 1612761 1309387 1632052
30819 1632052 1768778 1083930 175432 -52665 316695 512614 228802 -176035 -392767
30810 -392767 -498596 -640882 -783120 -765932 -445180 108757 467887 201271 -480964 -816257
30800 -816257 -455639 47544 -4143 -620007 -1381766 -2056244 -2448508 -2088600 -779147 733219
30790 733219 1324011 730167 -290534 -973474 -1160174 -937005 -346026 328849 539949
30781 539949 91013 -551900 -834303 -718306 -475624 -188633 180215 424181 250447 -186513
30771 -186513 -310072 144715 713179 793457 467406 353208 696856 1077334 1144385 1142729
30761 1142729 1343755 1412218 935917 312275 377999 1200175 1957817 2117375 1996900 1939833
30751 1939833 1684540 1004155 351726 289226 692720 1062881 1273110 1464287 1486454 1035326
30741 1035326 226243 -430694 -562685 -153134 573558 1194421 1280854 873570 484669 344963
30731 344963 82662 -453710 -608400 164435 1211773 1350483 448695 -469716 -656657
30722 -656657 -402350 -289469 -394004 -445227 -264322 152544 623698 789020 467887 -30227
30712 -30227 -313943 -479544 -811413 -1120944 -1016018 -698323 -751905 -1138039 -1167759 -592117
30702 -592117 31026 259437 317287 430223 333957 -106126 -390312 -59525 523659 622335
30692 622335 155800 -171344 257235 1219156 1815805 1380107 247837 -573679 -652757 -639070
30682 -639070 -1114176 -1483706 -870219 262709 563696 -148091 -564516 55858 779769
30673 779769 554369 -290345 -929201 -1406892 -2077248 -2512364 -2169382 -1571140 -1590344 -1936077
30663 -1936077 -1607092 -651735 -184874 -612759 -1089745 -1013965 -919124 -1390195 -2057054 -2308676
30653 -2308676 -2270791 -2373433 -2481479 -2176181 -1574116 -1194854 -1175740 -1196036 -1110318 -1130985
30643 -1130985 -1338830 -1448156 -1197037 -693930 -278338 -253222 -776151 -1696839 -2382725 -2074573
30633 -2074573 -750370 595089 972451 623154 727117 1810974 3007173 3219301 2531187
30624 2531187 1919624 1892000 2067580 1976810 1578983 948874 136475 -474225 -311242 550448
30614 550448 1227523 1088421 550196 426535 852084 1270798 1203745 639143 -102318 -564444
30604 -564444 -480734 -200113 -456925 -1367118 -2021456 -1535748 -200983 904632 1186023
30595 1186023 896813 485885 187968 142007 313018 306154 -217473 -934401 -1165790 -812962
30585 -812962 -482773 -595338 -857086 -809806 -506786 -376545 -626061 -995554 -1067094 -782856
30575 -782856 -641964 -1179782 -2142615 -2526386 -1770320 -598345 -176817 -644091 -1065342
30566 -1065342 -767619 -83933 317797 265367 23656 -150722 -141625 55643 334697 662740
30556 662740 1251390 2184708 2888107 2490958 921474 -796153 -1621701 -1539225 -1228063
30547 -1228063 -1017566 -609739 242234 1179537 1524712 994353 -23419 -924187 -1485312
30538 -1485312 -1838223 -1954135 -1577893 -818508 -326062 -461052 -650996 -151218 766621
30529 766621 1052604 280321 -830046 -1397347 -1314633 -1021730 -864686 -933770 -1118772 -1067348
30519 -1067348 -427941 645605 1527418 1806039 1609655 1145872 388951 -512327 -969884
30510 -969884 -556397 337360 841201 543927 -154889 -577241 -455080 -91121 52167 -148228
30500 -148228 -465300 -773934 -1206038 -1671068 -1621798 -777359 196471 363488 -241005 -710484
30490 -710484 -572683 -258271 -189482 -197485 -100272 -113453 -317910 -378145 -183495 -137297 -396556
30479 -396556 -488974 -178757 -18018 -388752 -645345 -38697 987605 1336595 802032 164079
30469 164079 -113556 -360449 -807560 -1054554 -716592 -33001 478043 632116 640206 771224
30459 771224 1044339 1144681 736384 -12400 -458806 -246779 291937 758925 1214191 1619016
30449 1619016 1348285 75436 -1267460 -1433396 -615531 -199134 -717337 -1167493 -662032
30440 -662032 327095 944505 1223175 1572025 1706876 1084169 54164 -378998 94082
30431 94082 765186 1013188 1024821 1163766 1212793 711263 -248604 -1054740 -1364791 -1448872
30421 -1448872 -1617993 -1675573 -1283792 -672813 -476679 -811614 -1039975 -708357 -241350 -282961
30411 -282961 -759472 -1146244 -1320694 -1456799 -1312525 -472967 718787 1338883 1127714
30402 1127714 723454 460565 -102180 -1026419 -1379842 -588306 364246 103862 -1202355
30393 -1202355 -2094114 -1784203 -910735 -363749 -280540 -376176 -516805 -681929 -861915 -1154349
30383 -1154349 -1539636 -1585686 -953349 -170907 -158642 -859402 -1166259 -530517 178890 -52030
30373 -52030 -970413 -1606304 -1665629 -1573643 -1525743 -1373097 -1263250 -1512878 -1840446 -1555387
30363 -1555387 -670114 -68694 -279293 -750104 -759646 -470270 -506677 -869388 -935064 -444752
30353 -444752 94005 110770 -337532 -799840 -1098811 -1474638 -2105744 -2738622 -2941589 -2628995
30343 -2628995 -2133397 -1738145 -1354367 -783047 -98446 430647 656096 586962 281123 -70761
30333 -70761 -183078 -118703 -413092 -1267108 -1886318 -1339766 33960 929254 853924 656452
30323 656452 974405 1178318 509179 -611077 -1281976 -1466826 -1660563 -1749898 -1319967 -783506
30313 -783506 -1007929 -1848475 -2171857 -1497057 -617188 -342942 -533850 -685262 -639420 -351399
30303 -351399 288525 1012183 1238354 919977 636954 558896 153130 -669119 -1060149 -549115
30293 -549115 21548 -257864 -885980 -727820 219139 916789 908012 797290 1094688 1475475
30283 1475475 1386307 744659 -170189 -1081873 -1833751 -2409174 -2822074 -2842918 -2145058 -1010690
30273 -1010690 -418860 -893845 -1678842 -1702760 -994190 -392369 -211004 -96039 18777 -171677
30263 -171677 -523083 -547227 -404823 -781034 -1607268 -1967883 -1608908 -1458429 -2083563 -2643265
30253 -2643265 -2207454 -1323847 -1241540 -2016666 -2438799 -1756056 -573767 140751 280327
30244 280327 465128 1029616 1547613 1414029 682970 20175 -268049 -733660 -1836340
30235 -1836340 -2827489 -2457497 -860989 235313 -335920 -1639265 -1957331 -1009813 61195
30226 61195 502133 636485 773997 548514 -228772 -880264 -682993 96551 655259 850935
30216 850935 1194170 1693434 1569244 504535 -535808 -488795 199130 106104 -1070900
30207 -1070900 -2023470 -1773177 -1034605 -874719 -933354 -171038 1135462 1542133 547041
30198 547041 -719246 -1137783 -819506 -352307 86017 357298 75382 -681725 -1168540
30189 -1168540 -1069239 -1016387 -1432434 -1737698 -1460242 -1220477 -1603949 -1852690 -935457 600131
30179 600131 1187629 413125 -658093 -1225227 -1500169 -1600605 -1049525 127454 893999
30170 893999 470350 -622340 -1361855 -1463831 -1298147 -1122324 -967695 -885729 -786978 -335795
30160 -335795 554107 1385387 1635033 1413152 1208462 1200640 1178986 950065 462090 -342072
30150 -342072 -1423100 -2404851 -2729487 -2180541 -1193337 -569109 -748844 -1276920 -1185254 -169051
30140 -169051 848563 795316 -66463 -432890 196551 790893 312870 -769956 -1206995
30131 -1206995 -711376 -140735 -125576 -358221 -325265 -32057 247619 390241 277912 -324253
30121 -324253 -1349969 -2162743 -2115689 -1302662 -470610 -219744 -482883 -737516 -543775 90427
30111 90427 713800 829421 413926 -37133 -111321 45693 113719 252860 875962 1780472
30101 1780472 2130810 1574298 804327 553226 547361 156356 -320967 2319 1031370 1529933
30091 1529933 878087 63175 301326 1380096 2122280 1983518 1371035 737787 259222
30082 259222 236332 869955 1560235 1309853 91569 -932091 -922384 -445551 -548557 -1267594
30072 -1267594 -1683598 -1226817 -356900 36110 -465962 -1499321 -2228577 -1985153 -862466
30063 -862466 272650 530608 -177013 -1119713 -1518832 -1254406 -849684 -870109 -1372680 -1916367
30053 -1916367 -2074614 -1863317 -1610306 -1500487 -1414292 -1196167 -892110 -649475 -509808 -393235
30043 -393235 -227842 -34174 97886 109763 66114 96624 204922 222309 41812 -186604
30033 -186604 -222747 -50583 89090 -47005 -480239 -961501 -1090578 -632407 162331 696469
30023 696469 650468 354313 372043 819544 1269104 1263082 782901 249964 102647 274296
30013 274296 151733 -677951 -1687846 -1865242 -976260 167963 890005 1419244 2081962
30004 2081962 2419945 1830494 632237 -244054 -331828 206112 1059987 1712660 1397855
29995 1397855 56229 -1061578 -818690 72686 -64482 -1432093 -2561873 -2596588 -2299763
29986 -2299763 -2456258 -2710499 -2610518 -2498069 -2563198 -2176406 -1088326 -278878 -586294 -1339887
29976 -1339887 -1416281 -916273 -668071 -674431 -263635 587246 1221488 1391463 1396444 1322203
29966 1322203 1061975 907201 1194888 1501040 1093194 118379 -523335 -468646 -243747 -321927
29956 -321927 -593066 -818707 -934275 -851002 -534040 -249556 -229690 -267398 -161311 -199191
29946 -199191 -528196 -547001 111567 468616 -639898 -2523873 -3234457 -2281659 -1248104
29937 -1248104 -1326347 -1763522 -1485265 -897697 -993453 -1652089 -2011165 -1913853 -1893876 -2088911
29927 -2088911 -2117979 -1815343 -1304875 -557774 400448 1038101 810021 26188 -434315 -277689
29917 -277689 -74742 -317150 -722267 -685861 -100566 504085 530983 -85427 -842431 -1212649
29907 -1212649 -1147251 -967566 -932782 -1127627 -1536227 -1838219 -1414058 -195143 698151 71141
29897 71141 -1568886 -2390654 -1663699 -676643 -670668 -1045893 -653609 102367 -100658 -1235637
29887 -1235637 -1822706 -1159831 -330647 -566408 -1600614 -2239132 -1918684 -1118867 -585142
29878 -585142 -613761 -970277 -1240887 -1269761 -1242684 -1277938 -1179895 -884191 -837880 -1389062 -1978851
29867 -1978851 -1646695 -393867 643882 619498 -11835 -241853 187497 639970 453352
29858 453352 -432505 -1553968 -2308600 -2324040 -1677445 -789392 -69014 303554 338649 196852
29848 196852 175777 493123 1009892 1321821 1152481 559407 -142266 -491635 -111383 856994
29838 856994 1698521 1877072 1686575 1703801 1795998 1350344 420287 -220572 -356863 -732318
29828 -732318 -1679758 -2247321 -1551441 -344097 -100029 -824961 -1021974 13599 1082558
29819 1082558 863620 -166744 -567440 -124910 -30723 -900086 -1764523 -1539428 -645301
29810 -645301 -321716 -748075 -835399 50438 1044339 926554 -228584 -1142528 -877328 182054
29800 182054 843145 288077 -1183679 -2320642 -1960052 -244367 1300623 1284014 3931
29791 3931 -903381 -356403 1056026 1916186 1497821 277748 -685174 -627934 385083 1534429
29781 1534429 1970117 1596434 1021093 751442 736884 721832 621414 374868 -154852 -849012
29771 -849012 -1246873 -1120588 -859185 -957536 -1383982 -1783897 -2031505 -2184653 -2145642 -1834821
29761 -1834821 -1526149 -1528642 -1662531 -1549287 -1310268 -1390834 -1696335 -1550382 -694541 245650
29751 245650 593099 449276 339359 423187 493374 497878 605214 847315 1065568 1176603
29741 1176603 1211407 1134208 875933 507475 150545 -219739 -628704 -831293 -531128 92317
29731 92317 422175 122764 -461325 -836240 -1042129 -1479393 -2174131 -2620910 -2452325 -1940474
29721 -1940474 -1603542 -1524612 -1372957 -1023883 -802345 -1013879 -1507705 -1874816 -1877453 -1502715
29711 -1502715 -805027 23014 565214 522611 140653 -4927 300913 690904 733704 407718
29701 407718 -28884 -375870 -548908 -503509 -271569 21499 235177 213386 -207587 -926645
29691 -926645 -1387243 -1065235 -179603 509269 640091 457359 55308 -772796 -1651645 -1572123
29681 -1572123 -418439 348377 -443123 -1849202 -2133884 -1375747 -1161002 -1880723 -2188367
29672 -2188367 -1467112 -935232 -1414101 -1722728 -673330 700836 635424 -546805 -980297
29663 -980297 -175690 502717 263425 -34030 365244 874120 799480 546133 727091 1027545
29653 1027545 828776 258374 -179683 -448378 -712690 -741334 -326309 86031 -90274 -690687
29643 -690687 -1049053 -926840 -649590 -510863 -521931 -562724 -383267 267969 1121939 1380941
29633 1380941 737325 -8684 15911 478225 376954 -394418 -920847 -668293 -122921 138109
29623 138109 208454 352642 408362 147577 -205911 -272902 -75252 73333 74214 131673 383343
29612 383343 654012 626145 213906 -278710 -466231 -327721 -120890 156210 773231 1531592
29602 1531592 1610857 706490 -171524 142548 1286321 1793973 1150097 383045 391664 723743
29592 723743 574821 145739 200077 781615 1198437 1078255 754553 638697 724053 764176
29582 764176 614207 347875 185367 247975 346703 245138 167916 630421 1583342 2209123
29572 2209123 1916820 1113889 575822 467221 504291 688859 1176752 1618620 1389137 519006
29562 519006 -210313 -225205 250595 631298 538180 -117274 -1111393 -1836733 -1748945 -1101419
29552 -1101419 -792732 -1230128 -1777004 -1668257 -1072997 -764769 -991841 -1247464 -1123123
29543 -1123123 -833703 -722036 -697789 -526402 -405009 -778766 -1596271 -2179103 -2010552 -1333991
29533 -1333991 -709759 -260433 247049 753558 885527 621576 457557 699602 1034581
29524 1034581 1085502 982742 991241 909299 350953 -530758 -1096485 -985731 -465113 -28209
29514 -28209 41533 -243511 -601569 -619072 -158919 404694 629501 580555 637068 860004
29504 860004 987820 981191 1053739 1135337 848986 166667 -412362 -547708 -466848 -450838 -368880
29493 -368880 -41463 361156 687333 1203330 2125612 2994941 3063144 2235069 1143326 268660
29483 268660 -560156 -1644152 -2749180 -3233697 -2729551 -1531209 -332575 357187 554375
29474 554375 604999 715641 778792 659547 483523 529475 945976 1671123 2497358 3075192
29464 3075192 2995666 2119195 831954 -209438 -677171 -861990 -1316524 -2202743 -3006474
29455 -3006474 -2976096 -1922577 -500715 453211 778253 950214 1258060 1400827 1015562
29446 1015562 249665 -427335 -737921 -705967 -478515 -260491 -221250 -263157 -110345 183902
29436 183902 135042 -488411 -1214387 -1475200 -1351454 -1275483 -1326886 -1378346 -1616529 -2168992
29426 -2168992 -2409218 -1553659 -19501 748731 138525 -749899 -546435 743405 2064912
29417 2064912 2681590 2594384 2092568 1590297 1586417 2128216 2555823 2353377 1933203 1904442
29407 1904442 1903093 1039901 -615588 -1938634 -2219191 -1862864 -1456599 -1016061 -496605
29398 -496605 -223472 -308290 -307148 8601 139594 -321820 -931715 -1097746 -1016351 -1164452
29388 -1164452 -1325830 -1029205 -642974 -981836 -1850533 -2027921 -968187 361174 750925
29379 750925 143978 -719431 -1432298 -2075565 -2621632 -2816152 -2560506 -2022620 -1456843 -1138510
29369 -1138510 -1236496 -1469864 -1185809 -180925 781605 748513 -224125 -1089951 -1023846 -244513
29359 -244513 378107 192345 -769956 -1835719 -2117579 -1223382 308060 1464548 1702260
29350 1702260 1250528 566845 -104763 -570706 -580523 -204323 22958 -253417 -604562 -280861
29340 -280861 788184 1854906 2228814 1913602 1304200 682725 273154 438282 1357308
29331 1357308 2571893 3240201 2937877 1996510 1023181 327773 -110495 -378236 -519646
29322 -519646 -563133 -523576 -466233 -597726 -1089541 -1728888 -2004579 -1711981 -1220212 -912650
29312 -912650 -640685 -88821 528842 608881 -19505 -796259 -1016529 -480406 396600 882377
29302 882377 472907 -538488 -1188791 -913541 -269674 -98768 -254382 70035 898488
29293 898488 1347875 1069200 777462 980630 1198274 1003320 838082 1019762 894012 11642
29283 11642 -673374 -54970 1252996 1700301 1115249 722026 917922 656360 -596491
29274 -596491 -1778563 -1804993 -1050147 -463490 -171596 177188 457263 370359 150710 135149
29264 135149 81148 -319095 -669159 -410524 192181 396596 87047 -210478 -251742 -283730
29254 -283730 -400521 -360957 -83377 196020 276854 124197 -234773 -547824 -289834 723720
29244 723720 1865178 2351556 2175510 1857141 1552042 1088555 651243 593509 656751 237594
29234 237594 -554999 -1002978 -1037266 -1419730 -2382772 -3063999 -2806109 -2154380 -1906023 -1919989
29224 -1919989 -1662350 -1316572 -1404643 -1673311 -1349364 -407796 318785 385341 293133 569410
29214 569410 964122 943365 501159 47562 -216958 -400823 -548156 -546710 -388821 -216494
29204 -216494 -41696 320063 871740 1182661 817179 -1553 -505204 -331825 -44903 -350284
29194 -350284 -1031676 -1201392 -571898 139083 264489 61641 131035 437705 483210 183281
29184 183281 -50948 -48934 -127215 -503924 -927258 -1072694 -977121 -868231 -790731 -619794
29174 -619794 -338764 -125990 -144604 -293761 -249024 121801 422136 97337 -758043 -1344851
29164 -1344851 -1189902 -835954 -1033290 -1584876 -1659055 -1061197 -413372 -88636 170865 393762
29154 393762 51148 -950125 -1740215 -1602700 -1004416 -813274 -1041876 -1187683 -1350505
29145 -1350505 -2001606 -2880252 -3194793 -2912908 -2790864 -2958514 -2565904 -1261292 -19108
29136 -19108 169333 -360283 -655291 -537144 -442912 -414283 -208727 -79772 -428435 -835374
29126 -835374 -508628 257101 185669 -1063817 -2110400 -1629014 -125177 875013 841115
29117 841115 499509 382312 187000 -290188 -544652 -198702 193069 -136620 -935440 -1138611
29107 -1138611 -337906 588295 604957 -174176 -763157 -618491 -103303 331320 797116 1512451
29097 1512451 2171943 2258981 1780705 1239010 946921 775949 566751 401443 384167 436175
29087 436175 393161 118353 -453596 -1152953 -1535565 -1328613 -860121 -680062 -809839 -813762
29077 -813762 -586177 -496472 -653080 -664243 -424032 -541457 -1516090 -2906252 -3805338 -3847803
29067 -3847803 -3314988 -2546574 -1724743 -1021683 -512264 -104640 112111 -228239 -1076724
29058 -1076724 -1555773 -884359 509721 1485751 1642792 1516823 1384231 774184 -554792
29049 -554792 -1920741 -2480049 -2193351 -1607821 -1084830 -690445 -543569 -773337 -1212496
29040 -1212496 -1472677 -1319267 -829405 -286591 -17700 -143455 -371784 -271657 108908
29031 108908 198577 -283038 -777924 -568251 163253 451860 -206416 -1171762 -1472366 -996538
29021 -996538 -491941 -503798 -796932 -951500 -1034108 -1268374 -1408177 -1070256 -527894 -426958
29011 -426958 -716420 -770647 -795117 -1966588 -4413251 -6083243 -4915925 -1629963 994617
29002 994617 1404129 502934 -332023 -908890 -1473539 -1746214 -1555608 -1413056 -1575131 -1337003
28992 -1337003 -128461 1372401 2117843 2117603 2084899 2142267 1855192 1242860 789502 582301
28982 582301 284002 -116945 -308922 -357869 -645578 -1078702 -1062342 -391314 382919 601792
28972 601792 128672 -667747 -1219607 -1178702 -869984 -1059887 -1875941 -2400164 -1952357 -1280149
28962 -1280149 -1565178 -2602815 -3073630 -2485960 -1654169 -1165814 -623541 223875 772161
28953 772161 612288 342742 598623 999377 804276 51147 -660373 -1069561 -1290296 -1323478
28943 -1323478 -1135646 -933839 -876035 -802724 -624592 -551789 -565608 -242687 376269 400033
28933 400033 -668892 -1864823 -1889398 -952526 -444715 -925660 -1524415 -1448249 -1062355 -1088637
28923 -1088637 -1513499 -1772984 -1517786 -823546 -47124 266093 -236175 -1167932 -1667182
$$ [...]
##END NTUPLES=NMR SPECTRUM
##END=
