##TITLE=31Pdec_LY-TMF-12.40.3
 D2O, 24 sc
 4.3.2020
##JCAMPDX= 6.0         $$ Bruker NMR JCAMP-DX V2.0
##DATA TYPE= NMR SPECTRUM
##DATA CLASS= NTUPLES
##ORIGIN= UXNMR, Bruker Analytische Messtechnik GmbH
##OWNER= root
$$ XWIN-NMR		Version 3.5
$$ Wed Mar  4 14:28:09 2020 Russian Standard Time (UT+4h)  she@DPX200
##.OBSERVE FREQUENCY= 81.013821
##.OBSERVE NUCLEUS= ^31P
##.ACQUISITION MODE= SIMULTANEOUS
##.ACQUISITION SCHEME= undefined
##.AVERAGES= 24
##.DIGITISER RES= 17
##SPECTROMETER/DATA SYSTEM= spect
##.PULSE SEQUENCE= zgpg30
##.SOLVENT NAME= CDCl3
##.SHIFT REFERENCE= (INTERNAL, CDCl3, 0, 182.463)
##AUDIT TRAIL= $$ (NUMBER, WHEN, WHO, WHERE, WHAT)
$$ ##TITLE= Audit trail, XWIN-NMR		Version 3.5
$$ ##JCAMPDX= 5.01
$$ ##ORIGIN= Bruker BioSpin GmbH
$$ ##OWNER= she
$$ F:/spectra/data/she/nmr/P31/1/pdata/1/auditp.txt
$$ ##AUDIT TRAIL=  $$ (NUMBER, WHEN, WHO, WHERE, WHAT)
(   1,<2020-03-04 14:27:19.84 +0400>,<she>,<DPX200>,
      <created by zg, POWCHK disabled, PULCHK disabled
       configuration hash MD5:
       00 E9 B6 7A A2 85 ED C7 34 08 36 98 17 FE 4E 26
       data hash MD5: 32K
       29 2D FF 90 75 F4 90 84 35 06 9A 3A FB 78 5C DD>)
(   2,<2020-03-04 14:27:22.09 +0400>,<she>,<DPX200>,
      <Start of raw data processing
       efp BC_mod = 2 LB = 1 FT_mod = 6 PKNL = 1 PHC0 = -1320.901 PHC1 = 73.8017 SI = 64K 
       data hash MD5: 64K
       FF A7 09 DF 04 CF 4F 14 13 26 8C BD A9 1C 00 63>)
(   3,<2020-03-04 14:27:39.37 +0400>,<she>,<DPX200>,
      <pk PHC0 = -4.610669 PHC1 = 0 
       data hash MD5: 64K
       24 5F 4B 13 4A 08 10 07 E6 D7 82 95 42 13 3D 81>)
(   4,<2020-03-04 14:27:42.25 +0400>,<she>,<DPX200>,
      <abs ABSG = 5 
       data hash MD5: 64K
       6E CC B8 E5 9B 2E 68 3E E4 B4 F9 5A 10 0C 7F 2D>)
$$ ##END=
$$ 
$$ hash MD5
$$ 34 81 F6 B7 DD 4E A9 A6 C4 7C B5 25 FE 53 46 F8
##$RELAX= 
##$RELAX= 
##$RELAX= 
##$RELAX= 
##$RELAX= 
##$RELAX= 
##$RELAX= 
##$RELAX= 
$$ Bruker specific parameters
$$ --------------------------
##$DU= <F:/spectra>
##$EXPNO= 1
##$NAME= <P31>
##$PROCNO= 1
##$TYPE= <nmr>
##$USER= <she>
##$AMP= (0..31)
100 100 100 100 100 100 100 100 100 100 100 100 100 100 100 100 100 100 
100 100 100 100 100 100 100 100 100 100 100 100 100 100 
##$AQSEQ= 0
##$AQ_mod= 1
##$AUNM= <au_zg>
##$AUTOPOS= <>
##$BF1= 81.014009
##$BF2= 200.13
##$BF3= 200.13
##$BF4= 200.13
##$BF5= 200.13
##$BF6= 200.13
##$BF7= 200.13
##$BF8= 200.13
##$BYTORDA= 1
##$CFDGTYP= 0
##$CFRGTYP= 5
##$CHEMSTR= <none>
##$CNST= (0..31)
1 1 145 1 1 1 1 1 1 1 1 1 1 1 1 1 1 1 1 1 1 1 1 1 1 1 1 1 1 1 1 1 
##$CPDPRG= <waltz16>
##$CPDPRG1= <>
##$CPDPRG2= <waltz16>
##$CPDPRG3= <>
##$CPDPRG4= <mlev>
##$CPDPRG5= <mlev>
##$CPDPRG6= <mlev>
##$CPDPRG7= <mlev>
##$CPDPRG8= <mlev>
##$CPDPRGB= <>
##$CPDPRGT= <>
##$D= (0..31)
0 1 0 0 0 0 0 0 0 0 0 0.03 2e-05 3e-06 0 0 0 0 0 0 0 0 0 0 0 0 0 0 0 0 
0 0 
##$DATE= 1583317639
##$DBL= (0..7)
120 120 120 11 120 120 24 19 
##$DBP= (0..7)
150 150 150 150 150 150 150 150 
##$DBP07= 0
##$DBPNAM0= <>
##$DBPNAM1= <>
##$DBPNAM2= <>
$$ [...]
##$SUBNAM3= <"">
##$SUBNAM4= <"">
##$SUBNAM5= <"">
##$SUBNAM6= <"">
##$SUBNAM7= <"">
##$SUBNAM8= <"">
##$SUBNAM9= <"">
##$SW= 369.568048894756
##$SWIBOX= (0..15)
0 1 3 0 0 0 0 0 0 0 0 0 0 0 0 0 
##$SW_h= 29940.119760479
##$TD= 32768
##$TD0= 1
##$TE= 0
##$TE2= 300
##$TE3= 300
##$TEG= 300
##$TL= (0..7)
0 120 53 12 22 120 120 120 
##$TP= (0..7)
150 150 150 150 150 150 150 150 
##$TP07= 0
##$TPNAME0= <>
##$TPNAME1= <>
##$TPNAME2= <>
##$TPNAME3= <>
##$TPNAME4= <>
##$TPNAME5= <>
##$TPNAME6= <>
##$TPNAME7= <>
##$TPOAL= (0..7)
0.5 0.5 0.5 0.5 0.5 0.5 0.5 0.5 
##$TPOFFS= (0..7)
0 0 0 0 0 0 0 0 
##$TUNHIN= 0
##$TUNHOUT= 0
##$TUNXOUT= 0
##$USERA1= <user>
##$USERA2= <user>
##$USERA3= <user>
##$USERA4= <user>
##$USERA5= <user>
##$V9= 5
##$VALIST= <valist>
##$VCLIST= <CCCCCCCCCCCCCCC>
##$VD= 0
##$VDLIST= <DDDDDDDDDDDDDDD>
##$VPLIST= <PPPPPPPPPPPPPPP>
##$VTLIST= <TTTTTTTTTTTTTTT>
##$WBST= 1024
##$WBSW= 4
##$XGAIN= (0..3)
0 0 0 0 
##$XL= 0
##$YL= 0
##$YMAX_a= 4811
##$YMIN_a= -11805
##$ZGOPTNS= <>
##$ZL1= 120
##$ZL2= 120
##$ZL3= 120
##$ZL4= 120
##$ABSF1= 182.463
##$ABSF2= -187.1042
##$ABSG= 5
##$ABSL= 3
##$ALPHA= 0
##$AQORDER= 0
##$ASSFAC= 0
##$ASSFACI= 0
##$ASSFACX= 0
##$ASSWID= 0
##$AUNMP= <proc_1d>
##$AZFE= 0.1
##$AZFW= 0.5
##$BCFW= 0
##$BC_mod= 2
##$BYTORDP= 0
##$COROFFS= 0
##$CY= -3
##$DATMOD= 1
##$DC= 0
##$DFILT= <>
##$DTYPP= 0
##$F1P= 0
##$F2P= 0
##$FCOR= 1
##$FTSIZE= 65536
##$FT_mod= 6
##$GAMMA= 0
##$GB= 0
##$INTBC= 1
##$INTSCL= 5.30512e-09
##$ISEN= 30
##$LB= 1
##$LEV0= 0
##$LPBIN= 0
##$MAXI= 10000
##$MC2= 0
##$MEAN= 0
##$ME_mod= 0
##$MI= 50
##$NCOEF= 0
##$NC_proc= -7
##$NLEV= 6
##$NOISF1= 182.463
##$NOISF2= 159.3651
##$NSP= 0
##$NTH_PI= 0
##$NZP= 0
##$OFFSET= 182.463
##$PC= 4
##$PHC0= -1325.512
##$PHC1= 73.8017
##$PH_mod= 1
##$PKNL= yes
##$PPARMOD= 0
##$PSCAL= 0
##$PSIGN= 0
##$REVERSE= no
##$SF= 81.0140089999434
##$SI= 65536
##$SIGF1= 159.3651
##$SIGF2= -187.1042
##$SINO= 113.3802
##$SIOLD= 16384
##$SREGLST= <1H.CDCl3>
##$SSB= 0
##$STSI= 65536
##$STSR= 0
##$SW_p= 29940.119760479
##$SYMM= 0
##$S_DEV= 0
##$TDeff= 32768
##$TDoff= 0
##$TI= <>
##$TILT= no
##$TM1= 0
##$TM2= 0
##$TOPLEV= 0
##$USERP1= <user>
##$USERP2= <user>
##$USERP3= <user>
##$USERP4= <user>
##$USERP5= <user>
##$WDW= 1
##$XDIM= 65536
##$YMAX_p= 394808926
##$YMIN_p= -38752964
$$ End of Bruker specific parameters
$$ ---------------------------------
##NTUPLES= NMR SPECTRUM
##VAR_NAME=  FREQUENCY,     SPECTRUM/REAL,   SPECTRUM/IMAG
##SYMBOL=    X,             R,               I
##VAR_TYPE=  INDEPENDENT,   DEPENDENT,       DEPENDENT
##VAR_FORM=  AFFN,          ASDF,            ASDF
##VAR_DIM=   65536,         65536,           65536
##UNITS=     HZ,            ARBITRARY UNITS, ARBITRARY UNITS
##FACTOR=    0.456856943014862, 1,           1
##FIRST=     14782.0589164792, 0,            0
##LAST=      -15158.0608439998, 0,           0
##MIN=       -15158.0608439998, -38752964,   0
##MAX=       14782.0589164792, 394808926,    0
$$ Real data points
##PAGE= N=1
##DATA TABLE= (X++(R..R)), XYDATA
$$ [...]
##PAGE= N=2
##DATA TABLE= (X++(I..I)), XYDATA
38583 -7204638 -7723762 -8765526 -9239940 -6757568 -2348177 57075 -1099322 -2936352
38575 -2936352 -2107956 1145814 3883132 3930212 1510157 -1446515 -2647862 -1001824 2071044
38566 2071044 3333160 749930 -4131585 -7414552 -6677337 -3290887 -615911 -38852
38558 -38852 376016 2653953 5318632 4936204 1173912 -2196232 -2454404 -1608858 -2797027
38549 -2797027 -5204839 -5753205 -4497276 -4475713 -6332388 -6984511 -4562313 -1263224 196014
38540 196014 50152 -310022 -962566 -2291701 -3483749 -4228672 -5766441 -8099984 -8443094
38531 -8443094 -5115037 -979144 50305 -1722463 -3264664 -4019239 -5637797 -7330533
38523 -7330533 -5916200 -924799 4236867 7016815 8055934 7984868 5848925 2368990
38515 2368990 907702 2619156 3841448 1291064 -2851690 -4335657 -3018435 -1943515
38507 -1943515 -1981856 -1523470 -550014 -640453 -983517 1216758 5465156 7262647 4506962
38498 4506962 1013800 1057957 3304264 3463480 1078580 -91163 2062685 5187643 6120977
38489 6120977 4715140 2889983 1761033 1139147 785449 781510 1089800 1730604 3105971
38480 3105971 5276004 7075342 6928188 4852070 2912979 3052074 4844306 6192881
38472 6192881 6095368 5620977 5760656 5604358 3940765 1759452 1099088 1460010 -161696
38463 -161696 -4529192 -7714271 -5697132 -88238 3634980 3324570 2466963 4383483 7079927
38454 7079927 6218093 1469983 -2998991 -3996287 -2590334 -1461357 -1328223 -1372275 -1522979
38445 -1522979 -2290521 -2973483 -2196019 -626041 -1264634 -5578428 -10339431 -10371440 -4781021
38436 -4781021 1325963 2667381 188036 -378471 3853375 9109840 9826093 5307094
38428 5307094 -413591 -3919367 -4888537 -3802777 -575665 3511396 5439539 4111619
38420 4111619 2370005 3034114 4617534 3899476 1543456 1406888 4286020 6388898 5381180
38411 5381180 4156853 5890405 8358898 7080902 2507747 -300216 879624 2564538
38403 2564538 1511174 -163136 1440359 5623162 7662172 5084186 457601 -2303741
38395 -2303741 -2080508 -357746 1054437 974091 -849538 -2847243 -2184498 1945035 6155044
38386 6155044 6036095 1563944 -2646857 -3030808 -958829 222069 -40445 136910 1369524
38377 1369524 2483940 3213945 4482233 5772719 5178512 2908573 1809282 2960336
38369 2960336 3684511 2083457 684629 2428798 5324431 5085524 1778998 -497100
38361 -497100 -158749 161226 -1007697 -1405274 513098 2527107 2357264 1082560 284522
38352 284522 -1101843 -3917611 -5471313 -3057359 845552 1000542 -3519095 -8360730
38344 -8360730 -9949893 -9126781 -8317108 -8204115 -8219513 -7905754 -6716938 -4353649 -2089015
38335 -2089015 -1956677 -3889420 -5411435 -4866560 -3176379 -1689229 -282297 1277376
38327 1277376 1977238 1132319 -108602 -473263 -679356 -2092318 -3987800 -3982271 -1119137
38318 -1119137 2884597 5633401 6270076 5545874 4589328 3981470 3491498 2352031 108630
38309 108630 -2506529 -3825245 -2873640 -779824 50157 -1428262 -3658331 -4603456 -4399233
38300 -4399233 -4460366 -4445675 -2431966 1517496 4657817 5729644 7003359 9867686 11126718
38291 11126718 7316294 866904 -2434001 -1433422 -500405 -2252116 -4155542 -3735542
38283 -3735542 -2743313 -3740180 -6045650 -7787217 -9152255 -10865473 -11827556 -11010439 -9661453
38274 -9661453 -9018214 -7858036 -5102931 -2919947 -3967457 -6799289 -7174803 -3331327
38266 -3331327 2547912 7346427 9232708 7937970 5244463 4226657 5766002 7055629
38258 7055629 5748502 3629569 3190172 2766353 -682732 -5452728 -6758509 -4172254
38250 -4172254 -2336963 -3662122 -5186323 -4145663 -2182046 -1808848 -2360202 -1929732 -514596
38241 -514596 972699 2418366 3402055 2708863 508411 -1386468 -2712712 -5291948 -8923948
38232 -8923948 -10223380 -7772075 -4945254 -4711587 -4974088 -2718524 246093 242583 -1715496
38223 -1715496 -1398354 1534545 2985435 1226326 -393827 1156288 4201844 5163075
38215 5163075 3087744 -295824 -3037250 -3953121 -2702587 -314123 1203360 626593
38207 626593 -1569311 -3945883 -4770929 -2488975 2627207 7304020 7773306 4036363 85793
38198 85793 -565188 1884229 4978906 6885774 7224746 6709803 6742802 7968010 8694966
38189 8694966 6425186 1670375 -1618368 -673835 2630809 4447730 3744748 2647364
38181 2647364 2875983 3816037 4037956 3194983 2097903 1771770 2567359 3635920 3420412
38172 3420412 1258397 -1687729 -3659886 -4218665 -4324201 -4723152 -4930196 -3837728 -968875
38163 -968875 2763561 5366620 5367389 3604851 2816723 4593689 7246865 7892594 6380206
38154 6380206 5470403 6655255 7631826 5486475 1196631 -1355414 -759969 -3621 -2004739
38145 -2004739 -5373097 -6611464 -5138104 -3535324 -3336368 -3442861 -3124443 -3657493 -5483816
38136 -5483816 -6143520 -3366689 1149183 3409512 1926082 -1160543 -3268453 -3650186
38128 -3650186 -2693402 -1038212 251949 242467 -726417 -1602791 -2317155 -3504006 -4584980
38119 -4584980 -3968172 -1680045 -115912 -1171047 -3708907 -4804040 -2848938 1130995
38111 1130995 4643456 5830238 4933725 3812830 3614240 3424113 2112062 687054 1078567
38102 1078567 2986926 4080264 3379859 2176787 1197376 -604576 -3380562 -4909932
38094 -4909932 -3460519 -391792 1653545 1641843 -36393 -2664204 -4365939 -2318787
38086 -2318787 3561470 8636904 8253296 3678289 411197 948507 2369281 1466529 -836432
38077 -836432 -1594399 -149686 1448972 1234065 -800997 -3012430 -3548424 -2079059 -531372
38068 -531372 -1394557 -4940928 -8830412 -10622824 -9811894 -7383081 -4723788 -3335690 -4035062
38059 -4035062 -5421222 -4418080 242321 5815601 8257393 6779020 4316302 3598774
38051 3598774 4321433 4655326 4037457 3231291 2531418 1562240 708252 1001278 2046203
38042 2046203 1784508 -342500 -1441454 1422339 6468627 8434818 4914180 -917200
38034 -917200 -4696321 -5533349 -4878848 -3311284 -1008178 367659 -608752 -2310610 -2019735
38025 -2019735 -383548 -716374 -3534495 -5086518 -2593500 1857073 4440422 4309369
38017 4309369 3070103 1515356 -394242 -1412901 109261 3170883 4446748 2419703
38009 2419703 -570242 -1281880 741939 3384470 4806391 4949811 4773460 5095622 6022792
38000 6022792 6685444 5733752 3017399 609108 872559 3256119 4509130 2942860 933550
37991 933550 1591135 4268816 5794996 5400115 5262406 5953035 4939431 1185642 -2037091
37982 -2037091 -1565806 936508 1773038 774431 575603 1739286 2462827 2390385 2655923
37973 2655923 2325706 -862355 -5633567 -7474424 -5277084 -3522923 -5541573 -8292119
37965 -8292119 -6926552 -1755259 2649771 3428132 1524082 -733884 -1457903 156581
37957 156581 2623976 2847350 146158 -1990869 -555325 2385072 2657826 -82391 -2815523
37948 -2815523 -4318970 -5971799 -7831724 -7880297 -5727476 -3766676 -3767261 -4936827 -6017609
37939 -6017609 -6834869 -7145684 -6291990 -4621568 -3158251 -1546015 1414550 4938344 6447668
37930 6447668 4989455 2037093 -1320636 -5170407 -8443096 -9153659 -7982265 -8309110
37922 -8309110 -11153561 -13140764 -11314634 -7125336 -3661748 -1681497 -575126 -565571 -1428219
37913 -1428219 -1519181 -775651 -2203253 -7208938 -11697031 -10609326 -4936119 -417853 -113007
37904 -113007 -1907470 -2910848 -2607100 -1487750 55033 871709 -67802 -1321769 -31282
37895 -31282 4071332 8023838 9518119 9142985 8239830 6926647 5127694 3424713 1844975
37886 1844975 -407553 -3065802 -4301217 -3115619 -907620 175947 -617653 -2581656
37878 -2581656 -4460840 -5182346 -4854008 -4952957 -6158129 -6544076 -4068256 -439649 354205
37869 354205 -2409325 -5209019 -5522779 -4660527 -3965254 -1767322 3239803 8381514 10002431
37860 10002431 8355628 6481883 5561193 4444816 2877075 1965225 1647402 605803
37852 605803 -1026897 -1399199 37584 1338214 690601 -1354556 -3042273 -3566302 -3338281
37843 -3338281 -2983050 -2736759 -2505243 -2302942 -2687246 -4297739 -6704368 -8556626 -9352835
37834 -9352835 -9848642 -9933369 -7849811 -3241426 623901 285143 -3019338 -4648051 -2614053
37825 -2614053 320308 891091 -922162 -3135980 -4373214 -4108903 -2279637 52480
37817 52480 1128929 645947 84046 72531 -797904 -3304547 -5523513 -5233348 -3135598
37808 -3135598 -1752444 -1888106 -2034773 -879070 1292325 3500830 4847193 4384462 1676105
37799 1676105 -2183385 -5142262 -6115373 -5631728 -4534120 -2944671 -790667 1422434
37791 1422434 2837671 2878709 1444228 -1116189 -3945880 -5916408 -6330021 -5482616 -4443063
37782 -4443063 -4171382 -4781424 -5686835 -6421343 -7038299 -7625874 -7965224 -8078417 -8493832
37773 -8493832 -9210752 -9033287 -7112289 -4680404 -3719565 -4153804 -4257406 -3854154 -4662904
37764 -4662904 -6772550 -7569318 -5902837 -4713139 -6812301 -10078559 -10273654 -7372652
37756 -7372652 -5101585 -4519215 -2533936 2109014 5664664 4762988 1684962 967190 2879244
37747 2879244 3859019 2303527 333104 -19111 860712 2016649 3220278 3711276 2372364
37738 2372364 292408 561306 3803615 6175160 4094941 -674331 -3265481 -1968190
37730 -1968190 587599 2125400 3509319 6076868 8760082 9460796 7789448 4960958
37722 4960958 1980478 -717638 -2543598 -2992498 -2364979 -1401837 -495679 190491 473282
37713 473282 728827 1940523 4185246 5767465 5027746 2468347 -125807 -2051420 -3589992
37704 -3589992 -4021841 -1909199 2191584 5220873 4883026 2176833 -290138 -1374204
37696 -1374204 -1691492 -1885183 -2101444 -2749528 -4274161 -5968855 -6091412 -3706847 -9020
37687 -9020 2529778 2289751 -103559 -2305427 -2280618 -38531 2608569 3846108 3077095
37678 3077095 611309 -2857039 -6013358 -7071044 -5193415 -1555500 1789200 3959977
37670 3959977 5418982 6290484 5752273 3696154 1988810 2734306 5350345 6669260 4563221
37661 4563221 484668 -2593895 -3914784 -4953200 -6036789 -5299161 -1999496 1107100
37653 1107100 683466 -2858020 -5847921 -5775915 -3569543 -1737776 -1786844 -3325164 -4431716
37644 -4431716 -3327240 -970782 -1009287 -5171763 -9856872 -10221181 -6876653 -4714767 -5147661
37635 -5147661 -4273000 -191200 2858309 1021925 -2540669 -2172137 1656683 3307366
37627 3307366 587652 -2446177 -1693506 1918760 4639895 4337388 1731120 -724461
37619 -724461 -566278 2356232 5126184 4916297 2463073 476934 -468140 -1644112 -2545232
37610 -2545232 -1278060 1275817 1608668 -1066938 -3312743 -2941293 -2532628 -5126070 -9244694
37601 -9244694 -11067353 -9733770 -7882253 -8053106 -10532193 -13685610 -14869224 -12243201
37593 -12243201 -7065388 -2833928 -1114853 -167027 1189020 1194991 -1189245 -3153662 -1840392
37584 -1840392 919817 1474701 409703 1508981 5360464 8414015 8686471 8149606 8266464
37575 8266464 7009421 2442164 -3534404 -7332352 -7746982 -6054213 -3763228 -2157645
37567 -2157645 -2572919 -4938524 -6808605 -5735847 -2236576 1089987 2971309 4411488
37559 4411488 6346752 7984907 8090365 6894975 5825075 5636899 5657698 5173704 4950460
37550 4950460 6402985 9170834 10706951 9162246 5814684 3410189 2796820 2839938 3179531
37541 3179531 4764479 7280172 8451147 7184633 5452205 5311615 5703079 4455229
37533 4455229 2222185 1463845 1854155 142720 -4335587 -7212408 -4684525 555736
37525 555736 2438942 -93551 -1575149 2151551 7908841 9394152 5288268 112191
37517 112191 -2132301 -2056892 -2431980 -4428617 -7312108 -9769295 -10307686 -7982819 -3970473
37508 -3970473 -998411 -36717 968042 3732739 6654862 7098042 5361506 4068139
37500 4068139 4330857 4889840 4777341 4503095 4440054 4187869 3983419 4762433 6120659
37491 6120659 6030508 3638837 947388 487321 2182556 3617080 2976324 884932 -601613
37482 -601613 -451843 30941 -1310919 -4558396 -7160003 -7054611 -5269989 -4048865 -3506448
37473 -3506448 -2306024 -938618 -1484218 -3921253 -5554944 -5006903 -4084602 -4334022 -4346380
37464 -4346380 -2511841 -238251 163185 -732752 -649619 238742 -638291 -3864000 -6344708
37455 -6344708 -5072183 -928817 2458499 2784426 935341 -832098 -1526672 -1711463 -1614600
37446 -1614600 -228658 2819742 5480796 5224910 2637691 940552 1449007 1827577 -6220
37437 -6220 -2623647 -3627496 -3354758 -3502715 -3664591 -2264714 -55803 483200 -977173
37428 -977173 -2291675 -2420497 -2374660 -2326507 -1016688 1065165 1187853 -1256156 -2819379
37419 -2819379 -716775 2946090 4352136 3398579 2735838 2706604 1047855 -2374045 -4231672
37410 -4231672 -2488793 271111 322151 -2055469 -3148189 -910110 2567262 3995729
37402 3995729 2823205 1289880 1199910 1838962 1518367 368719 305646 1973037 3083164
37393 3083164 1136694 -2819188 -4910046 -3152720 208774 1943163 1911990 2339323 3942550
37384 3942550 4924162 3911081 1888474 286746 -1308827 -4033475 -7173584 -8480017
37376 -8480017 -7074417 -4614741 -3084007 -2476565 -1429782 524279 2290157 2709618
37368 2709618 2012833 1441903 1662828 1961271 1306875 79239 71479 2305169 5366338
37359 5366338 6826971 6207578 5497880 6467727 8443136 9351952 8174301 5519949 2377043
37350 2377043 -555996 -2364161 -1954684 629734 3329873 3371741 -38469 -4441680 -6078962
37341 -6078962 -3429059 1495525 5599006 7763328 8696124 8440474 5716888 112355
37333 112355 -6384391 -10776533 -11281658 -7999794 -2665170 1718349 2509023 -58802 -2891076
37324 -2891076 -3531496 -2642539 -2155153 -2551568 -3545483 -5766049 -9234912 -11230903 -8787468
37315 -8787468 -3275659 460828 122230 -1559874 -1205260 1007055 2918181 3735914 3782465
37306 3782465 2707132 227347 -2379327 -3474185 -3037667 -1972857 -456245 1376691
37298 1376691 2239115 1228200 -317743 -687440 -800294 -2862851 -6418338 -8457327 -7554638
37289 -7554638 -5163355 -2462485 951745 4144162 3925092 -751173 -5875957 -6779847
37281 -6779847 -3941730 -1485911 -968061 -103450 2332427 3850318 1924448 -2076203
37273 -2076203 -4535231 -3902549 -1749369 -255050 -49340 -287135 151054 1500415 2635968
37264 2635968 2027433 -367810 -2532624 -2261970 574882 3981011 5792011 5424433 3937230
37255 3937230 2586579 1284900 -1111098 -4477114 -6218769 -4038782 316535 2392819
37247 2392819 893366 -175480 3037705 8733132 12059714 11752906 10797217 10865346 9865092
37238 9865092 6146809 1999593 748850 2233248 3391154 2324673 -150788 -2366242
37230 -2366242 -3356327 -2687636 -327480 2850486 5242469 5661857 4238759 2282410 1213029
37221 1213029 1176018 764840 -1172548 -3567165 -4097986 -2218070 180126 1408284 1587526
37212 1587526 1029230 -848072 -3586554 -4707286 -2825951 -307208 -376622 -2579668 -3715828
37203 -3715828 -2660628 -1417981 -1479121 -2099620 -2770401 -4568207 -7742784 -10217731 -10146379
37194 -10146379 -8374353 -6799668 -5574351 -3583040 -855850 1099458 1124269 -416127
37186 -416127 -1988398 -1826565 836780 4732036 7347512 7462750 6281779 5477033 5073429
37177 5073429 4271268 3449772 3770397 4961855 5006011 2600952 -852433 -2432639 -811525
37168 -811525 2153302 3231244 1271430 -1640389 -2907165 -2574958 -2538271 -3034344 -1996647
37159 -1996647 1376712 4312462 3406261 -1036494 -5174017 -5689031 -2431219 2406832
37151 2406832 6166235 6912712 4354329 125947 -3563535 -5691126 -6366747 -5697781 -4047621
37142 -4047621 -3064238 -4550218 -7795276 -9646583 -8152020 -4856856 -2421178 -1164530
37134 -1164530 503239 2990538 4700390 4271831 2109713 -559256 -2765172 -3552384
37126 -3552384 -2200019 361557 1588044 68004 -2588029 -3905576 -3781789 -3859349 -4235156
37117 -4235156 -3103780 -33565 2618431 2647450 646034 -1516545 -3228512 -4538573
37109 -4538573 -4514845 -2479277 -165872 -250403 -2661438 -4386018 -3392141 -1082762 -172406
37100 -172406 -1339694 -2708543 -1995089 1143783 4491987 5299431 3502121 2045742 2864471
37091 2864471 3795974 1644344 -2637356 -4818521 -3301973 -849529 219943 1047330
37083 1047330 2885144 4062370 2808323 483806 -926224 -2461301 -6047146 -10187002
37075 -10187002 -11354465 -9045883 -6080016 -4099951 -2161716 -53757 483818 -957290
37067 -957290 -1896620 -406172 2106273 3288256 3098034 2707378 1747532 -926330 -4468245
37058 -4468245 -6401994 -5775190 -4075432 -2722454 -1377134 537501 2105245 1974902
37050 1974902 370815 -1285129 -2468865 -3931102 -5860263 -7060597 -6644298 -5313932
37042 -5313932 -3782722 -951373 4418603 10402732 12462926 8325696 1044585 -3939389
37034 -3939389 -4091837 -1281087 1269217 2297419 2826651 4107644 5860593 6757189 6416300
37025 6416300 5952150 5861248 4527754 562134 -4077012 -5734179 -3865820 -1480343 -115413
37016 -115413 2505578 7935444 12851787 12406319 6382251 -636705 -4482963 -4619042 -2972668
37007 -2972668 -1873179 -2770159 -5079743 -6539691 -5958313 -4658657 -3881637 -2487458 602603
36998 602603 3473174 3686932 2309475 2107200 2823085 2114848 570984 1372500 4673757
36989 4673757 6787529 6058114 5247192 6286936 6742864 4159343 587511 -349528 1476678
36980 1476678 3558227 4858129 6228320 7994535 9534499 10296770 9532963 6458549
36972 6458549 2301795 190990 873530 694434 -3374432 -8592694 -9706126 -6024652
36964 -6024652 -1621922 738063 1933902 2760453 1936574 -979062 -3942711 -5300108
36956 -5300108 -5758773 -5940431 -4450851 -519244 3358292 3987719 1726023 -226858 -352840
36947 -352840 -269068 -1450323 -2809643 -2726880 -1835385 -1957555 -2973381 -2755988 -402659
36938 -402659 2322618 3596875 3926864 4491385 4502170 2449104 -612931 -1541985 801944
36929 801944 4106211 5856600 5975302 5325241 3716851 970620 -1615304 -2605283 -2245157
36920 -2245157 -1583471 -848148 -84584 -306703 -2366170 -5354206 -7448215 -7657674 -5800315
36911 -5800315 -2093306 1850334 3162395 849833 -2390398 -3497087 -2896473 -2690563
36903 -2690563 -2521723 -698336 1257519 -637442 -6635188 -11399983 -10220244 -4630878
36895 -4630878 -11259 493618 -2105889 -5059840 -6118226 -4363666 -754014 2441904
36887 2441904 3880718 4396732 5314584 6388666 6330401 4512505 1256314 -2528625 -4961267
36878 -4961267 -3816634 698223 4780409 4882696 2406288 2150745 5707750 8830447
36870 8830447 6740389 223815 -5524367 -7098338 -5722262 -4247336 -3779987 -4028188
36862 -4028188 -4829565 -5654953 -4975200 -2193004 493561 421765 -1450231 -1266773 2222801
36853 2222801 5322801 4192580 147177 -2055341 -205806 3347264 5252251 4522544
36845 4522544 2305214 318855 -23084 1365210 2524041 1268166 -1732056 -3344583
36837 -3344583 -2220531 -739149 -1235592 -2104584 -234712 3459215 4074529 -843035 -7331892
36828 -7331892 -9297285 -5407722 204329 3290787 3273537 1798042 51407 -1380463
36820 -1380463 -1945708 -2186582 -4183058 -9037247 -14543939 -17202638 -16229034 -13813962 -11666771
36811 -11666771 -9327934 -6035703 -2159050 1831078 5934879 9339643 10262826 8147556
36803 8147556 4762931 2300505 1539178 2324087 4164227 5581328 4658409 1405754 -1790719
36794 -1790719 -2915204 -2044419 76816 2882862 4623094 3051619 -862298 -2735048
36786 -2735048 -439699 2793786 3496202 3152716 4753310 6894521 5953857 2509414 646758
36777 646758 1494174 2234560 1515191 1095222 1563010 1126192 -85441 976802 4954583
36768 4954583 7701758 5814118 1439102 -1067601 -723409 498152 1492897 2507513
36760 2507513 3072379 2103077 -336465 -3014844 -4806444 -4999363 -3303475 -630581 1072152
36751 1072152 794774 -475864 -1284339 -1308994 -894702 -108852 1070421 2424448 3604599
36742 3604599 3861851 2181359 -956639 -2709047 -821810 3109244 5639115 5990526
36734 5990526 5650573 4324609 431051 -4327583 -5603909 -2790913 -206827 -158847 411091
36725 411091 3651435 5894880 3112852 -2311755 -4865092 -3560679 -1914276 -1996695 -2792384
36716 -2792384 -3432178 -4094247 -4143956 -2696732 -729306 62523 -57243 269810 887950
36707 887950 848578 647115 1158464 1460360 359082 -1084100 -1254445 -912429 -1503879
36698 -1503879 -1910866 -235934 2222563 2314826 -248951 -2835197 -3967320 -4246466 -3850731
36689 -3850731 -2521199 -1535872 -2263828 -3226584 -2111561 -123218 -345809 -2079046 -1247228
36680 -1247228 3101253 7040914 7525816 5928694 4551525 3309208 1492118 -328928
36672 -328928 -1660053 -2627495 -2262664 694292 4506795 5517289 3616430 2863354 5194677
36663 5194677 7515314 7030494 5320246 4378811 2684728 -1060476 -3760377 -2091255
36655 -2091255 1453881 1535472 -2114984 -4412365 -2530107 408401 249467 -2854200 -5632990
36646 -5632990 -6080551 -4911941 -3729577 -3267603 -3372145 -3771356 -4204940 -3853331 -1628095
36637 -1628095 2010554 4278622 2796268 -1141235 -3971476 -4565548 -5122784 -6836611
36629 -6836611 -7484584 -4944078 -738226 2157975 3378283 4596958 5930992 5490511
36621 5490511 2580909 -486694 -474700 3387385 8236558 9972058 7415521 3788652
36613 3788652 3014986 5178880 7529983 9291670 12205831 15844095 16246634 11418715
36605 11418715 5203973 2821364 4531474 6491565 6284303 4710907 3208601 2406016
36597 2406016 2841178 4691946 6818470 7688813 6909174 4716805 1142208 -2744795 -4210886
36588 -4210886 -1760755 2263609 4217436 3552148 2543752 2468015 2586004 2571268 3308648
36579 3308648 4876390 5721848 4507435 1712880 -736014 -841009 1726188 4413740
36571 4413740 3619093 -911747 -4980849 -4997439 -2492602 -1232615 -1544020 -877341 932272
36562 932272 937813 -1999750 -5003710 -5020384 -2328491 803014 2762316 2943001 1520299
36553 1520299 61983 779411 4069584 7827515 9687103 8910836 6147502 2902698
36545 2902698 1200528 1860441 2978316 2107019 -52640 -686693 106369 -1382386 -6566025
36536 -6566025 -10995103 -9526970 -3283757 1619456 1620273 -868965 -1741066 -313398 1050286
36527 1050286 829170 54989 322566 1473035 1966509 990090 -694029 -1957240 -2510432
36518 -2510432 -2668984 -2691291 -2697931 -2553914 -1677267 36013 1061542 -280201 -2767856
36509 -2767856 -3010676 -471636 862083 -1890531 -5688452 -5706891 -2382308 -190806 -515648
36500 -515648 -551124 667835 292331 -2844048 -5462127 -5051247 -3860844 -4587468 -5500156
36491 -5500156 -3726726 -914560 -1192273 -4586802 -6731025 -5272992 -3022949 -3736532
36483 -3736532 -7290419 -10315642 -10159946 -7274924 -4469875 -4204336 -6111766 -7382240
36475 -7382240 -6137685 -3704719 -2610503 -3342105 -4637176 -6026540 -7817524 -8912433
36467 -8912433 -7343762 -3641196 -1299978 -2572181 -5548565 -6919015 -6163333 -5190279
36459 -5190279 -4934233 -4582739 -3838097 -3590570 -3860834 -3124767 -778582 1290950 1020771
36450 1020771 -1034432 -2737010 -3346726 -3728352 -4144278 -3908053 -3278410 -3643069 -5221620
36441 -5221620 -6301033 -5513253 -3406352 -1113275 912251 2081818 1470815 -407873
36433 -407873 -1438502 -886431 -665150 -1938570 -2541436 -269537 2946971 3232289 203500
36424 203500 -2888701 -4029657 -4279440 -4582009 -3845474 -1228223 1943418 3758633 3858494
36415 3858494 3292756 3250915 4133653 5103069 5035203 4700868 6477379 10231063 11549431
36406 11549431 7114020 261973 -2641741 -443518 2430825 3289713 3822343 4922928
36398 4922928 4233041 841802 -2145296 -2312813 -1360747 -1205336 -321815 2964645 6652510
36389 6652510 7733069 6241418 3913277 1323377 -994862 -1322482 389139 1040802
36381 1040802 -1175373 -3471614 -2865624 -1212402 -2068266 -4865348 -6277266 -5500621 -4101221
36372 -4101221 -2268858 621631 3148614 3668438 3633551 4972048 5803155 3529156 733967
36363 733967 2392708 7731038 10644428 8529833 5052861 3289048 1847146 -502038
36355 -502038 -1854707 -1412572 -1915201 -4840037 -7225414 -6346346 -3922180 -2517924 -1222509
36346 -1222509 1449030 3278539 1137640 -3673889 -6699120 -6056884 -3855223 -2547806
36338 -2547806 -2442278 -2328305 -569217 3796380 9397285 12859084 12240778 9035368 5589763
36329 5589763 2387886 -484663 -1481259 184162 2228341 2124163 887534 1075250 2300742
36320 2300742 2247319 1307649 2119486 4296840 3846965 -695295 -5192996 -5400787 -2847227
36311 -2847227 -2199667 -4361495 -5613711 -3463698 -187241 674106 -838923 -1757618 -681020
36302 -681020 632189 320112 -957313 -1536272 -1431159 -1835628 -2708823 -2724904 -1494103
36293 -1494103 -61855 1044019 2581991 4851141 6676464 6950879 6040557 4947259
36285 4947259 4137456 3789513 4000914 4065195 2802182 455274 -918180 139473 2722062
36276 2722062 4927908 5765829 5041948 3016043 1220450 1751019 4156808 4885814 2005627
36267 2005627 -1166301 -56048 4465594 6740594 3892580 -442747 -1248732 1413667
36259 1413667 3106961 1080922 -2298685 -2358065 2547432 8996763 11869086 9527800
36251 9527800 5040909 2177783 1430845 888501 -298639 -1202550 -1222075 -736190 367339
36242 367339 2674359 5199669 5382253 2306284 -1529790 -3023725 -2092010 -1204204 -2018853
36233 -2018853 -3840506 -5103967 -5113046 -4201447 -3119034 -2592021 -2990436 -4151705 -5587042
36224 -5587042 -6626891 -6219244 -3330616 1535379 5633721 6191126 3672321 1610904
36216 1610904 2437184 4588239 4925470 2992273 1031120 342330 118868 198065 2065784
36207 2065784 5528182 7021712 4046884 -457213 -1605129 454984 998218 -1673966
36199 -1673966 -3366571 -402951 4809346 7345660 6095684 3364585 349678 -3155649
36191 -3155649 -5702720 -5022072 -2217218 -1517981 -4604954 -7884353 -7028314 -2330808 2111185
36182 2111185 3263561 1591092 -619404 -1796227 -1856883 -1352913 -377944 1490456 4177179
36173 4177179 6608421 7733435 7490660 6064252 3016336 -1509564 -5352770 -5982613
36165 -5982613 -3632831 -1079504 -102603 14044 104900 -527558 -2243115 -3536677 -3127125
36156 -3127125 -2096304 -1974794 -1914544 -232738 1882521 1170898 -2758167 -6108095 -5944223
36147 -5944223 -4221743 -4581903 -6896034 -8047271 -7419140 -7935045 -10741391 -12266589 -8962065
36138 -8962065 -2653590 1837491 3009356 3289322 4035833 3809038 2196697 1551343 3045734
36129 3045734 4020410 1816229 -1864542 -3171905 -1368318 681641 497705 -1703947
36121 -1703947 -4079347 -4804790 -3467297 -2241911 -4199234 -8694808 -10632409 -7144467
36113 -7144467 -2762133 -3758742 -8776367 -10236853 -5062866 1336827 3098134 1031836
36105 1031836 -489198 501701 3499455 7780972 11614336 12276104 9953292 8733865
36097 8733865 10519675 11094172 6281853 -812491 -3664381 -1460105 1059849 1739284
36089 1739284 2940125 5106348 4613341 121793 -4114744 -4356208 -2732982 -2992541 -4091380
36080 -4091380 -2191971 2647405 5836137 4160906 -531507 -3889332 -3498099 -601067
36072 -601067 1418352 274955 -2883334 -4868705 -4421587 -3406065 -3432461 -3302575 -1381783
36063 -1381783 1279071 2332240 1340530 -611475 -3288084 -6657123 -8731031 -7108383
36055 -7108383 -2692867 808828 1377510 252860 -1074838 -2491026 -3173038 -1121078
36047 -1121078 3312400 5914121 3191900 -2862605 -6863259 -6116731 -2732878 -315099
36039 -315099 -502783 -2629258 -5048396 -6383807 -6392422 -5799889 -4933613 -3116346 -192385
36030 -192385 2107851 1717914 -951765 -2928901 -1741574 1932704 4763776 3813811 -447630
36021 -447630 -3968505 -2733582 3005356 8887172 11078976 9548325 6433584 3213420
36013 3213420 762484 173578 1407956 2586292 2751181 3709830 6468485 7645688 3438417
36004 3438417 -3647460 -6770942 -4087339 -1390647 -3494836 -7305042 -6805751 -1787106
35996 -1787106 2536423 3022981 1678348 1525216 2850683 4264854 5010074 5045227 4233031
35987 4233031 2583982 919805 636251 2387737 4705009 4585293 849267 -3361615
35979 -3361615 -3611423 -119043 1988282 -247957 -3095647 -1311108 4264899 7680998
35971 7680998 5494739 151711 -3951889 -4683641 -2274584 1760668 4870096 5044394
35963 5044394 3400414 3449031 6621743 9927763 9321639 4538318 -558897 -2136841 -134076
35954 -134076 2252723 2493026 1480588 1681721 3237377 3955669 3429165 4361592 8154519
35945 8154519 11807252 11866350 9305693 7212101 5474021 1881552 -2639410 -4678597
35937 -4678597 -4141035 -4449652 -6106173 -5140128 -84047 4225676 3168472 -977422 -2776812
35928 -2776812 -1475927 -929186 -3162976 -6088870 -7305173 -6779938 -5461125 -3849669
35920 -3849669 -2457550 -1703439 -872983 1334688 4904989 8284465 10108497 10122262 8533459
35911 8533459 5679263 2546219 721191 1369994 4316542 7917958 9896699 8999285
35903 8999285 5983369 2279474 -1999627 -7200491 -11419324 -11140505 -5764135 545311
35895 545311 3242591 2197854 549395 250698 706383 798962 266293 -494040 -640433
35886 -640433 420614 1554688 428874 -3108693 -5765664 -4827312 -1919874 -414975
35878 -414975 -508045 98694 1486102 1080838 -1784945 -4168090 -3572560 -1253246 7957
35869 7957 -337198 -581246 614244 2882616 4821039 5045731 2993709 -505060 -3416406
35860 -3416406 -3715436 -997808 2587294 3454103 55239 -4516816 -5206809 -1172380 2708123
35851 2708123 2054514 -1416011 -2981536 -1722852 -677461 -1044031 -356823 2860483 6155094
35842 6155094 6485633 4039398 1098568 -969794 -1964450 -1580434 414469 3394672 6242979
35833 6242979 8000912 7974551 6282629 4423137 3831660 3675751 1903549 -1058395 -1848416
35824 -1848416 1402097 6067178 8027449 6245998 2759369 -572579 -3296940 -5056834
35816 -5056834 -5150707 -3618201 -1487570 273550 1253337 1180491 37682 -1252723 -1211004
35807 -1211004 501019 2197345 1817714 -290495 -995691 2152915 7229514 9254145
35799 9254145 6011725 1153130 17378 3356517 7053442 7483269 5069791 2595624
35791 2595624 2015855 3308620 4852386 4632862 2440276 730925 1683683 3948094 4786292
35782 4786292 5044019 8374793 14683536 18297724 15124013 8537243 4897943 5368278
35774 5368278 5877973 4014702 1883950 1856895 2985625 3045452 1852783 910632 981157
35765 981157 1363504 1034409 -343553 -2226814 -3500291 -3243708 -1527305 671862 2425818
35756 2425818 3595456 4663989 5963342 6970421 6401951 3429639 -1005389 -4490287
35748 -4490287 -5068879 -2773779 601437 2790703 2410786 49814 -1858456 -1281744 949012
35739 949012 1958507 569626 -940162 308845 4145452 7674891 8661940 7372066
35731 7372066 5245779 3026862 791844 -802031 -362996 2491585 5582057 5596841 1804972
35722 1804972 -2520954 -3466427 -679186 2893034 4756328 4798827 3904011 2482755 552386
35713 552386 -2019621 -5212442 -7705502 -7044762 -2917826 833074 306842 -3073051 -4628920
35704 -4628920 -3338328 -2422965 -2948980 -2089679 675796 1125056 -2779174 -6425305 -5298861
35695 -5298861 -2097590 -2110890 -4898457 -6324274 -6342417 -8239339 -11308917 -11032423 -6805945
35686 -6805945 -3132916 -1939641 167213 4718647 7203972 3769164 -2229114 -4638020
35678 -4638020 -2643616 -374089 -220053 -629021 27939 916480 673647 -288956 -370154
35669 -370154 1065137 2575391 1909797 -1198566 -4096835 -4289054 -2722918 -1956541 -1806179
35660 -1806179 -155476 1834852 -230952 -6797654 -11421693 -8619033 -1683346 1608069
35652 1608069 -745748 -3620403 -2940855 -392633 762505 305737 -421190 -1414067 -2899880
35643 -2899880 -3378994 -1458020 1262105 1527000 -1295458 -3989943 -3069465 1429079 6356694
35634 6356694 9063297 9679293 9742124 9688067 8916978 7834906 7797676 8353352 6666356
35625 6666356 1527965 -3675924 -4652411 -1980287 -51060 -363253 401845 4439969 8669060
35616 8669060 9120442 6651510 4950345 4907292 4857366 5039373 7101038 9216901 6751773
35607 6751773 -528928 -6265180 -5289916 -263391 2632166 1830795 504015 631092 1208534
35598 1208534 1508928 2117068 2753404 2374948 1409016 884522 -213784 -3231383 -5921475
35589 -5921475 -4526123 -66017 2108900 155867 -1660911 -84119 2348292 2616744
35581 2616744 2696521 5541183 9204746 9724264 7412762 5658086 5233429 4208411 2138014
35572 2138014 170360 -1744196 -3712575 -3475080 412158 4389684 3931159 743424
35564 743424 371502 3114031 3584484 -59256 -2994445 -1865849 62266 -915307 -2813108
35555 -2813108 -1919149 1191718 3603926 4722769 5156467 3901234 609752 -1839151
35547 -1839151 -1089996 417490 -1026942 -4313117 -5142496 -2587226 167337 997890 688335
35538 688335 -174474 -2039102 -3646167 -2325923 1696894 4480439 3482383 988757 635202
35529 635202 2452318 3391483 1659227 -1324847 -2918549 -1929924 587318 2440911 2361050
35520 2361050 1459715 2235620 5401380 8083560 6501081 869732 -3809469 -3460554 -564888
35511 -564888 -1401883 -7266823 -11773379 -9200748 -2617040 292408 -2190701 -4483569
35503 -4483569 -2938708 -870747 -2254547 -5185212 -5311455 -2618273 -699996 -1071880
35495 -1071880 -2069215 -2545667 -3163446 -4052787 -3985842 -2283419 300227 2747311 4489667
35486 4489667 5157110 4785276 3969131 3072113 2075287 1724856 3219454 5785489 6554650
35477 6554650 4408917 1977164 1928769 3313957 3876210 3953921 5169341 6848241 6978756
35468 6978756 5720603 4887840 4739084 4235013 3691582 4106893 4516791 3180744 876467
35459 876467 -177605 -146956 -890856 -1940284 -1135011 709261 144685 -3009535 -4455054
35450 -4455054 -1936541 882836 -332090 -4480679 -7138730 -6716657 -5521546 -5756102
35442 -5756102 -7011397 -7413240 -5556476 -1529056 2893652 5451322 5522286 4481219 3512446
35433 3512446 2141262 -250536 -2514824 -2702492 -709383 1129758 543013 -1961772
35425 -1961772 -3658573 -3307274 -3269235 -6193143 -10155374 -10161513 -5315418 -976667 -1535584
35416 -1535584 -4471926 -5072599 -3860681 -4394969 -5939540 -4442919 -186012 1867257
35408 1867257 105319 -1321440 300361 2423106 2977833 4275642 7753325 9936189
35400 9936189 7954125 4814257 4424688 5080701 3300285 1120267 3253668 8482879
35392 8482879 10402434 6898387 2966783 2804017 4379298 4210504 3059202 3462008 4703040
35383 4703040 4236185 2630995 3167964 6463272 8853079 7389979 3971744 2386842
35375 2386842 2804026 2106594 -530123 -1714885 1062018 5191800 6476261 5039566
35367 5039566 4354012 5257594 4792164 1472584 -1752242 -1300894 2556530 6306402 6676737
35358 6676737 2968253 -2283570 -4764850 -2607429 917326 1467302 -126226 552052
35350 552052 3789682 4721035 1432130 -1282438 691746 4355325 4586916 1749346 -217000
35341 -217000 -295405 -227931 -105013 1099170 2127188 1004696 -1299191 -2898575 -5036873
35332 -5036873 -9424744 -12970413 -10697574 -3689972 1264419 615569 -2257410 -3328620
35324 -3328620 -3077314 -3408692 -3577309 -1998854 488880 1706249 1060539 -112513 -95955
35315 -95955 1836567 4383745 4794532 2225635 -151792 1113311 4577986 5658648 3290174
35306 3290174 1183376 2080275 4481788 5952008 5969007 4170603 -516870 -6873822 -10551826
35297 -10551826 -8720939 -3573096 569636 1699741 391195 -1882446 -2920455 -572414
35289 -572414 4568534 8861018 9570549 7552069 4981900 2697545 1106367 1094243 2075879
35280 2075879 1561112 -1115407 -2905552 -1355242 1353063 1525438 -687059 -2217145
35272 -2217145 -1981003 -1408464 -868308 763788 2796806 2397458 -1253153 -4915833 -4911762
35263 -4911762 -1389861 2145154 2568951 -460779 -4909383 -8067929 -8205761 -5583608
35255 -5583608 -2222380 -262147 -31030 239861 2275114 5303614 6636562 5066819
35247 5066819 2424892 764735 -503405 -2812231 -5093921 -5024477 -3086793 -2282201 -3580994
35238 -3580994 -4752213 -4373814 -3874567 -4526722 -5597891 -6944207 -10029374 -14161773 -15096832
35229 -15096832 -10596633 -4710449 -2817770 -4435226 -5057524 -3760599 -4183547 -7812330
35221 -7812330 -10794541 -9077235 -3608313 1445119 3521370 2989703 1319074 -195300
35213 -195300 -689861 -271061 -78826 -853487 -1617845 -597197 2510509 5846653 7310744
35204 7310744 6738226 5533084 4369631 2531046 119646 -593732 2201313 6716252
35196 6716252 9271829 8866205 7626968 6708731 4732453 1207394 -1520577 -1573248 -392624
35187 -392624 -241191 -925714 -1196127 -1408369 -2135816 -1709806 1772265 6661734 8778036
35178 8778036 6210060 1150321 -2819197 -3584153 -1177468 2486683 4718281 4349408
35170 4349408 2721079 1525659 657658 -744484 -2632020 -4940491 -8418778 -12501990
35162 -12501990 -14060600 -10949351 -5626007 -2508851 -2618445 -3465833 -3316399 -2678738 -2243506
35153 -2243506 -2247347 -3346887 -5265221 -5206712 -820599 5580937 9019497 8004136 5580837
35144 5580837 4396680 4135171 3999001 4146548 3990317 2309274 -247001 -1752812 -2397868
35135 -2397868 -3922785 -5500719 -4323745 -1042215 1870 -2379391 -3783700 -1141196
35127 -1141196 2344990 2576470 1004089 1512679 3802279 4469556 2870763 1431493 1040142
35118 1040142 272092 -980130 -714580 1894408 5045817 6535320 5600067 2793527 -174960
35109 -174960 -1063776 438661 1513233 -421729 -3842433 -4972854 -2922448 -378586
35101 -378586 508721 117405 -880137 -2752499 -4757860 -4486845 -785337 4085991 6510636
35092 6510636 4905931 458471 -4371423 -7312897 -7295118 -5013274 -2127877 466628
35084 466628 3027902 5517603 6828671 6149147 4347616 3051152 2596387 1821515 104946
35075 104946 -1215780 -318173 2491824 4883544 5641133 6284394 8294927 10052515 8816212
35066 8816212 5157823 2565496 2332317 1875009 -711789 -3442047 -3808551 -2729496 -2398728
35057 -2398728 -2284744 -578003 1704818 1751563 -175723 -359419 3265727 8380604 11570135
35048 11570135 12111516 11390415 10276952 8396101 5252502 1406795 -1220662 -695639
35040 -695639 2447294 4976294 4691749 3361753 3818692 5145101 3860737 -292823 -3310659
35031 -3310659 -2515024 168284 2059265 3654957 6317241 8674011 8514580 6768823
35023 6768823 6379805 7815149 8605627 7291560 5217983 4074998 4033527 4993214 7376173
35014 7376173 10343971 11076351 7795438 2625054 -473635 -328804 708145 773516 1120554
35005 1120554 3489994 6463041 6671961 3329223 -591202 -2147638 -1535745 -524279
34997 -524279 405849 1795453 3366652 4318493 4760013 5144708 4922651 3583652 2415967
34988 2415967 3014545 4395205 4165249 2595236 2502852 4300028 4466820 969171 -2668685
34979 -2668685 -1784257 2732541 5688023 4789849 2939437 2925109 3359988 1724969 -1039732
34970 -1039732 -1640670 800293 3468085 3487039 1156979 -1020255 -1458002 -815209 -683727
34961 -683727 -1681334 -2885483 -2854047 -1168412 958237 1741416 590487 -1433833 -3094507
34952 -3094507 -4424134 -6068421 -7563783 -7503782 -5823056 -4711620 -6062267 -8566008
34944 -8566008 -8813065 -5485601 -1227536 354190 -1249365 -3306384 -3373337 -1841155 -686527
34935 -686527 -719303 -1177459 -1745828 -3402633 -6398967 -8590904 -7498507 -3724626 -467651
34926 -467651 703499 1695365 4525932 7830021 8459023 5677423 2055331 485578 1573931
34917 1573931 3707952 4698731 3720890 2360162 2953381 5227353 6178693 4661918 4044040
34908 4044040 7662786 13230842 15311442 12681934 9298254 7784664 6206225 2605347
34900 2605347 -1259904 -3041381 -3477033 -4254997 -4774988 -3925163 -3033547 -4028476 -6138271
34891 -6138271 -7238403 -7178099 -6995385 -6124695 -3476830 -351181 952090 836211 1497849
34882 1497849 2753504 2321109 310822 -365839 1107776 1834059 23231 -1926202 -1384123
34873 -1384123 310234 381993 -762278 -629776 841025 1142206 -564529 -1978192 -1132421
34864 -1132421 869101 1745839 1142683 405735 82224 -719370 -2343629 -3358114 -2353211
34855 -2353211 -348096 91418 -1573235 -2632687 -585444 3254030 5227850 3946554
34847 3946554 1698351 1260130 2932133 4965965 5396841 3198767 -667050 -2916013
34839 -2916013 -616842 4860967 8478362 7449105 4772722 5109327 8665534 11398192
34831 11398192 10285668 6009150 950279 -2943176 -4263578 -2601956 354156 2014029
34823 2014029 1900185 1887934 2881992 3226777 1624347 -185687 380283 2854575 4098103
34814 4098103 2414235 -475048 -1888988 -1268826 -188929 -199581 -1394005 -2733484 -3257177
34805 -3257177 -3006004 -2826371 -3140377 -3194079 -2097791 -404940 319003 -339450 -1097585
34796 -1097585 -1247976 -2144042 -4851739 -7117477 -5024283 1797361 8596491 10456477
34788 10456477 7548996 4032794 2824522 3353235 3922094 4046714 4069297 4165996 4311119
34779 4311119 3932222 1441063 -4038756 -9952420 -11639299 -7906704 -3336273 -2881868
34771 -2881868 -5599215 -6306058 -2580934 2804498 6223893 6877426 5551909 2782512
34763 2782512 -118849 -633808 2069589 5238471 5701407 3991844 3256565 4810176 7059804
34754 7059804 8522309 9385295 9657635 8245260 5194899 2990523 3688312 5728640 5638975
34745 5638975 2722331 79315 361300 2178784 2182467 -160808 -1832682 -598538 1685893
34736 1685893 1425897 -2046816 -5921334 -7765811 -7960666 -7722287 -6665409 -3922912 -489943
34727 -489943 1562752 1890526 2064283 2875651 3206239 2103993 399262 -682658 -1252141
34718 -1252141 -1908064 -2136697 -1069150 601449 1095371 180331 -89854 1850036 4422741
34709 4422741 4331861 692032 -3378256 -4050396 -1075354 2296703 3476919 3074156 2698940
34700 2698940 2024690 -69012 -2434025 -2425267 -34971 1269372 -933188 -4649565 -6284393
34691 -6284393 -5219163 -3563232 -2582510 -1887092 -1614851 -2671590 -4461175 -4813791 -3020806
34682 -3020806 -865505 425330 2184347 5581268 8600582 8103797 4241358 604919
34674 604919 26064 2050730 4645532 6431152 6651117 4890497 2181624 1042817 2739789
34665 2739789 5190861 5203473 2449585 -379314 -1209922 -512544 695162 2625208 5294579
34656 5294579 7134501 6939144 6058854 6474921 7355990 5998555 2143375 -1217778 -1911009
34647 -1911009 -994409 -145509 786962 1941638 1613906 -1107925 -3542432 -2297605 1808268
34638 1808268 4628210 4228432 2729686 2496078 3301649 3948664 4176333 3984332 3234094
34629 3234094 2909915 4646036 7850338 9389442 7546990 4379742 2587951 1901874
34621 1901874 414348 -2142702 -4515202 -5995573 -6336242 -4841732 -1761738 461101
34613 461101 -281641 -2713465 -3917234 -3357234 -2656304 -2072778 -238908 2675159 4678731
34604 4678731 5350591 6512345 8585986 9214910 7048688 4341389 3817958 4982821 5634849
34595 5634849 5378807 5362478 5747249 5768613 5596662 6002081 6552089 5957155 3916259 1126701
34585 1126701 -1906057 -4400012 -4546853 -1581403 1909163 2493145 732924 508856 2907111
34576 2907111 4188299 1658804 -1571110 -732318 3816362 7540817 8349815 8356953 9138382
34567 9138382 9320320 8088192 7424181 8595465 9301221 7168576 3950639 3017438 4153505
34558 4153505 4405245 3235739 2830596 3206966 1298301 -3703618 -7926929 -8077911 -6005915
34549 -6005915 -5134767 -4945760 -2698724 913945 1937631 -1111734 -5099727 -6391106
34541 -6391106 -4396854 -478390 3983292 7384260 8117339 6528392 5141537 5654251
34533 5654251 6885723 6769403 5290268 4316012 5183834 7305531 8843683 8568087 7475360
34524 7475360 8091726 11087491 13378868 11663582 7398460 5394742 7131271 8788334
34516 8788334 7304247 5026804 5734344 8681353 10024098 8643536 7014459 6848292
34508 6848292 7140672 6718694 6010183 5738107 5890606 6364116 6917460 6442386 4132057
34499 4132057 1401934 645545 1875781 2577221 1179917 -1293822 -3336380 -4563403
34491 -4563403 -4734927 -3437763 -1570723 -959868 -1452014 -554843 2719394 5781411 5921982
34482 5921982 3959576 2502161 2218499 2056971 1875493 2360834 2961147 2145663 -483902
34473 -483902 -3973719 -7331163 -9433020 -8630330 -4762413 -932089 -650493 -3345879 -5258339
34464 -5258339 -4726345 -3628076 -3182977 -1752578 1618236 4469798 4153849 1742797 221633
34455 221633 254456 254439 -388208 -702822 -235331 484083 1151794 1326951 -463978 -4712207
34445 -4712207 -8391966 -7463163 -2315819 2241415 3362307 3521999 5786214 8587902
34437 8587902 8122521 4238642 651944 -268733 12928 -704482 -2212460 -2826346 -1816712
34428 -1816712 186804 2159511 3055109 1973945 -919332 -3767901 -4183643 -1519266
34420 -1519266 2151500 3803400 2576776 760791 904772 2260710 1535525 -2573498
34412 -2573498 -7407733 -9841808 -9792552 -8568481 -5815226 -1101405 2733944 1785872 -3063790
34403 -3063790 -6218376 -4588626 -1489079 -1422590 -3951680 -5498713 -5002643 -4484868 -5154663
34394 -5154663 -6116007 -6506178 -6177779 -4529468 -1313857 1557413 1870928 942022 2458881
34385 2458881 6644397 8795519 5565260 99589 -1695564 1676282 6597150 9716552
34377 9716552 11037831 11739388 11714208 10156095 6800022 1852835 -3787014 -7690796 -7160921
34368 -7160921 -2584131 1934399 2843621 1044199 -28828 821478 1874665 2143901 3052923
34359 3052923 5678976 8432852 8923294 6844213 3701153 779264 -1187115 -1303569
34351 -1303569 711522 3401721 4820529 4778015 4453612 4002810 2245199 -1039636 -4047739
34342 -4047739 -4752902 -2821296 367581 2504394 1364185 -3192827 -7918524 -8669499
34334 -8669499 -4898894 -153301 2393521 2988315 3101804 2518991 411280 -2377676 -4152698
34325 -4152698 -4383942 -3212607 -231401 4227425 7738854 8095164 6276369 4795236
34317 4795236 3733791 1187150 -2472813 -3888730 -1314756 2442302 3215137 243512
34309 243512 -3453684 -4514091 -2151149 1580019 3761051 3402615 2443445 3250498 5377558
34300 5377558 6217968 4907376 3699519 4641940 6489543 6311865 3328105 -150938 -1346168
34291 -1346168 266188 2815022 4241006 4623578 6090224 10049208 15044901 18289378
34283 18289378 18858512 17972513 16303161 12871495 7270388 1505263 -1466868 -428830
34275 -428830 3318120 7191820 9176459 9305423 9412780 10524884 10795783 7587051 1590236
34266 1590236 -3073359 -3468481 -864065 1490427 1789280 62983 -2778581 -4834649
34258 -4834649 -3906816 -169805 3044851 2919752 657391 -408692 669486 1765229
34250 1765229 1014449 -1117432 -3115586 -4111745 -3980220 -2923979 -1323636 707952 3639762
34241 3639762 7716654 11961534 14712376 15118144 13556291 10749759 7097123 2886095
34233 2886095 -1175961 -3704153 -3213837 290020 4388583 6164316 5493229 5180169 7072820
34224 7072820 9386414 9245553 6982797 6161849 9232426 14325595 16953845 14739172
34216 14739172 10188023 8230736 10580930 13402342 11876691 6354687 1842427 1534612
34208 1534612 3486332 4369947 3885549 3995067 5852794 8978517 11718723 11459031 6667683
34199 6667683 59214 -2969936 -960435 1340110 -307108 -3664507 -4037277 -1436225
34191 -1436225 561761 1093514 2275302 4196153 4651611 3837567 4539192 6961388 7778294
34182 7778294 5531592 2972754 2454222 2593161 1437722 -123596 -176721 1458570 4064826
34173 4064826 7347338 10288504 10930682 9043405 7049871 6716286 6830280 5712038 4095680
34164 4095680 3734469 4668113 5497624 5197485 3562017 1190513 -205633 801535 2910874
34155 2910874 3066293 710740 -1254327 -847085 189249 -520399 -2492760 -3767924 -3639317
34146 -3639317 -2324506 -97287 1623246 781762 -1858934 -2425241 745102 4329039
34138 4329039 5154341 5018944 6909951 9272012 8492598 5169371 3146611 3406316 3634506
34129 3634506 3257542 4011667 5412204 4611965 1745717 820743 3667109 7105254 8100168
34120 8100168 7887520 8514961 8864382 7379403 5971878 7388682 10238554 10332826 6468814
34111 6468814 1840565 -154285 1122140 4678006 9153548 12308006 11808558 8022918
34103 8022918 4459406 4006894 5829544 7227964 7366862 7365706 7514016 6789933 5293432
34094 5293432 4790745 5919263 7008868 7144213 8209210 11437447 13694911 10760994
34086 10760994 3846706 -906967 -59876 3465616 5519423 5925367 6335324 6121182 3807439
34077 3807439 707987 -356590 837931 2022364 2138281 2294974 3276541 4486117 5340983
34068 5340983 5705688 5054178 3057050 827351 -113766 244428 1138772 2934887 6239917
34059 6239917 9782989 11526750 11483447 11085681 10263729 7943423 5260020 5036449 7382568
34050 7382568 8762173 6663749 2775393 175859 -437521 -94310 1021371 3419241
34042 3419241 6465086 8512635 8808531 8243864 8129895 8756269 9368061 9476657 9723147
34033 9723147 10735512 11538264 10750039 9498598 10717554 14462734 16713188 14967297
34025 14967297 12253444 12379126 13644285 11584253 6483264 3328724 4652557 8081775
34017 8081775 11205928 14179806 16604520 16411737 13578494 11127752 10624297 10054145 7852475
34008 7852475 5675488 5289370 5824789 6086297 6756522 8446012 10220772 11702800 13879219
33999 13879219 16320903 16634277 14368784 12371360 12478471 13116125 13126705 14425252 18243497
33990 18243497 21963659 22648450 21067604 19508793 18195680 16560020 15489438 15543891
33982 15543891 15310284 14132585 14096228 16756245 20229780 21930835 21876234 21272106 20559315
33973 20559315 20796652 23794276 28761155 32168698 32899434 33675617 35495019 35419256 32347449
33964 32347449 29736776 29634004 29633856 28949021 30958167 35767901 37648801 35044347 35253060
33955 35253060 42754243 51097416 53988149 55691603 61320012 66135310 65767360 67631650
33947 67631650 78681794 91091000 95744099 100149149 114065868 128223083 132232671
33940 132232671 142481329 175230997 193976698 130957648 -19337957 -167721087 -223102898
33933 -223102898 -190863533 -145790479 -131317242 -128892435 -115215051 -99777547 -96197561
33926 -96197561 -95141255 -84682739 -72492240 -69934590 -72143915 -69654165 -65370386 -65403860
33918 -65403860 -65050076 -57926056 -49400859 -47673555 -49332025 -46321309 -40772171 -40630633
33910 -40630633 -45343940 -47457853 -45113844 -42436726 -40001462 -34806390 -28256381 -25243412
33902 -25243412 -26015213 -26619756 -26472581 -28074915 -30032897 -27911625 -22196891 -18519800
33894 -18519800 -19135377 -20156712 -18339133 -15383193 -14159705 -14892409 -16257584 -16993465
33886 -16993465 -15943767 -13332596 -11676753 -12661544 -14267475 -14197685 -14288538 -17223793 -20680420
33877 -20680420 -20187429 -16856370 -16234142 -19316856 -20817321 -17563566 -12758071 -9821365
33869 -9821365 -7592395 -4809687 -4459636 -9263380 -15979733 -18667364 -16091498 -12299594
33861 -12299594 -10815985 -11466942 -12578380 -13394103 -13728185 -13172771 -11715056 -10397013 -10520585
33852 -10520585 -12131506 -13717712 -13874183 -12990879 -12323557 -11588712 -9372044 -6413625 -5860428
33843 -5860428 -8563851 -10839260 -9709813 -7896229 -9645880 -13376363 -13347901 -8130155
33835 -8130155 -2406223 37039 168654 -461248 -2617121 -5902697 -7050840 -4811961
33827 -4811961 -2820679 -4220571 -6609415 -6000538 -3199051 -2215868 -4054499 -6000698
33819 -6000698 -6196906 -5497566 -5220595 -5821298 -7300435 -8608865 -7589400 -3991646 -1398775
33810 -1398775 -3253287 -7928430 -10908677 -11029789 -10876800 -11352751 -10169317 -6664579 -4090042
33801 -4090042 -5014014 -7449218 -8000248 -6708631 -6186133 -7287916 -8214676 -7489571 -5812148
33792 -5812148 -4856657 -5507082 -7373724 -9233228 -10001107 -9828481 -9940758 -10845306 -11216766
33783 -11216766 -9458083 -6116780 -3672064 -3606182 -4506367 -3857429 -1449828 32897 -1659172
33774 -1659172 -5295057 -7681862 -7854123 -7933932 -9437293 -10920224 -10784411 -10382335 -11714616
33765 -11714616 -13332346 -11928563 -7803487 -5074170 -5597220 -6397506 -5076170 -4140807
33757 -4140807 -6525066 -9548829 -8053483 -2507660 1041355 -356647 -2772920 -2224666
33749 -2224666 -806618 -2414618 -5595578 -5468713 -1482304 1568483 531700 -2308269
33741 -2308269 -3540387 -2996174 -2035518 -796826 395593 -329260 -3381942 -5564269 -4242765
33732 -4242765 -1905985 -2793960 -6230302 -7678599 -6065616 -5207915 -7037571 -8242063
33724 -8242063 -5998491 -2931492 -2926956 -4988786 -5216573 -3113907 -1894394 -3131948 -4747342
33715 -4747342 -4607621 -3280784 -2529306 -3059025 -4312840 -5086845 -4217049 -1879413 32294
33706 32294 21947 -1180362 -2294245 -3801778 -6376626 -8114457 -6469574 -2705125 -1025784
33697 -1025784 -2682972 -4215968 -2851157 -609741 -959615 -3742318 -6024287 -6617014
33689 -6617014 -7151270 -9026167 -11305199 -11870550 -9560275 -5094967 -605188 1799155
33681 1799155 1501983 -433343 -2384237 -3225386 -2808595 -2177370 -2770029 -4435314 -5087785
33672 -5087785 -3768755 -2824152 -4609020 -7103752 -6363104 -3031664 -2025808 -4810410
33664 -4810410 -6782565 -4744779 -2388338 -4424570 -8962911 -10763357 -9673439 -10169305
33656 -10169305 -13348927 -15045975 -12647349 -8933127 -7438579 -7786192 -7625943 -6277507
33648 -6277507 -4446397 -2622610 -1589795 -2625766 -5551990 -8169911 -8930574 -8534629
33640 -8534629 -7822260 -6165202 -3497795 -1878274 -2918866 -5203135 -6424741 -6781145
33632 -6781145 -7893227 -9471350 -9884491 -9580954 -10831686 -13555374 -14348068 -11213657 -6994758
33623 -6994758 -5855481 -7764206 -9176157 -8728583 -9130284 -12399465 -16062098 -16527810 -14479804
33614 -14479804 -13659341 -14857101 -14788007 -11701233 -8440123 -7809961 -8045909 -6092072 -3073396
33605 -3073396 -2458038 -3953039 -3712225 -752802 1210323 -371280 -3033953 -3454860 -2249670
33596 -2249670 -1778245 -1497733 1046842 5476651 7941599 5595253 -159569 -5313745
33588 -5313745 -7062077 -5881479 -4626866 -5598526 -8145317 -9522786 -8291799 -5986339
33580 -5986339 -4968451 -5664683 -6654830 -6576127 -5142179 -3062495 -1636041 -1654176 -2251110
33571 -2251110 -1873704 -770644 -1019920 -3325866 -5434690 -4953530 -2331894 263711 1640729
33562 1640729 1678699 190025 -2385328 -4136955 -3511516 -1451424 -141794 -293341 -1185854
33553 -1185854 -2520168 -4318542 -5586741 -5145568 -3719993 -3490454 -5453409 -8453550
33545 -8453550 -10719884 -11328830 -10487557 -9289293 -8641367 -7795035 -5194921 -1665212 -704276
33536 -704276 -3726207 -7085869 -6685620 -3948059 -3694006 -6941420 -9685008 -8895164 -6023642
33527 -6023642 -3832605 -3116121 -3727862 -5843240 -8627895 -10009043 -9245524 -7826042 -6814460
33518 -6814460 -5471305 -3605674 -2906954 -4263256 -5668050 -4640631 -1463681 1474382
33510 1474382 2575452 2179729 1641940 1793414 1486268 -1892184 -8535112 -13439786 -10865439
33501 -10865439 -2146724 4586379 4070943 -210939 -2117460 -1338116 -2181796 -6158233
33493 -6158233 -9933153 -10132122 -6945602 -2855823 -10380 1027978 1305026 1979945 2209002
33484 2209002 17921 -3792892 -5057546 -1618785 3037752 4342626 2880464 2718477
33476 2718477 4953994 6727976 6085957 4151864 2399428 990384 123844 172947 156860
33467 156860 -1325251 -3517283 -4520783 -4831273 -6700775 -9569456 -9556708 -4813585 1461792
33458 1461792 4965011 4966649 3467652 1670031 -836869 -4460522 -8496375 -11039959 -9842265
33449 -9842265 -4686984 900120 2295535 -1113620 -5159203 -5934269 -3897083 -2196990
33441 -2196990 -2706794 -4811390 -6763570 -7256637 -6618069 -6801780 -8983639 -11218121 -10344551
33432 -10344551 -6395866 -2958157 -2656143 -4413990 -5729277 -5399947 -3416506 -688846
33424 -688846 283063 -2828037 -8554055 -12355137 -12143883 -10309007 -9041616 -7148567 -3616610
33415 -3616610 -739081 -505044 -823297 1000712 3409190 3176135 991850 214074 1189421
33406 1189421 1079383 -1182845 -3851416 -6110851 -8774953 -10903654 -9744778 -5152997
33398 -5152997 -676085 1061848 1097971 960418 -249230 -3605578 -7362942 -8402603 -5673267
33389 -5673267 -885173 3381294 5561566 6067127 6678930 7960821 7687688 3773340 -1615286
33380 -1615286 -3779794 -1859266 -373603 -2971340 -7480418 -9342187 -7634194 -4925788
33372 -4925788 -2664161 186508 4133081 7304598 7316841 3846800 -958727 -4137070
33364 -4137070 -4306440 -2969673 -2899650 -4775281 -6353977 -5659546 -3752354 -3053199 -3887111
33355 -3887111 -4361085 -3273235 -1491439 -329796 48863 122866 -55769 -607135 -1005186
33346 -1005186 -526052 243599 -717971 -4333839 -8098400 -8119147 -4183848 -770731 -1264030
33337 -1264030 -3077334 -1486189 2912555 4583089 1088780 -3412316 -4235284 -2060959
33329 -2060959 -434002 -524345 -1357380 -2776072 -4782177 -5645203 -4061068 -1944723 -1723396
33320 -1723396 -1953100 590082 4953724 6213768 2142472 -3935866 -7889543 -9040563
33312 -9040563 -8417872 -6150209 -2890678 -1263222 -2986022 -5815857 -5905262 -2687251 670789
33303 670789 1595333 1117881 2021297 4980167 7427567 6433680 2382308 -1014875 -820909
33294 -820909 1871384 3725618 3242638 1504617 -272952 -1626572 -1616025 564864 3375933
33285 3375933 4053387 2717737 2469656 4072464 3695144 -1587560 -8650335 -11945465 -10668161
33276 -10668161 -8824443 -8928397 -9217111 -7434218 -4287923 -2043221 -1750901 -2914425
33268 -2914425 -4432688 -5099539 -4377283 -3228526 -3122727 -3950654 -4126535 -2994551 -1778183
33259 -1778183 -1709866 -2504109 -3263577 -3775318 -4219455 -4382113 -3702161 -1668340 1727253
33250 1727253 5183728 6246322 3787332 186405 -834258 1114720 2490386 614249
33242 614249 -2808924 -4150878 -2303437 697424 2297709 1345913 -1603332 -4589481
33234 -4589481 -5621328 -4794667 -4157263 -4628564 -4486164 -2254654 475178 1165313 122190
33225 122190 -247741 641624 949220 -323671 -1953693 -2848164 -3524137 -4403762 -4586624
33216 -4586624 -3468993 -2090950 -1669351 -1892025 -1737711 -1069882 -443022 -158577 -468359
33207 -468359 -1943507 -4545114 -6779570 -6819430 -4445747 -1357310 341702 -219689 -2099206
33198 -2099206 -3336087 -2812822 -1537193 -1512514 -3212886 -4961920 -5039170 -3486286 -1442658
33189 -1442658 313260 1509354 1921661 1605843 1137020 1055918 1396151 1903107 2149339
33180 2149339 1523119 59404 -896062 -301185 407262 -1151799 -4236227 -5098096 -2370212
33171 -2370212 516996 491884 -335312 1618813 4916828 4753884 562696 -2620498 -1304203
33162 -1304203 1924218 2773697 818104 -1692947 -3882429 -6030953 -6936131 -4849617
33154 -4849617 -871194 1300591 -286624 -3396062 -4282022 -1834165 1644647 3238892
33146 3238892 2270163 330232 -944470 -1372900 -1384486 -730843 877479 2408694 2221615
33137 2221615 159045 -2245867 -3622347 -3640165 -2298447 30961 1920589 2145446 1744741
33128 1744741 2697892 4336323 3793455 806627 -1092053 89950 1420827 -281824
33120 -281824 -3087122 -2837930 481181 3301355 4310712 5321818 6378986 4623310
33112 4623310 -520668 -4817744 -4264860 -287640 2275193 795674 -3217971 -6415151
33104 -6415151 -6325326 -3014669 665027 1553167 -194920 -1384661 -497352 10752 -2227343
33095 -2227343 -5300390 -5609004 -3327321 -2099576 -3520533 -5009123 -3970886 -1547506
33087 -1547506 -667866 -1948892 -3320692 -3097200 -1829309 -968960 -827616 -601227 -62210
33078 -62210 -296221 -2213690 -4821155 -5953555 -4772755 -2542289 -684694 672319 1569608
33069 1569608 1149004 -803243 -2366105 -1589486 379308 544923 -1410486 -2241815 275052
33060 275052 4038304 5586582 4743102 4044324 4406170 4032466 1956391 261520 1343694
33051 1343694 4318104 5849508 4169012 890462 -1222182 -1145966 171366 1577024
33043 1577024 2778013 3745625 3849469 2196674 -1114766 -4462772 -5866742 -4795439
33035 -4795439 -2571595 -899993 -348718 -471206 -833837 -1148561 -591076 1917156 6102852
33026 6102852 9523030 9253259 4753702 -1180433 -4734990 -4589377 -2959949 -2778770 -4108496
33017 -4108496 -4420607 -2710954 -1705751 -4331660 -8995927 -10868696 -8011094 -3752318
33009 -3752318 -2035899 -2765913 -3503053 -3708667 -4590185 -5733241 -4911564 -1556115 1916790
33000 1916790 3076681 2213415 1292802 1321453 1553302 694900 -1565528 -3932510 -4559521
32991 -4559521 -3205452 -1765365 -1823145 -2515251 -2147839 -983223 -443179 -298508 721610
32982 721610 1754697 365438 -3092017 -4831123 -2820706 158314 571841 -1208287
32974 -1208287 -2605777 -2979097 -3188004 -2671146 -259194 2816053 3865425 2620016 1436611
32965 1436611 1516463 1588933 839687 513905 1453570 2148645 828715 -1774799 -3218597
32956 -3218597 -2235198 260977 2643552 4142310 4978064 5480278 5428201 4543924 3511635
32947 3511635 3578130 4589611 4499692 2073679 -732554 -867033 1539609 2862193 460516
32938 460516 -3971453 -6419055 -5147437 -2497476 -2196538 -5148491 -8216555 -7854966 -4789898
32929 -4789898 -3421066 -5813120 -8407009 -6714291 -1491048 2680796 3767675 3614430
32921 3614430 3296067 1388200 -2090217 -3974780 -2375567 251556 903640 292912 509056
32912 509056 660160 -1678269 -5862001 -8545328 -8485890 -8007146 -9258911 -11360488 -11928611
32903 -11928611 -9804135 -5818129 -2153733 -1045954 -2726223 -4569886 -3643642 -151202
32895 -151202 2988653 3888484 3409730 3125393 3483390 4510419 6458050 8674568 9284975
32886 9284975 7325091 4294832 2403231 1964631 1718719 1220822 1540099 3476489 6107562
32877 6107562 7584680 6976849 5040743 3309817 2522688 1948775 413103 -1985468 -3612135
32868 -3612135 -3161840 -1453224 -611277 -1435765 -2501709 -2419344 -2105834 -3584706 -6879596
32859 -6879596 -9687355 -10448876 -10117276 -10040019 -9766658 -8464570 -6991127 -6383168 -5443895
32850 -5443895 -2614681 389104 170640 -2944613 -4726121 -3274724 -1688673 -2583256
32842 -2583256 -3747987 -2405579 -491564 -1423469 -3926227 -4068647 -2319010 -3173918 -7480175
32833 -7480175 -10400514 -8708754 -5584199 -5489854 -7779126 -8573823 -6642195 -4197059 -3129346
32824 -3129346 -3176649 -3261860 -2720589 -1620415 -983117 -1795635 -3041187 -2398459 -244
32815 -244 739298 -2021459 -5040268 -4051676 274256 3546440 3811179 3193691 3776393
32806 3776393 5154617 6363489 7205420 7021264 4922094 2140971 1559488 3737736 5767982
32797 5767982 5300929 3290214 1193210 -1918147 -6889993 -11124038 -11034974 -7258368 -4304972
32788 -4304972 -4714841 -6169277 -5326298 -2380084 -253487 -536397 -2008371 -2887799 -3007772
32779 -3007772 -3258490 -3788187 -3696085 -2394065 -424750 1455212 3310318 5343629 6605673
32770 6605673 5539414 1921899 -2714908 -6725378 -9327811 -9881623 -7894749 -4551538
32762 -4551538 -2551077 -3028664 -4021499 -3595962 -2993176 -4362280 -6654510 -6968150 -5506328
32753 -5506328 -5436712 -7197662 -6941112 -2633767 1903671 2261799 5058 -93006 2317857
32744 2317857 3069688 828832 -365858 2479210 6348894 6423106 2661445 -769578 -1185434
32735 -1185434 234625 1086497 468296 -820573 -1279570 -118060 1346052 518665 -3073380
32726 -3073380 -6383771 -6416158 -3876426 -1193911 1583513 5666561 9058218 7443564
32718 7443564 623186 -5608522 -6184275 -2673500 -49184 170163 470215 2418973 4632573
32709 4632573 5576783 5501873 4960007 3650840 1701287 392173 457215 772353 -146913
32700 -146913 -1959796 -2710126 -957550 2841866 6867553 9437288 10052998 9214537 7476931
32691 7476931 5145782 2949522 2076382 2737176 3411642 2706219 1461223 1502188 2541063
32682 2541063 2315593 315371 -728458 1420114 4727998 4931119 886656 -4043963
32674 -4043963 -6104404 -4905169 -2475971 -222252 1646547 2444107 787774 -3235502
32666 -3235502 -6832331 -6709174 -2508053 2671729 5255115 4159854 922079 -2071088
32658 -2071088 -2971651 -1150452 2232582 4552481 3708071 -14688 -4588015 -8396804
32650 -8396804 -10830897 -11260756 -9263932 -6252952 -4968962 -6097537 -6793197 -4215332
32642 -4215332 436382 3344692 3022082 1644109 1306015 1278750 84628 -1595024 -1973817
32633 -1973817 -1201552 -1355172 -3410731 -5855780 -6837091 -6543682 -6667414 -8111033 -9999828
32624 -9999828 -10768408 -9668758 -7204216 -4454000 -2163076 -498106 381655 -110621 -2304344
32615 -2304344 -5121912 -6318134 -4481105 -637044 2554883 3142132 1237203 -1519915
32607 -1519915 -3265662 -3002953 -1328423 -192019 -1049019 -2915264 -3169813 -934674 1216420
32598 1216420 15396 -4494968 -8911369 -10265578 -8620741 -5824331 -3166859 -1004059
32590 -1004059 457813 1125771 1252112 887791 -427706 -2736434 -4993469 -6115603 -6149914
32581 -6149914 -5633637 -4565699 -3074043 -2244048 -2782796 -3568288 -3346377 -3192994 -4801294
32572 -4801294 -6582143 -4756445 730666 4667153 2957521 -2221239 -6218450 -8256091
32564 -8256091 -10390222 -12043752 -10222487 -4955232 -104995 2083300 3350290 5049093
32556 5049093 5292315 2770577 170132 724452 3499129 5050875 4180227 2241890 160881
32547 160881 -1816495 -2351904 -159851 3289284 4843451 3372934 281162 -3055981
32539 -3055981 -5823165 -6460351 -4083752 -1142529 -1259273 -3976024 -5066983 -2851678
32531 -2851678 -448916 -233040 -14100 2453304 4560027 2444686 -2498842 -5058441
32523 -5058441 -3559922 -1719080 -2595111 -4269767 -3289174 19712 2097750 1170270 -529639
32514 -529639 -134366 1684360 1560517 -1584202 -4398457 -3450622 -173709 1262293 364568
32505 364568 1000124 5000423 8901461 9042308 6468390 3937413 1239029 -2656602 -5375332
32496 -5375332 -3940073 -490028 -100351 -3141280 -4895767 -3383821 -2374743 -4790861
32488 -4790861 -7849939 -7710881 -5290470 -4125361 -5140472 -6813450 -8414961 -9825666
32480 -9825666 -9755492 -7360331 -4521636 -3616221 -4046016 -3855783 -3707368 -5797941 -9228076
32471 -9228076 -10100503 -6874896 -2583692 -648444 -996057 -1583801 -1574553 -1319477 -731221
32462 -731221 482036 1626166 1469529 -279104 -2643465 -4232656 -4004007 -1733341 1635226
32453 1635226 4384702 5345471 4932769 4744746 5967328 7907684 8237647 5418520 964473
32444 964473 -1899633 -2333134 -2971310 -5597261 -7532149 -4922620 1336249 6098900 6402491
32435 6402491 4298096 2682817 1631955 388386 -209420 115826 -1027233 -5385541
32427 -5385541 -10173595 -11000401 -8009715 -5603015 -6072037 -7177188 -6989062 -7476708 -10869665
32418 -10869665 -14972186 -15282519 -10901080 -5606961 -3082404 -3240951 -3710167 -3130341 -1964001
32409 -1964001 -1045709 -477198 90579 583858 195434 -1739807 -4430908 -5829306 -4870671
32400 -4870671 -3110140 -3094779 -5160806 -6938123 -6337299 -4080332 -2732666 -3918648 -7053906
32391 -7053906 -10265143 -11904181 -11449067 -9531689 -7218852 -5259639 -4053987 -3780993
32383 -3780993 -3768312 -2261369 1610887 5524017 5510745 803147 -4469825 -5819386 -3368055
32374 -3368055 -794913 -647349 -2700663 -5856835 -9070631 -10857019 -10616275 -10443219 -12790348
32365 -12790348 -16028907 -15567853 -10446139 -5400117 -4319729 -4906952 -3045535 153745
32357 153745 66288 -3860814 -7005941 -6496884 -4888134 -5324825 -6789408 -6766724 -5754720
32348 -5754720 -5741978 -5928294 -3735610 301947 2222310 -21556 -3729663 -5224680 -4120987
32339 -4120987 -2242806 -432515 1214437 1399296 -1196382 -5169901 -7514010 -7548294 -7116021
32330 -7116021 -6564769 -3749658 1505738 5060907 3303768 -1682564 -4784858 -4310582
32322 -4310582 -2668220 -1646906 -612092 786822 1689776 2289028 3739048 5113838
32314 5113838 3840502 344349 -1138845 1779806 6186761 8185648 7925066 7956132 9090645
32305 9090645 10480385 11604309 11603039 8820216 3618721 -695682 -2510018 -4582576 -8553566
32296 -8553566 -10044959 -4484470 4395716 8086746 4651412 447478 309011 2091177
32288 2091177 2070477 -176027 -4100436 -9587830 -13549151 -10917697 -2614306 2769228
32280 2769228 -366568 -6919237 -8948047 -6825949 -6278983 -7575804 -5312139 1624867
32272 1624867 6951003 5425192 -627223 -5124920 -4981099 -1520157 1957055 2688504
32264 2688504 636724 -1205779 -442324 1276310 884852 -972293 -1104891 386209 -72272
32255 -72272 -3262086 -5407484 -4345244 -3024628 -4259701 -5965418 -5100360 -3218383 -3966940
32246 -3966940 -6957691 -8259094 -6240047 -3369619 -2342441 -3322306 -5065786 -6269127
32238 -6269127 -5691643 -3217242 -1004988 -1555431 -4433219 -6824643 -7466507 -7841315 -8928602
32229 -8928602 -8987498 -5933108 -562277 3988925 5417954 4015918 1761972 419040
32221 419040 330827 634836 539608 152819 -129593 -418483 -852996 -1022313 -901000 -1623748
32211 -1623748 -3749312 -5234988 -3236633 1874488 6334184 7374427 5786861 3374047
32203 3374047 237427 -3766853 -6973658 -7703490 -6841441 -6242796 -5527500 -3056580 517622
32194 517622 2643100 2899855 3637133 5770206 6793133 4597763 994225 -711307 -201702
32185 -201702 -72049 -2046766 -5114883 -7058870 -6442039 -3464249 -42518 1401230 357063
32176 357063 -982575 -254871 2381430 4890215 5621472 3837390 -590962 -6180189 -9669340
32167 -9669340 -9115189 -6552888 -5496338 -6482724 -7394316 -7388741 -7503624 -7634786 -6283047
32158 -6283047 -3750138 -2296487 -2262460 -1351044 925910 1518206 -1369378 -4837573 -5333312
32149 -5333312 -3645618 -2920825 -3707146 -4185525 -3900473 -3929086 -4097782 -3201656 -1798741
32140 -1798741 -1958415 -3993140 -5755958 -5635254 -4544333 -4570856 -6742950 -10025921 -11772600
32131 -11772600 -10004018 -6198813 -4483360 -6721064 -10037060 -10911757 -9721158 -8803736
32123 -8803736 -8115249 -6168718 -3798092 -3181100 -3912494 -3769052 -2812404 -2938195 -3796254
32114 -3796254 -3211365 -1405564 -426257 561650 4394768 9698662 10987958 6656894 1654453
32105 1654453 -93795 -707670 -2831010 -4480867 -3701840 -3565287 -7087799 -10839824 -9649206
32096 -9649206 -5093211 -2920427 -3551494 -1953806 3022340 5843899 2558698 -3561479
32088 -3561479 -7130806 -7124799 -5532894 -3197664 -404556 769099 -1695614 -6347263 -9383933
32079 -9383933 -9026895 -6900174 -5117774 -3758388 -1920026 -195044 -685981 -4161100
32071 -4161100 -8196546 -9521116 -7939150 -6078813 -4988279 -2551967 2263063 6253936
32063 6253936 5935350 2899809 1791859 3756503 5479322 4666402 2877956 2165350 2112374
32054 2112374 1545370 593296 -387620 -1788814 -3301216 -3477971 -2128070 -1305177 -2410200
32045 -2410200 -3937018 -3706510 -2001757 -843165 -1140218 -2096480 -2797547 -3150323 -3648957
32036 -3648957 -4905277 -6811719 -7875982 -6574966 -3828820 -2538225 -3733011 -4837125
32028 -4837125 -3233696 -181339 738266 -1604523 -4479356 -4547160 -1217279 3155026 5379379
32019 5379379 3911338 308840 -1743272 207599 4715614 7687757 6579335 3026354
32011 3026354 953780 2075060 3809701 2459226 -1747299 -4427270 -2760273 423763
32003 423763 491553 -2360487 -3626182 -1517751 335598 -1377685 -4628714 -5359237 -3323043
31994 -3323043 -1353667 -272968 1772145 4985989 6379089 3793644 -824210 -3822000
31986 -3822000 -4122118 -3349451 -2416502 -169336 3855393 7011584 5897322 941503 -3449681
31977 -3449681 -4177965 -2997839 -3228461 -4790604 -5197975 -4313515 -4561622 -6340347 -6891565
31968 -6891565 -4927179 -3091870 -3814084 -5352154 -4491125 -1397200 740023 -96720 -2970723
31959 -2970723 -5734276 -7010257 -6994408 -7190356 -8511875 -9375508 -7418382 -3393616 -690575
31950 -690575 -202185 898489 3612300 4308115 500673 -4167397 -4754257 -1903860 571126
31941 571126 2263400 4867948 6301806 2667548 -4136343 -7148434 -3858537 536756
31933 536756 1061224 -946431 -1881759 -1419787 -1182703 -1463126 -1954576 -2803168 -2836522 113732
31923 113732 5046490 7293091 4602848 566841 -537658 822788 1775089 1494864 274115
31914 274115 -2613980 -6592109 -8323302 -6409957 -4632498 -6162431 -7412731 -3101853
31906 -3101853 4470433 7399669 3125577 -2427332 -3474093 -947488 1120695 1320088
31898 1320088 710183 209119 250275 790717 450368 -2048931 -4933193 -4800447 -1878232
31889 -1878232 -525578 -2962469 -5784108 -4910380 -1115033 2054073 3516086 4712303
31881 4712303 5879683 5431747 2787124 -466720 -2384597 -2369709 -1271780 -621325 -1260034
31872 -1260034 -2202279 -1777617 -292748 -58284 -2054852 -4292708 -4530644 -2926236 -889138
31863 -889138 748074 1086658 -997080 -4386695 -5376085 -2412064 792761 33602 -3125360
31854 -3125360 -3601770 -348377 2519676 2146581 275220 -766947 -1440856 -2486978 -2429599
31845 -2429599 -221072 2003197 1617161 -574731 -1741839 -1331689 -1377690 -2912882 -4428664
31836 -4428664 -4070554 -1574194 2200203 6030950 8206193 7158773 3233824 -912761
31828 -912761 -2599586 -1685498 -425541 -862606 -2704672 -3888180 -3021318 -877363 671877
31819 671877 710448 -286637 -1656810 -3183291 -4495869 -4913913 -4328971 -3433951 -2628653
31810 -2628653 -1470353 306536 1998662 2704368 2176894 497882 -2111726 -4536466
31802 -4536466 -5003025 -3168074 -1075836 -878111 -2417754 -4262120 -6087661 -8272085
31794 -8272085 -9859873 -9160457 -6391684 -3767178 -2666062 -2438338 -2244590 -2155523 -1941156
31785 -1941156 -820226 693367 683928 -1173084 -2344421 -703060 2621452 5384149 7394302
31776 7394302 9125940 8798254 4331800 -2215030 -5860359 -5072641 -3572856 -4331536 -5035483
31767 -5035483 -2177493 2808102 5117076 3325365 995165 1330514 3383710 4593833
31759 4593833 4417406 3721561 2536561 535208 -1357697 -1866790 -1343607 -1120371 -1306786
31750 -1306786 -991758 -439018 -1176416 -3595514 -6101561 -7119403 -6506965 -4618062 -1698430
31741 -1698430 1048121 1595471 -456455 -3037522 -4482901 -5632854 -7364879 -7771043
31733 -7771043 -4531075 705691 3291517 1129619 -3158672 -5899912 -5855533 -3695121
31725 -3695121 -700270 946755 -849693 -5093789 -7654231 -6064751 -2728516 -1487803
31717 -1487803 -2643855 -3644052 -3349763 -2875852 -2813698 -2348558 -1187090 -83998 723564
31708 723564 1530913 1495949 -708202 -3976978 -4847209 -1795830 2247704 3196728 479293
31699 479293 -2999220 -4730398 -4934718 -5284226 -6603024 -8229584 -9139267 -9257327 -9419573
31690 -9419573 -9986628 -10047882 -8625043 -6241404 -4386037 -3695484 -3696356 -4043724 -4624183 -4510452
31680 -4510452 -2523730 699614 2766525 2421883 1085088 681311 1182390 1303435 561685
31671 561685 -561603 -1828716 -3491113 -5557687 -7382240 -7750035 -5506192 -1086381
31663 -1086381 2669042 2886166 324370 -1037182 1168289 5055096 7564349 8045787
31655 8045787 7355923 5703682 3592852 2881882 4161209 4708482 2148196 -1228697 -1414015
31646 -1414015 986714 1570713 -878875 -2866741 -2541246 -2751293 -5435943 -7314306 -4874898
31637 -4874898 -589445 208192 -2938628 -5190609 -3271087 910585 3678769 3543411
31629 3543411 1210249 -1731609 -3386950 -2920129 -1939580 -2632799 -4225541 -3561792 198895
31620 198895 3900164 4490782 2536133 282246 -1440359 -2403845 -1232882 2690865 6776146
31611 6776146 7683184 5911701 5189381 7143226 9199327 8466386 5375843 2339015 716244
31602 716244 528131 1657701 3669803 5293466 5547654 4952886 4660211 4977332 5649990
31593 5649990 6826898 8605415 10209896 10797080 10683217 10727410 10873753 10304134 8730674
31584 8730674 6735362 5256501 5287515 7090800 8899998 7876458 3824211 420014
31576 420014 706841 2901455 3394956 2418035 2904265 4492431 3425696 -919273 -4244746
31567 -4244746 -3940318 -2946331 -4219045 -5601659 -4137680 -1936004 -2806476 -5390294 -4964066
31558 -4964066 -970088 2433266 3032232 2767845 2984477 2430656 1101156 1392480 3606131
31549 3606131 4460896 2294847 -39190 -12879 394983 -1547701 -4387977 -4791302 -2530111
31540 -2530111 239608 2727003 4950136 5109216 1608290 -3035891 -4279705 -1608118
31532 -1608118 898119 266998 -2301587 -4416509 -5221804 -4333182 -1321855 2274194 3263138
31523 3263138 983827 -1174341 -446569 1256684 447984 -2459428 -3785541 -2022988
31515 -2022988 372000 947831 423236 776983 2049364 2640492 1850947 591179 -158752
31506 -158752 -327079 -123476 436736 926126 296884 -1935205 -4728680 -6501836 -6871848
31497 -6871848 -6733123 -6832589 -7079834 -7090913 -6418280 -4378448 -1031045 1518370 614089
31488 614089 -3213029 -5723595 -3834801 225059 1635521 -904229 -4043650 -4530026
31480 -4530026 -2662124 -516002 1002735 2113494 2782356 2817299 2399198 1441871 -645030
31471 -645030 -3473134 -4931144 -3361853 55148 2501655 2840700 2411752 2615412 3134977
31462 3134977 2896965 1563053 -596344 -3378422 -6296003 -8045878 -7276649 -3958786
31454 -3958786 451877 4193907 6275363 6636279 5780374 4227177 1936633 -1557962
31446 -1557962 -5857587 -8793281 -8088449 -4520310 -2242331 -4522937 -9536479 -11924241
31438 -11924241 -8820737 -3039774 364484 -360983 -2532010 -2750258 -535436 1847909
31430 1847909 2361866 1397146 913610 1680876 2197662 1002890 -750135 -595936 1553540
31421 1553540 3094458 2778727 2876648 5595430 9071628 9444642 6175943 2677319 1573371
31412 1573371 1799910 1179777 -224045 -771092 27558 1047169 1397567 1446939 1809839
31403 1809839 2057214 1021056 -1510647 -3797710 -3601397 -848362 1987968 2732605 1891401
31394 1891401 1396753 1947558 2831573 3514800 3726562 2493921 -963074 -5347733 -8008801
31385 -8008801 -7788455 -5838743 -3734513 -2320027 -2193220 -3386261 -4516591 -4229319 -3503067
31376 -3503067 -4273621 -5759208 -5089423 -2216950 -864521 -2971740 -5368882 -4443635 -1446550
31367 -1446550 -41554 -570717 -389510 1047275 1125889 -1658516 -5271627 -6763956 -5393049
31358 -5393049 -2511523 178007 1710361 2182863 2319012 2355805 1880539 1133761 1122990
31349 1122990 1520936 263439 -3058274 -5263976 -3504657 415163 2566582 2490738 2799984
31340 2799984 4011892 3860374 1879299 524013 747522 349520 -1693392 -2869205 -1222613
31331 -1222613 1365425 2396711 2370319 2492187 1579190 -1302189 -3291974 -936435 4045626
31322 4045626 6149111 3178113 -1453601 -3794341 -3532275 -2429262 -1636317 -1891646 -3870507
31313 -3870507 -6631722 -7597954 -5819624 -3763422 -4085703 -5907664 -6308384 -4557215 -2472450
31304 -2472450 -953111 1060840 3491931 3719999 288647 -3734962 -3804290 255090 4099124
31295 4099124 4743486 3868373 4270514 5683399 6134169 5428525 4715995 3918090 2340883
31286 2340883 975368 1269424 2115884 1192331 -869583 -1114228 660272 1380731 419699
31277 419699 1696096 7588281 14236782 16190451 13209476 9137636 6207825 4156402
31269 4156402 3280414 4176309 5078967 3371774 -188176 -2016125 -568742 2241790 4337137
31260 4337137 5085556 3820899 256555 -3402151 -4362676 -3739934 -5314689 -8982952 -9758039
31251 -9758039 -5099427 998855 3946631 4697629 6386367 8183654 7152157 4242514
31243 4242514 3454515 5476453 6637136 4718161 1972016 1112330 1422077 732073 -781870
31234 -781870 -890490 1310925 3799448 3595677 20628 -4210083 -5668864 -4130160 -2731768
31225 -2731768 -3673940 -5338434 -5018752 -2831050 -754566 770893 2336883 2512327 -1027489
31216 -1027489 -6883593 -9910631 -7283248 -1984235 1349034 1735878 1113992 370115 -1255648
31207 -1255648 -3676416 -5242086 -4616223 -2070502 1032269 3229217 3794617 3326255 3155531
31198 3155531 3847688 5015635 6666301 9115560 10980767 9433291 4132798 -928649
31190 -928649 -1901026 -156294 -139620 -2827748 -4539433 -2645832 585771 1263660 -1220049
31181 -1220049 -4311995 -5928562 -6259778 -6704130 -8311415 -10747401 -11929034 -9547888
31173 -9547888 -4031736 878377 1830721 -521129 -2950752 -3891592 -4250206 -4340406 -2609743
31164 -2609743 1625471 6223729 8570160 8526188 7376794 5059204 766904 -4136191
31156 -4136191 -6504803 -5458689 -3837569 -4239892 -5315726 -3884601 309452 4100511
31148 4100511 4866990 3048718 614648 -1054601 -1172384 718566 3655864 4959352
31140 4959352 2571655 -2431469 -6608111 -7484972 -5675570 -3813456 -3819167 -5267592 -6335886
31131 -6335886 -6228790 -6069579 -6831283 -7187215 -5003450 -917938 1468546 -208472 -4196180
31122 -4196180 -7006518 -7326868 -6193300 -4432601 -1782564 1784645 5355292 7738457
31114 7738457 8076190 6210827 3186048 735204 -469829 -1210386 -1811651 -1490621 -729493
31105 -729493 -2072310 -6295676 -9836214 -9234195 -6562655 -6463425 -8783359 -9015264 -6120898
31096 -6120898 -4384132 -5828413 -6318357 -2559997 1822360 1963429 -47137 1610756
31088 1610756 6948876 9910824 7558807 3958613 3579042 5415492 5878622 4084776
31080 4084776 1760093 235064 -149992 708692 2057040 2156542 401460 -1495918 -1744834
31071 -1744834 -780552 -93466 34011 203922 403081 420295 955997 2628010 4264723
31062 4264723 3759043 636627 -3356447 -6195133 -7127885 -6384591 -4465502 -2109804 -285992
31053 -285992 341979 -77690 -710825 -780552 -385770 -465354 -1564566 -2798792 -2702944 -1080629
31043 -1080629 786422 1850469 2314733 2735094 3115421 3366922 3817880 4724372 5843248
31034 5843248 6645762 6197084 3063317 -3050543 -9307278 -11420979 -8465919 -4316700
31026 -4316700 -2899509 -3615466 -3255994 -950077 1229668 1768501 1262847 685074 455197
31017 455197 1309875 3730858 6032059 5329151 1470011 -1872091 -1375985 1995468 4534293
31008 4534293 4145585 1752193 -836951 -2768483 -3852585 -3751567 -2150231 501546
31000 501546 2725637 2808140 332528 -3039571 -4904677 -4487843 -3196640 -2630964 -2745302
30991 -2745302 -2492912 -1670241 -1208976 -1682749 -2352725 -2210182 -1617907 -2108158 -4211105
30982 -4211105 -6210399 -6065534 -4268048 -3313569 -4046299 -4301210 -2280511 432642 1163580
30973 1163580 206880 85292 1340806 1972100 1335349 1621278 4179978 6850579 6851717
30964 6851717 4616433 2712121 2098427 1574893 429787 -350679 246669 1610767 1943253
30955 1943253 10164 -3409378 -5800612 -5375575 -3350346 -2595827 -3822846 -4870097
30947 -4870097 -4481334 -4551137 -6884605 -9656356 -9589635 -6517302 -3249525 -1671997 -1530499
30938 -1530499 -2480842 -4437491 -5968329 -5345467 -3640522 -3854991 -6155538 -6983958 -4378674
30929 -4378674 -1325696 -1582311 -4467742 -6537555 -6739183 -6672740 -6540682 -4460651 -485863
30920 -485863 1761228 -585111 -5325208 -7387826 -4924258 -1347701 -824141 -3164475
30912 -3164475 -4531319 -2677879 310073 1138374 -358256 -1550930 -848636 792096
30904 792096 2095610 3141562 4234666 4922825 5110768 5640528 6690383 7023065 6042143
30895 6042143 5130174 5393221 5514606 3943952 2109313 2772415 5464888 6367330 3445959
30886 3445959 -586619 -1738496 398623 2691919 2432727 -99730 -2581016 -2948650
30878 -2948650 -806172 2496676 4737749 4240783 1182959 -2155460 -2963369 -648749
30870 -648749 2052688 1932016 -498120 -1392813 895954 2825137 529632 -3894662 -4492966
30861 -4492966 276046 5014537 4381442 -399833 -4023101 -3772904 -1277077 828886
30853 828886 1292012 -14887 -2249174 -3463440 -2201477 543492 2325652 2195007 1335105
30844 1335105 866853 562542 -27266 -665056 -1257170 -2415567 -4330192 -5748022 -4905262
30835 -4905262 -1388535 3191895 6243725 6003449 2894782 -588593 -1645649 694535
30827 694535 4788902 7552745 6805655 3119208 -721818 -2698927 -3658687 -5340192 -6830032
30818 -6830032 -5300988 -849332 2089651 26163 -5017926 -8663664 -10037629 -11254653
30810 -11254653 -12320033 -10689837 -6120196 -2008423 -649626 -510943 90493 -209715
30802 -209715 -2836460 -5658411 -5579103 -3346329 -2570120 -4385267 -5985896 -4844880 -2115596
30793 -2115596 -891328 -2396817 -4841182 -5603407 -4113635 -2505509 -3098955 -5288141
30785 -5288141 -5922785 -3229417 815611 2908878 2144648 197939 -1246411 -1849172 -1990304
30776 -1990304 -2098102 -2343846 -2244923 -1188830 112297 -4876 -1411662 -1603689 455694
30767 455694 1753814 -908157 -5787815 -8111286 -6519894 -4179740 -3323671 -2331351 482320
30758 482320 3333006 3431045 991926 -1441329 -2561601 -3250703 -4489229 -5884039 -6427502
30749 -6427502 -6048752 -6124197 -8042039 -10919507 -11781651 -9311719 -6318858 -6252082 -8070495
30740 -8070495 -7662117 -4250719 -1693461 -2466236 -4161422 -3950578 -2983416 -3374030 -3703245
30731 -3703245 -1298394 2738932 4611358 3172001 819924 -562973 -1369535 -1912136
30723 -1912136 -1321862 499492 2063096 2177733 1148049 -167511 -1167505 -1485730 -1452481
30714 -1452481 -2114799 -3434810 -3403995 -789703 2341697 3242080 2611991 3231532 5270872
30705 5270872 6385107 6124972 6393568 7187186 5916080 2068654 -1247503 -1955858 -1608103
30696 -1608103 -1607269 -661054 1527050 1751177 -2065193 -6597919 -7201263 -4106730 -936484
30687 -936484 1004262 2993519 4918677 5231469 4214650 3521611 2984988 1506699 434542
30678 434542 1953051 4496145 4331744 1917991 1725246 4689354 6041193 2837220 -1361542
30669 -1361542 -2651904 -3091545 -6289024 -10177514 -9750635 -5249340 -2013753 -2457072 -3328758
30660 -3328758 -1750277 578466 858627 -787813 -2785901 -4625716 -5755768 -4512787
30652 -4512787 -671472 2801137 3059082 1078483 -306479 -706358 -1731058 -3223286
30644 -3223286 -3297822 -2141250 -2346173 -4449258 -5281692 -2704053 587061 681513 -1865014
30635 -1865014 -3131507 -1700026 67513 592620 1090520 1814347 170722 -4537245 -7502704
30626 -7502704 -3788857 4091456 8609100 7182105 4844968 5587429 6056016 1494115
30618 1494115 -5810046 -9186492 -7066471 -4462769 -4947469 -6294571 -5657681 -4542117
30610 -4542117 -5706451 -8376378 -9951557 -10288787 -10800821 -10813846 -8560530 -5137818 -3741539
30601 -3741539 -4788551 -5248045 -3521403 -1660700 -1379888 -956133 1696267 5172812 6369036
30592 6369036 4708910 2213080 361928 -789300 -1057110 -87576 1245752 1423932 321826
30583 321826 -1026414 -2502231 -4706403 -6647051 -6051128 -2872376 -384995 -1307632 -4319029
30574 -4319029 -6052707 -5504317 -4628642 -4997870 -5725435 -5099997 -2957106 -524492 1583729
30565 1583729 4243656 8273724 12398295 13687409 10618212 5147810 823050 -863584
30557 -863584 -1094679 -951676 132787 2378463 3793175 2042902 -2383633 -6398847 -7661405
30548 -7661405 -6580712 -4980357 -3882799 -3031526 -1907493 -655704 -46511 -552170 -1502257
30539 -1502257 -1642695 -848273 -594834 -1931185 -3560287 -3254269 -1139054 -53180 -1913553
30530 -1913553 -4934969 -5790138 -3969871 -2397656 -3513969 -6320574 -8296557 -8982927
30522 -8982927 -9868720 -11218550 -11329430 -9554519 -7830569 -7600583 -7030081 -3721812 839325
30513 839325 2489827 -11162 -3417008 -4561992 -3668824 -1993572 853504 4959607
30505 4959607 7688475 6177892 1389886 -2763319 -3855250 -2527677 -342352 1595971
30497 1595971 2078719 235864 -2919742 -4987666 -4692562 -2891560 -1171422 -519415 -973131
30488 -973131 -1298211 398338 4177609 7089147 6420249 3518866 2115423 3309260 4870340
30479 4870340 5321002 5591346 6121339 5485499 3147298 913207 220797 305093 370888
30470 370888 1128438 2600562 2891258 1150023 -429466 174727 1425616 391541 -3096110
30461 -3096110 -6513159 -7590748 -5526300 -1012585 3016136 2672406 -2393280 -7490881
30453 -7490881 -8302856 -5961572 -4212933 -3930415 -3942679 -4959554 -7922820 -9784170 -6267007
30444 -6267007 1151466 5992484 5174956 2066383 297156 -616752 -1848145 -2241874 -1361622
30435 -1361622 -1598133 -4270524 -6835788 -6833028 -5698813 -5875438 -6961386 -7605009 -8342871
30426 -8342871 -9365387 -8344199 -4272988 -943090 -2265112 -6008295 -6759915 -3813321
30418 -3813321 -1328856 -1285723 -1284211 188121 904523 -1294663 -5289944 -8561186 -9535602
30409 -9535602 -7352452 -2205411 3293948 5907753 5665247 5298660 5537692 4359066 1499782
30400 1499782 -270599 152991 129203 -2025687 -3895961 -3102125 -1191582 -375078 485607
30391 485607 3030095 5194468 3995728 730574 -790707 -83862 10010 -1453306 -2277367
30382 -2277367 -1071666 1085604 3038060 4395112 4110465 1723999 40290 2593662
30374 2593662 7773616 9586033 5702339 803674 -203252 1433216 1661144 195319
30366 195319 -97123 1478634 2638948 2007713 500582 -1158854 -3532215 -6591734 -8755646
30357 -8755646 -8391561 -5194875 -248250 4101569 5013088 1560291 -3698941 -6985445
30349 -6985445 -6932709 -4721402 -1421773 2628827 6139628 7223939 6056115 4886445
30341 4886445 4506156 2978559 -638364 -3474540 -2229189 1725463 3383674 401294
30333 401294 -3919865 -4858608 -1872701 1408416 1902649 133636 -1447699 -1673862 -1266546
30324 -1266546 -1067153 -1003931 -868860 -1044614 -1995323 -3691163 -5866044 -8144308 -9631471
30315 -9631471 -9392195 -7921696 -6967048 -6912193 -5681094 -1905558 2020914 2592603 414955
30306 414955 -347226 1644654 2389729 -1541203 -7286623 -9120394 -6230561 -3476275 -4447696
30297 -4447696 -7263217 -8394610 -7637868 -7052631 -7006043 -6136674 -4446284 -3560171 -3710734
30288 -3710734 -3079926 -1203821 -819531 -4364342 -9893409 -12771455 -11173558 -7834864
30280 -7834864 -6015128 -5683229 -4740535 -2521895 -456454 139132 -598862 -1920194 -3387136
30271 -3387136 -4533415 -4383967 -2040717 2181991 6383062 8123832 6294244 2102014
30263 2102014 -1992925 -4249773 -4333722 -2768693 -944824 -1192642 -4653540 -8564036 -8158391
30254 -8158391 -2869548 1682134 456288 -4055501 -5095983 -998983 2773068 1496542
30246 1496542 -2785369 -4964836 -3630385 -1551317 -1177320 -2221615 -3020925 -2381901 -313403
30237 -313403 1975252 3193661 3588235 4447583 5568048 4898647 1723583 -1575568 -2446995
30228 -2446995 -1323228 -203231 377112 949624 1042774 -104878 -1581286 -1858307 -1280637
30219 -1280637 -1391437 -2332718 -3051654 -3444576 -3833851 -2849865 1128011 6168155 7467925
30210 7467925 3026260 -3547120 -7085835 -6025607 -2547287 685614 2560371 3340589
30202 3340589 3626348 3197250 933977 -3178176 -6423013 -5636610 -1323479 2436394 2710967
30193 2710967 533909 -1510385 -2422258 -2482601 -1715146 -136704 1588526 2815959 3386528
30184 3386528 3057043 1792111 767595 1109157 1263295 -1834322 -7959068 -12637320 -12641282
30175 -12641282 -9990682 -8459527 -8476523 -8077254 -6905368 -6183415 -5949589 -5253456 -4238462
30166 -4238462 -3382321 -1630015 1878574 5115469 5388288 3712490 3538540 5245536 5621830
30157 5621830 3424445 1671496 2830941 5000240 5131053 3536355 2558424 2457422 1436454
30148 1436454 -935978 -2811029 -2703026 -1370017 -682824 -1600676 -3511377 -4977235 -5043852
30139 -5043852 -4174873 -3825673 -4859226 -6598041 -7670154 -7526522 -6805378 -6260820 -5588633
30130 -5588633 -3695215 -523284 1783154 802691 -2682202 -4580653 -2013194 3197625
30122 3197625 6872033 7104760 4874396 1410950 -2426939 -4891678 -4545585 -2857525
30114 -2857525 -2783665 -4421136 -5008067 -3792055 -3442133 -5189878 -6127883 -3975394 -1605971
30105 -1605971 -3240242 -7802145 -9861756 -6795654 -1698328 1214951 1346558 819864
30097 819864 780097 170039 -2171388 -5054431 -5277394 -1206563 4231912 5901716 2515146
30088 2515146 -1545693 -1799736 920176 2651283 1958817 415079 -1308882 -4114139
30080 -4114139 -7264136 -8108307 -6061131 -3998807 -4247572 -5412054 -4768186 -2101202 392073
30071 392073 788136 -1253912 -4757338 -7802021 -8512319 -6693106 -3900086 -1532109 84202
30062 84202 599373 -443745 -1812018 -827806 2995740 6260871 5520705 1532397 -2161932
30053 -2161932 -3562899 -2907480 -313836 4219031 8692288 9978764 7490277 3769682
30045 3769682 907653 -1373443 -3411559 -3979686 -2472338 -587722 91373 574982 2462925
30036 2462925 4807219 5389424 4341192 3902178 4685077 4663509 2380163 -919685 -3148782
30027 -3148782 -3684961 -3012597 -1617364 -195000 370378 180873 251764 477280 -756110
30018 -756110 -3768693 -6092355 -5477145 -2933039 -769490 974773 3503806 5730659
30010 5730659 5175807 2401710 1093244 2754922 4449390 3422915 1196951 783051
30002 783051 2015074 2420782 1393674 633865 955345 1243683 687059 -12977 12673
29993 12673 757882 1816946 2624020 2264951 396477 -1677148 -2190984 -1186655 -299492
29984 -299492 -345829 -534219 -116491 605558 1036338 686306 -1132729 -4328224 -6630376
29975 -6630376 -5215238 -475690 3616519 3985617 1847953 535283 1258286 2387456
29967 2387456 2012753 -131154 -2783691 -4226574 -3703739 -2415779 -2371131 -3674676 -4057048
29958 -4057048 -2019711 711375 1223361 -948468 -3746771 -5617845 -6964793 -8575302
29950 -8575302 -9976334 -9810101 -7274879 -3163358 191511 511520 -2185177 -5330923
29942 -5330923 -6373627 -5012099 -2408329 585581 3232847 4209432 3021363 1433941
29934 1433941 1427052 2139428 1128486 -1468087 -2722636 -1409169 96943 -230899 -810941
29925 -810941 663591 3077623 3490807 1863489 1127862 2501391 3531178 1815847 -1329610
29916 -1329610 -2368732 309944 4841668 7879442 7435003 4357975 1635030 1695230 3922128
29907 3922128 5400258 4416639 2243116 878238 300384 -785851 -2533117 -4097970
29899 -4097970 -5652582 -8071120 -10465855 -10370113 -7424615 -4871995 -5579521 -7906041 -7733657
29890 -7733657 -4060261 -257700 480831 -1179697 -2539935 -2675904 -2806282 -3629996 -4049739
29881 -4049739 -2835147 -467201 1388894 1927438 2070829 2998961 4068360 2916171 -1789447
29872 -1789447 -7989708 -11469037 -9782579 -4569603 231975 2053537 1337086 22110
29864 22110 -871742 -1872461 -3544468 -5039802 -4887306 -3178631 -1953872 -2756381 -4554623
29855 -4554623 -5014142 -3301879 -680920 1049427 525347 -2891172 -7788748 -10095931
29847 -10095931 -6470418 1031174 6074456 5027781 699905 -2229695 -3017761 -3719750
29839 -3719750 -4396256 -3070417 89908 2069057 1173356 -792655 -1615813 -1772994 -2946952
29830 -2946952 -4889547 -5414041 -3068605 1139094 4510577 4925699 2886322 1322069
29822 1322069 2505905 5155630 5771835 3037257 -545679 -1974411 -1237007 -422908 -519061
29813 -519061 -587468 287610 1544686 1834297 619987 -959730 -807109 2029484 5862787
29804 5862787 7863589 7374901 6552025 6949552 6874607 3800142 -1387971 -4720917 -3943218
29795 -3943218 -1100231 498548 372951 540642 2046019 3629213 3809546 2611761 635315
29786 635315 -2061815 -4895512 -5803413 -3439337 9666 583769 -2244145 -4391281 -2555036
29777 -2555036 1320719 3099848 2209393 1362458 1557574 1009199 -801868 -1785949 -1205635
29768 -1205635 -1506539 -4013837 -5783044 -3788704 -155820 294635 -3355238 -7391854
29760 -7391854 -8877067 -8388954 -7257170 -5543524 -3763237 -3462981 -4347290 -3414876 747063
29751 747063 4680992 3774527 -1588956 -6132234 -5882459 -2199964 718566 616480 -1300473
29742 -1300473 -2396108 -1188724 1517869 3318932 2251755 -1331885 -4986582 -6488698
29734 -6488698 -5810402 -4672954 -4439057 -4839211 -4758456 -3856332 -2980600 -2913366 -3121984 -2315736
29724 -2315736 -301913 1347452 1065459 -552814 -1199392 266384 2071836 1390265 -2266099
29715 -2266099 -6321245 -8011628 -7261720 -6108549 -5801498 -5502030 -3922412 -1204166 1488468
29706 1488468 3542428 5069020 5746134 4666670 1809548 -1138919 -2241716 -1314357
29698 -1314357 213803 1250163 1942771 2467823 2032039 89332 -2025256 -2128110 -124826
29689 -124826 1367497 196067 -2447039 -3566681 -2316235 -870627 -1173920 -2388484
29681 -2388484 -2589076 -1912654 -2363562 -4495982 -5826796 -3555875 1756213 6403439 7526273
29672 7526273 5860994 3962673 2756579 1297584 -448933 -638397 1760661 4802620
29664 4802620 5545543 3463733 633241 -883352 -621050 696139 1816810 1774375 1316498
29655 1316498 2641444 6091555 8352315 6432646 2301340 104059 -500434 -3483927
29647 -3483927 -8409487 -9033383 -2846623 3343225 2365616 -2787953 -3810867 -83846
29639 -83846 816778 -4208379 -8371826 -5339669 1254492 3612973 1097299 -7527 3560316
29630 3560316 7828501 7875031 4135612 666505 -308328 -3690 -379196 -1713219 -2878880
29621 -2878880 -2902317 -1667994 511826 3208995 5504682 6140286 4969668 3779079 4398880
29612 4398880 6097050 6225206 3658536 179203 -2029572 -2836052 -3293469 -3569422 -2895438
29603 -2895438 -928141 1714528 3870736 4405738 3061761 1052087 -44990 -202612
29595 -202612 -632370 -1352239 -690640 2034521 4943949 5878547 4977880 3778695 2923881
29586 2923881 2077995 1096781 -50343 -1661200 -3447165 -4274085 -3878237 -3642659 -4346826
29577 -4346826 -4480039 -2453412 757802 3035838 3968675 4228343 3426494 1200345 -637009
29568 -637009 -201797 706129 -1526691 -6436121 -9059043 -6559372 -2028559 132921 -185566
29559 -185566 -240205 677453 749499 -873670 -2711393 -3053597 -1628313 870106 3523045
29550 3523045 5361043 5887781 5620404 5494276 5849025 6493599 7328204 8173458 8394964
29541 8394964 7569546 6284276 5393918 4566410 2474642 -1278913 -5024350 -6307670 -4298691
29532 -4298691 -741135 1651032 1793423 1031813 1244848 2640452 3960229 4384900 4281083
29523 4281083 4229094 4413482 5112532 6698047 8735588 9964525 9632401 8188080 6413894
29514 6413894 4643089 3016735 1600966 22912 -2053261 -3945011 -4579725 -4157410
29506 -4157410 -3676922 -2736354 -35424 3246851 3362775 -794663 -4874206 -4371723 -953702
29497 -953702 169438 -1739899 -1921016 2233830 6670699 6064797 826013 -4000117 -5001307
29488 -5001307 -2926362 -259994 933194 -593866 -4213251 -6733649 -5312538 -1469656
29480 -1469656 196932 -1998452 -4659396 -4537277 -3423106 -5159934 -9206878 -10513367
29472 -10513367 -6100623 830263 4482599 2585085 -2086193 -5098332 -4190759 -546307
29464 -546307 2616588 2891485 662143 -1860834 -3395617 -4532969 -5935646 -6891245 -6236508
29455 -6236508 -3735902 -38271 3760910 6192613 6354535 5203345 4418041 3663420 1158154
29446 1158154 -2359784 -3201947 -38754 3376424 3500293 2109381 2485453 3272076 1160934
29437 1160934 -2138836 -1737965 1978067 3254261 470749 -784574 3199641 8168108
29429 8168108 8861052 6803756 6159843 6156671 3585840 -163143 -1005479 430998 -383860
29420 -383860 -3941965 -5484120 -2532511 1555696 3104433 2877602 3454950 5328875 7528162
29411 7528162 9419317 10285802 9355885 7340440 5768975 4231879 927219 -3530562
29403 -3530562 -6069471 -5927976 -6017406 -7863863 -8559171 -5186737 432563 4118204 4446490
29394 4446490 3054978 1648152 1093061 1883687 3126037 2444705 -887637 -4143792 -4698126
29385 -4698126 -3897766 -4848446 -7635310 -9587107 -9455452 -8403782 -7134410 -4798830 -1062105
29376 -1062105 2843135 5460369 6127203 4984805 3402471 3567181 5770662 7048824
29368 7048824 4857090 1139364 -256945 456187 -532782 -3903064 -5211133 -1489739
29360 -1489739 3877206 5891319 4848071 4738693 6178588 5184208 -506022 -7343001
29352 -7343001 -9972136 -7377245 -3176055 -867372 -702071 -1091375 -1345498 -2107902 -3758452
29343 -3758452 -5350943 -5388521 -3497981 -1177538 -535530 -1864925 -2741116 -475505 4323721
29334 4323721 7784664 7142673 4021178 2107757 2466849 2935660 1697015 -672815 -2845640
29325 -2845640 -4359664 -5084926 -4942911 -4753265 -5531388 -6426394 -5464420 -2888913 -1076330
29316 -1076330 -179022 2740858 8164109 11292501 8329042 2803208 1172620 3827852
29308 3827852 5328245 2861019 -583319 -1773652 -1077232 435161 3144507 6175016
29300 6175016 6571435 3737170 1313431 1818307 2411787 -657312 -5669780 -7277378 -3705947
29291 -3705947 1187764 2865655 647644 -2701696 -4113773 -2895058 -1280048 -1845057
29283 -1845057 -3885545 -3934190 -851213 1858302 808195 -2293975 -3193300 -957476 1967623
29274 1967623 4438894 7531140 10896546 12059695 10366893 8533696 8740909 9527519
29266 9527519 8200005 4661927 1359004 528340 2487593 5570717 7067402 5489163
29258 5489163 2595484 1817213 3924463 5744300 4179535 72660 -3186551 -3671846
29250 -3671846 -2114335 -120885 1105236 786172 -1003040 -2849398 -3142384 -1931923
$$ [...]
##END NTUPLES=NMR SPECTRUM
##END=
