##TITLE=31Pdec_LY-TMF-12.24.R.t
 D2O, 24 sc
 4.3.2020
##JCAMPDX= 6.0         $$ Bruker NMR JCAMP-DX V2.0
##DATA TYPE= NMR SPECTRUM
##DATA CLASS= NTUPLES
##ORIGIN= UXNMR, Bruker Analytische Messtechnik GmbH
##OWNER= root
$$ XWIN-NMR		Version 3.5
$$ Wed Mar  4 14:22:18 2020 Russian Standard Time (UT+4h)  she@DPX200
##.OBSERVE FREQUENCY= 81.013821
##.OBSERVE NUCLEUS= ^31P
##.ACQUISITION MODE= SIMULTANEOUS
##.ACQUISITION SCHEME= undefined
##.AVERAGES= 24
##.DIGITISER RES= 17
##SPECTROMETER/DATA SYSTEM= spect
##.PULSE SEQUENCE= zgpg30
##.SOLVENT NAME= CDCl3
##.SHIFT REFERENCE= (INTERNAL, CDCl3, 0, 182.463)
##AUDIT TRAIL= $$ (NUMBER, WHEN, WHO, WHERE, WHAT)
$$ ##TITLE= Audit trail, XWIN-NMR		Version 3.5
$$ ##JCAMPDX= 5.01
$$ ##ORIGIN= Bruker BioSpin GmbH
$$ ##OWNER= she
$$ F:/spectra/data/she/nmr/P31/1/pdata/1/auditp.txt
$$ ##AUDIT TRAIL=  $$ (NUMBER, WHEN, WHO, WHERE, WHAT)
(   1,<2020-03-04 14:21:16.70 +0400>,<she>,<DPX200>,
      <created by zg, POWCHK disabled, PULCHK disabled
       configuration hash MD5:
       00 E9 B6 7A A2 85 ED C7 34 08 36 98 17 FE 4E 26
       data hash MD5: 32K
       41 75 65 FE 9F 94 F5 B7 54 EF 26 F5 6D 99 1D B8>)
(   2,<2020-03-04 14:21:19.35 +0400>,<she>,<DPX200>,
      <Start of raw data processing
       efp BC_mod = 2 LB = 1 FT_mod = 6 PKNL = 1 PHC0 = -1321.915 PHC1 = 73.8017 SI = 64K 
       data hash MD5: 64K
       66 95 DB B0 BF 43 B4 2C 14 F2 CA 92 D1 C6 FF 89>)
(   3,<2020-03-04 14:21:40.45 +0400>,<she>,<DPX200>,
      <pk PHC0 = 1.013563 PHC1 = 0 
       data hash MD5: 64K
       6E 1E 67 97 BF 79 24 00 52 13 5F A9 EE 19 6C 6E>)
(   4,<2020-03-04 14:21:43.68 +0400>,<she>,<DPX200>,
      <abs ABSG = 5 
       data hash MD5: 64K
       E5 A1 A4 23 C0 55 1D 97 AA BA 4B 15 AD 86 07 A8>)
$$ ##END=
$$ 
$$ hash MD5
$$ 52 EE E3 5C 66 E3 CA 43 4B 6A 4F 05 41 0E C4 03
##$RELAX= 
##$RELAX= 
##$RELAX= 
##$RELAX= 
##$RELAX= 
##$RELAX= 
##$RELAX= 
##$RELAX= 
$$ Bruker specific parameters
$$ --------------------------
##$DU= <F:/spectra>
##$EXPNO= 1
##$NAME= <P31>
##$PROCNO= 1
##$TYPE= <nmr>
##$USER= <she>
##$AMP= (0..31)
100 100 100 100 100 100 100 100 100 100 100 100 100 100 100 100 100 100 
100 100 100 100 100 100 100 100 100 100 100 100 100 100 
##$AQSEQ= 0
##$AQ_mod= 1
##$AUNM= <au_zg>
##$AUTOPOS= <>
##$BF1= 81.014009
##$BF2= 200.13
##$BF3= 200.13
##$BF4= 200.13
##$BF5= 200.13
##$BF6= 200.13
##$BF7= 200.13
##$BF8= 200.13
##$BYTORDA= 1
##$CFDGTYP= 0
##$CFRGTYP= 5
##$CHEMSTR= <none>
##$CNST= (0..31)
1 1 145 1 1 1 1 1 1 1 1 1 1 1 1 1 1 1 1 1 1 1 1 1 1 1 1 1 1 1 1 1 
##$CPDPRG= <waltz16>
##$CPDPRG1= <>
##$CPDPRG2= <waltz16>
##$CPDPRG3= <>
##$CPDPRG4= <mlev>
##$CPDPRG5= <mlev>
##$CPDPRG6= <mlev>
##$CPDPRG7= <mlev>
##$CPDPRG8= <mlev>
##$CPDPRGB= <>
##$CPDPRGT= <>
##$D= (0..31)
0 1 0 0 0 0 0 0 0 0 0 0.03 2e-05 3e-06 0 0 0 0 0 0 0 0 0 0 0 0 0 0 0 0 
0 0 
##$DATE= 1583317276
##$DBL= (0..7)
120 120 120 11 120 120 24 19 
##$DBP= (0..7)
150 150 150 150 150 150 150 150 
##$DBP07= 0
##$DBPNAM0= <>
##$DBPNAM1= <>
##$DBPNAM2= <>
$$ [...]
##$SUBNAM3= <"">
##$SUBNAM4= <"">
##$SUBNAM5= <"">
##$SUBNAM6= <"">
##$SUBNAM7= <"">
##$SUBNAM8= <"">
##$SUBNAM9= <"">
##$SW= 369.568048894756
##$SWIBOX= (0..15)
0 1 3 0 0 0 0 0 0 0 0 0 0 0 0 0 
##$SW_h= 29940.119760479
##$TD= 32768
##$TD0= 1
##$TE= 0
##$TE2= 300
##$TE3= 300
##$TEG= 300
##$TL= (0..7)
0 120 53 12 22 120 120 120 
##$TP= (0..7)
150 150 150 150 150 150 150 150 
##$TP07= 0
##$TPNAME0= <>
##$TPNAME1= <>
##$TPNAME2= <>
##$TPNAME3= <>
##$TPNAME4= <>
##$TPNAME5= <>
##$TPNAME6= <>
##$TPNAME7= <>
##$TPOAL= (0..7)
0.5 0.5 0.5 0.5 0.5 0.5 0.5 0.5 
##$TPOFFS= (0..7)
0 0 0 0 0 0 0 0 
##$TUNHIN= 0
##$TUNHOUT= 0
##$TUNXOUT= 0
##$USERA1= <user>
##$USERA2= <user>
##$USERA3= <user>
##$USERA4= <user>
##$USERA5= <user>
##$V9= 5
##$VALIST= <valist>
##$VCLIST= <CCCCCCCCCCCCCCC>
##$VD= 0
##$VDLIST= <DDDDDDDDDDDDDDD>
##$VPLIST= <PPPPPPPPPPPPPPP>
##$VTLIST= <TTTTTTTTTTTTTTT>
##$WBST= 1024
##$WBSW= 4
##$XGAIN= (0..3)
0 0 0 0 
##$XL= 0
##$YL= 0
##$YMAX_a= 9323
##$YMIN_a= -6783
##$ZGOPTNS= <>
##$ZL1= 120
##$ZL2= 120
##$ZL3= 120
##$ZL4= 120
##$ABSF1= 182.463
##$ABSF2= -187.1042
##$ABSG= 5
##$ABSL= 3
##$ALPHA= 0
##$AQORDER= 0
##$ASSFAC= 0
##$ASSFACI= 0
##$ASSFACX= 0
##$ASSWID= 0
##$AUNMP= <proc_1d>
##$AZFE= 0.1
##$AZFW= 0.5
##$BCFW= 0
##$BC_mod= 2
##$BYTORDP= 0
##$COROFFS= 0
##$CY= -3
##$DATMOD= 1
##$DC= 0
##$DFILT= <>
##$DTYPP= 0
##$F1P= 0
##$F2P= 0
##$FCOR= 1
##$FTSIZE= 65536
##$FT_mod= 6
##$GAMMA= 0
##$GB= 0
##$INTBC= 1
##$INTSCL= 5.30512e-09
##$ISEN= 30
##$LB= 1
##$LEV0= 0
##$LPBIN= 0
##$MAXI= 10000
##$MC2= 0
##$MEAN= 0
##$ME_mod= 0
##$MI= 50
##$NCOEF= 0
##$NC_proc= -6
##$NLEV= 6
##$NOISF1= 182.463
##$NOISF2= 159.3651
##$NSP= 0
##$NTH_PI= 0
##$NZP= 0
##$OFFSET= 182.463
##$PC= 4
##$PHC0= -1320.901
##$PHC1= 73.8017
##$PH_mod= 1
##$PKNL= yes
##$PPARMOD= 0
##$PSCAL= 0
##$PSIGN= 0
##$REVERSE= no
##$SF= 81.0140089999434
##$SI= 65536
##$SIGF1= 159.3651
##$SIGF2= -187.1042
##$SINO= 113.3802
##$SIOLD= 16384
##$SREGLST= <1H.CDCl3>
##$SSB= 0
##$STSI= 65536
##$STSR= 0
##$SW_p= 29940.119760479
##$SYMM= 0
##$S_DEV= 0
##$TDeff= 32768
##$TDoff= 0
##$TI= <>
##$TILT= no
##$TM1= 0
##$TM2= 0
##$TOPLEV= 0
##$USERP1= <user>
##$USERP2= <user>
##$USERP3= <user>
##$USERP4= <user>
##$USERP5= <user>
##$WDW= 1
##$XDIM= 65536
##$YMAX_p= 514365229
##$YMIN_p= -14069224
$$ End of Bruker specific parameters
$$ ---------------------------------
##NTUPLES= NMR SPECTRUM
##VAR_NAME=  FREQUENCY,     SPECTRUM/REAL,   SPECTRUM/IMAG
##SYMBOL=    X,             R,               I
##VAR_TYPE=  INDEPENDENT,   DEPENDENT,       DEPENDENT
##VAR_FORM=  AFFN,          ASDF,            ASDF
##VAR_DIM=   65536,         65536,           65536
##UNITS=     HZ,            ARBITRARY UNITS, ARBITRARY UNITS
##FACTOR=    0.456856943014862, 1,           1
##FIRST=     14782.0589164792, 0,            0
##LAST=      -15158.0608439998, 0,           0
##MIN=       -15158.0608439998, -14069224,   0
##MAX=       14782.0589164792, 514365229,    0
$$ Real data points
##PAGE= N=1
##DATA TABLE= (X++(R..R)), XYDATA
$$ [...]
$$ plain form
36643 4215395 1991642 114085 -106116 1447091 3698426 4838727 3799546 1575696
36635 1575696 188702 227666 533037 394062 484358 1093253 1173785 280789 -73128 1444892
36625 1444892 3644154 4331802 3312166 2034342 984730 -388203 -1510820 -954149
36617 -954149 799087 1282568 -341534 -1768920 -1015815 485536 94355 -2076127 -3494544
36608 -3494544 -2818848 -1156002 77958 723253 1103324 1213042 1165475 1407347 2070786
36599 2070786 2794406 3260010 3197824 2082563 -100317 -1935032 -1825665 -369580 -5896
36590 -5896 -1746325 -3695116 -3724250 -2332899 -1605915 -2304486 -3431095 -4072430 -4166458 -3690626
36580 -3690626 -2538380 -1254638 -625294 -393176 372074 1376416 970044 -1379605 -3681206
$$ packed form
36643D215395k223753j877557k20201J553207K251335J140301j039181k223850
36635A575696j386994L8964L05371j38975R0296O08895Q0532q92996l53917J518020
36625A444892K199262O87648j019636j277824j049612j372933j122617N56671
36617i54149J753236M83481j624102j427386P53105J501351l91181k170482j418417
36608c494544O75696J662846J233960O45295L80071J09718m7567K41872O63439
36599B070786P23620M65604o2186j115261k182880j834715J09367J456085L63684
36590e896j740429j948791k9134J391351P26984o98571j126609o41335r4028M75832
36580c690626J152246J283742O29344K32118P65250J004342m06372k349649k301601
$$ plain form
36571 -3681206 -3580973 -1200010 1296168 2457520 2636449 2492490 1808670 314596 -1266989
36562 -1266989 -1829645 -1211054 -315600 -33647 -440242 -968501 -1030103 -522534 -32332 -490246
36552 -490246 -2269996 -4543403 -5815366 -5278852 -3512815 -1752675 -659288 1320 596841
36543 596841 922304 507593 -459931 -912933 31869 1871863 3070899 2832730 2055951
36534 2055951 2031778 2564065 2192545 247547 -2224624 -3882970 -4571423 -4807792 -4599920
36525 -4599920 -3704501 -2564559 -1888954 -1463502 -466112 993383 1742886 1217160 218307
36516 218307 -398351 -742839 -971708 -423569 1304870 3186342 3833763 3256439 2405450
36507 2405450 1434628 -159551 -1837760 -2113003 -744660 608264 626737 -20974 -171421
$$ packed form
36571c681206J00233K380963K496178J161352J78929j43959o83820j494074j581585
36562a266989n62656O18591Q95454K81953m06595n28259o1602N07569M90202m57914
36552d90246j779750k273407j271963N36514J766037J760140J093387O60608N95521
36543E96841L25463m14711r67524m53002R44802J839994J199036k38169p76779
36534B055951k4173N32287l71520j944998k472171j658346o88453k36369K07872
36525d599920Q95419J139942O75605M25452R97390J459495P49503n25726r98853
36516B18307o16658l44488k28869N48139J728439J881472O47421n77324q50989
36507B405450r70822j594179j678209k75243J368343J352924J8473o47711j50447
$$ plain form
36498 -171421 -155144 -985628 -2272218 -2433495 -893025 1115809 2030015 1335661 -542521
36489 -542521 -2739710 -4121143 -3855345 -2257980 -513624 672998 1567376 2415859 2772060
36480 2772060 2228897 1166123 283183 -90223 173771 1194920 2511466 2901780 1584572
36471 1584572 -677804 -2325923 -2610112 -1910808 -871469 13782 250050 -290709 -890112
36462 -890112 -696704 57932 341572 -167198 -743977 -924933 -1136144 -1608744 -1638278 -650578
36452 -650578 714406 1456293 1714751 2515523 4174060 5774853 6317725 5728486 4540603
36443 4540603 3117996 1563884 104793 -887839 -1313939 -1504272 -1747761 -1783906 -1111370
36434 -1111370 132927 1022369 860670 -15760 -857513 -1503504 -2129629 -2384099 -1719453
$$ packed form
36498a71421J6277q30484j286590j61277J540470K008834R14206o94354j878182
36489e42521k197189j381433K65798J597365J744356J186622Q94378Q48483L56201
36480B772060n43163j062774q82940l73406K63994J021149J316546L90314j317208
36471A584572k262376j648119k84189O99304J039339Q85251K36268n40759n99403
36462h90112J93408P54636K83640n08770n76779j80956k11211m72600k9534R87700
36452f50578J364984P41887K58458Q00772J658537J600793N42872n89239j187883
36443D540603j422607j554112j459091r92632m26100j90333k43489l6145O72536
36434a111370J244297Q89442j61699q76430q41753o45991o26125k54470O64646
$$ plain form
36425 -1719453 -476022 404169 851670 1762046 3272442 4049226 2967175 688998 -1084139
36416 -1084139 -1283031 71226 2218757 3860786 3875854 2537817 1221828 384377 -942688
36407 -942688 -2874893 -3534935 -1750909 513125 551955 -1172157 -1881005 -725130 408692
36398 408692 325038 89397 602421 1087863 986159 1133244 1807276 1630993 -55187 -1492293
36388 -1492293 -910142 804145 1628721 1331115 948166 434635 -956306 -2551806 -2755037
36379 -2755037 -1553528 -559363 -443374 -166231 886342 1672247 1044820 -702159 -2459940
36370 -2459940 -3524071 -3708715 -3097879 -2155858 -1455923 -1035600 -595325 -325673 -705084
36361 -705084 -1429432 -1518602 -719416 111122 305121 176880 187090 209698 93707 161952
$$ packed form
36425a719453J243431Q80191M47501R10376J510396P76784j082051k278177j773137
36416a084139j98892J354257K147531J642029J5068j338037j315989q37451j327065
36407i42688j932205o60042J784026K264034L8830j724112p08848J155875J133822
36398D08692q3654k35641N13024M85442j01704J47085O74032j76283j686180j437106
36388a492293N82151J714287Q24576k97606l82949n13531j390941j595500k03231
36379b755037J201509R94165J15989K77143J052573P85905o27427j746979j757781
36370b459940j064131j84644O10836R42021O99935M20323M40275K69652l79411
36361g05084p24348q9170P99186Q30538J93999j28241J0210K2608j15991O8245
$$ plain form
36351 161952 600752 963934 785581 215992 -295345 -473057 -163411 592402 1240117 1180400
36341 1180400 788695 1138497 2351647 3122961 2422424 799449 -668524 -1840618 -3034224
36332 -3034224 -3869375 -3760689 -3119180 -2857262 -2851070 -2055821 -258156 1323296 1513434
36323 1513434 454384 -947923 -2101673 -2726162 -2389052 -883019 1014391 1849547 890122
36314 890122 -1032163 -2354845 -2381090 -1786025 -1537234 -1689477 -1514745 -517331 1156119
36305 1156119 3143877 5056024 6185094 5789267 4081941 2371107 1643028 1380271 389886
36296 389886 -1461731 -3025298 -3295968 -2401113 -1116020 -67845 337724 -173424 -1388604
36287 -1388604 -2496757 -2862503 -2763192 -2858633 -3026556 -2402188 -809422 501091 179842
$$ packed form
36351A61952M38800L63182j78353n69589n11337j77712L09646P55813O47715n9717
36341A180400l91705L49802J213150P71314p00537j622975j467973j172094j193606
36332c034224q35151J08686O41509K61918O192P95249J797665J581452J90138
36323A513434j059050j402307j153750o24489L37110J506033J897410Q35156r59425
36314H90122j922285j322682k6245N95065K48791j52243J74732R97414J673450
36305A156119J987758J912147J129070l95827j707326j710834p28079k62757r90385
36296C89886j851617j563567k70670Q94855J285093J048175M05569n11148j215180
36287a388604j108153l65746R9311r5441j67923O24368J592766J310513l21249
$$ plain form
36278 179842 -1449104 -2645875 -2234514 -641059 1082598 2409089 3140503 2927723 1775049
36269 1775049 516474 -44174 -166670 -592190 -1274816 -1618905 -1726634 -2267633 -3073830
36260 -3073830 -3052975 -1843674 -498611 -8596 -69934 69173 360010 282529 -201414 -708154
36250 -708154 -919520 -457217 1032413 2935064 3535447 1893378 -535100 -1245974 407570
36241 407570 2534030 2930896 1258849 -1006344 -2109157 -1440087 44922 828146 603105
36232 603105 705853 2197754 3996704 3932755 1517963 -1390823 -2761161 -2223364 -627646
36223 -627646 1095793 2197547 2260756 1786085 1893546 2808006 3349268 2634148 1552854
36214 1552854 1555650 2466437 2702788 1567429 108733 -599447 -960971 -1952610 -3441680
$$ packed form
36278A79842j628946j196771M11361J593455J723657J326491P31414k12780j152674
36269A775049j258575n60648j22496m25520o82626l44089j07729n40999q06197
36260c073830K0855J209301J345063M90015o1338J39107K90837p7481m83943n06740
36250g08154k11366M62303J489630J902651O00383j642069k428478p10874J653544
36241D07570K126460L96866j672047k265193j102813O69070J485009P83224k25041
36232F03105J02748J491901J798950o3949k414792k908786j370338N37797J595718
36223f27646J723439J101754O3209m74671J07461R14460N41262p15120j081294
36214A552854K796R10787K36351j135359j458696p08180l61524r91639j489070
$$ plain form
36205 -3441680 -4314185 -4010907 -3085824 -2221383 -1465175 -690367 -105292 207741 730152
36196 730152 1781452 2668174 2384705 1104770 127930 215638 846173 1381649 1956573
36187 1956573 2601513 2524854 1349792 295409 700187 1738928 1246363 -1053610 -2816786
36178 -2816786 -2264760 -628337 -220995 -1149776 -1526866 -517295 493321 49506 -1354493
36169 -1354493 -2065911 -1273086 478729 2231324 3324852 3395915 2371763 612144 -1235064
36160 -1235064 -2577481 -3043558 -2637978 -2005764 -2102054 -3023368 -3542510 -2664011 -1396152
36151 -1396152 -1721142 -3624180 -4672635 -3405428 -1658496 -1920376 -3465760 -3390092 -1189134
36142 -1189134 290291 -819336 -2509776 -1918573 504051 1958875 1488165 959565 1954687
$$ packed form
36205c441680q72505L03278R25083Q64441P56208P74808N85075L13033N22411
36196G30152J051300Q86722k83469j279935r76840Q7708O30535N35476N74924
36187A956573O44940p6659j175062j054383M04778J038741m92565k299973j763176
36178b816786N52026J636423M07342r28781l77090J009571J010616m43815j403999
36169a354493p11418P92825J751815J752595J093528P1063j024152j759619j847208
36160a235064j342417m66077M05580O32214r6290r21314n19142Q78499J267859
36151a396152l24990j903038j048455J267207J746932k61880j545384P5668K200958
36142a189134J479425j109627j690440N91203K422624J454824m70710n28600R95122
$$ plain form
36133 1954687 3602495 4045248 2808678 1092116 371212 1052040 2128191 2220310 1292295
36124 1292295 834075 1706253 2595472 1822917 23529 -692812 -28326 15570 -1713387
36115 -1713387 -3763777 -4307688 -3558361 -2899836 -2870375 -3188024 -3763125 -4411807 -4275964
36106 -4275964 -2788643 -854346 -80547 -1058697 -2993207 -4518912 -4361706 -2085430 908809
36097 908809 1982139 35255 -2952669 -4348120 -4118423 -4154415 -4910415 -4738793 -2750596
36088 -2750596 -396215 658367 786980 1392208 2572962 3067682 2199500 828604 254610
36079 254610 786786 1616752 1806519 1158621 115512 -980368 -2145011 -3183141 -3424536
36070 -3424536 -2592363 -1595820 -1690105 -2879855 -3852437 -3571325 -2291950 -905912 -7956
$$ packed form
36133A954687J647808M42753j236570j716562p20904O80828J076151R2119r28015
36124A292295m58220Q72178Q89219p72555j799388p16341O64486M3896j728957
36115a713387k050390n43911P49327O58525K9461l17649n75101o48682J35843
36106d275964J487321J934297P73799r78150j934510j525705J57206K276276K994239
36097I08809J073330j946884k987924j395451K29697l5992p56000J71622J988197
36088b750596K354381J054582J28613O05228J180754M94720q68182j370896n73994
36079B54610N32176Q29966J89767o47898j043109j095880j164643j038130k41395
36070c424536Q32173R96543r4285j189750r72582K81112J279375J386038Q97956
$$ plain form
36061 -7956 122944 -655305 -2006507 -3029084 -3035242 -2219471 -1232504 -335949 710616 2139822
36051 2139822 3819904 5179572 5294802 3490097 348601 -2194073 -2516066 -1150291
36043 -1150291 -302189 -1233425 -2739011 -2814394 -1345138 -143961 -368523 -1117435 -1145307
36034 -1145307 -836010 -1328590 -2454782 -3059720 -3029090 -3266735 -3610039 -2754870 -894995
36025 -894995 -373341 -2319479 -4380045 -3717866 -1001918 813752 829586 765077 1443031
36016 1443031 1440271 -153578 -1966747 -2396473 -1630001 -564305 631234 1690358 1583066
36007 1583066 189367 -621093 738759 3102769 3988586 2815716 1024811 -445539
35999 -445539 -1863129 -2990272 -2707331 -975830 408420 40740 -1126285 -1134186 217069
$$ packed form
36061g956J30900p78249j351202j022577o158Q15771R86967Q96555J046565J429206
36051B139822J680082J359668J15230j804705l141496k542674l21993J365775
36043a150291Q48102r31236j505586p5383J469256J201177k24562p48912k7872
36034a145307L09297m92580j126192o04938L0630k37645l43304Q55169J859875
36025h94995N21654j946138k060566O62179K715948J815670J5834o4509O77954
36016A443031k760j593849j813169m29726P66472J065696J195539J059124j07292
36007A583066j393699q10460J359852K364010Q85817j172870j790905j470350
35999d45539j417590j127143K82941J731501J384250l67680j167025p901J351255
$$ plain form
35990 217069 1080798 47684 -1975261 -2850973 -1760622 -4488 773810 450921 35553
35981 35553 62709 339211 961702 2277183 3649795 3595675 1733276 -532410 -1944948
35972 -1944948 -2860836 -3957757 -4750559 -4602681 -4082343 -3847465 -3182065 -1347665 500204
35963 500204 806241 410897 1459737 3682940 4392046 2662104 919000 1242268 2395419
35954 2395419 2167110 807860 133387 443307 415000 -528747 -1544689 -1818547 -1297754
35945 -1297754 -209441 988952 1525110 1300375 1489960 2902842 4260450 3665282 1503307
35936 1503307 140097 628544 1461810 1079350 6969 -329878 366477 1408990 2283254
35927 2283254 2605642 1732898 -355979 -2184647 -1987095 156756 2255125 2664953 1819960
$$ packed form
35990B17069Q63729j033114k022945q75712J090351J756134P78298l22889m15368
35981C5553K7156K76502O22491J315481J372612n4120j862399k265686j412538
35972a944948r15888j096921p92802J47878N20338K34878O65400J834400J847869
35963E00204L06037l95344J048840K223203P09106j729942j743104L23268J153151
35954B395419k28309j359250o74473L09920k8307r43747j015942k73858N20793
35945a297754J088313J198393N36158k24735J89585J412882J357608n95168k161975
35936A503307j363210M88447Q33266l82460j072381l36847O96355J042513Q74264
35927B283254L22388q72744k088877j828668J97552K143851K098369M09828q44993
$$ plain form
35918 1819960 1464841 2561510 4244180 4751668 3257361 723953 -1101287 -1432525 -953789
35909 -953789 -671647 -744257 -662910 -172072 417516 659237 351264 -445004 -1478700 -2399032
35899 -2399032 -2959378 -3172250 -3235063 -3370665 -3713555 -4163269 -4354233 -4042993 -3543443 -3380040
35889 -3380040 -3377390 -2609483 -670136 1399518 2072621 1108495 -250192 -927354 -1247340
35880 -1247340 -2147604 -3576296 -4309588 -3436509 -1561207 -182552 -51549 -535672 -632942
35871 -632942 -174939 275345 395387 446524 688398 973477 1100643 1153708 1196491 945219
35861 945219 124390 -1021840 -1967534 -2591041 -3203174 -3812886 -3831729 -2910145 -1820694
35852 -1820694 -1870094 -3227360 -4381739 -3813529 -1903987 -445620 -320379 -589933 -182129
$$ packed form
35918A819960l55119J096669J682670N07488j494307k533408j825240l31238M78736
35909i53789K82142p2610Q1347M90838N89588K41721l07973p96268j033696r20332
35899b399032n60346k12872o2813j35602l42890m49714j90964L11240M99550J63403
35889c380040K650P67907J939347K069654O73103r64126j358687o77162l19986
35880a247340r00264j428692p33292Q73079J875302J378655J31003m84123r7270
35871f32942M58003M50284J20042N1137K41874K85079J27166N3065M2783k51272
35861I45219q20829j146230r45694o23507o12133o09712j8843R21584J089451
35852a820694m9400j357266j154379N68210J909542J458367J25241k69554M07804
$$ plain form
35843 -182129 516879 499127 -237091 -931334 -1399853 -1941657 -2211984 -1507587 -133282 868419
35833 868419 1482787 2755669 4675272 5585916 4520753 2708057 1710665 1378052 934069
35824 934069 835678 1806959 2896663 2481659 835541 -221593 -142632 -208432 -1078680 -1716476
35814 -1716476 -1342621 -696695 -433381 224431 2045892 4145004 5050008 4666552 3996814
35805 3996814 3439490 2510821 1012653 -466904 -1195698 -900837 95285 972315 998439
35796 998439 348452 -134642 -214261 -490743 -993165 -687862 755265 1849043 1268595
35787 1268595 47177 110923 1153429 945546 -1193149 -3218929 -3287384 -2127071 -1442536
35778 -1442536 -1336558 -754985 352172 905818 513737 12092 -16376 -141720 -1006423
$$ packed form
35843a82129O99008j7752p36218o94243m68519n41804k70327P04397J374305J001701
35833H68419O14368J272882J919603R10644j065163j812696r97392l32613m43983
35824I34069r8391R71281J089704m15004j646118j057134P8961o5800q70248o37796
35814a716476L73855O45926K63314O57812J821461K099112R05004l83456o69738
35805C996814n57324r28669j498168j479557p28794K94861R96122Q77030K6124
35796I98439o49987m83094p9619k76482n02422L05303J443127J093778n80448
35787A268595j221418O3746J042506k07883k138695k025780o8455J160313O84535
35778a442536J05978N81573J107157N53646l92081n01645k8468j25344q64703
$$ plain form
35769 -1006423 -2166798 -2725210 -2656872 -2690899 -2953274 -2558326 -923398 1087839 1981206
35760 1981206 1375675 286239 -292397 -381026 -436746 -512297 -421740 -167347 307891 1276997
35750 1276997 2531607 2998266 1829834 -371958 -2160068 -2891302 -3077189 -3303008 -3627679
35741 -3627679 -3980998 -4299797 -4215446 -3398137 -2267395 -1543123 -1051380 28179 1502203
35732 1502203 1856426 210009 -2273945 -3648272 -3269140 -2024853 -1043716 -822434 -1221453
35723 -1221453 -1736872 -2033045 -2461458 -3520890 -4608370 -4257472 -2197489 -162046 283884
35714 283884 -206907 -104159 445364 53914 -1320280 -2083264 -1478901 -654378 -719645 -1201664
35704 -1201664 -1144844 -459786 651628 2378622 4355834 5155796 4076058 2618096 2685165
$$ packed form
35769a006423j160375n58412O8338l4027k62375L94948J634928K011237Q93367
35760A981206o05531j089436n78636q8629n5720p5551R0557K54393M75238R69106
35750A276997J254610M66659j168432k201792j788110p31234j85887k25819l24671
35741c627679l53319l18799Q4351Q17309J130742P24272M91743J079559J474024
35732A502203L54223j646417k483954j374327L79132J244287R81137K21282l99019
35723a221453n15419k96173m28413j059432j087480L50898K059983K035443M45930
35714B83884m90791J02748N49523l91450j374194p62984O04363Q24523o5267m82019
35704a201664N6820O85058J111414J726994J977212P99962j079738j457962O7069
$$ plain form
35695 2685165 3830574 3922281 2355223 882684 966893 1884280 2148351 1514941 627692
35686 627692 -349285 -1608209 -2742812 -2989544 -2286103 -1363804 -891973 -1008554 -1395882
35677 -1395882 -1307519 37039 2355554 3979913 3536432 1760028 676577 1021369 1501907
35668 1501907 826263 -527879 -1029261 152078 2531669 4798352 5514775 4050327 1428975
35659 1428975 -250297 169883 1780147 2830481 2563559 1445642 291783 -145486 642213
35650 642213 2190670 2899422 1647243 -522788 -1321119 77516 2127236 2964507 2550360
35641 2550360 2281384 3054110 4361965 5105293 4708082 3299383 1192569 -1325517 -3598094
35632 -3598094 -4519519 -3507852 -1463164 -11830 382185 819381 2172890 3717582 4125597
$$ packed form
35695B685165J145409R1707j567058j472539Q4209R17387K64071o33410q87249
35686F27692r76977j258924j134603k46732P03441R22299M71831j16581l87328
35677a395882Q8363J344558K318515J624359m43481j776404j083451L44792M80538
35668A501907o75644j354142n01382J181339K379591K266683P16423j464448k621352
35659A428975j679272M20180J610264J050334k66922j117917j153859m37269P87699
35650F42213J548457P08752j252179k170031p98331J398635K049720Q37271m14147
35641B550360k68976P72726J307855P43328l97211j408699k106814k518086k272577
35632c598094r21425J011667K044688J451334L94015M37196J353509J544692M08015
$$ plain form
35623 4125597 3102857 1320373 -617434 -2282439 -3074139 -2737573 -1881694 -1186284 -572550
35614 -572550 34535 -135015 -1585624 -3245598 -3696275 -3245152 -3231317 -3668459 -3372869
35605 -3372869 -2243698 -1420266 -1066202 -87407 1561523 2461630 2316054 2739292 4374420
35596 4374420 5366641 4217637 2242690 1368446 1160080 163519 -1143279 -1165049 -155517
35587 -155517 57218 -994601 -1987733 -2276546 -2666907 -3443616 -3602390 -2723230 -2023112
35578 -2023112 -2663104 -4113145 -5025663 -4963820 -4519313 -4181940 -3757183 -2904742 -1997843
35569 -1997843 -2122102 -3748098 -5545110 -5549406 -3841899 -2779992 -3780888 -5304271 -5356430
35560 -5356430 -4574300 -4827762 -5791764 -5397457 -3358842 -1731902 -1711627 -2145220 -1809333
$$ packed form
35623D125597j022740j782484j937807j665005p91700L36566Q55879O95410O13734
35614e72550O07085j69550j450609j659974m50677M51123J3835m37142K95590
35605c372869J129171Q23432L54064R78795J648930R00107j45576M23238J635128
35596D374420R92221j149004j974947q74244k08366r96561j306798k1770J009532
35587a55517K12735j051819r93132k88813l90361p76709j58774Q79160P00118
35578b023112o39992j450041r12518O1843M44507L37373M24757Q52441R06899
35569a997843j24259j625996j797012m296J707507J061907j000896j523383n2159
35560e356430P82130k53462r64002L94307K038615J626940K0275m33593L35887
$$ plain form
35551 -1809333 -1144325 -914987 -835796 -377838 405669 1438096 2656592 3167020 2023012
35542 2023012 247871 147845 1967558 3333307 2951328 2526102 3502392 4221966 2574254
35533 2574254 -309690 -1658765 -1221109 -1107369 -2091666 -2810534 -2604683 -2537170 -3055253
35524 -3055253 -2933024 -1530909 -317887 -899563 -2722803 -3931399 -3736827 -2889599 -2280804
35515 -2280804 -2039208 -1885952 -1679410 -1496238 -1486504 -1707192 -1981071 -1947978 -1342829 -262614
35505 -262614 815929 1384754 1455089 1632078 2281759 2783367 2254372 981605 221320
35496 221320 347170 264777 -753421 -1727634 -1397237 -69811 1126756 2074908 3281864
35487 3281864 4094855 3002359 -50812 -2984908 -3706321 -2052021 608480 2786096
$$ packed form
35551a809333O65008K29338P9191M57958P83507J032427J218496N10428j144008
35542B023012j775141j00026J819713J365749l81979m25226R76290P19574j647712
35533B574254k883944j349075M37656J13740r84297p18868K05851O7513n18083
35524c055253J22229J402115J213022n81676j823240j208596J94572Q47228O08795
35515b280804K41596J53256K06542J83172R734k20688k73879L3093O05149J080215
35505b62614J078543N68825P0335J76989O49681N01608n28995j272767p60285
35496B21320J25850q2393j018198r74213L30397J327426J196567R48152J206956
35487C281864Q12991j092496l053171k934096p21413J654300K660501K177616
$$ plain form
35479 2786096 3610085 3135452 2467482 2890940 4337222 5217118 4224992 1878849 -150581
35470 -150581 -864298 -620727 -216126 209774 1160295 2785348 4176888 4062552 2313269
35461 2313269 302292 -581152 -347684 117223 478935 1064399 1844823 2272618 2193465
35452 2193465 2079454 2123013 1815073 802914 -343378 -671560 46891 1031175 1259331
35443 1259331 444169 -729486 -1363338 -1238116 -685867 223335 1610633 2818000 2609769
35434 2609769 1006624 -98478 759100 2455285 2716405 1206544 -275227 -440486 193189
35425 193189 745800 1221760 1881889 2552504 3029610 3243946 2793911 1388418 -29051
35416 -29051 83336 1595290 2384811 1107465 -843160 -1178354 308632 1712073 1489288
$$ packed form
35479B786096Q23989m74633o67970M23458J446282Q79896r92126k346143k029430
35470a50581p13717K43571M04601M25900R50521J625053J391540j14336j749283
35461B313269k010977q83444K33468M64907L61712N85464P80424M27795p9153
35452B193465j14011M3559l07940j012159j146292l28182P18451R84284K28156
35443A259331q15162j173655o33852J25222N52249R09202J387298J207367k08231
35434B609769j603145j105102Q57578J696185K61120j509861j481771j65259O33675
35425A93189N52611M75960O60129O70615M77106K14336m50035j405493j417469
35416b9051J12387J511954P89521j277346j950625l35194J486986J403441k22785
$$ plain form
35407 1489288 -581 -1230682 -1101084 88748 934035 449460 -634423 -722336 413416
35398 413416 1240035 699804 -275587 -273937 548429 994889 724690 443281 525178 530406
35388 530406 84122 -514853 -621810 173998 1570494 2414663 1620227 -344863 -1569242
35379 -1569242 -878753 821088 2056618 2727205 3485491 4013504 3394246 1855147 707735
35370 707735 595413 1016673 1505016 1993735 2025079 1059609 -152967 11450 1669014
35361 1669014 2811066 1939948 147892 -574725 -170390 -192676 -1116722 -1616835 -782242
35352 -782242 351523 318481 -609295 -879900 30099 965170 996578 832641 1431535 1995538
35342 1995538 822096 -1870431 -3562134 -2655731 -816585 -748492 -2365438 -2883622 -760189
$$ packed form
35407A489288j489869j230101J29598J189832Q45287m84575j083883q7913J135752
35398D13416Q26619n40231r75391J650Q22366M46460k70199k81409Q1897N228
35388E30406m46284n98975j06957P95808J396496Q44169p94436j965090j224379
35379a569242O90489J699841J235530O70587P58286N28013o19258j539099j147412
35370G07735j12322M21260M88343M88719L1344r65470j212576J64417J657564
35361A669014J142052q71118j792056p22617M04335k2286r24046n00113Q34593
35352g82242J133765l3042r27776k70605R09999R35071L1408j63937N98894N64003
35342A995538j173442k692527j691703R06403J839146O8093j616946n18184K123433
$$ plain form
35333 -760189 2104141 2866590 1307411 -260096 -119087 1093122 1908223 2170316 2768505
35324 2768505 3709269 3686584 1983370 -152533 -981611 -594994 -536756 -1244358 -1355473
35315 -1355473 -29750 1474382 1563922 587616 92087 530806 1062702 1178692 1143665
35306 1143665 1024061 624677 379404 1016157 2188807 2623697 1856015 744729 54922
35297 54922 -357131 -670403 -573269 -68198 231612 112727 139273 571357 873639 789756
35287 789756 891580 1461332 1825350 1489926 968627 711394 193994 -978010 -1926462
35278 -1926462 -1554130 -143207 1050269 1243817 366557 -1372836 -3141222 -3466899 -1799224
35269 -1799224 471993 1727432 2236753 3259307 4675949 5178829 4478198 3526672 2581309
$$ packed form
35333g60189K864330P62449j559179j567507J41009J212209Q15101K62093N98189
35324B768505R40764k2685j703214k135903q29078L86617N8238p07602j11115
35315a355473J325723J504132Q9540r76306m95529M38719N31896J15990l5027
35306A143665j19604l99384k45273O36753J172650M34890p67682j111286o89807
35297E4922m12053l13272R7134N05071K99810j18885K6546M32084L02282q3883
35287G89756J01824N69752L64018l35424n21299k57233n17400j172004r48452
35278a926462L72332J410923J193476J93548q77260j739393j768386l25677J667675
35269a799224K271217J255439N09321J022554J416642N02880p00631r51526r45363
$$ plain form
35260 2581309 881729 -1442159 -2907731 -2737967 -1872951 -1260844 -600100 387772 830998
35251 830998 -39997 -1571560 -2666925 -3143022 -3110840 -2046599 220347 2405988 3102064
35242 3102064 2706405 2640593 3024507 2624774 1037948 -545692 -1023901 -617128 -44432
35233 -44432 488201 965127 1054927 536315 -241480 -751826 -855257 -829161 -1181848 -2384805
35223 -2384805 -4230211 -5493519 -4954117 -2831252 -479312 1355198 2960251 4151898
35215 4151898 3725502 1360560 -970620 -926545 1231601 2933050 2585139 1314051 1035323
35206 1035323 1918960 2659187 2616835 2551116 3163391 3811302 3211379 1085890 -1366881
35197 -1366881 -2592523 -2002624 -300731 1158129 1386928 587349 67670 971000 2953416
$$ packed form
35260B581309j699580k323888j465572J69764Q65016O12107O60744R87872M43226
35251H30998q70995j531563j095365m76097L2182J064241K266946K185641O96076
35242C102064l95659o5812L83914l99733j586826j583640m78209M06773N72696
35233d4432N32633M76926Q9800n18612p77795n10346j03431K6096l52687j202957
35223b384805j845406j263308N39402K122865K351940J834510J605053J191647
35215D151898m26396k364942k331180M4075K158146J701449l47911j271088k78728
35206A035323Q83637P40227m2352o5719O12275O47911n99923k125489k452771
35197a366881j225642N89899J701893J458860K28799p99579n19679R03330J982416
$$ plain form
35188 2953416 4497827 4625639 3759657 2733599 1741432 770870 236464 274675 56146
35179 56146 -1052966 -2084386 -1566249 162299 1236521 982320 740992 1473925 2146376
35170 2146376 1503729 175732 -282238 384074 1117496 1213297 837822 273633 -282590
35161 -282590 -408783 140316 905062 1308007 1443395 1611870 1578767 1121873 786453 1126447
35151 1126447 1658251 1598231 1212622 1338698 1941036 2268030 2071912 1517698 342375
35142 342375 -1540880 -3042720 -3080156 -2438364 -2701381 -3539056 -3085616 -1091359 526932
35133 526932 742380 761625 1505162 2044577 1819003 2205409 4093888 5748909 5218132
35124 5218132 3459507 2773330 3161338 2710680 1015572 -326308 -581262 -836135 -1686718
$$ packed form
35188B953416J544411J27812q65982j026058r92167r70562n34406L8211k18529
35179E6146j109112j031420N18137J728548J074222k54201k41328P32933O72451
35170B146376o42647j327997m57970O66312P33422R5801l75475n64189n56223
35161b82590j26193N49099P64746M02945J35388J68475l3103m56894l35420L39994
35151A126447N31804o0020l85609J26076O02338L26994j96118n54214j175323
35142C42375j883255j501840l7436O41792k63017q37675M53440J994257J618291
35133E26932K15448J9245P43537N39415k25574L86406J888479J655021n30777
35124E218132j758625o86177L88008m50658j695108j341880k54954k54873q50583
$$ plain form
35115 -1686718 -2127110 -1508107 -766123 -703764 -590818 327941 1211822 985084 477012 1500618
35105 1500618 3938855 5324143 3834836 596906 -1841752 -2622164 -3026477 -4027845
35097 -4027845 -4769666 -4117225 -2665432 -2017179 -2522945 -2968567 -2393410 -1038134 521552
35088 521552 1892560 2296401 863444 -1942974 -4367018 -5382003 -5502306 -5110428 -3564756
35079 -3564756 -934538 999181 998714 407806 1273503 3380470 4871691 5006875 4423845
35070 4423845 3267690 1161362 -1122345 -2010418 -1425197 -1033210 -1821831 -2877573 -2960672
35061 -2960672 -1973383 -431139 1346116 3004914 4012322 4141623 3522022 2225713 470064
35052 470064 -1066565 -2003310 -2914502 -4202187 -4916606 -4109813 -2821638 -2942836 -4328384
$$ packed form
35115a686718m40392O19003P41984O2359J12946R18759Q83881k26738n08072J023606
35105A500618K438237J385288j489307l237930k438658p80412m04313j001368
35097d027845p41821O52441J451793O48253n05766m45622N75157J355276J559686
35088E21552J371008M03841j432957k806418k424044j014985j20303L91878J545672
35079c564756K630218J933719m67n90908Q65697K106967J491221J35184n83030
35070D423845j156155k106328k283707q88073N85221L91987p88621j055742q3099
35061b960672R87289J542244J777255J658798J007408J29301o19601j296309j755649
35052D70064j536629r36745r11192j287685p14419Q06793J288175j21198j385548
$$ plain form
35043 -4328384 -4904153 -3667996 -1766468 -458039 188497 386518 253618 527459 1751428
35034 1751428 2608325 1283246 -1201329 -1582369 909466 3041795 2119182 -446035 -1824432
35025 -1824432 -1778950 -1828263 -2179898 -1889972 -981211 -279041 103408 419421 305106 -278888
35015 -278888 -160625 1279716 2504909 1867561 341495 171093 1498071 2459659 2240189
35006 2240189 1942466 2514711 3638916 4693972 5248230 4655313 2652931 296677 -1043105
34997 -1043105 -1380024 -1490604 -1135723 358593 2120775 2364438 1044456 -67228 -215812
34988 -215812 -632996 -2129546 -3595088 -3881726 -3686442 -4292051 -5358757 -5260420 -3367919
34979 -3367919 -1083163 -366173 -1470146 -2428129 -1164933 1942239 4393084 4669520 3854431
$$ packed form
35043d328384n75769J236157J901528J308429O46536J98021j32900K73841J223969
35034A751428Q56897j325079k484575l81040K491835K132329r22613k565217j378397
35025a824432M5482m9313l51635K89926R08761P02170L82449L16013j14315n83994
35015b78888J18263J440341J225193o37348j526066j70402J326978R61588k19470
35006B240189k97723N72245J124205J055056N54258n92917k002382k356254j339782
34997a043105l36919j10580L54881J494316J762182K43663j319982j111684j48584
34988b15812m17184j496550j465542k86638J95284o05609j066706R8337J892501
34979c367919K284756P16990j103973r57983J263196L107172K450845K76436q15089
$$ plain form
34970 3854431 3466288 3074067 1482641 -803720 -2146144 -2217477 -2093088 -2270065 -2355921
34961 -2355921 -2473045 -3180246 -4086746 -4249864 -3875776 -3926748 -4151137 -3342569 -1562380
34952 -1562380 -226694 109360 181448 187333 -422902 -1191164 -914591 4679 -189994 -1501448
34942 -1501448 -1822703 -487522 468962 -163150 -651327 461338 1469337 255372 -1902179
34933 -1902179 -1990733 301735 2358965 2367518 1049851 -224989 -1153980 -2020696 -2776802
34924 -2776802 -2991651 -2234001 -631188 792682 1074656 833745 1660721 3575538 4617314
34915 4617314 3694428 2106155 1187390 401349 -710636 -773400 1010010 2498068 1430096
34906 1430096 -700342 -679822 1309894 1964612 118499 -1702250 -1642819 -1226343 -2277742
$$ packed form
34970C854431l88143l92221j591426k286361j342424p1333J24389j76977q5856
34961b355921j17124p07201r06500j63118L74088n0972k24389Q08568J780189
34952a562380J335686L36054P2088N885o10235p68262K76573R19270j94673j311454
34942a501448l21255J335181R56484o32112m88177J112665J007999j213965k157551
34933a902179q8554K292468K057230Q553j317667j274840r28991q66716p56106
34924b776802k14849P57650J602813J423870K81974k40911Q26976J914817J041776
34915D617314r22886j588273r18765p86041j111985o2764J783410J488058j067972
34906A430096k130438K0520J989716O54718j846113j820749N9431M16476j051399
$$ plain form
34897 -2277742 -3759787 -3608399 -1967247 -669912 -564381 -976366 -1153348 -930210 -407998
34888 -407998 72764 75669 -133843 421724 1904567 2816687 1616217 -1248485 -3740455
34879 -3740455 -4338205 -3064900 -902398 884903 1120707 -437361 -2359782 -2555233 -602231
34870 -602231 1480302 1497021 -211306 -1249908 -418436 684806 51823 -1749923 -2396858
34861 -2396858 -1143893 404586 952431 1061732 1405060 1371731 670527 630859 2118956
34852 2118956 3425276 2349001 -358534 -1829871 -1063131 42191 -340299 -1908112
34844 -1908112 -3366992 -3815474 -2702967 -182612 2089340 2250673 827079 292828 1492949
34835 1492949 2421626 1429317 -335792 -1030791 -908870 -1280547 -2011252 -1989789 -1314026
$$ packed form
34897b277742j482045J51388J641152J297335J05531m11985j76982K23138N22212
34888d07998M80762K905k09512N55567J482843R12120j200470k864702k491970
34879c740455n97750J273305K162502J787301K35804j558068j922421j95451J953002
34870f02231K082533J6719j708327j038602Q31472J103242o32983j801746o46935
34861b396858J252965J548479N47845J09301L43328l3329p01204l9668J488097
34852B118956J306320j076275k707535j471337P66740J105322l82490j567813
34844a908112j458880m48482J112507K520355K271952J61333j423594n34251J200121
34835A492949R28677r92309j765109o94999J21921l71677p30705K1463O75763
$$ plain form
34826 -1314026 -1170347 -1879610 -2584771 -2677589 -2277631 -1558504 -806063 -860640 -2228851 -3915823
34816 -3915823 -4389730 -3652445 -3143403 -3584531 -4186780 -4181622 -3872538 -3702343 -3370731 -2549954
34806 -2549954 -1670929 -1282302 -1179678 -831109 -278755 -9658 -181212 -516646 -827873
34797 -827873 -1175801 -1582460 -1988051 -2462509 -3074727 -3536295 -3390093 -2683460 -2025907 -1681898
34787 -1681898 -1027619 526507 2340920 3099228 2609692 2110958 2369385 2465830 1343462
34778 1343462 -297630 -980646 -832455 -1336592 -2676752 -3089340 -1527822 544125 1094512
34769 1094512 119618 -922989 -1386210 -1712155 -1947242 -1470007 -199264 1060453 1564415
34760 1564415 1082402 -409447 -2455001 -3671305 -2842990 -659474 827097 815716 651667
$$ packed form
34826a314026J43679p09263p05161r2818L99958P19127P52441n4577j368211j686972
34816c915823m73907P37285N09042m41128o02249N158L09084J70195L31612Q20777
34806b549954Q79025L88627J02624L48569N52354K69097j71554l35434l11227
34797h27873l47928m06659m05591m74458o12218m61568J46202P06633O57553L44009
34787a681898O54279J554126J814413P58308m89536m98734K58427R6445j122368
34778A343462j641092o83016J48191n04137j340160m12588J561518K071947N50387
34769A094512r74894j042607m63221l25945k35087M77235J270743J259717N03962
34760A564415m82013j491849k045554j216304Q28315K183516J486571j1381j64049
$$ plain form
34751 651667 1639491 3252210 4373467 5100750 5969337 6227114 4597763 1601698 -506526
34742 -506526 -478572 527047 792225 118791 -696818 -1433397 -2358607 -3167303 -3210976 -2597783
34732 -2597783 -2020782 -1560251 -686023 506582 1183568 1189213 1458247 2407475 2893946 1679033
34722 1679033 -685558 -2328788 -2058617 -217075 1986464 3253762 2844555 1397110
34714 1397110 704166 1664312 2857117 2382542 800482 617714 2673083 4759224 4646198
34705 4646198 3049241 2350386 3291795 4337689 3947016 2204684 163466 -1396466 -2209980
34696 -2209980 -2219849 -1564790 -708403 -213980 -235547 -307602 127165 908731 1236489 812024
34686 812024 393801 627489 880750 267972 -538312 37850 1919924 3057789 2257207
$$ packed form
34751F51667R87824J612719J121257P27283Q68587K57777j629351k996065k108224
34742e06526K7954J005619K65178o73434q15609p36579r25210q08696m3673O13193
34732b597783N77001M60531Q74228J192605O76986N645K69034R49228M86471j214913
34722A679033k364591j643230K70171J841542K203539J267298m09207j447445
34714A397110o92944R60146J192805m74575j582060j82768K055369K086141j13026
34705D646198j596957o98855R41409J045894l90673j742332k041218j559932q13514
34696b209980r869O55059Q56387M94423k1567p2055M34767P81566L27758m24465
34686H12024m18223K33688K53261o12778q06284N76162J882074J137865q00582
$$ plain form
34677 2257207 869541 695417 1475983 1753345 1256301 921854 1079468 1110106 779817
34668 779817 654999 1105852 1816131 2324754 2366369 1818408 945323 384524 249476 -212201
34658 -212201 -1257019 -1689140 -483186 1293055 1753917 1016872 966929 2247437 3375724
34649 3375724 3206335 2434841 1950984 1373829 202071 -993188 -1612678 -2078491 -2766043
34640 -2766043 -3000570 -2262921 -1362092 -1185722 -1260048 -865061 -580363 -1127367 -1544093 -438826
34630 -438826 1462948 2135617 1475187 1468537 2822106 3713937 2847326 1649162 1861125
34621 1861125 2537117 1430636 -1494096 -3935342 -4340245 -3302627 -1849038 -133221
34613 -133221 1601304 2306722 1451319 133057 -211466 319650 524110 70159 -74293
$$ packed form
34677B257207j387666j74124P80566K77362m97044l34447J57614L0638l30289
34668G79817j24818M50853P10279N08623M1615n47961q73085n60799j35048m61677
34658b12201j044818m32121J205954J776241M60862p37045m9943J280508J128287
34649C375724j69389p71494m83857n77155j171758j195259o19490m65813o87552
34640b766043k34527P37649R00829J76370p4326L94987K84698n47004m16726J105267
34630d38826J901774O72669o60430o650J353569Q91831q66611j198164K11963
34621A861125O75992j106481k924732k441246m04903J037618J453589J715817
34613a33221J734525P05418q55403j318262l44523N31116K04460m53951j44452
$$ plain form
34604 -74293 721707 1683842 1691004 758432 -169705 -565307 -743844 -969136 -835425 68422
34594 68422 1284015 1844952 1485429 1004768 1241473 2038722 2542775 2312973 1731011 1319574
34584 1319574 1019074 309444 -1111467 -2886740 -4161613 -4202720 -3042908 -1553708 -696282
34575 -696282 -636416 -770629 -654018 -598802 -1132450 -2081789 -2572810 -2003274 -764728 204742
34565 204742 501131 590165 904970 955926 -37848 -1623481 -2108240 -671441 1264166
34556 1264166 1790406 1150192 1248144 2664330 3853942 3795889 3693693 4902825 6618315
34547 6618315 7213238 6813012 6661794 6621071 5472813 3573567 2919814 4039454 4871853
34538 4871853 3753373 1810086 1034001 1294277 888989 -654842 -1941312 -1733974 -413813
$$ packed form
34604g4293P96000R62135P162r32572r28137l95602j78537k25292J33711R03847
34594F8422J215593N60937l59523m80661K36705P97249N04053k29802n81962m11437
34584A319574l00500p09630j420911j775273j274873m1107J159812J489200Q57426
34575f96282N9866j34213J16611N5216n33648r49339m91021N69536J238546R69470
34565B04742K96389Q9034L14805N0956r93774j585633m84759J436799J935607
34556A264166N26240o40214R7952J416186J189612n8053j02196J209132J715490
34547F618315N94923m00226j51218m0723j148258j899246o53753J119640Q32399
34538D871853j118480j943287p76085K60276m05288j543831j286470K07338J320161
$$ plain form
34529 -413813 745837 1038115 895079 1247485 2176683 2292117 243552 -2982026 -4494831
34520 -4494831 -2963330 -439278 421575 -158643 -11397 1375221 2307062 1853476 1203373
34511 1203373 1410019 1622984 747449 -466574 -497169 481841 756058 -375996 -1574715
34502 -1574715 -1454190 -576899 -519967 -1425132 -1707552 -490412 831332 497757 -855317
34493 -855317 -896424 980007 2667594 2415597 1207957 823369 929669 -77839 -2208338
34484 -2208338 -3881912 -4460815 -4751802 -4969685 -4239629 -2550231 -1302658 -1196436 -1257055
34475 -1257055 -778906 -542371 -1036383 -1122809 106704 1541833 1729200 1138823 980230
34466 980230 831709 -400873 -1863240 -1557316 297327 1145273 -159275 -1708125 -1544564
$$ packed form
34529d13813J159650K92278j43036L52406R29198J15434k048565l225578j512805
34520d494831J531501K524052Q60853n80218J47246J386618R31841m53586o50103
34511A203373K06646K12965q75535j214023l0595R79010K74217j132054j198719
34502a574715J20525Q77291N6932r05165k82420J217140J321744l33575j353074
34493h55317m1107J876431J687587k51997j207640l84588J06300j007508k130499
34484b208338j673574n78903k90987k17883P30056J689398J247573J06222o0619
34475a257055M78149K36535m94012q6426J229513J435129J87367n90377j58593
34466I80230j48521j232582j462367L05924J854643Q47946j304548j548850J63561
$$ plain form
34457 -1544564 -320279 329651 351687 558054 627405 -263952 -1511261 -1648620 -588832
34448 -588832 362243 624680 820592 1029668 330767 -1336679 -2415802 -1760491 -195779
34439 -195779 958039 1804090 3035304 4062647 3588034 1761008 260578 101303 585102
34430 585102 700002 464071 421867 672479 944736 1048841 818315 89795 -906455 -1551506
34420 -1551506 -1470772 -763352 449831 2084829 3596383 4192191 3810377 3124541 2316069
34411 2316069 814252 -1224214 -2255740 -1169464 952302 2016572 1464759 562031
34403 562031 372240 554958 264258 -698319 -1920334 -2895711 -3198771 -2656142 -1719813
34394 -1719813 -1382290 -2307098 -3958124 -4793819 -3689924 -1352451 105419 -470087 -1709878
$$ packed form
34457a544564J224285O49930K2036K06367O9351q91357j247309j37359J059788
34448e88832R51075K62437J95912K09076o98901j667446j079123O55311J564712
34439a95779J153818Q46051J231214J027343m74613j827026j500430j59275M83799
34430E85102J14900k35931m2204K50612K72257J04105k30526p28520r96250o45051
34420a551506Q0734P07420J213183J634998J511554N95808l81814o85836q08472
34411B316069j501817k038466j031526J086276K121766J064270n51813r02728
34403E62031j89791J82718k90700r62577j222015r75377l03060N42629R36329
34394a719813L37523r24808j651026q35695J103895K337473J457870n75506j239791
$$ plain form
34385 -1709878 -1389139 643305 2480088 3037609 3178119 3436544 2630190 135938 -2109482
34376 -2109482 -1893363 16462 1035366 568868 385949 1341489 2078071 1497953 498800
34367 498800 327116 764053 1012287 1219627 1974317 2981449 3271300 2491874 1364795
34358 1364795 883127 1232601 1481762 604529 -988767 -1611689 -608454 372901 -431346
34349 -431346 -2227625 -2803465 -1835903 -1105177 -1478432 -1768791 -1007973 98402 703189
34340 703189 1088755 1582575 1749156 1513352 1628952 2175637 2052930 870096 -175847
34331 -175847 -327313 -591697 -1779027 -2747419 -2176460 -805152 -165437 -95801 657271
34322 657271 2057550 2803692 2363084 1396489 407501 -592897 -1257137 -1090500 -444818
$$ packed form
34385a709878L20739K032444J836783N57521J40510K58425q06354k494252k245420
34376b109482K16119J909825J018904m66498j82919R55540P36582n80118r99153
34367D98800j71684M36937K48234K07340P54690J007132K89851p79426j127079
34358A364795m81668L49474K49161q77233j593296o22922J003235R81355q04247
34349d31346j796279n75840R67562P30726l73255k90359P60818J106375O04787
34340G03189L85566M93820J66581k35804J15600N46685j22707j182834j045943
34331a75847j51466k64384j187330r68392N70959J371308O39715O9636P53072
34322F57271J400279P46142m40608r66595r88988j000398o64240J66637O45682
$$ plain form
34313 -444818 -239422 -772609 -1689455 -2800327 -3932197 -4333817 -3383636 -1717597 -599563
34304 -599563 -276478 115363 1152562 2515001 3628096 4103553 3686426 2471789 1012579
34295 1012579 -274397 -1381049 -1960197 -1149548 1074474 3239970 4081876 4086709 4274998
34286 4274998 4406909 3781438 2910767 2697625 2628537 1656159 399496 409151 1412226 1445516
34276 1445516 -37071 -1254972 -851071 315662 909398 998668 1215453 1382253 1074361
34267 1074361 603201 470084 511199 301238 -188501 -840763 -1668002 -2448299 -2744111 -2551343
34257 -2551343 -2212146 -1596376 -369362 811471 684083 -633717 -1462547 -1034352 -660819
34248 -660819 -1402937 -2071613 -1155887 387518 342218 -1214283 -1758332 -64303 1834594
$$ packed form
34313d44818K05396n33187r16846j110872j131870m01620R50181J666039J118034
34304e99563L23085L91841J037199J362439J113095M75457m17127j214637j459210
34295A012579j286976j106652n79148Q10649K224022K165496Q41906M833J88289
34286D274998J31911o25471q70671k13142o9088r72378j256663R655J003075L3290
34276A445516j482587j217901M03901J166733N93736Q9270K16785J66800l07892
34267A074361m71160j33117M1115k09961m89739o52262q27239p80297k95812J92768
34257b551343L39197O15770J227014J180833j27388j317800q28830M28195L73533
34248f60819p42118o68676R15726J543405m5300j556501n44049J694029J898897
$$ plain form
34239 1834594 1452228 -716628 -1926491 -708681 1658241 3088917 2913787 1833409
34231 1833409 588437 -580700 -1518472 -1909599 -1529943 -455365 966729 2229028 2954723
34222 2954723 3239137 3385196 3156669 1938708 79268 -792454 221536 1641511 1350548
34213 1350548 -411742 -1417353 -702269 429809 972450 1731974 3315432 4425411 3638488
34204 3638488 1647530 266896 59798 183508 -199125 -1425281 -3361757 -4882952 -4316209
34195 -4316209 -1552229 1268402 2270671 1905285 1384146 606716 -705879 -1350512 -334877
34186 -334877 882632 234170 -1648254 -2385924 -1548967 -860625 -969886 -625648 723784
34177 723784 1855925 1790613 1008892 311421 98746 848931 2584114 3901602 3380218
$$ packed form
34239A834594l82366k168856j209863J217810K366922J430676j75130j080378
34231A833409j244972j169137r37772l91127L79656J074578J422094J262299P25695
34222B954723K84414J46059k28527j217961j859440q71722J013990J419975k90963
34213A350548j762290j005611P15084J132078N42641P59524J583458J109979p86923
34204C638488j990958j380634k07098J23710l82633j226156j936476j521195N66743
34195d316209K763980K820631J002269l65386n21139p77430j312595o44633J015635
34186c34877J217509o48462j882424p37670Q36957O88342j09261L44238J349432
34177G23784J132141o5312p81721o97471k12675P50185J735183J317488n21384
$$ plain form
34168 3380218 1904945 1672889 2948282 3838915 3280682 2137969 1324062 979828 1469683
34159 1469683 2862508 3483947 1584528 -1501148 -2697082 -1842140 -1798065 -3446373 -4227181
34150 -4227181 -2858688 -1801757 -3010911 -4559306 -4052118 -2574808 -2344143 -2733759 -1785260
34141 -1785260 9805 637392 203395 581224 1894067 2136514 418944 -1623289 -2108049
34132 -2108049 -1116619 -217925 -636979 -2082724 -3080511 -2675880 -1682937 -1399389 -1401182 -296167
34122 -296167 1326414 1028299 -1654326 -3898136 -3421118 -1484938 -496966 -602196 -523129
34113 -523129 -110046 -56391 -302552 -421159 -487135 -282252 931524 2646188 2962089 1632280
34103 1632280 1127906 2841033 4458708 3475381 1281819 967824 2656018 3953666 3858367
$$ packed form
34168C380218j475273k32056J275393Q90633n58233j142713q13907l44234M89855
34159A469683J392825O21439j899419l085676j195934Q54942M4075j648308p80808
34150d227181J368493J056931j209154j548395N07188J477310K30665l89616R48499
34141a785260J795065O27587m33997L77829J312843K42447j717570k042233m84760
34132b108049R91430Q98694m19054j445745r97787M04631R92943K83548j793J105015
34122b96167J622581k98115k682625k243810M77018J936180R87972j05230P9067
34113e23129M13083N3655k46161j18607o5976K04883J213776J714664L15901j329809
34103A632280n04374J713127J617675r83327k193562l13995J688194J297648r5299
$$ plain form
34094 3858367 3327015 2843403 2180584 1915434 2624272 3177263 2188159 427958 -522081
34085 -522081 -1050303 -2323882 -3283264 -1935576 754479 1409180 -1106484 -4202729 -5043953
34076 -5043953 -3268061 -115350 2916656 4329805 3595588 2144614 1734961 2008559 1455009
34067 1455009 341684 395651 1681926 2158466 645075 -1752118 -3450952 -3836818 -2773074
34058 -2773074 -540073 1416660 1342898 -742841 -2938932 -3504034 -2081721 682294 3548018
34049 3548018 5165388 5317257 5143386 5241546 4689338 3087898 1954866 2347394 2738001
34040 2738001 1442617 -329774 -335777 1080808 1856285 1603546 1484751 1699500 1784613
34031 1784613 2421565 4174202 5413239 4395441 2468572 2179742 3047053 2353888 -517531
$$ packed form
34094C858367n31352m83612o62819k65150P08838N52991r89104j760201r50039
34085e22081n28222j273579r59382J347688K690055O54701k515664l096245q41224
34076e043953J775892L152711L032006J413149p34217j450974m09653K73598n53550
34067A455009j113325N3967J286275M76540j513391k397193j698834l85866J063744
34058b773074K233001J956733p3762k085739k196091n65102J422313K764015K865724
34049C548018J617370J51869j73871R8160n52208j601440j133032L92528L90607
34040B738001j295384j772391o003J416585P75477k52739j18795K14749Q5113
34031A784613O36952J752637J239037j017798j926869k88830Q67311o93165k871419
$$ plain form
34022 -517531 -3570037 -5278864 -5267353 -2969019 1062696 3530140 1719806 -2252036 -3996808
34013 -3996808 -2740119 -1029989 167531 1696717 2481037 497504 -2716269 -3356860
34005 -3356860 -1331238 -269136 -1272321 -1442751 637233 2590360 2506150 1401113 422435
33996 422435 -605680 -1096046 167139 2304983 3247302 3281395 3983356 4284793 2081825
33987 2081825 -943535 -1191686 723667 1168300 231779 1203891 3658781 3741117 1508754
33978 1508754 1019626 2592419 2258273 -228831 -460961 2255221 3389415 1683825 1215615
33969 1215615 3095142 3323627 1110579 844216 3351469 4026305 2267305 3326069 7698473
33960 7698473 8745703 4652538 2372719 5382393 8241515 7955333 9303792 13709785
$$ packed form
34022e17531l052506j708827J1511K298334M031715K467444j810334l971842j744772
34013c996808J256689J710130J197520J529186P84320j983533l213773o40591
34005c356860K025622J062102j003185j70430K079984J953127q4210j105037r78678
33996D22435j028115m90366J263185K137844R42319L4093P01961L01437k202968
33987B081825l025360k48151J915353M44633r36521R72112K454890Q2336k232363
33978A508754m89128J572793l34146k487104k32130K716182J134194j705590m68210
33969A215615J879527K28485k213048k66363K507253O74836j759000J058764M372404
33960G698473J047230m093165k279819L009674K859122k86182J348459M405993
$$ plain form
33952 13709785 15018402 12128246 12808036 18814094 21689660 20049235 24260453 36066574
33944 36066574 43551091 46503305 62305831 92151105 112863419 128389439 193600243
33937 193600243 337874162 485548631 514365229 398185711 238742409 141987778
33931 141987778 113185346 97299839 71892134 54997739 51919164 45367757 30854491
33924 30854491 22628437 24317129 23263558 15402136 11052398 13648986 13912020 8214214
33916 8214214 4427931 6134752 6973174 4042322 2769707 5172406 5938003 3264496
33908 3264496 2173822 4299124 4903199 2446108 1204244 2289744 1626456 -1214109
33900 -1214109 -1520269 1295269 2075626 -422419 -1202594 1431065 2763301 624390 -934154
$$ packed form
33952A3709785J308617k890156O79790O006058K875566j640425M211218J1806121
33944C6066574P484517K952214J5802526K9845274K0712314J5526020O5210804
33937A93600243J44273919J47674469K8816598j16179518j59443302r6754631
33931A41987778k8802432j5885507k5407705j6894395l078575o551407j4513266
33924C0854491q226054J688692j053571p861422m349738K596588K63034n697806
33916H214214l786283J706821Q38422k930852j272615K402699P65597k673507
33908C264496j090674K125302O04075k457091j241864J085500o63288k840565
33900a214109l06160K815538P80357k498045p80175K633659J332236k138911j558544
$$ plain form
33891 -934154 318062 1076295 -251382 -260171 2344890 3603738 1533227 -272326 512303
33882 512303 1000531 -762111 -1973024 -730746 396397 -244698 -136314 1980260 2936501
33873 2936501 783199 -1608884 -1874309 -1956273 -3314694 -3493451 -1064592 861013 -181924
33864 -181924 -1783350 -1270685 -237940 -753361 -1179328 352163 2030970 1699401 621840
33855 621840 402117 -330580 -2539102 -3588533 -1354647 1570010 1691688 -89393 -749256
33846 -749256 -158426 -138735 -798035 -1343000 -2448238 -4492865 -5487819 -3948015 -1795343
33837 -1795343 -1324874 -1404919 131607 2396635 3077320 2341250 1859502 1566580 546167
33828 546167 -371389 26542 748815 274539 -564061 -198324 551954 -174487 -2007775
$$ packed form
33891i34154J252216P58233j327677q789K605061J258848k070511j805553P84629
33882E12303M88228j762642j210913J242278J127143o41095J08384K116574R56241
33873B936501k153302k392083k65425q1964j358421j78757K428859J925605j042937
33864a81924j601426N12665J032745n15421m25967J531491J678807l31569j077561
33855F21840k19723p32697k208522j049431K233886K924657J21678j781081o59863
33846g49256N90830J9691o59300n44965j105238k044627r94954J539804K152672
33837a795343M70469q0045J536526K265028O80685p36070m81748k92922j020413
33828E46167r17556L97931P22273m74276q38600L65737P50278p26441j833288
$$ plain form
33819 -2007775 -3111723 -3083109 -2630333 -1668817 -195916 362194 -739454 -1500937 130140
33810 130140 2818127 3745448 2701408 1617839 1248691 1003653 958890 1344528 1035960
33801 1035960 -881158 -3032413 -3612474 -3112070 -2828718 -2196894 -322859 1410754 1383353
33792 1383353 946522 2220699 3941715 3215108 530536 -890849 -337008 -226606 -1429266
33783 -1429266 -1877492 -506511 949738 1136370 1088005 2006246 3534755 5088226 6560349
33774 6560349 7068614 5398319 2392497 600858 922723 1859135 2507227 3617228 4982502
33765 4982502 4758653 2758607 1687962 3199550 4971314 3926065 709213 -1352061
33757 -1352061 -753437 870523 1492128 931987 307705 487047 1328206 1854040 1154604
$$ packed form
33819b007775j103948K8614M52776R61516J472901N58110j101648p61483J631077
33810A30140K687987R27321j044040j083569l69148k45038m4763L85638l08568
33801A035960j917118k151255n80061N00404K83352O31824J874035J733613k7401
33792A383353m36831J274177J721016p26607k684572j421385N53841J10402j202660
33783a429266m48226J370981J456249J86632m8365R18241J528509J553471J472123
33774F560349N08265j670295l005822j791639L21865R36412O48092J110001J365274
33765D982502k23849k000046j070645J511588J771764j045249l216852k061274
33757a352061N98624J623960O21605n60141o24282J79342Q41159N25834o99436
$$ plain form
33748 1154604 -588258 -2156195 -2517064 -1689945 -416701 497209 513273 -335227 -1365829
33739 -1365829 -1937789 -2094490 -2027355 -1365157 101225 1425839 1516531 1002342 1689359
33730 1689359 3924665 5799172 5492149 3426925 1559167 1264839 2379203 3708845
33722 3708845 4073903 3237140 2040047 1404999 1344516 1308514 1142775 1079626 1091553 953053
33712 953053 692516 385088 -76968 -369547 422001 2389033 3909473 3421167 1586676
33703 1586676 337340 177504 2462 -577470 -459673 1082668 3171551 4478933 4595360
33694 4595360 3872868 2777553 1711316 809300 -174602 -1208518 -1507678 -593180 516896
33685 516896 311819 -1175930 -2463679 -2609706 -1963074 -1089780 -245104 115128 -369649
$$ packed form
33748A154604j742862j567937l60869Q27119J273244R13910J6064q48500j030602
33739a365829n71960j56701O7135O62198J466382J324614R0692n14189O87017
33730A689359K235306J874507l07023k065224j867758k94328J114364J329642
33722C708845L65058q36763j197093o35048o0483l6002j65739o3149J1927j38500
33712I53053k60537l07428m62056k92579P91548J967032J520440m88306j834491
33703A586676j249336j59836j75042n79932J17797J542341K088883J307382J16427
33694D595360p22492j095315j066237r02016r83902j033916k99160R14498J110076
33685E16896k05077j487749j287749j46027O46632Q73294Q44676L60232m84777
$$ plain form
33676 -369649 -1036269 -806715 130034 446313 -373921 -1432580 -1944188 -2120238 -2245631
33667 -2245631 -2074425 -1554562 -1136271 -987703 -772520 -409903 -161510 141179 981248
33658 981248 2175283 3005015 3382428 3832630 4301091 4156026 3461201 2987948 2754347
33649 2754347 1813980 -151555 -2153722 -3149819 -2978408 -1885692 -267426 901348 598680
33640 598680 -908536 -2302452 -3006902 -3605175 -4284732 -4226110 -3033584 -1570856 -765092
33631 -765092 -543113 -448524 -407405 -431568 -383726 -412665 -908611 -1816743 -2637676 -3044750
33621 -3044750 -2799873 -1488765 564780 1622614 260969 -2512050 -4400161 -4712304
33613 -4712304 -4360775 -3491227 -1526577 500175 429550 -1596054 -2780260 -1672304 -49410
$$ packed form
33676c69649o66620K29554R36749L16279q20234j058659n11608j76050j25393
33667b245631J71206N19863M18291J48568K15183L62617K48393L02689Q40069
33658I81248J194035Q29732L77413M50202M68461j45065o94825m73253k33601
33649B754347r40367j965535k002167r96097J71411J092716J618266J168774l02668
33640E98680j507216j393916p04450n98273o79557N8622J192526J462728Q05764
33631g65092K21979R4589M1119k4163M7842k8939m95946r08132q20933m07074
33621c044750K44877J311108K053545J057834j361645k773019j888111l12143
33613d712304L51529Q69548J964650K026752p0625k025604j184206J107956J622894
$$ plain form
33604 -49410 305416 165454 658483 907300 -99605 -1207276 -864298 245131 429888
33595 429888 -316454 -826372 -947809 -1303193 -1691520 -1542497 -1269844 -1518918 -1764119 -1267851
33585 -1267851 -746813 -1413108 -2865019 -3496145 -2644383 -1049791 339017 852798 93737
33576 93737 -1320181 -1762928 -624405 535135 201170 -761657 -647384 219691 159974
33567 159974 -983973 -1735945 -1398136 -606507 267312 1330437 1973871 1445435 549682
33558 549682 747664 1497991 675733 -1931432 -3713995 -2753966 -486588 301079 -1136014
33549 -1136014 -3176909 -3938000 -2741301 -211709 2240204 3457351 3534053 3345107 2953396
33540 2953396 1325430 -1965917 -5521273 -7192721 -6044288 -3039065 -226461 688777
$$ packed form
33604d9410L54826j39962M93029K48817j006905j107671L42978J109429J84757
33595D29888p46342n09918j21437l55384l88327J49023K72653k49074k45201M96268
33585a267851N21038o66295j451911o31126Q51762J594592J388808N13781p59061
33576I3737j413918m42747J138523J159540l33965r62827J14273Q67075n9717
33567A59974j143947p51972L37809P91629Q73819J063125O43434n28436q95753
33558E49682J97982P50327q22258k607165j782563R60029K267378P87667j437093
33549a136014k040895p61091J196699K529592K451913J217147P6702j88946l91711
33540B953396j627966l291347l555356j671448J148433L005223K812604R15238
$$ plain form
33532 688777 -398683 -1961444 -2523434 -2363664 -2930125 -4639565 -6138884 -5944890 -4022653
33523 -4022653 -1452935 716272 1876296 1775150 663811 -671107 -1420102 -1340805 -849151
33514 -849151 -625804 -1012836 -1660691 -1988435 -2088821 -2682554 -3892670 -4731977 -4401541
33505 -4401541 -3484042 -3054440 -3128464 -2943566 -2382635 -2028858 -1981780 -1720132 -1177852 -942256
33495 -942256 -1181108 -1225465 -517218 644729 1532818 1706652 1203120 407406 -248294 -729131
33485 -729131 -1340304 -1960379 -1823517 -596045 850738 1473199 1423984 1579157 2084108
33476 2084108 2275635 1801097 937328 -27407 -917360 -1338475 -982324 -150969 561545
33467 561545 825980 446837 -591367 -1371533 -422061 2089148 3630855 2273206 -520186
$$ packed form
33532F88777j087460j562761n61990J59770n66461j709440j499319J93994J922237
33523d022653K569718K169207J160024j01146j111339j334918p48995P9297M91654
33514h49151K23347l87032o47855l27744j00386n93733j210116q39307L30436
33505d401541R17499M29602p4024J84898N60931L53777M7078K61648N42280K35596
33495i42256k38852m4357P08247J161947Q88089J73834n03532p95714o55700m80837
33485g29131o11173o20075J36862J227472J446783O22461m9215J55173N04951
33476B084108J91527m74538q63769r64735q89953m21115L56151Q31355P12514
33467E61545K64435l79143j038204p80166R49472K511209J541707j357649k793392
$$ plain form
33458 -520186 -1799919 -1053241 -154067 62328 670779 1976681 2466947 1268898 -328079
33449 -328079 -829008 -439777 -36324 376214 1093548 1685076 1589465 1033196 628542 648238
33439 648238 1064667 1558567 1316095 -160094 -1832081 -1931797 -335287 1133079 1222686
33430 1222686 763750 1053029 2057693 3031652 3728805 4058261 3491378 1770809 -430106
33421 -430106 -2198946 -3113921 -2981309 -1795846 -321329 367519 314003 491658 898473
33412 898473 381586 -1079024 -1710042 -628488 504280 -41391 -1356186 -1346912 179886
33403 179886 1637460 2064308 1663725 519981 -1410589 -3209034 -3530473 -2381017 -1157594
33394 -1157594 -821100 -1014026 -984240 -459687 378427 962234 456223 -1351006 -3300912
$$ packed form
33458e20186j279733P46678Q99174K16395O08451J305902M90266j198049j596977
33449c28079n00929L89231M03453M12538P17334N91528r5611n56269m04654J9696
33439F48238M16429M93900k42472j476189j671987r9716J596510J468366Q9607
33430A222686m58936K89279J004664R73959O97153L29456n66883j720569k200915
33421d30106j768840r14975J32612J185463J474517O88848n3516J77655M06815
33412H98473n16887j460610o31018J081554J132768n45671j314795R274J526798
33403A79886J457574M26848m00583j143744j930570j798445l21439J149456J223423
33394a157594L36494j92926K9786N24553Q38114N83807n06011j807229j949906
$$ plain form
33385 -3300912 -3801087 -2579975 -899864 -3355 90620 154727 544690 662324 -310256
33376 -310256 -2102554 -3198139 -2590082 -1322929 -1215590 -2199857 -2368166 -898269 687790
33367 687790 830411 -95626 -1060545 -2052650 -3152184 -3343967 -1959485 -364074 -478336
33358 -478336 -2152874 -3502155 -3438889 -2575645 -1976601 -2121607 -2703905 -2622864 -939838
33349 -939838 1323859 1547838 -1111838 -4066396 -4634013 -3624955 -3470262 -4081024 -3370847
33340 -3370847 -1213525 224597 173836 309638 1487688 2155132 1132237 -303452 -476525
33331 -476525 341976 1003225 1380030 1800973 1791157 807861 -531354 -1150250 -950190 -682961
33321 -682961 -827283 -1234639 -1502521 -1291708 -681746 -372777 -972985 -2032101 -2459062
$$ packed form
33385c300912n00175J221112J680111Q96509R3975O4107L89963J17634r72580
33376c10256j792298j095585O08057J267153J07339r84267j68309J469897J586059
33367F87790J42621r26037r64919r92105j099534j91783J384482J595411j14262
33358d78336j674538j349281O3266Q63244N99044j45006n82298Q1041J683026
33349i39838K263697K23979k659676k954558n67617J009058J54693o10762P10177
33340c370847K157322J438122n0761J35802J178050O67444j022895j435689j73073
33331d76525Q18501O61249L76805M20943r816r83296j339215o18896K00060K67229
33321f82961j44322m07356k67882K10813O09962L08969o00208j059116m26961
$$ plain form
33312 -2459062 -1894977 -974418 -419182 -698056 -2145805 -4236072 -5223227 -4076730 -2416067
33303 -2416067 -2674995 -4558900 -5467582 -4425030 -3123400 -2719885 -2323245 -1520537 -1603115
33294 -1603115 -2844847 -3186727 -1495196 225763 -8043 -980087 -662331 217775 -187054
33285 -187054 -1250904 -1012153 182172 297386 -782719 -1293776 -796612 -346825 205858
33276 205858 1854951 3384379 2180519 -1265450 -3101014 -1581684 407774 1253
33268 1253 -1471452 -1281200 197536 634436 -195809 -403705 714417 1893141 2151530
33259 2151530 1786501 1238132 666774 542555 1153408 1675500 1115068 -41736 -464338
33250 -464338 59676 747199 1524489 2869393 4127003 3944919 2592252 1869270 2199305
$$ packed form
33312b459062N64085R20559N55236k78874j447749k090267r87155J146497J660663
33303b416067k58928j883905r08682J042552J301630M03515L96640Q02708q2578
33294a603115j241732l41880J691531J720959k33806r72044L17756Q80106m04829
33285a87054j063850K38751J194325J15214j080105n11057M97164M49787N52683
33276B05858J649093J529428j203860l445969j835564J519330J989458m06521
33268A253j472705J90252J478736M36900q30245k07896J118122J178724K58389
33259B151530l65029n48369n71358j24219O10853N22092n60432j156804m22602
33250d64338N24014O87523P77290J344904J257610j82084j352667p22982L30035
$$ plain form
33241 2199305 1833148 -114693 -1807300 -1370793 138905 372395 -741171 -1204976 -336390
33232 -336390 268952 -491875 -1402640 -864184 625148 1184956 119917 -1439772 -2306376
33223 -2306376 -2527540 -2622168 -2457160 -1680276 -830722 -966649 -2007835 -2419476 -1221183
33214 -1221183 409343 572116 -682306 -1359634 -249572 1619367 2641798 2547149 1986671
33205 1986671 1324156 764243 754854 1188992 984094 -390885 -1706324 -1637545 -1011788 -1768664
33195 -1768664 -3972555 -5561678 -5112835 -3266475 -1246849 416398 1360390 1231470 652652
33186 652652 866770 1761332 1707820 91200 -1548556 -1844309 -1500900 -1611834 -1545284 -150327
33176 -150327 1991005 3258374 3290443 3038925 3046288 3101962 3151036 3177626 2619619 1210580
$$ packed form
33241B199305l66157j947841j692607M36507J509698K33490j113566m63805Q68586
33232c36390O05342p60827r10765N38456J489332N59808j065039j559689q66604
33223b306376k21164r4628J65008P76884Q49554j35927j041186m11641J198293
33214a221183J630526J62773j254422o77328J110062J868939J022431r4649n60478
33205A986671o62515n59913r389M34138k04898j374979j315439O8779O25757p56876
33195a768664k203891j589123M48843J846360K019626J663247R43992j28920n78818
33186F52652K14118Q94562n3512j616620j639756k95753L43409j10934O6550J394957
33176a50327K141332J267369L2069k51518P363N5674M9074K6590n58007j409039
$$ plain form
33166 1210580 -62862 -139477 529261 902583 1135035 1821624 2203946 1158639 -471711
33157 -471711 -762161 220713 538647 -333731 -824791 -321072 -291899 -1358241 -1761056 -337332
33147 -337332 1143054 617086 -992687 -1423799 -843883 -1488223 -3917395 -5943400 -5611140
33138 -5611140 -3530295 -1652861 -947653 -986938 -1082788 -1070121 -1120433 -1269164 -1384665 -1538678
33128 -1538678 -1980948 -2465191 -2183674 -1090605 -649855 -1999582 -3844672 -3963389 -2692202
33119 -2692202 -2628268 -4353813 -5056664 -2852522 -84257 -49617 -2236357 -3537686 -3077923
33110 -3077923 -2841657 -3846342 -4614057 -3898389 -2551973 -1916647 -2155607 -2802289 -3338413
33101 -3338413 -2735927 -165199 3167880 4598426 3294491 1405057 940597 1097219 36835
$$ packed form
33166A210580j273442p6615O68738L73322K32452O86589L82322j045307j630350
33157d71711k90450R82874L17934q72378m91060N03719K9173j066342m02815J423724
33147c37332J480386n25968j609773m31112N79916o44340k429172k026005L32260
33138e611140K080845J877434P05208l9285r5850J2667n0312j48731j15501j54013
33128a538678m42270m84243K81517J093069M40750j349727j845090j18717J271187
33119b692202O3934j725545p02851K204142K768265L4640k186740j301329M59763
33110c077923K36266j004685p67715P15668J346416O35326k38960o46682n36124
33101c338413O02486K570728L333079J430546j303935j889434m64460J56622j060384
$$ plain form
33092 36835 -2023902 -3214718 -2702221 -1299859 236556 1961127 3741634 4745302 4233190
33083 4233190 2202732 -753897 -3584103 -4932401 -4059237 -1793292 49127 397671
33075 397671 -296289 -982307 -1166412 -1019812 -785232 -362312 548155 1817922 2453024
33066 2453024 1361117 -1024876 -2562238 -1789808 -116944 -326660 -2836840 -4928348
33058 -4928348 -4335774 -2213757 -1298622 -2145136 -2877302 -2255364 -1153640 -783229 -1102709
33049 -1102709 -1578184 -2073221 -2206933 -1222728 464227 943442 -580190 -2101943 -1555509
33040 -1555509 -190682 -848370 -3373527 -4549171 -2947485 -1028863 -1231834 -2500561
33032 -2500561 -2590257 -1810436 -2018283 -3141746 -3408106 -2616938 -2580741 -3979335 -5008747
$$ packed form
33092C6835k060737j190816N12497J402362J536415J724571J780507J003668n12112
33083D233190k030458k956629k830206j348298Q73164K265945J842419L48544
33075C97671o93960o86018j84105J46600K34580M22920R10467J269767O35102
33066B453024j091907k385993j537362P72430J672864k09716k510180k091508
33058d928348N92574K122017R15135q46514p32166O21938J101724L70411l19480
33049a102709m75475m95037j33712R84205J686955M79215j523632j521753N46434
33040a555509J364827o57688k525157j175644J601686J918622k02971j268727
33032b500561q9696P79821k07847j123463k66360P91168L6197j398594j029412
$$ plain form
33023 -5008747 -4036427 -1915170 -511473 -102451 453287 1534981 2061405 1113417 -580999
33014 -580999 -1312412 -340173 1293494 2055932 1608777 734282 -15459 -647657 -809680
33005 -809680 129128 1607471 1837094 221204 -1323559 -758102 1244659 2350357 1806563
32996 1806563 959126 870485 1239589 1776800 2874198 4358092 5015834 4146652 2605048
32987 2605048 1654132 1557657 1809583 2024081 2093470 2023544 1979396 2069399 2021604 1641649
32977 1641649 1472208 2130009 3020935 2793777 1305466 100643 512673 2113700 3427030
32968 3427030 3446735 2185724 497011 -378713 160563 1288428 1698860 1337264 1221637
32959 1221637 1569294 1412298 352872 -676091 -954961 -994919 -1318759 -1464065 -1089699
$$ packed form
33023e008747R72320K121257J403697M09022N55738J081694N26424r47988j694416
33014e80999p31413R72239J633667P62438m47155q74495p49741o32198j62023
33005h09680R38808J478343K29623j615890j544763N65457K002761J105698n43794
32996A806563q47437q8641L69104N37211J097398J483894O57742q69182j541604
32987B605048r50916r6475K51926K14498O9389o9926m4148R0003m7795l79955
32977A641649j69441O57801Q90926k27158j488311j204823M12030J601027J313330
32968C427030J9705j261011j688713q75724N39276J127865M10432l61596j15627
32959A221637L47657j56996j059426j028963k78870l9958l23840j45306L74366
$$ plain form
32950 -1089699 -975914 -1857514 -3061256 -3318854 -2375951 -1020087 -97979 -158592 -1378344
32941 -1378344 -3137432 -4290692 -4419037 -4094888 -3496004 -1882234 793284 2942196 3175932
32932 3175932 2239528 1948092 2826359 3828572 3775015 2129810 -879887 -3861092 -4781465
32923 -4781465 -3156319 -1059146 -700105 -1669244 -1980486 -1180358 -630222 -901976 -738790
32914 -738790 958500 3414187 4818849 4188596 2173430 523711 617958 1985495 2673422
32905 2673422 1681814 347033 411943 1552083 2115499 1602034 836576 238914 -277212
32896 -277212 -62775 1530847 3203886 2735800 392260 -933450 109880 1146072 -485062
32887 -485062 -3842336 -5868201 -5669365 -5178873 -5820645 -6495627 -5464453 -2957014 -953132
$$ packed form
32950a089699J13785q81600j203742k57598R42903J355864R22108o0613j219752
32941a378344j759088j153260j28345L24149N98884J613770K675518K148912K33736
32932C175932r36404k91436Q78267J002213n3557j645205l009697k981205r20373
32923d781465J625146K097173L59041r69139l11242Q00128N50136k71754J63186
32914g38790J697290K455687J404662o30253k015166j649719R4247J367537O87927
32905B673422r91608j334781O4910J140140N63416n13465p65458n97662n16126
32896b77212K14437J593622J673039m68086k343540j325710J043330J036192j631134
32887d85062l357274k025865J98836M90492o41772o74982J031174K507439K003882
$$ plain form
32878 -953132 -791800 -1805975 -2474098 -2362652 -2279792 -2600743 -2401800 -851168 1309434
32869 1309434 2653827 2961606 3096756 3312928 2995255 2066425 1304805 1037625 768390
32860 768390 404369 551743 1088127 723801 -1215549 -3537845 -4512648 -3749251 -2207580
32851 -2207580 -1111216 -1308912 -2799970 -4336806 -4397916 -3081282 -2039114 -2036165 -1885657
32842 -1885657 -650648 533021 220011 -876992 -886763 377560 1284347 886719 24408
32833 24408 -170106 364724 937681 865159 -145884 -1586608 -2247015 -1573641 -676090 -944221
32823 -944221 -1907801 -1809230 -356874 590092 -340788 -1963811 -2050155 -181202 1855760
32814 1855760 2211307 795126 -926854 -1439794 -476305 898865 1411216 746275 -471153
$$ packed form
32878i53132J61332j014175o68123J11446Q2860l20951J98943J550632K160602
32869A309434J344393L07779J35150K16172l17673r28830p61620k67180k69235
32860G68390l64021J47374N36384l64326j939350k322296r74803P63397J541671
32851b207580J096364j97696j491058j536836o1110J316634J042168K949J50508
32842a885657J235009J183669l13010j097003r771J264323R06787l97628q62311
32833B4408j94514N34830N72957p2522j011043j440724o60407O73374Q97551k68131
32823i44221r63580R8571J452356R46966r30880j623023q6344J868953K036962
32814A855760L55547j416181j721980n12940R63489J375170N12351o64941j217428
$$ plain form
32805 -471153 -1580418 -2292503 -2351264 -1538938 -244874 601516 535451 -2741 -568943 -1414515
32795 -1414515 -2647336 -3279282 -2202964 -53002 1070284 198670 -1140215 -975020 415721
32786 415721 1036264 64906 -1220322 -1599844 -1497412 -1639874 -1484583 -302369 1113501
32777 1113501 1455303 1147098 1861263 3866673 5551385 5778666 5030097 3792360 1600609
32768 1600609 -1439373 -3751092 -4065147 -2935064 -1560392 -420597 -33837 -1362043
32760 -1362043 -3894107 -4937136 -2928992 -216573 -119309 -2162489 -3019007 -1702203 -642344
32751 -642344 -1305773 -1975590 -1059099 227715 219380 -454833 -503844 -466479 -1289747 -1878774
32741 -1878774 -625705 1488123 1962014 671183 128976 1586040 3266160 3327593 2516344
$$ packed form
32805d71153j109265p12085n8761Q12326J294064Q46390o6065n38192n66202q45572
32795a414515j232821o31946J076318K149962J123286q71614j338885J65195J390741
32786D15721O20543r71358j285228l79522J02432j42462J55291J182214J415870
32777A113501L41802l08205P14165K005410J684712K27281p48569j237737k191751
32768A600609l039982k311719l14055J130083J374672J139795L86760j328206
32760a362043k532064j043029K008144K712419R7264k043180q56518J316804J059859
32751f42344o63429o69817R16491J286814q335o74213m9011L7365q23268n89027
32741a878774J253069K113828M73891j290831n42207J457064J680120O1433q11249
$$ plain form
32732 2516344 2508118 3100169 2731946 1063986 -540090 -946139 -418750 238716 681716
32723 681716 833146 517249 -143486 -452793 102423 1038165 1443794 1303886 1514775 2356819
32713 2356819 2746131 1687491 -88426 -918746 -420414 199828 135171 42488 582619
32704 582619 1070318 607072 -232238 -89763 1174322 2395787 2908010 3211067 3668361
32695 3668361 3672963 2603336 795726 -925549 -2049493 -2345883 -1791846 -1064755 -1360195
32686 -1360195 -2920791 -4254504 -3718710 -1647235 -44606 -217004 -1501269 -2430111 -2387327
32677 -2387327 -1802387 -1318289 -1242870 -1509719 -1772648 -1665448 -1196446 -724681 -365936 319289
32667 319289 1695901 3228777 3732121 2651088 868711 -116430 98715 229543 -1215226
$$ packed form
32732B516344q226N92051l68223j667960j604076m06049N27389O57466M43000
32723F81716J51430l15897o60735l09307N55216R35742M05629j39908K10889Q42044
32713B356819L89312j058640j775917q30320M98332O20242o4657r2683N40131
32704E82619M87699m63246q39310J42475J264085J221465N12223L03057M57294
32695C668361M602j069627j807610j721275j123944k96390N54037P27091k95440
32686a360195j560596j333713N35794K071475J602629j72398j284265r28842M2784
32677b387327N84940M84098P5419k66849k62929J07200M69002M71765L58745O85225
32667C19289J376612J532876N03344j081033j782377r85141K15145J30828j444769
$$ plain form
32658 -1215226 -3939915 -5873278 -5411072 -3156721 -948176 397351 1532635 2930895
32650 2930895 3864078 3466932 2057833 772365 336643 743540 1697538 2714901 3077585
32641 3077585 2406314 1213307 348652 4336 -230332 -519352 -638476 -592034 -656116 -727046
32631 -727046 -278579 838552 2070522 2825799 3069340 3150746 3393938 3837191 4007085
32622 4007085 3154087 1296580 -217718 -45576 1352532 2207403 1720777 733006 23449
32613 23449 -661751 -1422176 -1511270 -728825 -218055 -720692 -1153967 -300251 1019630 1075641
32603 1075641 -94398 -868505 -604159 -250938 -351017 -141674 895007 1983653 2163128
32594 2163128 1401040 123849 -1414692 -2869681 -3809790 -4356831 -4922507 -5030444 -3536517
$$ packed form
32658a215226k724689j933363M62206K254351K208545J345527J135284J398260
32650B930895R33183l97146j409099j285468m35722M06897R53998J017363L62684
32641C077585o71271j193007q64655l44316k34668k89020j19124M6442o4082p0930
32631g27046M48467J117131J231970P55277K43541Q1406K43192M43253J69894
32622D007085q52998j857507j514298J72142J398108Q54871m86626r87771p09557
32613B3449o85200p60425q9094P82445N10770n02637m33275Q53716J319881N6011
32603A075641j170039p74107K64346L53221j00079K09343J036681J088646J79475
32594B163128p62088j277191j538541j454989r40109n47041n65676j07937J493927
$$ plain form
32585 -3536517 -567023 1874042 2057711 488041 -1016283 -1398221 -737757 619592 2213210
32576 2213210 3184185 2900398 1796516 903738 669471 779945 885662 858913 504289
32567 504289 -308813 -1172832 -1293522 -316742 1109210 1647132 321357 -2391001 -4596276
32558 -4596276 -4658023 -2923713 -1284744 -1045312 -1906785 -2977584 -3727883 -3751288 -2817336
32549 -2817336 -1703839 -1773989 -2961279 -3366707 -1877023 -44657 -34187 -1624003 -2799366
32540 -2799366 -2682662 -2180942 -2000683 -1714887 -961193 -207578 -25748 -542200 -1632297
32531 -1632297 -2757725 -2838653 -1425983 183945 258044 -1075391 -2148994 -2218145 -2051960
32522 -2051960 -2077777 -1711014 -864269 -355632 -243421 510026 1957914 2521877 1483929
$$ packed form
32585c536517K969494K441065J83669j569670j504324l81938O60464J357349J593618
32576B213210R70975k83787j103882q92778k34267J10474J05717k6749l54624
32567E04289q13102q64019j20690R76780J425952N37922j325775k712358k205275
32558d596276o1747J734310J638969K39432q61473j070799p50299k3405R33952
32549b817336J113497p0150j187290m05428J489684J832366J0470j589816j175363
32540b799366J16704N01720J80259K85796P53694P53615J81830n16452j090097
32531a632297j125428q0928J412670J609928P4099j333435j073603o9151J66185
32522b051960k5817L66763Q46745N08637J12211P53447J447888N63963j037948
$$ plain form
32513 1483929 440108 889918 1866088 1617718 434009 -99736 170540 -7620 -889770
32504 -889770 -1257142 -451680 645097 975893 536489 10133 27550 863773 2154457
32495 2154457 3010562 3030942 2814395 2786161 2280045 905786 -16325 940063 2796560
32486 2796560 3244375 2111138 1642320 3024926 4759485 5202599 4688080 4037696 2867974
32477 2867974 882621 -705545 -799236 -333383 -801336 -1750699 -1603778 -372871 384278
32468 384278 102626 -160889 250750 655848 547645 633237 1721030 3491071 4803216
32459 4803216 4579637 2430242 -660438 -2444237 -1535352 538841 911691 -799497 -1992466
32450 -1992466 -923438 939318 1516346 1095201 911461 402486 -1670973 -4286305 -5050617
$$ packed form
32513A483929j043821M49810R76170k48370j183709n33745K70276j78160q82150
32504h89770l67372Q05462J096777L30796m39404n26356J7417Q36223J290684
32495B154457Q56105K0380k16547k8234n06116j374259r22111R56388J856497
32486B796560M47815j133237m68818J382606J734559M43114n14519o50384j169722
32477B867974j985353j588166r3691M65853m67953r49363J46921J230907P57149
32468C84278k81652k63515M11639M05098j08203Q5592J087793J770041J312145
32459D803216k23579k149395l090680j783799R08885K074193L72850j711188j192969
32450a992466J069028J862756N77028m21145j83740n08975k073459k615332p64312
$$ plain form
32441 -5050617 -3855668 -2995125 -3268673 -2635895 150870 2991804 3348319 1922084 1212178
32432 1212178 1544039 1003347 -1082391 -3075796 -3755675 -3887039 -4187753 -3619701 -1154255
32423 -1154255 2000136 3566773 2992765 1631496 532151 -403723 -1051128 -450768 1743797
32414 1743797 4267134 5520231 5237274 4239825 3152067 2137979 1422036 1113173 691647
32405 691647 -409307 -1692998 -1944644 -877804 381407 807288 706790 879388 1189230
32396 1189230 810377 -346502 -1256535 -962316 307798 1312448 893692 -942757 -2740026
32387 -2740026 -2635341 -209472 2822045 4307870 3981048 3454384 3909140 4658108 4436570
32378 4436570 3380242 2878919 3680837 4925061 5226909 4214621 2671298 1428139 548070
$$ packed form
32441e050617J194949Q60543k73548O32778K786765K840934L56515j426235p09906
32432A212178L31861n40692k085738j993405o79879j31364l00714N68052K465446
32423a154255L154391J566637n74008j361269j099345r35874o47405O00360K194565
32414A743797K523337J253097k82957r97449j087758j014088p15943l08863m21526
32405F91647j100954j283691k51646J066840J259211M25881j00498J72598L09842
32396A189230l78853j156879r10033K94219J270114J004650m18756j836449j797269
32387b740026J04685K425869L031517J485825l26822n26664M54756P48968k21538
32378D436570j056328n01323Q01918J244224L01848j012288j543323j243159q80069
$$ plain form
32369 548070 -333517 -1236266 -1817327 -2046597 -2334758 -2716405 -2455681 -1080416 555442
32360 555442 1088417 433846 -161785 26871 325236 68410 -130194 625467 1946665
32351 1946665 2602779 2202785 1534279 1401117 1898548 2661821 3062861 2366316 569331
32342 569331 -1055151 -1233156 -465651 -438473 -1562514 -2376915 -1844375 -931602 -1008171 -1740476
32332 -1740476 -1807931 -1039836 -468479 -516824 -501124 -74278 74598 -541881 -1241540 -1191314
32322 -1191314 -788795 -1171358 -2545349 -3771088 -3721768 -2479002 -916617 411031 1433602
32313 1433602 1879466 1237515 -313149 -1610335 -1782362 -1378677 -1408291 -1562350 -582173
32304 -582173 1496509 2861129 2386866 1318681 1296088 1710634 717525 -1613046 -3113619
$$ packed form
32369E48070q81587r02749n81061k29270k88161l81647K60724J375265J635858
32360E55442N32975o54571n95631J88656K98365k56826j98604P55661J321198
32351A946665O56114l99994o68506j33162M97431P63273M01040o96545j796985
32342E69331j624482j78005P67505K7178j124041q14401N32540R12773p6569p32305
32332a740476o7455P68095N71357m8345J5700M26846J48876o16479o99659N0226
32322a191314M02519l82563j373991j225739M9320J242766J562385J327648J022571
32313A433602M45864o41951j550664j297186j72027M03685k9614j54059R80177
32304e82173K078682J364620m74263j068185k2593M14546r93109k330571j500573
$$ plain form
32295 -3113619 -2656431 -1591949 -1366796 -1416261 -601983 653495 1252674 1519499 2613498
32286 2613498 4234774 4715375 3507393 1965300 1256481 986295 563404 493610 1184528
32277 1184528 1558617 366518 -1596272 -2105029 -426743 1612942 1883413 328908 -1460060
32268 -1460060 -2317955 -2348802 -2042445 -1462731 -592784 49225 -272757 -1537592 -2705531
32259 -2705531 -2724920 -1634453 -357159 438801 787464 807710 384347 -247253 -339469 338580
32249 338580 888956 483429 -261136 -56509 1141138 2059052 1970294 1512100 1330868 970951
32239 970951 -225180 -1837362 -2721328 -2268419 -839122 677319 1385604 975056 211346
32230 211346 343102 1582172 2679865 2461083 1229980 151865 -181559 -457 237407
$$ packed form
32295c113619M57188J064482K25153m9465Q14278J255478N99179K66825J093999
32286B613498J621276M80601j207982j542093p08819k70186m22891o9794O90918
32277A184528L74089j192099j962790n08757J678286K039685K70471j554505j788968
32268a460060q57895l0847L06357N79714Q69947O42009l21982j264835j167939
32259b705531j9389J090467J277294P95960L48663K0246m23363o31600r2216O78049
32249C38580N50376m05527p44565K04627J197647R17914q8758m58194j81232l59917
32239I70951j196131j612182q83966M52909J429297J516441P08285m10548p63710
32230B11346J31756J239070J097693k18782j231103j078115l33424J81102K37864
$$ plain form
32221 237407 54838 -853293 -1994600 -2287185 -1554329 -979995 -1237180 -1235557 -44349 1020907
32211 1020907 172815 -1667831 -1849944 -126635 691537 -1108529 -3633329 -4233985 -2929679
32202 -2929679 -1440659 -386385 677565 1457762 1132803 1187 -672178 -355979 378241
32193 378241 987515 1380075 1417655 1020737 618561 636112 795718 714799 713434 1086275
32183 1086275 1177151 397706 -398833 -84363 562095 -384982 -3017891 -5178945 -5409035
32174 -5409035 -4581034 -3921316 -3118644 -1569339 -141341 -170708 -1424958 -2465577 -2676071
32165 -2676071 -2695522 -2974460 -3061850 -2556336 -1924221 -1920261 -2556302 -3000804 -2501838 -1335479
32155 -1335479 -703674 -1472642 -3075018 -4009174 -3430864 -1864401 -375682 398914 349434
$$ packed form
32221B37407j82569r08131j141307k92585P32856N74334k57185J623J191208J065256
32211A020907q48092j840646j82113J723309Q18172j800066k524800o00656J304306
32202b929679J489020J054274J063950P80197l24959j131616o73365L16199P34220
32193C78241O09274L92560L7580l96918m02176J7551J59606q0919j365L72841
32183A086275R0876p79445p96539L14470O46458r47077k632909k161054k30090
32174e409035Q28001O59718Q02672J549305J427998k9367j254250j040619k10494
32165b676071j9451k78938q7390N05514O32115L960o36041m44502M98966J166359
32155a335479O31805p68968j602376r34156N78310J566463J488719P74596m9480
$$ plain form
32146 349434 -267682 -787976 -547640 278640 719038 184058 -877461 -1699611 -1895182
32137 -1895182 -1144339 896224 3672285 5465591 4996620 2916295 908134 -305037
32129 -305037 -1191101 -2005283 -2273197 -1737487 -867395 -137389 496413 1083848 1244379 699933
32119 699933 -76080 -186846 709346 1930070 2360348 1552056 182456 -723679 -916288
32110 -916288 -912042 -977868 -828564 -539539 -896812 -2167884 -3183146 -2598009 -802428 342491
32100 342491 -307169 -1909377 -2578509 -1150290 1799196 4198762 4102839 1773002 -213752
32091 -213752 189094 1891013 2048334 -135423 -2436167 -2657148 -1122942 570930 1861716
32082 1861716 2992060 3420612 2096178 -748602 -3317364 -4089181 -3257076 -2157215 -1845381
$$ packed form
32146C49434o17116n20294K40336Q26280M40398n34980j061519q22150j95571
32137a895182P50843K040563K776061J793306m68971k080325k008161j213171
32129c05037q86064q14182k67914N35710Q70092P30006O33802N87435J60531n44446
32119F99933p76013j10766Q96192J220724M30278q08292j369600r06135j92609
32110i16288M246o5826J49304K89025l57273j271072j015262N85137J795581J144919
32100C42491o49660j602208o69132J428219K949486K399566r5923k329837j986754
32091b13752M02846J701919J57321k183757k300744k20981J534206J693872J290786
32082A861716J130344M28552j324434k844780k568762p71817Q32105J099861L11834
$$ plain form
32073 -1845381 -2430691 -3297444 -3619025 -2873743 -1192178 686880 1812445 1542567 38828
32064 38828 -1591747 -1981872 -730752 1112251 2059832 1654017 734538 343501 660073
32055 660073 1077211 1085656 842912 839787 1172573 1372384 985700 72483 -1023550 -2125570
32045 -2125570 -3154872 -3844836 -3908583 -3348502 -2278107 -738980 807329 1204185 -290119
32036 -290119 -2709852 -4152396 -3941075 -3074026 -2394626 -1533530 -173015 895852 950393
32027 950393 622591 879007 1423967 1338802 787975 741766 1236210 1248157 330761 -827484
32017 -827484 -1594905 -1996572 -1926622 -952670 662305 1798780 1902995 1691597 1890788
32008 1890788 2137457 1784680 1014066 406163 69530 -59590 291096 1084192 1414883
$$ packed form
32073a845381n85310q66753l21581P45282J681565J879058J125565k69878j503739
32064C8828j630575l90125J251120J843003R47581m05815r19479l91037L16572
32055F60073M17138Q445k42744l125L32786J99811l86684r13217j096033j102020
32045b125570j029302o89964o3747N60081J070395J539127J546309L96856j494304
32036b90119k419733j442544K11321Q67049O79400Q61096J360515J068867N4541
32027I50393l27802K56416N44960q5165n50827m6209M94444J1947r17396j158245
32017h27484p67421m01667O9950R73952J614975J136475J04215k11398J99191
32008A890788K46669l52777p70614o07903l36633j29120L50686P93096L30691
$$ plain form
31999 1414883 603118 -587620 -901273 -472503 -582921 -1613601 -2502265 -2489930 -2218411
31990 -2218411 -2529610 -3135569 -3209573 -2591459 -1662124 -594524 485654 1064426 832877
31981 832877 406147 578403 1110448 1240316 1227531 2125438 3813777 4639821 3743156 2516240
31971 2516240 2585099 3258354 2543048 279569 -1481748 -1405500 -519576 -297588 -567794
31962 -567794 -431247 -131749 -544840 -1379942 -1413804 -467529 144257 -615335 -2260351 -3556406
31952 -3556406 -3704769 -2579730 -725350 554335 62198 -1759290 -2947536 -2312862 -899933
31943 -899933 -427750 -987453 -1333938 -1008280 -873927 -1473585 -2046698 -1721156 -891286 -700615
31933 -700615 -1520121 -2560124 -2876158 -2268385 -1165198 -43207 813227 1210116 1055369
$$ packed form
31999A414883q11765j190738l13653M28770j10418j030680q88664J2335K71519
31990b218411l11199o05959p4004O18114R29335J067600J080178N78772k31549
31981H32877m26730J72256N32045J29868j2785Q97907J688339Q26044q96665j226916
31971B516240O8859O73255p15306k263479j761317P6248Q85924K21988k70206
31962e67794J36547K99498m13091q35102l3862R46275O11786p59592j645016j296055
31952c556406j48363J125039J854380J279685m92137j821488j188246O34674J412929
31943h99933M72183n59703l46485L25658J34353n99658n73113L25542Q29870J90671
31933g00615q19506j040003l16034O07773J103187J121991Q56434L96889j54747
$$ plain form
31924 1055369 557385 207536 372561 966518 1663429 2295922 2769996 2706500 1658377
31915 1658377 -165566 -1807325 -2446456 -2087874 -1220687 -283636 205168 -408824 -2122913
31906 -2122913 -3751489 -4024875 -3154785 -2525896 -2783138 -3071667 -2453743 -1264720 -506501
31897 -506501 -481636 -687558 -697111 -480679 -60620 510291 881097 676124 61495 -436493
31887 -436493 -694268 -1071206 -1651823 -1947238 -1588546 -886586 -428252 -478530 -1023804 -1945089
31877 -1945089 -2741756 -2557185 -1170538 267791 305046 -924365 -1623944 -475686 1711724
31868 1711724 2909716 2003537 -381982 -2755610 -3902032 -3458795 -2040734 -798488
31860 -798488 -405367 -522866 -598772 -857964 -1796632 -2903143 -2919123 -1636135 -472033
$$ packed form
31924A055369m97984l49849J65025N93957O96911O32493M74074o3496j048123
31915A658377j823943j641759o39131L58582Q67187R37051M88804o13992j714089
31906b122913j628576k73386Q70090O28889k57242k88529O17924J189023P58219
31897e06501K4865k05922r553K16432M20059N70911L70806k04973o14629m97988
31887d36493k57775l76938n80617k95415L58692P01960M58334n0278n45274r21285
31877a945089p96667J84571J386647J438329L7255j229411o99579J148258K187410
31868A711724J197992r06179k385519k373628j146422M43237J418061J242246
31860g98488L93121j17499p5906k59192r38668j106511j5980J282988J164102
$$ plain form
31851 -472033 -648941 -1520986 -1511438 -257620 1052400 1305970 601362 -278483 -789098 -790264
31841 -790264 -363081 173313 393964 263028 340065 1211700 2729452 3967084 4001078 2751405
31831 2751405 1056085 -111621 -454476 -291340 138131 867089 1617837 1613340 484372
31822 484372 -951877 -1449326 -822788 -130993 -310072 -1165855 -1968983 -2589029 -3524990
31813 -3524990 -4883251 -5807389 -5262799 -3294972 -1126603 170906 740428 1286307 1754133
31804 1754133 1482861 585556 89413 305215 123726 -1250721 -2742797 -2713060 -1271115
31795 -1271115 -18465 279537 451283 1246846 2121356 2124715 1166011 -32032 -676411
31786 -676411 -414731 323519 451265 -635690 -2036727 -2223531 -907985 836063 2217125
$$ packed form
31851d72033j76908q72045R548J253818J310020K53570p04608q79845n10615j166
31841g90264M27183N36394K20651j30936P7037Q71635J517752J237632L3994j249673
31831B751405j695320j167706l42855J63136M29471P28958P50748m497j128968
31822D84372j436249m97449O26538O91795j79079q55783q03128o20046r35961
31813c524990j358261r24138N44590J967827K168369J297509N69522N45879M67826
31804A754133k71272q97305m96143K15802j81489j374447j492076K9737J441945
31795a271115J252650K98002J71746P95563Q74510L359r58704j198043o44379
31786f76411K61680P38250J27746j086955j401037j86804J315546J744048J381062
$$ plain form
31777 2217125 3329315 4063356 3861238 3028755 2868901 3663380 3735335 1618138 -1703454
31768 -1703454 -3809850 -3538115 -1792411 -227588 79132 -816651 -1753600 -1511250 -318216
31759 -318216 386433 103002 68688 1181984 2381186 2216934 965352 -72380 -388381
31750 -388381 -114638 838345 1979687 1721133 -482994 -2491913 -2105778 -469275 -398345
31741 -398345 -1962847 -2623517 -1625254 -1070753 -1985828 -2380214 -599940 1890855 2729473
31732 2729473 1724253 195741 -979251 -1183299 309369 2801961 3812253 2053075
31724 2053075 -503704 -1292481 -634146 -664723 -1911185 -3057200 -3387851 -3354316 -3044213
31715 -3044213 -1951871 -148696 1759820 3519687 4786441 4501264 2320246 -10065
$$ packed form
31777B217125J112190P34041k02118q32483j59854P94479P1955k117197l321592
31768a703454k106396K71735J745704J564823L06720q95783r36949K42350J193034
31759c18216P04649k83431l4314J113296J199202j64252j251582j037732l16001
31750c88381K73743R52983J141342k58554k204127k008919L86135J636503P0930
31741c98345j564502o60670R98263N54501r15075l94386J780274K490795Q38618
31732B729473j005220j528512j174992k04048J492668K492592J010292j759178
31724B053075k556779p88777O58335l0577j246462j146015l30651L3535L10103
31715c044213J092342J803175J908516J759867J266754k85177k181018k330311
$$ plain form
31707 -10065 -563312 -2557 -453493 -2012556 -2612471 -1333538 412160 1324151 1731091
31698 1731091 2130143 2159903 1740971 1520101 1467911 665892 -792387 -1334669 -219896
31689 -219896 1176096 1287271 217727 -1096158 -2096548 -2130330 -423177 2278895 3574418
31680 3574418 2357862 641080 946914 3018980 4673126 4880102 4293728 3540825 2793096
31671 2793096 2524000 2988818 3286151 2451623 1076996 287087 -391618 -2229979 -4560371
31662 -4560371 -4964737 -2600479 492268 2059941 2035829 1512756 834292 -109970 -717105
31653 -717105 -140200 1395062 2637000 2600089 1420500 159543 -32022 1057570 2307607
31644 2307607 2290511 773546 -1254547 -2936628 -4131964 -4668239 -4130482 -2834039 -2017307
$$ packed form
31707a0065n53247N60755m50936j559063n99915J278933J745698R11991M06940
31698A731091L99052K9760m18932k20870n2190q02019j458279n42282J114773
31689b19896J395992J11175j069544j313885j000390l3782J707153K702072J295523
31680C574418j216556j716782L05834K072066J654146K06976n86374p52903p47729
31671B793096k69096M64818K97333q34528j374627p89909o78705j838361k330392
31662d560371m04366K364258L092747J567673k4112n23073o78464r44262o07135
31653g17105N76905J535262J241938l6911j179589j260957j91565J089592J250037
31644B307607j7096j516965k028093j682081j195336n36275N37757J296443Q16732
$$ plain form
31635 -2017307 -2374689 -3121885 -3187367 -2676421 -2428917 -2685962 -2981036 -2965413 -2638889 -2093568
31625 -2093568 -1642196 -1810913 -2576211 -3060034 -2691107 -2143498 -2206237 -2258203 -1178124 443117
31615 443117 578781 -1374324 -3449422 -3612640 -2233214 -997129 -366412 349690 877917
31606 877917 -213889 -3174682 -6008182 -6689137 -5515634 -4232695 -3511982 -2613932 -1306531
31597 -1306531 -613745 -1166985 -1956581 -1609299 -280719 608906 204756 -1008085 -2081850
31588 -2081850 -2515345 -2365994 -2170361 -2735802 -4259305 -5573714 -5096975 -2824751 -593465
31579 -593465 120803 -47785 502055 1999073 3039522 2525311 989858 -190033 -263254
31570 -263254 511881 1473576 2105747 2152451 1575222 548221 -529122 -1106048 -806549
$$ packed form
31635b017307l57382p47196o5482N10946K47504k57045k95074J5623L26524N45321
31625b093568M51372j68717p65298m83823L68927N47609o2739n1966J080079J621241
31615D43117J35664j953105k075098j63218J379426J236085O30717P16102N28227
31606H77917j091806k960793k833500o80955J173503J282939P20713Q98050J307401
31597a306531O92786n53240p89596L47282J328580Q89625m04150j212841j073765
31588b081850m33495J49351J95633n65441j523503j314409M76739K272224K231286
31579e93465P14268j68588N49840J497018J040449n14211j535453j179891p3221
31570b63254P75135R61695O32171M6704n77229j027001j077343n76926K99499
$$ plain form
31561 -806549 75884 515122 -419282 -2479481 -4205103 -4241378 -2680467 -947186 -378493
31552 -378493 -1075873 -2145147 -2763773 -2748993 -2258015 -1419392 -424020 419013 1054827 1833894
31542 1833894 2896626 3667272 3522077 2822127 2574870 2994959 3162926 2431901 1459428
31533 1459428 1295848 2007159 2867871 3483727 3908217 3859418 2722584 491490 -1912883
31524 -1912883 -3449740 -3670385 -2656907 -879762 755879 1401385 1191737 1226207 2230760
31515 2230760 3586065 4077555 3342987 2161331 1441289 1291901 1113348 438053 -345990
31506 -345990 -209834 1301615 3127499 3507783 1969948 -29960 -850859 -533588 -304829
31497 -304829 -646386 -810387 -267070 330268 122965 -597186 -667626 448537 1912434
$$ packed form
31561h06549Q82433M39238r34404k060199j725622l6275J560911J733281N68693
31552c78493o97380j069274o18626J4780M90978Q38623R95372Q43033O35814P79067
31542A833894J062732P70646j45195o99950k47257M20089J67967p31025r72473
31533A459428j63580P11311Q60712O15856M24490m8799j136834k231094k404373
31524a912883j536857k20645J013478J777145J635641O45506k09648L4470J004553
31515B230760J355305M91490p34568j181656p20042j49388j78553o75295p84043
31506c45990J36156J511449J825884L80284j537835j999908q20899L17271K28759
31497c04829l41557j64001N43317N97338k07303p20151p0440J116163J463897
$$ plain form
31488 1912434 2309168 991599 -1334725 -3152914 -3265149 -1646506 579495 1964378
31480 1964378 1716552 203880 -1298781 -1515278 -185108 1667349 2604837 2039286 643047
31471 643047 -410732 -491762 117278 630841 426011 -574154 -2001905 -3371074 -4191513
31462 -4191513 -3942737 -2449849 -509705 386214 -455190 -1981472 -2586237 -2052176 -1499541
31453 -1499541 -1476691 -1199718 -74405 1096369 1270576 798097 852668 1608911 2056588
31444 2056588 1582065 772558 473677 832971 1532972 2280893 2702696 2326942 1196470
31435 1196470 241999 621419 2659347 5475715 7539738 7701799 6038634 3727693 1847458
31426 1847458 420699 -1022434 -2256960 -2520886 -1821761 -1129536 -912889 -351240 1335771
$$ packed form
31488A912434L96734j317569k326324j818189j12235J618643K226001J384883
31480A964378k47826j512672j502661k16497J330170J852457R37488n65551j396239
31471F43047j053779q1030O09040N13563k04830j000165j427751j369169q20439
31462d191513K48776J492888J940144Q95919q41404j526282o04765N34061N52635
31453a499541K2850K76973J125313J170774J74207m72479N4571P56243M47677
31444B056588m74523q09507k98881L59294P00001P47921M21803l75754j130472
31435A196470r54471L79420K037928K816368K064023J62061j663165k310941j880235
31426A847458j426759j443133j234526k63926O99125O92225K16647N61649J687011
$$ plain form
31417 1335771 3402620 4262353 3400039 1861048 878603 644773 583923 377738 341237
31408 341237 772400 1156302 443548 -1567183 -3480175 -3615153 -1971315 -92153 1019659
31399 1019659 1773391 2470024 2228913 424859 -1754660 -2501893 -1691686 -780866 -672143
31390 -672143 -908682 -962324 -1097836 -1637112 -2276981 -2536940 -2304580 -1748636 -1216061 -1232071
31380 -1232071 -1975793 -2752867 -2662632 -1784718 -981361 -540425 137505 1375158 2548535
31371 2548535 2809284 1888690 177386 -1352580 -1507890 -63978 1599368 2119140 2108369
31362 2108369 3043710 4448656 4250712 2257240 922091 1627449 2530150 1814922 968625
31353 968625 2348776 4973630 5663078 3770378 1885948 1758567 2199502 1622904 247334
$$ packed form
31417A335771K066849Q59733q62314j538991r82445k33830o0850k06185l6501
31408C41237M31163L83902p12754k010731j912992j34978J643838J879162J111812
31399A019659P53732O96633k41111j804054k179519p47233Q10207R10820J08723
31390f72143k36539n3642j35512n39276o39869k59959K32360N55944N32575j6010
31380a232071p43722p77074R0235Q77914Q03357M40936O77930J237653J173377
31371B548535K60749r20594j711304j529966j55310J443912J663346N19772j0771
31362B108369R35341J404946j97944j993472j335149P05358R02701p15228q46297
31353I68625J380151K624854O89448j892700j884430j27381M40935n76598j375570
$$ plain form
31344 247334 -1229858 -3022604 -4910492 -5188724 -2732723 810492 2516392 1498841
31336 1498841 -453534 -1260168 -507803 819083 1550833 1064809 -526177 -2469032 -3717816
31327 -3717816 -3444293 -1620612 630408 1720157 1296900 907637 2021726 3714742 3730079
31318 3730079 1884828 628060 1473430 2641640 1722280 -626232 -1576988 -133019 1766524
31309 1766524 2173342 1369401 648878 321898 -104372 -595246 -459673 649141 2211532
31300 2211532 3308687 3375020 2589754 1666452 1178319 1085368 1008930 791598 542716 349638
31290 349638 327960 772548 1766380 2736488 2945731 2445732 2010763 2012144 1848615 735455
31280 735455 -1231090 -2975917 -3296792 -1913478 94828 1116757 668860 -41609 219749
$$ packed form
31344B47334j477192j792746j887888k78232K456001L543215J705900j017551
31336A498841j952375q06634P52365J326886P31750m86024j590986j942855j248784
31327c717816K73523J823681K251020J089749m23257l89263J114089J693016J5337
31318C730079j845251j256768Q45370J168210r19360k348512r50756J443969J899543
31309A766524M06818q03941p20523l26980m26270m90874J35573J108814J562391
31300B211532J097155O6333p85266r23302m88133r2951p6438k17332k48882j93078
31290C49638k1678M44588R93832R70108K09243m99999m34969J381j63529j113160
31280G35455j966545j744827l20875J383314K008306J021929m47897p10469K61358
$$ plain form
31271 219749 853534 246443 -1605449 -2625473 -1382386 876318 1938080 1541943 1271417
31262 1271417 1965053 2779770 3017466 3392206 4619856 5744155 5077020 2483690 -338916
31253 -338916 -1898655 -2318658 -2475031 -2585199 -2283432 -1596682 -1053381 -869601 -631315
31244 -631315 47261 898017 1209162 541610 -747305 -1607078 -1179303 116106 694907
31235 694907 -443182 -2324234 -3106528 -2419539 -1558710 -1251249 -609595 934867 1965148
$$ packed form
31271B19749O33785o07091j851892j020024J243087K258704J061762l96137k70526
31262A271417O93636Q14717K37696L74740J227650J124299o67135k593330k822606
31253c38916j559739m20003j56373j10168L01767O86750N43301J83780K38286
31244f31315O78576Q50756L11145o67552j288915q59773M27775J295409N78801
31235F94907j138089j881052p82294O86989Q60829L07461O41654J544462J030281
$$ [...]
##END NTUPLES=NMR SPECTRUM
##END=
