##TITLE=31Pdec_LY-TMF-12.100
 D2O, 24 sc
 5.3.2020
##JCAMPDX= 6.0         $$ Bruker NMR JCAMP-DX V2.0
##DATA TYPE= NMR SPECTRUM
##DATA CLASS= NTUPLES
##ORIGIN= UXNMR, Bruker Analytische Messtechnik GmbH
##OWNER= root
$$ XWIN-NMR		Version 3.5
$$ Thu Mar  5 14:16:01 2020 Russian Standard Time (UT+4h)  she@DPX200
##.OBSERVE FREQUENCY= 81.013821
##.OBSERVE NUCLEUS= ^31P
##.ACQUISITION MODE= SIMULTANEOUS
##.ACQUISITION SCHEME= undefined
##.AVERAGES= 24
##.DIGITISER RES= 17
##SPECTROMETER/DATA SYSTEM= spect
##.PULSE SEQUENCE= zgpg30
##.SOLVENT NAME= DMSO
##.SHIFT REFERENCE= (INTERNAL, DMSO, 0, 182.463)
##AUDIT TRAIL= $$ (NUMBER, WHEN, WHO, WHERE, WHAT)
$$ ##TITLE= Audit trail, XWIN-NMR		Version 3.5
$$ ##JCAMPDX= 5.01
$$ ##ORIGIN= Bruker BioSpin GmbH
$$ ##OWNER= she
$$ F:/spectra/data/she/nmr/P31/1/pdata/1/auditp.txt
$$ ##AUDIT TRAIL=  $$ (NUMBER, WHEN, WHO, WHERE, WHAT)
(   1,<2020-03-05 14:14:43.93 +0400>,<she>,<DPX200>,
      <created by zg, POWCHK disabled, PULCHK disabled
       configuration hash MD5:
       00 E9 B6 7A A2 85 ED C7 34 08 36 98 17 FE 4E 26
       data hash MD5: 32K
       17 DC 2C F9 46 FE A7 5B EA 56 3E 96 38 D3 59 FA>)
(   2,<2020-03-05 14:14:46.48 +0400>,<she>,<DPX200>,
      <Start of raw data processing
       efp BC_mod = 2 LB = 1 FT_mod = 6 PKNL = 1 PHC0 = -1361.961 PHC1 = 150.6017 SI = 64K 
       data hash MD5: 64K
       C3 E1 11 1A CE C7 17 1F 89 33 9D AB E6 92 61 EA>)
(   3,<2020-03-05 14:14:59.23 +0400>,<she>,<DPX200>,
      <pk PHC0 = 3.619765 PHC1 = 0 
       data hash MD5: 64K
       6D 3D E1 70 B6 7D A1 81 F2 F3 6F EC 71 2C 98 D5>)
(   4,<2020-03-05 14:15:09.15 +0400>,<she>,<DPX200>,
      <abs ABSG = 5 
       data hash MD5: 64K
       A8 9B 87 32 C8 CD 8F F5 BD E2 FB 9F 23 B9 A1 B1>)
(   5,<2020-03-05 14:15:26.71 +0400>,<she>,<DPX200>,
      <pk PHC0 = -6.000886 PHC1 = 0 
       data hash MD5: 64K
       39 FD 97 05 DB CA F9 79 B2 92 F6 E0 7D 0C 5B 4E>)
$$ ##END=
$$ 
$$ hash MD5
$$ 89 7B 9D 04 71 43 ED 16 B2 37 3A C6 CE 09 07 62
##$RELAX= 
##$RELAX= 
##$RELAX= 
##$RELAX= 
##$RELAX= 
##$RELAX= 
##$RELAX= 
##$RELAX= 
$$ Bruker specific parameters
$$ --------------------------
##$DU= <F:/spectra>
##$EXPNO= 1
##$NAME= <P31>
##$PROCNO= 1
##$TYPE= <nmr>
##$USER= <she>
##$AMP= (0..31)
100 100 100 100 100 100 100 100 100 100 100 100 100 100 100 100 100 100 
100 100 100 100 100 100 100 100 100 100 100 100 100 100 
##$AQSEQ= 0
##$AQ_mod= 1
##$AUNM= <au_zg>
##$AUTOPOS= <>
##$BF1= 81.014009
##$BF2= 200.13
##$BF3= 200.13
##$BF4= 200.13
##$BF5= 200.13
##$BF6= 200.13
##$BF7= 200.13
##$BF8= 200.13
##$BYTORDA= 1
##$CFDGTYP= 0
##$CFRGTYP= 5
##$CHEMSTR= <none>
##$CNST= (0..31)
1 1 145 1 1 1 1 1 1 1 1 1 1 1 1 1 1 1 1 1 1 1 1 1 1 1 1 1 1 1 1 1 
##$CPDPRG= <waltz16>
##$CPDPRG1= <>
##$CPDPRG2= <waltz16>
##$CPDPRG3= <>
##$CPDPRG4= <mlev>
##$CPDPRG5= <mlev>
##$CPDPRG6= <mlev>
##$CPDPRG7= <mlev>
##$CPDPRG8= <mlev>
##$CPDPRGB= <>
##$CPDPRGT= <>
##$D= (0..31)
0 1 0 0 0 0 0 0 0 0 0 0.03 2e-05 3e-06 0 0 0 0 0 0 0 0 0 0 0 0 0 0 0 0 
0 0 
$$ [...]
##$SUBNAM3= <"">
##$SUBNAM4= <"">
##$SUBNAM5= <"">
##$SUBNAM6= <"">
##$SUBNAM7= <"">
##$SUBNAM8= <"">
##$SUBNAM9= <"">
##$SW= 369.568048894756
##$SWIBOX= (0..15)
0 1 3 0 0 0 0 0 0 0 0 0 0 0 0 0 
##$SW_h= 29940.119760479
##$TD= 32768
##$TD0= 1
##$TE= 0
##$TE2= 300
##$TE3= 300
##$TEG= 300
##$TL= (0..7)
0 120 53 12 22 120 120 120 
##$TP= (0..7)
150 150 150 150 150 150 150 150 
##$TP07= 0
##$TPNAME0= <>
##$TPNAME1= <>
##$TPNAME2= <>
##$TPNAME3= <>
##$TPNAME4= <>
##$TPNAME5= <>
##$TPNAME6= <>
##$TPNAME7= <>
##$TPOAL= (0..7)
0.5 0.5 0.5 0.5 0.5 0.5 0.5 0.5 
##$TPOFFS= (0..7)
0 0 0 0 0 0 0 0 
##$TUNHIN= 0
##$TUNHOUT= 0
##$TUNXOUT= 0
##$USERA1= <user>
##$USERA2= <user>
##$USERA3= <user>
##$USERA4= <user>
##$USERA5= <user>
##$V9= 5
##$VALIST= <valist>
##$VCLIST= <CCCCCCCCCCCCCCC>
##$VD= 0
##$VDLIST= <DDDDDDDDDDDDDDD>
##$VPLIST= <PPPPPPPPPPPPPPP>
##$VTLIST= <TTTTTTTTTTTTTTT>
##$WBST= 1024
##$WBSW= 4
##$XGAIN= (0..3)
0 0 0 0 
##$XL= 0
##$YL= 0
##$YMAX_a= 12186
##$YMIN_a= -12140
##$ZGOPTNS= <>
##$ZL1= 120
##$ZL2= 120
##$ZL3= 120
##$ZL4= 120
##$ABSF1= 182.463
##$ABSF2= -187.1042
##$ABSG= 5
##$ABSL= 3
##$ALPHA= 0
##$AQORDER= 0
##$ASSFAC= 0
##$ASSFACI= 0
##$ASSFACX= 0
##$ASSWID= 0
##$AUNMP= <proc_1d>
##$AZFE= 0.1
##$AZFW= 0.5
##$BCFW= 0
##$BC_mod= 2
##$BYTORDP= 0
##$COROFFS= 0
##$CY= -3
##$DATMOD= 1
##$DC= 0
##$DFILT= <>
##$DTYPP= 0
##$F1P= 0
##$F2P= 0
##$FCOR= 1
##$FTSIZE= 65536
##$FT_mod= 6
##$GAMMA= 0
##$GB= 0
##$INTBC= 1
##$INTSCL= 5.30512e-09
##$ISEN= 30
##$LB= 1
##$LEV0= 0
##$LPBIN= 0
##$MAXI= 10000
##$MC2= 0
##$MEAN= 0
##$ME_mod= 0
##$MI= 50
##$NCOEF= 0
##$NC_proc= -4
##$NLEV= 6
##$NOISF1= 182.463
##$NOISF2= 159.3651
##$NSP= 0
##$NTH_PI= 0
##$NZP= 0
##$OFFSET= 182.463
##$PC= 4
##$PHC0= -1364.342
##$PHC1= 150.6017
##$PH_mod= 1
##$PKNL= yes
##$PPARMOD= 0
##$PSCAL= 0
##$PSIGN= 0
##$REVERSE= no
##$SF= 81.0140089999434
##$SI= 65536
##$SIGF1= 159.3651
##$SIGF2= -187.1042
##$SINO= 113.3802
##$SIOLD= 16384
##$SREGLST= <1H.CDCl3>
##$SSB= 0
##$STSI= 65536
##$STSR= 0
##$SW_p= 29940.119760479
##$SYMM= 0
##$S_DEV= 0
##$TDeff= 32768
##$TDoff= 0
##$TI= <>
##$TILT= no
##$TM1= 0
##$TM2= 0
##$TOPLEV= 0
##$USERP1= <user>
##$USERP2= <user>
##$USERP3= <user>
##$USERP4= <user>
##$USERP5= <user>
##$WDW= 1
##$XDIM= 65536
##$YMAX_p= 272225962
##$YMIN_p= -4885070
$$ End of Bruker specific parameters
$$ ---------------------------------
##NTUPLES= NMR SPECTRUM
##VAR_NAME=  FREQUENCY,     SPECTRUM/REAL,   SPECTRUM/IMAG
##SYMBOL=    X,             R,               I
##VAR_TYPE=  INDEPENDENT,   DEPENDENT,       DEPENDENT
##VAR_FORM=  AFFN,          ASDF,            ASDF
##VAR_DIM=   65536,         65536,           65536
##UNITS=     HZ,            ARBITRARY UNITS, ARBITRARY UNITS
##FACTOR=    0.456856943014862, 1,           1
##FIRST=     14782.0589164792, 0,            0
##LAST=      -15158.0608439998, 0,           0
##MIN=       -15158.0608439998, -4885070,    0
##MAX=       14782.0589164792, 272225962,    0
$$ Real data points
##PAGE= N=1
##DATA TABLE= (X++(R..R)), XYDATA
$$ [...]
36920C82165K1992J88059J08952m5223q5607j21374l09175m30857j41725L83946
36910d8847N18194K7273n34459n17802M541L93510K68134j01709k12830O6810
36900a37185L99995M14444J27362j24510j28626k6049n0979j99091k89660k46213
36890b60512j49267p1538j3994L1720P8454J50196J94805Q5293j70848l43520
36880d69211k56817l6103R1262J05372J01334M2518j21783k16138m0905K47547
36870e52924K93587P0563p3078P1626L13497L70824J80630j37501l72358k75030
36860a10164J76971N61863M13213j12252l57179o2786K77730J71787j80364k72024
36850E06795m0626J69088J87616J51666J34137K1597k09511l79647l53828k26030
$$ plain form
36920 382165 404157 592216 701168 655945 570338 448964 139789 -291068 -432793 -48847
36910 -48847 469347 496620 -37839 -555641 -551100 -157590 110544 8835 -203995 -137185
36900 -137185 262810 677254 804616 680106 551480 525431 474452 275361 -14299 -260512
36890 -260512 -409779 -481317 -495311 -463591 -385137 -234941 -40136 45157 -125691 -469211
36880 -469211 -726028 -762131 -670869 -565497 -464163 -421645 -543428 -759566 -800471 -552924
36870 -552924 -259337 -188774 -261852 -190226 123271 494095 674725 537224 164866 -110164
36860 -110164 66807 628670 1041883 929631 572452 509666 787396 959183 778819 506795
36850 506795 466169 635257 822873 974539 1108676 1130273 920762 541115 187287 -38743
36840c8743j72305k09511j69035Q3705M11236M71597J40848k18425j48382K61770
36830D12755M36823J03964l13918k94948P9930L10956J70201j14162k76804l14616
36820B00181l41828l54614k32056P5249L94091M34353J37103j69637j49247R3275
36810H6870K06408J48667J67195K62995J71447p5271j33022k6019j91130n89359
36800B8781n16446K41913Q19165N06532j09597j21955J88171p1153p03761o12731
36790c51081L40132R58348M89934l50298o07019l50881j31301m684J94495K59263
36780D46908l013k62286j73793J6936m7947j67714J0352K86300K38045m4130j69027
36769A30631j31234j78755k31464n9228J53684O2637j71875j22539J24112J11523
$$ plain form
36840 -38743 -211048 -420559 -589594 -505889 -94653 376944 517792 299367 150985 412755
36830 412755 849578 953542 639624 344676 424606 735562 905763 791601 514797 200181
36820 200181 -141647 -496261 -728317 -653068 -258977 175376 312479 142842 -6405 86870
36810 86870 293278 441945 609140 872135 1043582 968311 835289 809270 618140 28781
36800 28781 -487665 -245752 573413 1079945 970348 848393 1036564 965411 261650 -351081
36790 -351081 -10949 947399 1437333 1087035 480016 129135 -2166 -6850 187645 446908
36780 446908 443895 181609 7816 24752 -23195 -190909 -180557 105743 343788 299658 130631
36769 130631 -603 -179358 -410822 -470050 -316366 -253729 -425604 -548143 -424031 -312508
36759c12508j35330j40747J20471J32709j94962k55141K41072O80594M57988r7764
36749D96382k72148k9896Q2949j42754l74026l72544k79758k10687l4280K89883
36739h46879N25286N05811L81125K99957J13706l05191o51542n02101J1772K87788
36729a80268R4430j22466N603J79308J4486j97839M6779M82729L39009m07211
36719B54560q59024n12060L6221R9745q1744P1509M56601N65878L90590L01892
36709G24168K80769M249m30864n70427l46530j26397m1346J16236L23782K86196
36699B19836L5090k3029K23711M12472L14458J12986l6420k10268l62815k82580
36689D03441l6968M1818o8055m7931J07488J7370l23587l70312Q1864M59680K67945
$$ plain form
36759 -312508 -447838 -588585 -468114 -335405 -530367 -785508 -544436 136158 594146 496382
36749 496382 224234 194338 277287 134533 -239493 -612037 -891795 -1102482 -1136762 -846879
36739 -846879 -321593 184218 565343 865300 979006 673815 22273 -479828 -468056 -180268
36729 -180268 -85838 -208304 -202701 -23393 -8907 -206746 -159967 322762 661771 254560
36719 254560 -604464 -1116524 -1080303 -980558 -1062302 -990793 -534192 31686 422276 724168
36709 724168 1004937 1009186 578322 7895 -338635 -465032 -506378 -390142 -66360 219836
36699 219836 254926 231897 455608 868080 1182538 1295524 1259104 1048836 686021 403441
36689 403441 366473 408291 340236 292305 399793 417163 93576 -276736 -194872 264808 532753
36678E32753j70245k86681j07638k9638j31159j88983j12269K8375J65032J53759
36668a46694j47739m89898l49095K78584O94048M64962N1806K0860J83096Q8055
36658F47985j35843j22696l7029k50008n48461m28369K8187L04362L09761L52930
36648A20819L89389Q1906m24441n60403k21943R9918J38884J12164R7969j02182
36638b67920l41455j36871M47798O66922J94774l16412k17331K06882L02790L4899
36628E74076j75435k11711k52900k48513O38L41050L72982O1082j83248q3077
36618A94944J66993K20472k957k92300l79455j60750J95918L57196J45205k40117
36608B05149m00635j48430L08915N73369M17755k1703l77581l91184j29743J33666
$$ plain form
36678 532753 362508 75827 -31811 -61449 -192608 -381591 -493860 -465485 -300453 -146694
36668 -146694 -294433 -784331 -1133426 -854842 -160794 304168 355974 376834 559930 647985
36658 647985 512142 389446 352417 102409 -446052 -874421 -846234 -541872 -232111 120819
36648 120819 510208 592114 167673 -392730 -614673 -514755 -375871 -263707 -165738 -267920
36638 -267920 -609375 -746246 -298448 368474 563248 246836 29505 236387 539177 574076
36628 574076 398641 186930 -65970 -314483 -313845 27205 400187 461269 278021 194944
36618 194944 361937 582409 579452 287152 -92303 -253053 -57135 300061 445266 205149
36608 205149 -195486 -343916 -35001 538368 956123 934420 556839 165655 35912 169578
36598A69578K04099R1657p2612j69743j81964j90716k31775j77024P8954L35656
36588a43890K73850j9518q6245J87065L31336O6969j71912L9341L24639J03866
36578I05501l62655l38546J51063L34245l7241l26797j19593J51291L1010k42693
36568A45585k82259j81251j48452o2857J46955J89636n4143j75878Q6750L08011
36558b7903O9200k59880q9431L99657N40519K17772q7255j52104k17904l66705
36548B5966l45699q9474J33398K01900K91944M28967L33726j17858o26699q22232
36538e86061o31419k15209K11516M36740L76048K04114J59021K07901J27319j02938
36528A87032k48998j77579o280J26369J99018J86124M0887j43798j73019k4476
$$ plain form
36598 169578 373677 465334 392722 222979 41015 -149701 -381476 -558500 -479546 -143890
36588 -143890 129960 110442 24197 211262 542598 609567 437655 476996 801635 905501
36578 905501 542846 204300 355363 689608 652367 325570 205977 357268 388278 145585
36568 145585 -136674 -317925 -466377 -529234 -382279 -192643 -246786 -422664 -335914 -27903
36558 -27903 41297 -218583 -308014 91643 632162 849934 762679 610575 392671 25966
36548 25966 -319733 -409207 -275809 -73909 218035 647002 980728 862870 236171 -586061
36538 -586061 -1217480 -1432689 -1221173 -784433 -408385 -204271 -45250 162651 289970 187032
36528 187032 -61966 -239545 -245825 -119456 79562 265686 306573 162775 -10244 -34720
36518c4720Q5267j1416j94879j78296J63097N81294O12661Q8093n30007n89483
36508h389r1972K62368M6469l03714k08608J63227K38329k8740j78335m5333Q6077
36497f8621P8355R3744J34738Q692j86352j07859J95915K62296k6176k25146p4425
36486H5161J05028L0412p6459J2212P6129r2896k25682l4904K39348K28976N6909
36475D04234N0962J26391L530j85066r6817J54247J43068j17673k02890o8603
36465B11383j49748n00774n17494J05011P03150M92977k62246n66738n8705N59462
36455A6278N64245J41984m8589J13304J18320l17077p59074o29642p157M61569
36445c45839L83525M1878q2215O4833J73346Q2888o1551j20582j34409j34379
$$ plain form
36518 -34720 50547 39131 -155748 -334044 -170947 410347 1023008 1111101 581094 -8389
36508 -8389 -100361 162007 208476 -95238 -303846 -140619 97710 68970 -109365 -154698 -68621
36497 -68621 9734 103478 238216 246908 60556 -47303 148612 410908 384732 159586 85161
36486 85161 190189 220601 144142 156354 232483 139587 -86095 -120999 118349 347325 404234
36475 404234 455196 581587 585117 400051 303234 457481 600549 482876 279986 211383
36465 211383 61635 -439139 -956633 -851622 -148472 344505 82259 -484479 -543184 16278
36455 16278 580523 722507 673918 787222 905542 588465 -170609 -800251 -807408 -345839
36445 -345839 37686 79564 -2651 62182 235528 318416 256865 136283 1874 -132505
36435a32505n0846O9344N941k74764m21114j40318L05522L92884P2890j61822
36425c34788R075L30051M16266K47991J1526k18109l58465j99684K36037M80725
36415F20625J87373l05549m40600k66850k34272l24652j05244L54462M28218K035
36405h4454k07952J90563N46846J91614m58104n57496j18968J82487J61217J94794
36395D0547L05641Q7159m02080n25206o2227M07316L91328J16619k8477p5541
36385B55079j32900k6725K61999K95177j57534n54749k92510L00933L56868k39634
36375F6004o32813k11499N31933O84420R8073m97005m35225J66214O58084N87759
36365A015945O1413m78066o63979m34561k5294K17451J47360K937J44590N42098
$$ plain form
36435 -132505 -183351 -114007 -108066 -382830 -803944 -944262 -638740 -245856 -172966 -334788
36425 -334788 -325713 4338 420604 668595 680121 462012 103547 -96137 139900 620625
36415 620625 807998 502449 61849 -205001 -439273 -763925 -869169 -514707 -86489 -84454
36405 -84454 -292406 -101843 445003 636617 178513 -378983 -497951 -315464 -154247 40547
36395 40547 346188 433347 31267 -493939 -556166 -148850 242478 359097 330620 255079
36385 255079 122179 95454 357453 652630 495096 -59653 -352163 -51230 305638 66004
36375 66004 -566809 -778308 -246375 438045 536118 39113 -396112 -229898 428186 1015945
36365 1015945 1077358 599292 -64687 -499248 -524542 -307091 -159731 -156794 -12204 529894
36355E29894P21594L69631k20148n40213n19150m52360m25735k43123P7533K02536
36345d99541L1039n6811K33928N97374N15693N668l70964k38904J29841K05463
36335E52786j05189l50691j49955K61296L15385r1541m02727j58530L38981M37099
36325F46914K9033l52857k92882M5572K70390K44230R9371J2197Q1957K67661
36315A051586L72835K26090r9666l62717m11497k56868j659J46921k8302m19298
36305B17425n54180j86779K93229L90953J94408Q6066M4543j67078l40836r7925
36295a20174K75649J02640n23239p17624j50200M53666M88470K97061L43748L59250
36285H09247l2015m70359l88854N6829K79967J51068l2523j63496k97292k65575
$$ plain form
36355 529894 1251488 1621119 1400971 860758 341608 -110752 -536487 -779610 -702077 -499541
36345 -499541 -468502 -525313 -291385 305989 821682 827350 456386 217482 347323 552786
36335 552786 447597 96906 -53049 208247 523632 432091 29364 -129166 209815 646914
36325 646914 675947 323090 30208 75780 346170 590400 689771 701968 783925 1051586
36315 1051586 1424421 1650511 1550845 1188128 776631 519763 518104 665025 636723 217425
36305 217425 -336755 -523534 -230305 160648 355056 441122 485665 318587 -22249 -120174
36295 -120174 155475 258115 -265124 -982748 -1132948 -679282 -190812 106249 449997 809247
36285 809247 777232 306873 -81981 -25152 254815 405883 373360 209864 -87428 -353003
36275c53003P6158M08862L24224k0282j42043K5906J43293P3761j4751o3413j65907
36264B92805k55681j55129J03636L14977L63608K22183j06216m08423l33601O8966
36254A07125K61014L748k16929Q163K89365J05496k84522l17586j12375j62428
36244c18929l49911j64340K61988K61488k40774n71564l61261K9732K42838L45036
36234h65697L88579K39707N414M187J78834J35350j47347k67951j30840o5543
36224e25307j41248n5412J91809K32961O7432J05954L32102K34554k03932l17108
36214g8195J10371L87642N2519l63718k68325M8406M8545j25727o0911J23630
36204a25763Q2952o8617l6582O3341M21n8508P3492J05231k15835m72565j76758
$$ plain form
36275 -353003 -276845 132017 456241 435959 293916 319822 463115 536876 522125 458712 292805
36264 292805 37124 -118005 -14369 300608 664216 886399 780183 371760 38159 107125
36254 107125 368139 371887 154958 163121 452486 557982 273460 -44126 -156501 -318929
36244 -318929 -668840 -833180 -571192 -309704 -550478 -1122042 -1483303 -1453571 -1210733 -865697
36234 -865697 -477118 -237411 -231997 -227810 -48976 86374 -60973 -328924 -459764 -525307
36224 -525307 -666555 -721967 -530158 -297197 -229765 -123811 208291 442845 238913 -78195
36214 -78195 32176 419818 472337 108619 -159706 -111300 -62755 -188482 -249393 -125763
36204 -125763 -42811 -111428 -148010 -84669 -84248 -142756 -69264 35967 -179868 -652433 -829191
36193h29191L26648L39267l3742n6109L80093N41029N3500m53673k74293L59113
36183C52642O38749K68361k47186l40349p2979N6821j51589l40661j65585J59689
36173A57913K07175K1192j3472J11416L1987k43170k60551M3403J32992k08009
36163a9124m41178j58080K69811M00721M09821N07806L67812j65132m59648m9203
36153F63606L89056J571p64409p73731J797N04041L12928J21055L43753M34245
36143A233912k6872n46692n29077j09248K78304N06002N17363J34891m47540n76537
36133D34506k8296N32058M62148L2619j08984O4538Q3116j88517m20399l92079
36123D70710k30048j16316r4161j27926j34919l0580J23528J65065J16699J82695
$$ plain form
36193 -829191 -502543 -163276 -197018 -253127 126966 667995 721495 267822 -6471 352642
36183 352642 991391 1259752 1012566 672217 599238 656059 504470 163809 -1776 157913
36173 157913 365088 386280 372808 484224 516211 273041 12490 55893 188885 -19124
36163 -19124 -460302 -618382 -348571 52150 461971 969777 1337589 1172457 712809 663606
36153 663606 1052662 1054233 289824 -483907 -482110 21931 334859 455914 799667 1233912
36143 1233912 1207040 660348 131271 22023 300327 806329 1323692 1458583 1011043 434506
36133 434506 406210 938268 1400416 1433035 1324051 1388589 1471705 1283188 862789 470710
36123 470710 240662 124346 30185 -97741 -232660 -263240 -139712 25353 142052 324747
36113C24747L47908L04082l6701l03565k12231k6251j35839m39317n20145k60398
36103i57710Q2636K86815L23664K08024N031p6972J09694L86113M30264K01201
36093I98760l5907q4701j6726j609j06791k74708l81168l21444j16601R2598J94776
36082e3521J81228O4109j31941k64848j62819R3816J85480k2250k67903k64240
36072f42889q0367L6613L4685K0432K026o8950r4087O8453L29150M25009K57454
36061B87529m780j62150j69572q4016K6588R2425O5064k6549q5037k1918J67112
36050H4696L58026L48583O2063k87599l70594j25612J64228K26788Q1718r4389
36040D47908k10485k64405k52314j94011j43039r7132j5503M3396j7474r4951
$$ plain form
36113 324747 672655 976737 940036 636471 424240 397989 262150 -177167 -697312 -957710
36103 -957710 -875074 -588259 -264595 -56571 -51540 -128512 -18818 367295 797559 998760
36093 998760 962853 878152 861426 859817 753026 478318 97150 -224294 -340895 -248297 -53521
36082 -53521 127707 191816 59875 -204973 -367792 -273976 -88496 -110746 -378649 -642889
36072 -642889 -723256 -686643 -651958 -631526 -629500 -698450 -792537 -724084 -394934 30075 287529
36061 287529 282749 120599 -48973 -132989 -106401 -13976 51088 24539 -60498 -82416 84696
36050 84696 442722 791305 853368 565769 195175 69563 233791 460579 542297 447908
36040 447908 237423 -26982 -279296 -473307 -616346 -713478 -728981 -685585 -703059 -798010
36030g98010M6277L65911M77474J59725l00793m83687l36007q4774J31767K87343
36020e34774L16290K27067K15504L82555M84870K66662r7167k27265j09335p1677
36010H52730k32891l43367k19173j4664K5414j44724l84769m84460k72605J89802
36000a028707N58253N58099L24045J53594M9226j55853l36965k08702J02094J37848
35990A52932j36033j96520K00568N71761M37152M3848q7458K1281l5009l02371
35980F70151m37607l25231k04924j77609n5230K15392L88285L09668J34569J3519
35970E30983j25186l10794l35477o2115K65656K72201p0555l98830l68752p190
35960f10059L31845L22968J4122k10678r1602J70811K18281P7310Q2489K62089
$$ plain form
36030 -798010 -751733 -385822 91652 251377 -49416 -533103 -869110 -953884 -822117 -534774
36020 -534774 -218484 8583 224087 606642 1091512 1358174 1261007 1033742 924407 852730
36010 852730 619839 276472 57299 42635 68049 -76675 -461444 -945904 -1218509 -1028707
36000 -1028707 -470454 87645 411690 565284 614510 458657 121692 -87010 15084 152932
35990 152932 16899 -179621 20947 592708 1029860 1073708 986250 1007531 972522 670151
35980 670151 232544 -92687 -297611 -475220 -530450 -315058 73227 382895 517464 530983
35970 530983 405797 95003 -240474 -302589 -36933 235268 164713 -234117 -602869 -610059
35960 -610059 -278214 44754 58876 -151802 -243404 -72593 145688 222998 305487 567576
35950E67576K12643k41370o46699m98318N0747M23919L91372K16917J27519M9791
35940F54097r0425j67956r0106J8500N234q8959j01799N1737K99638M57880L71403
35929A319244R7817j11072j22961j11920k67995m58340m24453k02407m4957q597
35919c35641L8056N4151j16562l23760j96316K49789N27564L69090Q6899M1476
35909C94746J52611J92928J73860J35775o7455m12281m85846n2798M46593M37086
35899I15219K9388j91320m2084J11287K2777j27632j41610q5433o7768o9441q1250
35888B72133j39380j72228o0459J25278J86351J04778N4465R9949J08991k5484
35878E54394k56260m46490m27150j13551K73858L14073n6015l48417k03717M9779
$$ plain form
35950 567576 780219 538849 -107850 -606168 -555421 -131502 259870 476787 604306 654097
35940 654097 563672 395716 305610 324110 329344 240385 138586 190323 489961 947841 1319244
35929 1319244 1417061 1305989 1183028 1071108 803113 344773 -79680 -282087 -327044 -335641
35919 -335641 -297585 -243434 -359996 -683756 -880072 -630283 -102719 266371 353270 394746
35909 394746 547357 740285 914145 1049920 982465 570184 84338 31540 478133 915219
35899 915219 944607 753287 711203 822490 845267 717635 576025 490592 422824 353383 272133
35888 272133 132753 -39475 -99934 25344 211695 316473 370938 470887 579878 554394
35878 554394 298134 -148356 -575506 -689057 -415199 -101126 -157141 -505558 -709275 -659496
35868f59496l1505j91708J24427P40563Q70188K83339l72277n51344m30898l31536
35858e50247j73400J48839L89038L35321J65503R0790J9756j32722j84943m0169
35848F7766O0739o0775k04731j58344m1059r717L5038J64545J89714N228j63114
35837a14710j26853j3147O1343J91529L12216J13479l48230m87976o4974L25677
35827a51646J55831j84307q9032K08354Q2731l49615m29686q0047J61488J43157
35817e32772K32102M14728J82181m74236q00198l78393K11575K71284n4725j77384
35807a105838K9876K39019K83134K74024K59264J65405K1816m9939l8467l8365
35797C9929q2829j15172q3299J4838J21573J36639M4920J0724J85953M34369M43742
$$ plain form
35868 -659496 -691001 -882709 -758282 -17719 852469 1135808 763531 212187 -218711 -550247
35858 -550247 -723647 -574808 -185770 149551 315054 405844 425600 292878 107935 67766
35848 67766 128505 67730 -137001 -295345 -336404 -346121 -311083 -146538 43176 48404 -114710
35837 -114710 -241563 -254710 -193367 -1838 310378 423857 75627 -412349 -477323 -151646
35827 -151646 4185 -180122 -269154 -60800 21931 -327684 -757370 -837417 -675929 -532772
35817 -532772 -300670 114058 296239 -177997 -978195 -1356588 -1145013 -873729 -928454 -1105838
35807 -1105838 -1075962 -836943 -553809 -279785 -20521 144884 166700 116761 78294 39929
35797 39929 -42900 -158072 -241371 -226533 -104960 31679 76599 87323 273276 707645 1151387
35786A151387J30661k58945m65067m28075j94671J39213L58490K62247n6475k87970
35776C50795l17477l14456l50352k25248J65625N41611N36524J57338k35116l26828
35766a7584j15628J49384K02452n958k56450k90269r3005J26829K12847J93835
35756A06453J58291J31063Q7245n931j46219k32486j33929Q5124J59495n205j37902
35745F5999p602J68374M3405k82385l97133k04448R324J06553K35098L84801K90974
35734D12960o1174k78294j37275O1446q221j87875j47890O6854J76442J60391
35724E7364K16604L17780K11144j05809k69587o4804K13802J56959j55652k64073
35714C13728l4930J03013j73270n05981l59396R6487J78984k20793m03193M0696
$$ plain form
35786 1151387 1282048 1023103 558036 129961 -64710 74503 432993 695240 638765 350795
35776 350795 33318 -281138 -631490 -856738 -691113 -149502 387022 544360 309244 -17584
35766 -17584 -133212 16172 218624 212666 -43784 -334053 -427058 -300229 -87382 106453
35756 106453 264744 395807 483052 477121 330902 98416 -35513 49611 209106 203901 65999
35745 65999 58397 226771 270176 -12209 -409342 -613790 -604466 -497913 -262815 121986 412960
35734 412960 351786 73492 -63783 -2337 -10558 -198433 -346323 -279469 -103027 57364
35724 57364 273968 591748 802892 697083 427496 362692 576494 733453 577801 313728
35714 313728 278798 381811 208541 -297440 -656836 -560349 -381365 -602158 -1005351 -964655
35704i64655N44107M53891N0692K5596L36843L54879o2085m14608m16375k66195
35694c57910o7388K88014N83127L70211k24705m96314j93963J15782p99k18908
35684b02853j57954n2369k15645l78478j38296L20400N10007L68689K12633J69910
35674D36044R9929o3736k29765k94021j71362J22703L13141J22267k09342j35773
35664i915K91323L48507k06772o00281k07078L88795K61427m08490o40283j52145
35654i34912L49760L36377P9870q741L0063J183p4421j12752j29859j06912J9871
35643e50473J72547J99171J24963P9388M3201n2698j00928j3109K1576j43827
35633b20189k24690Q6477M83474L93521j04947l22028M3914N28095O24694L40179
$$ plain form
35704 -964655 -420548 33343 84035 109631 446474 801353 739268 324660 -91715 -357910
35694 -357910 -425298 -137284 445843 816054 591349 95035 -98928 16854 16055 -202853
35684 -202853 -360807 -413176 -628821 -1007299 -1145595 -825195 -315188 53501 266134 436044
35674 436044 535973 472237 242472 -51549 -222911 -100208 212933 335200 125858 -9915
35664 -9915 281408 629915 423143 -177138 -384216 4579 266006 -142484 -782767 -934912
35654 -934912 -585152 -248775 -168905 -177646 -147583 -146400 -220821 -333573 -463432 -570344 -550473
35643 -550473 -377926 -178755 -53792 25596 68797 16099 -84829 -97938 -76362 -220189
35633 -220189 -444879 -358402 125072 518593 413646 91618 135532 663627 1288321 1628500
35623A628500j12253o11243r08591o50977N9164N45773L38940k40567n51387l82221
35613h84862L0604M23025O21876M90677R4917k28509k43551j24383j49118k38078
35603b07402j02173K24588L37006J9130l94255l97207M1568M09526K69340k15815
35593a5694n22307m12686j00053J74392L83286M81736L35035N1251j8338J39859
35583D96481O3365l92120o21223j75968L68222K08243l72257m11355J61711M09207
35573b65694n9122m68329j81989L34991M16970K40476K71577L44384R2980k01271
35563E24973n8026K39515K2918n76847p14352j37935M12586L25855p4125j79824
35553b15262J2396J00824k9322j67423k02983j80300n5152K33292M92689M12136
$$ plain form
35623 1628500 1516247 905004 -3587 -654564 -595400 -49627 289313 48746 -502641 -884862
35613 -884862 -854258 -431233 190643 681320 776237 547728 304177 179794 30676 -207402
35603 -207402 -309575 -84987 252019 271149 -123106 -520313 -478745 -69219 200121 -15694
35593 -15694 -538001 -950687 -1050740 -876348 -493062 -11326 323709 374960 356622 496481
35583 496481 559846 167726 -453497 -629465 -261243 -53000 -425257 -836612 -674901 -265694
35573 -265694 -324816 -793145 -975134 -640143 -223173 17303 288880 633264 726244 524973
35563 524973 466947 706462 729380 152533 -561819 -699754 -287168 38687 -35438 -215262
35553 -215262 -202866 -102042 -131364 -298787 -501770 -682070 -737222 -503930 -11241 400895
35543D00895L392l55040l82680j87740j6969N6140N7717m4570j94208j18784L23375
35532d58472P51876O09217n6824n45534l84417J14660L97754L79236K71483O7592
35522A146571l12136n89802m14436R8P3146k81416n07802k18610L21925O65544
35512a16918O91270M77625Q3858l18072m51364k98474j50518j28881k1705K15095
35502a8084K26398j61580n19408l81146N3344K21572J7115j39647K0565K66728
35492d14143K42856p6999l88844l87390o7973K64624L37021K25096J77090J81434
35482I2772J2575k83441l42839n1705K27615J90035j9437j54147k17233k23043
35472g68848l1273K75467K86182r8698l70122j81380O7226m6046j58144K37463
$$ plain form
35543 400895 404287 49247 -333433 -521173 -538142 -482002 -424285 -468855 -663063 -781847 -458472
35532 -458472 293404 902621 845797 300263 -84154 30506 428260 807496 1078979 1146571
35522 1146571 834435 244633 -169803 -169705 -96559 -377975 -885777 -1104387 -782462 -116918
35512 -116918 574352 1051977 1135835 817763 366399 67925 -82593 -211474 -233179 -18084
35502 -18084 208314 46734 -472674 -853820 -800476 -578904 -561789 -701436 -680871 -414143
35492 -414143 -171287 -248286 -637130 -1024520 -1092493 -827869 -490848 -265752 -88662 92772
35482 92772 105347 -178094 -520933 -572638 -345023 -154988 -174425 -328572 -545805 -768848
35472 -768848 -800121 -524654 -238472 -337170 -707292 -888672 -821446 -867492 -1025636 -788173
35462g88173P66428O77470J11231j10269J30170J09126l84243o25946k30330J50976
35452a93560m8124l54881j37347K77430K10972j55311j04087L66836N48432K08566
35442F18926r4699J567J45893l867k00490j25940K8722n3873k28015j53995Q1167
35431A5396J00131j04944j21429K18203N13951L25381k25926n96969m52944J4067
35421c15083L41211K35721k09652o14821o13482j59013M14622O76995M85590Q3430
35411C25518j74811j48860L8417K00638K56130K14486R8017n4644j53330j23119
35401D78442k0433L239j03938k16909k18377j72557j99151k46179j56123O3541
35391g88445K20172K02706Q1555q3090k97207m19570j78564L94682P90464N74353
$$ plain form
35462 -788173 -21745 655725 766956 656687 786857 895983 511740 -114206 -344536 -193560
35452 -193560 -241684 -596565 -733912 -456482 -245510 -400821 -504908 -138072 410360 618926
35442 618926 524227 525794 671687 667820 467330 341390 370112 316239 88224 -65771 15396
35431 15396 115527 10583 -110846 107357 621308 946689 720763 123794 -329150 -315083
35421 -315083 26128 261849 52197 -562624 -1176106 -1335119 -920497 -243502 242088 325518
35411 325518 150707 1847 40264 240902 497032 711518 809535 754891 601561 478442
35401 478442 458009 461248 357310 140401 -77976 -250533 -449684 -695863 -851986 -788445
35391 -788445 -568273 -365567 -284012 -367102 -664309 -1083879 -1262443 -867761 -77297 497056
35381D97056j5744l24893p2358L82391N34086K39512k61900o02649n46654j84028
35371c55181J25822J39930p813p0830m8037m3274L5844K85988M69975K97282n7880
35360G71826j86075j12050j92292l80548k50959J59091K55490j11015k83401J36800
35350a93133N51150K87416l12660m51104r6662J42155R2625J25308K86061J66342
35340E97498k60484m32692p6482L35962L21330O5668j72R6788J9751k68419m56748
35329e8000l67153j62173n1229l106J57619M40607N79900L22328j86109m74541
35319A98143l11750p225M6460o6734k815K09308J93989r7302k05504J44465N45894
35308F46929M25821j53186n53237l67490J32628M14892L17511R4675m7806j98437
$$ plain form
35381 497056 481312 156419 84061 466452 1000538 1240050 978150 375501 -171153 -355181
35371 -355181 -229359 -89429 -97242 -168072 -216109 -259383 -223539 62449 532424 829706 771826
35360 771826 585751 473701 281409 -99139 -350098 -191007 64483 -46532 -329933 -193133
35350 -193133 358017 645433 332773 -118331 -214993 -72838 19787 145095 431156 597498
35340 597498 337014 -95678 -172160 163802 485132 550800 550628 647416 667167 398748 -58000
35329 -58000 -425153 -587326 -638555 -641661 -484042 -43435 536465 858793 672684 198143
35319 198143 -113607 -120832 -74372 -141106 -143921 65387 259376 162074 -43430 101035 646929
35308 646929 1072750 919564 366327 -1163 131465 546357 863868 958543 910737 712300
35298G12300m41121n49116k55511K54071M67714K32254l2809K4203J75179L6141
35288F23305k81279l49962j03336J02366O3607m0481l9127k3678r0466j27200
35278b66251k3492J10160J05372J633K752J95948L93901K99156j33593n40555
35268A45031n08196j07610J58039L0547j65808o3916J70601J40171j31280k57943
35258e90364r5945J19472K10712K57063L30533L51914K65579J17216o2325k49498
35248F54357l38770k60153j17103k3267N8596J13748m5618l90196m48346P1763
35238g24989O70371O31023N8544k86001j26053M3914j19751l03681j80125N6309
35228b80439J06816L1974j0085o5021j37337m1097K29267L57893K02772N2595
$$ plain form
35298 712300 271179 -277937 -533448 -279377 188337 420591 387782 411985 587164 623305
35288 623305 342026 -7936 -111272 -8906 54701 14220 -24907 -48585 -139051 -266251
35278 -266251 -289743 -179583 -74211 -72578 -69826 126122 520023 819179 685586 145031
35268 145031 -363165 -470775 -312736 -282189 -447997 -511913 -341312 -201141 -332421 -590364
35258 -590364 -686309 -566837 -356125 -99062 231471 583385 848964 966180 903855 654357
35248 654357 315587 55434 -61669 -84936 -26340 87408 41790 -348406 -796752 -724989
35238 -724989 -54618 576405 634949 348948 222895 266809 147058 -156623 -336748 -280439
35228 -280439 -173623 -141649 -151734 -216755 -354092 -395189 -165922 191971 394743 447338
35218D47338J17779J60161m8765k71788j83229R1959J90407M2815j30646j72434
35208B43597o9135J32147K74358J75026o4006j15271K8601n4679n11134q05838
35198g66334m36445K72183N69362K76344q8002p8074K05472L92372K63099j09896
35188E00081m20792l79498n6164J65582J28756J41935M32605O58892L68167k53783
35178A285781n60245l13040O3470J36716j6512q3675j2490j3731j84847l23320
35168b1893j73202J92174L63415Q7181l33699l65084N5283M25384L44178k4362
35158E49375k60726j88577O3583K46494J30748k70794n48955k92511K91346N49350
35148B69333K76748l5215p018J25233Q5407N4175J88943K01503q4523k64648j6226
$$ plain form
35218 447338 565117 725278 676513 404725 221496 313455 503862 546677 416031 243597
35208 243597 174462 306609 580967 755993 691987 576716 605317 550638 39504 -766334
35198 -766334 -1202779 -930596 -361234 -84890 -172892 -250966 -45494 346878 609977 500081
35188 500081 79289 -300209 -356373 -190791 -62035 79900 512505 1171397 1539564 1285781
35178 1285781 725536 412496 475966 612682 596170 512495 500005 486274 301427 -21893
35168 -21893 -195095 -2921 360494 447675 113976 -251108 -195825 229559 573737 549375
35158 549375 288649 100072 163655 410149 540897 270103 -278852 -571363 -280017 269333
35148 269333 546081 510866 503848 629081 714488 768663 957606 1159109 1074586 809938 793712
35137G93712K44433K3667l60740l04230K4392l694l33286l10972J43621L63281
35127B80184L7936l36965l30352j55170j03125n9027R3792J49305L208q0031N1500
35116d48745J26869o2223k75435k40808p8767N203Q4783K39024K68786N6735j06302
35105d30880L9750K27289M7446l62046m87859k02549J13310K07980K60349M25175
35095a62035M81428J96418k16471l27686q8461J07379o856k05781j25921K06209
35085a41777M28268L33587O2774j69857k84876k48828m6605J75167J89429J9199
35075C16481n5250Q0655K18628K02271J32641N3870j75447m69698m10219J03369
35065b699N18512L87478N6482N6772J93855n5948n17433n22107o3607J28995j93928
$$ plain form
35137 793712 1038145 1061812 701072 396842 421234 417540 84254 -226718 -83097 280184
35127 280184 318120 -18845 -349197 -504367 -607492 -666519 -572727 -423422 -420214 -500245 -448745
35116 -448745 -321876 -384099 -659534 -900342 -979109 -973906 -889123 -650099 -381313 -324578 -430880
35105 -430880 -391130 -163841 -116395 -478441 -966300 -1168849 -1055539 -847559 -587210 -162035
35095 -162035 319393 515811 299340 -28346 -116807 -9428 -16284 -222065 -347986 -141777
35085 -141777 286491 620078 682852 512995 228119 -20709 -67314 107853 297282 316481
35075 316481 261231 341886 560514 762785 895426 949296 773849 304151 -106068 -2699
35065 -2699 515813 903291 959773 1016545 1210400 1154452 637019 114912 51305 180300 -13628
35054a3628l58134J14689O57904M62084l43638q77334o40190R186M35245M14238
35044a39578K02043J18323J69712J10456j40267l15108j83763O3598Q7213r7978
35034a25349k16704j99906j71709q2323J92024M39222K97914j30583l47265j81592
35024e26271L6329Q8685J25783K01703J13861j07650r9097K01400L43990Q7628
35014D66361j82193j11043M0428r0695k97608j59811K28897M10300K59939O2204
35004F26779j0120p0215k01083l05690k94499k03036j22025j28673k11565j93772
34994a113899R7063M96630N89533K71014n4274m4361R1097l0852l28227l66911
34984c93187k1336L22580K65184j27030m20590l08846M9242K18361L4631j65665
$$ plain form
35054 -13628 -371762 -257073 400831 862915 519277 -358057 -998247 -989061 -553816 -139578
35044 -139578 62465 180788 350500 460956 320689 5581 -178182 -114584 -27371 -125349
35034 -125349 -342053 -541959 -713668 -795991 -603967 -164745 133169 2586 -344679 -526271
35024 -526271 -489942 -401257 -275474 -73771 40090 -67560 -166657 34743 378733 466361
35014 466361 284168 173125 213553 122858 -174750 -334561 -105664 304636 564575 626779
35004 626779 616659 546444 345361 39671 -254828 -457864 -579889 -708562 -920127 -1113899
34994 -1113899 -1016836 -520206 69327 340341 286067 241706 332803 301951 -26276 -393187
34984 -393187 -414523 -91943 173241 46211 -374379 -683225 -633983 -415622 -380991 -546656
34974e46656j9694L09310L51996K4370k77032k76335j16559J3276J48353L13825
34964g5146L85941L36322K90620K41173N6923j48473r9308Q7056n0542n20353
34954E04213o94970k39847L16403L53462J6256j81676j80683k37058k88088o8119
34944g00107L10569M51613K83126J11307J02981J10787M177j50618k46314k40898
34934C6623j38925j8666J8467K2454J27212K34214Q3425k29962k33991J75093
34924G5944M24555Q6336m12307l90622J00964M38358L36802O2037j31522k52076
34914C38469l05182k13531p454J98254L50528L65798J01255l12400l95798N0008
34904A69947N11068L87940j80879n72496n28422k66358L8987L40813M36704J67012
$$ plain form
34974 -546656 -566350 -257040 94956 119326 -157706 -434041 -550600 -537324 -388971 -75146
34964 -75146 310795 647117 937737 1178910 1235833 1087360 988052 1075108 1024566 504213
34954 504213 -190757 -430604 -114201 239261 255517 73841 -106842 -343900 -631988 -700107
34944 -700107 -389538 62075 345201 456508 559489 670276 674453 523835 277521 36623
34934 36623 -102302 -120968 -102501 -80047 47165 281379 364804 134842 -99149 75944
34924 75944 500499 586835 174528 -216094 -115130 323228 660030 722067 590545 338469
34914 338469 33287 -180244 -187698 10556 361084 726882 828137 515737 119939 169947
34904 169947 681015 1068955 888076 315580 -212842 -479200 -440213 -99400 337304 504316
34894E04316j69388j21836K24212L51693P1995k91169m50920m23341k58409L2667
34884e30180K68403K46992J14865J74458L42070K45352j27068l43355j80738O5131
34874B75930N7342j41879k51933j39316J07808K94252K67326P3501q4132j28865
34864C30034j70811j86382K7126L64387L12528k76446p39697m58983J96417M00368
34854b01459O2868j87964l2797K29946L19193K58710O3140k63957m54370k59152
34844d65842N9559O8340j35268j49351j4161m5629j02381J83670N57372L92742
34834C49051k20281n25737k81872M503R4596L02162N98530M49055j48668m39907
34824A81432j21282J63345j6007j65674J19195L51885O5127k87759j31395K18079
$$ plain form
34894 504316 334928 213092 437304 788997 860992 569823 118903 -304438 -562847 -530180
34884 -530180 -261777 -14785 100080 274538 616608 861960 734892 391537 210799 275930
34874 275930 333272 191393 -60540 -199856 -92048 202204 469530 543031 458899 330034
34864 330034 159223 -27159 -33 364354 676882 400436 -339261 -798244 -601827 -201459
34854 -201459 -138591 -326555 -359352 -129406 189787 448497 511637 247680 -206690 -465842
34844 -465842 -406283 -337943 -473211 -622562 -636723 -682352 -784733 -601063 -43691 349051
34834 349051 128770 -396967 -678839 -674336 -579740 -277578 320952 770007 621339 181432
34824 181432 60150 223495 207488 41814 161009 512894 578021 290262 158867 376946
34814C76946J66370j02246l3641K74050K95566N411j92467k09032k36605j97671
34804A46681R3977M08703L79704J43429R3695J63517j3958l47516l54716J4303
34794G27819K30910k6463m33124n19708k49040O7124J88056J44054J17266J76808
34784D23702J60334o3862k75489j43747J93239K11286k01175m96653k77913J11882
34774c58396J73467N786J6589J97525J91397q6367l28842k75538J3597K50677
34764b00105J49909k64395n27681k23829L61353N32534K00349l253K02752K97480
34754E25114o1910l75195j64775J94630J83995M4080J97722L33095l8937n39365
34744B98454m04871K27036M68930L2762m38612m05204m4931K22818K04836j00048
$$ plain form
34814 376946 543316 441070 407429 681479 977045 982456 789989 580957 344352 146681
34804 146681 240658 649361 1029065 1172494 1266189 1429706 1415748 1068232 713516 727819
34794 727819 958729 932266 499142 -20566 -269606 -202482 -14426 129628 246894 423702
34784 423702 584036 520174 244685 100938 294177 505463 304288 -192365 -470278 -358396
34774 -358396 -184929 -179143 -162554 34971 226368 140001 -188841 -464379 -450782 -200105
34764 -200105 -50196 -314591 -842272 -1066101 -704748 -172214 28135 24882 227634 525114
34754 525114 463204 88009 -76766 117864 301859 345939 543661 876756 837819 298454
34744 298454 -106417 120619 589549 622311 183699 -221505 -266436 -43618 161218 61170
34734F1170m71075m60508P4282N80596M88131N6224o9221J13875J09961j13310
34724C70125j36035O0130R1940k2735R2935L40333K20911k06341l22651j2823
34714D75789J52000m2728j26714J00270J80903r7675k71048p6561M2000k17577
34704A18659m15700j56615K01097J97393L9267J14855K56797J14430j55600j79337
34694A35246k3198o061j14419j00735M9381J66348K08534J91417N1723j32014
34684D26222r4647J57703K17193q9660l59437k69759j18397k48409l89057j35651
34674i03899K90130L84906J87197J20401K18835J52404r9727k22813j62195j68683
34664b03444k61796j91406M6609J71225J35154J89154L60805L54669Q9485j16937
$$ plain form
34734 61170 -409905 -870413 -796131 -215535 272596 328820 259599 373474 483435 370125
34724 370125 234090 294220 386160 363425 456360 796693 1017604 811263 488612 475789
34714 475789 627789 585061 458347 558617 739520 641845 370797 294236 336236 118659
34704 118659 -297041 -453656 -252559 -55166 -15899 98956 355753 470183 314583 135246
34694 135246 112048 105987 -8432 -109167 -59786 106562 315096 506513 558236 426222
34684 426222 331575 489278 706471 616811 257374 -12385 -130782 -379191 -768248 -903899
34674 -903899 -613769 -228863 -41666 78735 297570 449974 350247 127434 -34761 -203444
34664 -203444 -465240 -656646 -610037 -438812 -303658 -114504 246301 600970 690455 573518
34654E73518o0177N3115J558j08255r5032p160K2336m017k6110k0563P7911L09485
34642G16609M66308K46437k31894m13791m9323L58882J97732l82551o53881k93515
34632c8987K37393L60305N9776k71217l84852l25288j84586M972J65127J92422
34622a84935J23808J10551J82407J96986Q3963k5291j2761L2929k1456j19207
34612C66994j06681J9575J21363J16090J8245j45301l00416k89854p5284R1253
34602a84016o0368l97583m90726j58357L35316O58369P28149N92032K76573j00798
34592A198591k98710k06985R450J35392J22178Q006j64507k52513q9249J94839
34582F56492K04229j57646m50320l20019o4191j41395l59947j54958L92156N15497
$$ plain form
34654 573518 513341 566456 568014 459759 364727 357567 379903 375886 349776 329213 407124 716609
34642 716609 1182917 1429354 1197460 783669 734346 1093228 1290960 908409 254528 -38987
34632 -38987 198406 558711 618487 347270 -37582 -362870 -547456 -542484 -377357 -184935
34622 -184935 -61127 49424 231831 428817 512780 487489 474728 507657 486201 366994
34612 366994 260313 279888 401251 517341 535586 390285 89869 -199985 -275269 -184016
34602 -184016 -244384 -641967 -1132693 -1291050 -955734 -297365 430784 1022816 1299389 1198591
34592 1198591 899881 692896 702346 837738 959916 967922 803415 550902 461653 656492
34582 656492 860721 703075 252755 -67264 -131455 -272850 -632797 -787755 -395599 119898
34572A19898n5700n48267k26597M97864O67155J64500k37175j17611Q4719l6171
34562C12615j94709l4540J81558L0535l33657m56825k98992j21085P6135L93765
34552d45200N40825J95636k73529k13169K30554K66674k27415m63115n8268L48194
34542i8813K42977P7524L17145M96669O7575m98398m22230O9508J69764j19945
34532C01776j00178K98828L87143n2151l99147k44043O7588J66647J74080K33192
34522H33735K07910Q6824P2114Q4951j77094n29664l74220K73124N78781R3652
34512A150113n36591n31631m4138K58251J82834K7706l4284p0296j13534j59583
34502A28847k38121k47594p015L31261L20249q1891l00950L2474M86750M50990
$$ plain form
34572 119898 64198 -484069 -710666 -212802 454353 618853 381678 264067 348786 312615
34562 312615 117906 83366 264924 295459 -38198 -495023 -794015 -915100 -838965 -445200
34552 -445200 95625 291261 17732 -195437 35117 301791 74376 -388739 -447007 -98813
34542 -98813 144164 221688 538833 1035502 1103077 604679 182449 251957 421721 301776
34532 301776 201598 500426 887569 835418 436271 192228 259816 426463 600543 833735
34522 833735 1041645 1128469 1200583 1285534 1108440 578776 204556 477680 1056461 1150113
34512 1150113 613522 81891 37753 296004 478838 506544 472260 401964 288430 128847
34502 128847 -109274 -356868 -363883 -32622 287627 205736 -95214 -62740 424010 875000
34492H75000k7942m46005n41812l75893k0633L87073N32477K88293l407R544J47869
34481H24564l554m22687o44868l54940K72236P47586O53373K7732n45705m95591
34471E8146J8511L05354J24141m6584J13545K47008K7126k28719j57819k2592
34461D38117j84482l75692j79805J33868J2895l82090l70340J44873N15666L46131
34451I9141j2745j11453R108Q2908M4832k8405j08009j71552j70065j22595q3010
34440e71845j0101J52117K99473K71510R6062n5977j12320j18873q2898J7557
34430a15295J12766Q7405p9765l02969m42887l46274J1769L90968M84732K79084
34420G9534m913k77522n47226n83150j25641N09816O32146J57706k12804n2131
$$ plain form
34492 875000 847058 401053 -140759 -516652 -537285 -150212 382265 670558 667151 676695 824564
34481 824564 821010 398323 -246545 -601485 -329249 418337 1071710 1099442 553737 58146
34471 58146 76657 382011 506152 459568 573113 820121 847247 618528 460709 438117
34461 438117 253635 -122057 -301862 -167994 -155099 -537189 -907529 -762656 -246990 99141
34451 99141 86396 -25057 -15949 66959 111791 83386 -24623 -196175 -366240 -488835 -571845
34440 -571845 -581946 -429829 -130356 141154 237216 181239 68919 -49954 -132852 -115295
34430 -115295 -2529 84876 5111 -297858 -740745 -1087019 -1075250 -684282 -199550 79534
34420 79534 74621 -202901 -750127 -1333277 -1458918 -949102 -316956 -159250 -372054 -424185
34410d24185K11933J31580l0615Q0363K06186K9124j26012J23757L92072Q3428
34400F77631n46330p07159k53161K30023L88543M04575L87559J72856k09159m35845
34390A09533l42448n8266K60517M55645K94174j84662m56794j44938L59134M41954
34380G33849J82508Q7741J56565l0245l99279l76481J41847N34121L45101j44619
34370A231108m16680l17591k8127J90095J47122p1367j04259J82902L85120J30199
34360A328522k97024l92082k12297j32020r2110J99475N18392L56824j77235m54653
34350F45792k93133r6838m4311J03689L41015L12250j3719k40999k20000j92051
34340C01695k09434o8239J35092O4614j79495j37930J95070L40189J66781K3225
$$ plain form
34410 -424185 -212252 -80672 -111287 -30924 175262 204386 78374 202131 594203 677631
34400 677631 131301 -575858 -829019 -598996 -210453 194122 581681 754537 545378 109533
34390 109533 -232915 -291181 -30664 424981 719155 534493 77699 -67239 291895 733849
34380 733849 916357 1004098 1160663 1130418 731139 354658 496505 1030626 1375727 1231108
34370 1231108 814428 496837 468710 658805 805927 734560 630301 813203 1198323 1328522
34360 1328522 1031498 639416 427119 295099 202989 402464 920856 1277680 1100445 645792
34350 645792 352659 255821 211510 315199 656214 968464 954745 713746 493746 301695
34340 301695 92261 24022 159114 223728 44233 -93697 101373 441562 608343 631568
34330F31568j1248k04713m29975k21997K68830L08437j73552l16375K87540Q48005
34320I86520N68836j93881n90800m63351k29205q7225L0613O6498m5301j00135
34310e7431J08869M22851N14659K88626q2196l22233k08614J75660L78924J05840
34300A324955l10277l82304k10567j75261j39898K52818O71976M42689k34787
34291A239344m42779j7201K17413j03880l26401l4926K32004M4984j66295l5977
34281F06286J2671l57278o49824l75283J16535L14998L36461L87112J93430l22707
34271B62401n23421K2627P24532Q08157L77062m5693l86327o98085o26734k0699
34261a06180M87471L20447j34150k13499k6613j7373n4734J59555K98939l2502
$$ plain form
34330 631568 620320 415607 -14368 -236365 32465 340902 167350 -149025 138515 986520
34320 986520 1555356 1361475 770675 307324 78119 -9106 21507 88005 42704 -57431
34310 -57431 51438 474289 988948 1277574 1195378 873145 664531 840191 1219115 1324955
34300 1324955 1014678 632374 421807 246546 106648 359466 1031442 1474131 1239344
34291 1239344 796565 779364 996777 892897 566496 531570 763574 808558 642263 606286
34281 606286 618957 261679 -388145 -763428 -646893 -331895 4566 391678 585108 262401
34271 262401 -261020 -238393 486139 1294296 1671358 1625665 1239338 541253 -85481 -106180
34261 -106180 381291 701738 567588 354089 327476 310103 255369 414924 713863 681361
34251F81361m06279k00879K61386K09603k56415l76826n7841O2033j85401k35650
34241e04908J63643N21029M27128J20895l846O0162R1029j8206k03153l14061
34231C39712k65810j91786k47602k17896K36102Q08269O78773k49730r57051o71001
34221g38020N9671L14384J54932K05347M35228L23658r8063l00073j80270j23401
34211E3393k40753k57603p7706J32125L07952M41068L59026J7145k51576k11360
34201B71711j05853j45615p5843K58032M47788K03109n5435P8583K48423J1528
34191A136428l13297k47417l3732r2648j60582J41008M23267J71461k35138j39832
34181F49518K21243J88164j24451j53130Q362p9554j81348J79931O24167M39345
$$ plain form
34251 681361 275082 74203 335589 545192 288777 -88049 -145890 -83857 -269258 -504908
34241 -504908 -341265 179764 606892 727787 723941 784103 875132 856926 653773 339712
34231 339712 73902 -117884 -365486 -583382 -347280 460989 1139762 890032 -67019 -738020
34221 -738020 -678349 -363965 -209033 -3686 431542 755200 657137 357064 176794 53393
34211 53393 -187360 -444963 -522669 -390544 -82592 358476 717502 734647 483071 271711
34201 271711 165858 20243 -55600 202432 650220 853329 797894 876477 1124900 1136428
34191 1136428 823131 575714 541982 449334 288752 429760 853027 1024488 789350 649518
34181 649518 870761 1058925 934474 781344 789706 710152 528804 708735 1332902 1772247
34171A772247r7544j49583J84717Q3520m57354o07153j87754Q8051p3840j78376
34161C76931K1694K02526K60818M07655M53880K6342n18380m45387J17186L45617
34151A248882P7629r6719l3654j50579l69098j67087K77571K30201k42812l13403
34141D60931J08323K09540k18450m23646r7606J62146J01458K19827N53713L61860
34131A438096m64404r20022m33080K24324K34696n7027N6462M70801O00980K84616
34121A435442j85588m75682l69654L1353K15554r6648l75407o3736L71503J54169
34111F41306l62253k22330L87249L79073k93136n07488N4060M10392R4838j18549
34101D63162K04165L69249k7972l07881k1388K26788l0093k91871j21590J09690
$$ plain form
34171 1772247 1674703 1525120 1709837 1793357 1336003 728850 541096 629147 555307 376931
34161 376931 398625 601151 861969 1269624 1723504 1749846 1231466 786079 903265 1248882
34151 1248882 1326511 1229792 1196138 1045559 676461 509374 786945 1017146 774334 460931
34141 460931 569254 778794 560344 136698 39092 201238 302696 522523 1076236 1438096
34131 1438096 973692 53670 -379410 -155086 79610 22583 79045 549846 1150826 1435442
34121 1435442 1249854 774172 404518 435871 651425 554777 179370 115634 487137 641306
34111 641306 279053 56723 443972 823045 529909 22421 76481 486873 581711 463162
34101 463162 667327 1036576 1008604 700723 679335 906123 876030 584159 462569 572259
34091E72259J08684K01210M61616M11707N6035N1728M17841L33474l37062o63509
34081A613983k81003K930k29001k96761J13740K86936l4952l4960N41106O91880
34071B373898k9170n75681k43263J16256k19057m86303K5349N41786K21201l13508
34061A411508j93131J54491k03k78453p8718J84855k0549k36239O918J45467k88444
34050H07502n64638j4150O40856M68621j29048k76003r2359j24294k05915j7042
34040D93530R6562j22509j86804J31436J84034k93145m85392L9023M59338K24336
34030E40409M9060M05087N19174l4737l14753K33677O05087O3914n02302l50459
34020A214157k54565p27994p29977L02801J022914M58206j81059K20086N85388
$$ plain form
34091 572259 680943 882153 1343769 1755476 1811511 1863239 2281080 2614554 2277492 1613983
34081 1613983 1332980 1335910 1106909 810148 923888 1210824 1175872 1140912 1682018 2373898
34071 2373898 2344728 1769047 1525784 1642040 1422983 936680 962029 1503815 1725016 1411508
34061 1411508 1218377 1372868 1372665 1094212 1015494 1200349 1179800 943561 950479 1095946 807502
34050 807502 242864 228714 869570 1338191 1209143 933140 840781 716487 510572 493530
34040 493530 590092 467583 280779 412215 596249 303104 -182288 -143265 316073 540409
34030 540409 589469 994556 1513730 1478993 1164240 1397917 2003004 2066918 1564616 1214157
34020 1214157 959592 231598 -498379 -195578 827336 1285542 1104483 1324569 1909957
34011A909957j70312q64601j93383P40824M28325l09691n0244M93955L6214o37363
34001A383681k30644M30513J7142o06605o1486P16909J85912p62811m12377N67918
33991A228152N06865r9132J59563O30218J1774p14395j2071J011588M82809o47611
33981B557760l65810N71607K18705o67600j67760Q45166L08835q96054n63227
33972A841622N16839J47019q34031k03149J058354N72214n81820J53644J562486
33963D233178P64962j009992n34126J104682M97413j301990o77796J305588P81984
33954E163903j136920k79005K097015J247561j600889j015606K136653K048107
33946H660819o19917J68614L439040K422220j385105M66934O674469O959636K114143
$$ plain form
34011 1909957 1739645 875044 681661 1422485 1850810 1541119 1490875 1984830 2021044 1383681
34001 1383681 1153037 1583550 1600692 994087 932601 1649510 1835422 1072611 660234 1228152
33991 1228152 1735017 1635885 1795448 2425666 2437440 1723045 1710974 2722562 3205371 2557760
33981 2557760 2191950 2763557 2982262 2314662 2146902 2992068 3300903 2404849 1841622
33972 1841622 2358461 2505480 1671449 1468300 2526654 3098868 2517048 2670692 4233178
33963 4233178 4998140 3988148 3454022 4558704 5056117 3754127 3076331 4381919 5163903
33954 5163903 4026983 3747978 5844993 7092554 5491665 4476059 6612712 8660819
33946 8660819 8040902 8209516 11648556 14070776 12685671 13152605 19827074 26786710 28900853
33937B8900853M336374J2977001J3118562P800006K3639036O3735781Q1646278
33930B36153891L6072071m3799531q5843958o3891177k1935610o369465j2306978
33923C8079243j2015108k801577l58397n474957n545741L99458J850445k386056
33915A1747310l135486J238937K730269n71061j393124K641536M901115K648819
33907B0808315K779254R921186J7282296J4975900K537084j1164522j7476946
33900C9662567j4710838p720249k861311k360814l247261k363605o61581n94502
33892E142406j566884j290297j7288K21034n03277m55641K60282O7577q40611
33883A017301q62282p7542N2718m37189l24436J87851l4234n62325j70275N75289
$$ plain form
33937 28900853 33237227 46214228 59332790 67132796 90771832 154507613 236153891
33930 236153891 272225962 228426431 142582473 78691296 56755686 50386221 38079243
33923 38079243 26064135 23262558 22904161 17429204 11883463 12282921 14133366 11747310
33915 11747310 8611824 9850761 12581030 12009969 10616845 13258381 18159496 20808315
33907 20808315 23587569 33508755 50791051 65766951 68304035 57139513 39662567
33900 39662567 24951729 17231480 14370169 12009355 8762094 6398489 5736908 5142406
33892 5142406 3575522 2285225 2267937 2488971 1985694 1530053 1790335 1857912 1017301
33883 1017301 155019 77477 130195 -306994 -631430 -443579 -477813 -1040138 -1210413 -635124
33873f35124K54584n83436l59466M89053L16375n29723l41063O25786N51683n17845
33863g29176p15747K70143Q15407L88833J38697L46244L2293p10485o33281J87073
33853f09999L17411l56414m34795K73886L86438l42391m89283L23853O52525j29868
33843d08637p24644k70705K95960J36357j44309N2183K16875n6254k60889j08697
33833a272760q0204k68737n7827N46664O55789M5178m00131k20144n669r7110
33823a154951l0237L10177L28166q5207k79785j06885j44859l89912j29200N50743
33813a131950O04278j68652o03645l3919O72891N90883M5613k20634j47420k388
33803c94943J69748K49143L832l26800k33072J16356N1353l81541m24610N5810
$$ plain form
33873 -635124 -380540 -963976 -1323442 -834389 -518014 -1047737 -1388800 -763014 -211331 -729176
33863 -729176 -1444923 -1174780 -359373 29460 168157 514401 546694 -163791 -797072 -609999
33853 -609999 -292588 -649002 -1083797 -809911 -423473 -765864 -1255147 -931294 -278769 -408637
33843 -408637 -1133281 -1403986 -1108026 -971669 -1115978 -1063795 -846920 -903174 -1164063 -1272760
33833 -1272760 -1352964 -1621701 -1679528 -1132864 -477075 -431897 -832028 -1052172 -1057841 -1154951
33823 -1154951 -1185188 -875011 -546845 -632052 -911837 -1018722 -1163581 -1553493 -1682693 -1131950
33813 -1131950 -527672 -696324 -1299969 -1333888 -660997 -70114 -24501 -245135 -392555 -394943
33803 -394943 -225195 23948 27780 -299020 -532092 -415736 -364383 -745924 -1170534 -1114724
33793a114724L51522J76664J9167P5314j1792j95493K403M04613K94955k15702
33783b13073k40788K69652L61849j79275l80228J59053M86132o8020p60529o93191
33773a258418j07050L03810M28151M33876K67106J0292j2392J23606k9156l85551
33763b25726l50344O6420J75274j49641k60064K123J8629l36487l88376J6563
33753a431629J64012j26913r0905M69238O33359J2235m03003J12394P57938N63895
33743F60621o9566k16017Q0920J64438p6876l01797m01462l74873o8727L90556
33733b12783M92492J22061k08899k45760l08161m25016j36695M46543M77440k09404
33723b08182o15788j48047M28467L25845m6309k0491J65574L7978j60687p1478
$$ plain form
33793 -1114724 -763202 -586538 -567371 -492057 -503849 -699342 -696939 -292326 2629 -213073
33783 -213073 -453861 -184209 177640 -1635 -381863 -222810 263322 195302 -565227 -1258418
33773 -1258418 -1365468 -1061658 -633507 -199631 67475 77767 65375 188981 159825 -225726
33763 -225726 -576070 -509650 -334376 -484017 -744081 -741958 -723329 -1059816 -1448192 -1431629
33753 -1431629 -1267617 -1394530 -1485435 -1016197 -382838 -370603 -773606 -661212 96726 660621
33743 660621 591055 375038 455958 620396 543520 241723 -159739 -534612 -603339 -212783
33733 -212783 279709 401770 192871 -52889 -361050 -786066 -922761 -476218 1222 -208182
33723 -208182 -823970 -972017 -543550 -217705 -264014 -284505 -118931 -80953 -241640 -313118
33713c13118J6836j72852k49476O1619K52865p1339m03138k01993J96432K82041
33703f02123K18636K76346K08227r7551j62353J88432L40074j5668k53811j1584
33693H8625N0169m70584p82356k51662L89505L10592K4914L32349P86408N63909
33683A041869J8191m1344J11628k62528q34633p33461j08037K22826K24036L85512
33673B4059M65521q3836p95326p26288p0433J51904j92049l15811m3999J3384
33663a572874k15473j01922M34777P16870M66653J21592o1960k25278k51218R7722
33653e91111M29939J39454m73870n35121p201K86956N4708j25418P0476K63680
33643d87508J85406L3396r0059k89012m05867k04637P4542J01124J39825M92810
$$ plain form
33713 -313118 -296282 -469134 -718610 -656991 -404126 -475465 -878603 -1080596 -884164 -602123
33703 -602123 -383487 -107141 101086 3535 -158818 29614 369688 354020 100209 88625
33693 88625 138794 -331790 -1114146 -1365808 -976303 -665711 -640797 -308448 477960 1041869
33683 1041869 1060060 1018716 1130344 867816 33183 -700278 -808315 -585489 -361453 24059
33673 24059 489580 405744 -389582 -1115870 -1186303 -1034399 -1226448 -1542259 -1586258 -1572874
33663 -1572874 -1788347 -1890269 -1455492 -738622 -271969 -150377 -212337 -437615 -688833 -591111
33653 -591111 -161172 -21718 -495588 -1030709 -1037910 -750954 -696246 -821664 -751188 -487508
33643 -487508 -302102 -268706 -358765 -647777 -1053644 -1258281 -1183739 -1082615 -942790 -449980
33633d49980O41366K3495o94474l96791O68671J214184R01491N63439M94763R6366
33623C062530o25276q07676l41114j97474o70787p84338p4289M85487J35655m16754
33613b34036l18165L6893n5686k87660l9788L93141L51958j0945r1083J00345
33603a55026J18866m0006n2532M9004R203q4155J9640K01364J45408j24955k94150
33592b07339j81554J36915M26623L81385p2662n00286m09819P315J46226j9122
33582b92318M7504L80340L62906j32754m06602j10398J67034j3469j89259N6881
33572a30135K72451r540l69124k53347M7792J0116j48155K7471K68743N4991l47337
33561e76074k33402L90373Q23143O72921J58390l91300p06534n01516J25900M88379
$$ plain form
33633 -449980 191386 214881 -479593 -876384 -207713 1006471 1907962 2471401 2966164 3062530
33623 3062530 2437254 1629578 1288464 1090990 420203 -364135 -438424 47063 182718 -234036
33613 -234036 -552201 -515308 -570994 -858654 -898442 -505301 -153343 -164288 -255371 -155026
33603 -155026 -36160 -76166 -128698 -79694 -70491 -154646 -135006 66358 211766 86811 -207339
33592 -207339 -388893 -251978 174645 556030 483368 -16918 -426737 -419422 -273196 -292318
33582 -292318 -244814 135526 498432 365678 -40924 -151322 15712 2243 -187016 -130135
33572 -130135 142316 132776 -236348 -489695 -441903 -431787 -579942 -552471 -283728 -228737 -576074
33561 -576074 -809476 -419103 404040 1076961 1235351 844051 137517 -363999 -238099 250280
33551B50280J59263k80303p2426M63169L92255l09439o84178k82768K23211J63697
33541B2761k17367l61047k53131k02668k06865m3443K25933K83364M6872j69336
33531h74927o2418K41518L10822m0482m56207m47935k6845L28062L32150K02400
33521d93862K06291K47055J06459j68944l52302l15772p4139K43698L79577J80898
33511d1041q3157k812L07158K98966j25037m02605k28856l8284j83912l07958
33501h07538q7231M9035l03484n92601r6319P35187P95064M9526l62506R6370
33491e24497N66644K12372m75900m96406J52060N71977L06640j68019k84915j07901
33481b47945j9959j09330j71755j22684r2998j35339r3170J33755L59989L14899
$$ plain form
33551 250280 409543 129240 56814 519983 912238 602799 -81379 -364147 -140936 22761
33541 22761 -194606 -555653 -808784 -1011452 -1218317 -1261760 -1035827 -752463 -705591 -874927
33531 -874927 -937345 -695827 -385005 -425487 -881694 -1329629 -1356474 -1028412 -696262 -493862
33521 -493862 -287571 -40516 65943 -103001 -455303 -771075 -845214 -601516 -221939 -41041
33511 -41041 -124198 -127010 180148 479114 354077 -48528 -277384 -315668 -499580 -807538
33501 -807538 -894769 -845734 -1149218 -1741819 -1838138 -1102951 -307887 -258361 -620867 -524497
33491 -524497 42147 254519 -221381 -717787 -565727 6250 312890 144871 -140044 -247945
33481 -247945 -267904 -377234 -548989 -671673 -764671 -900010 -993180 -859425 -499436 -184537
33471a84537L194k88703l24004j26785J17468K50722K42527J92674K01950J98115
33461B82621K6511k18316k06533J01726K61575q746l19581k16666K0615j68820
33451d45614n99025n57701m434L25640J47757O1028M36339P32225M30034r0223
33441D36026k34206j47910k96702n55534m49633j3652K64542J99857N0584J6606
33431g30022N5753R7346P8794q4835k76313j57877L16244O56193M55547l1040
33421C79790k90913k41949j36228o1951N0388J56811J93505K19579K00620l1929
33411D37723l56835l39263N1678K20757j35552m40943j17714M67243N85904K34971
33401F07969n8355j39002k11922k40560p8606N1947j06157k89483j40195J19614
$$ plain form
33471 -184537 -181343 -470046 -794050 -920835 -803367 -552645 -310118 -117444 84506 282621
33461 282621 309132 90816 -115717 -13991 247584 238838 -80743 -297409 -276794 -445614
33451 -445614 -1044639 -1602340 -1606774 -1281134 -1133377 -1072349 -636010 96215 526249 436026
33441 436026 201820 53910 -242792 -798326 -1247959 -1261611 -997069 -797212 -746628 -730022
33431 -730022 -674269 -576923 -498129 -582964 -859277 -1017154 -700910 -44717 410830 379790
33421 379790 88877 -153072 -289300 -351251 -300863 -144052 49453 269032 469652 437723
33411 437723 80888 -258375 -206697 14060 -121492 -562435 -680149 -212906 372998 607969
33401 607969 549614 410612 198690 -41870 -120476 -68529 -174686 -464169 -604364 -484750
33391d84750J21302R7676M22381P61689N71472J31071J01613K95041k8034p46354
33381A243107r31680l88792J5334j89233l85222m6929L80186L28505K5957m2051
33371I182L9663p1063k86211k58948L8357L05143K94503q57l37351l40129Q0366
33360e27345M68039L51485o6584k30867j04270r5859k30720j45509J03495N5008
33350d23127k45979k09488K41938M50100J40044j06062J17000L65038J97030o6007
33340D60487k794J59483N9372j25306j29937j94123n50286p74192l42764M52327
33330i87733P92840L87375k58226n12528j99952L57912O19074K97482k79492n13015
33320b96263k85229q301Q9731J85110K79670P1809l72663n14212k14478j3509
$$ plain form
33391 -484750 -363448 -265772 156609 918298 1489770 1620841 1722454 2017495 1989461 1243107
33381 1243107 311427 -77365 -62031 -251264 -636486 -683415 -303229 25276 51233 9182
33371 9182 48845 -22218 -308429 -567377 -529020 -223877 70626 69769 -267582 -607711 -527345
33360 -527345 -59306 292179 225595 -5272 -109542 -205401 -436121 -581630 -478135 -423127
33350 -423127 -669106 -878594 -636656 -186556 -46512 -152574 -35574 329464 526494 460487
33340 460487 457693 617176 676548 551242 421305 227182 -323104 -1097296 -1440060 -987733
33330 -987733 -194893 192482 -65744 -578272 -778224 -420312 198762 496244 216752 -296263
33320 -296263 -581492 -589793 -500062 -314952 -35282 36527 -336136 -850348 -1064826 -1078335
33310a078335j70077j94650J75783L50778q8054m90484j31958M98651M04062l07599
33300a031883n55566P9414P99148P71265J28753m16876m47267j14685J57747J29271
33290e00679j3238N4178K48828J67337j94035l11528L2579L50833K46103K3445
33280A03823M5141P0675j79630l66633j20261K07085J08137j86288j39624J49232
33270c08343K15172Q6949Q2197P7234j86982l89217j06965K79115J18056l13430
33260d46214j91854M10990N77768N0299m24194l94145k66323l01529j03931M50974
33250f38159P12894K47640l93723m63667k5740L18387K62369n2395l43572l43415
33240g19381J0486L63740L05874N403k2382J85016M3732n27749q18023l92767
$$ plain form
33310 -1078335 -1248412 -1443062 -1267279 -916501 -1004555 -1495039 -1626997 -1128346 -724284 -1031883
33300 -1031883 -1587449 -1508035 -708887 62378 191131 -225745 -673012 -787697 -629950 -500679
33290 -500679 -513917 -459739 -210911 -43574 -237609 -549137 -516558 -165725 80378 103823
33280 103823 148964 219639 40009 -326624 -446885 -239800 -131663 -317951 -457575 -308343
33270 -308343 -93171 -6222 75975 153209 -33773 -422990 -529955 -250840 -132784 -446214
33260 -446214 -638068 -227078 350690 400989 -23205 -417350 -683673 -985202 -1089133 -638159
33250 -638159 74735 322375 -71348 -535015 -560755 -242368 20001 -32394 -375966 -719381
33240 -719381 -708895 -345155 -39281 -33878 -56260 128756 172488 -355261 -1173284 -1566051
33230a566051K34902M03758J71577l7638j09108j20823k1878J57761J86990O1022
33220f39488J09141L74102L99598q124l49570j94329J41781J67683r009q926J33283
33209A16142J64581J48896K52838K80520l2194m67497n63660k46823J76541M74465
33199C03809N73744M05673L2881k64733l34046l46721m09989l27126l3479J48834
33189b51153N2477O170K07686K57231j36551m84343k37797K43161K39955j32282
33179b35446j64687K00996L08567l8151k55967l620L01406K63846R4336P2844
33169E44124M7313j38419k31453j6211K21744J13308j91304k48806J4602K26860
33159C41758R8619k32624m01118k26894R4277K13866N6158q8609P504J74034J50140
$$ plain form
33230 -1566051 -1331149 -927391 -755814 -793452 -902560 -1023383 -1045261 -887500 -700510 -639488
33220 -639488 -530347 -156245 243353 235229 -114341 -308670 -166889 794 -8215 -17141 116142
33209 116142 280723 429619 682457 962977 930783 463286 -100374 -347197 -170656 303809
33199 303809 877553 1283226 1316107 1051374 717328 370607 -39382 -366508 -399987 -251153
33189 -251153 -198676 -192506 15180 272411 135860 -348483 -586280 -343119 -103164 -235446
33179 -235446 -400133 -199137 109430 71279 -184688 -188308 113098 376944 471280 544124
33169 544124 591437 453018 221565 205354 427098 540406 349102 100296 114898 341758
33159 341758 440377 207753 -193365 -420259 -325982 -112116 -55958 -144567 -137063 36971 187111
33148A87111K7480M5558J05751o6864l51071l24945K8834K27437M1891j39666
33138b18484N5217M04458M57452J68288j56101l14809l21584k18111n1124O0387
33128a34411M2116k0606j6074M0048P7349P0714j0638j96269l72626l28826n2302
33117i01525J96669K21069J22654P7097N7018n1282j93079j97087k8556J44301
33107e52721J31783p3465k59336j95125P4959K34891J07708q2881n6745R8987
33097e71945J54746J97349M16479N64753K25098l69006m55679J13675N25922J73314
33087I74706m36760m59805Q5371N05998M72690K17550p7175m26710o73669n78700
33077c96504k70125q0455L0391L42004O87684N37323j16269n74192l83414P0588
$$ plain form
33148 187111 214591 260149 365900 299036 -52035 -376980 -348146 -120709 -78818 -218484
33138 -218484 -163267 241191 698643 866931 710830 396021 74437 -143674 -194798 -134411
33128 -134411 -92295 -112901 -128975 -88927 -11578 59136 48498 -147771 -520397 -849223 -901525
33117 -901525 -704856 -483787 -361133 -284036 -227018 -278300 -471379 -668466 -697022 -552721
33107 -552721 -420938 -494403 -753739 -948864 -873905 -639014 -531306 -614187 -670932 -571945
33097 -571945 -417199 -219850 196629 761382 986480 617474 161795 275470 801392 974706
33087 974706 537946 78141 163512 669510 1142200 1359750 1282575 855865 182196 -396504
33077 -396504 -666629 -747084 -716693 -374689 312995 850318 734049 159857 -223557 -152969
33067a52969K39064J75293J98022K07288j00582n43944n65086m5619M56808M31411
33057B99686L9117j87825m8017J74842J70463l0736j93700k03842j30673n8653
33047a69338k766L4362N6180J10357J99896J92968Q871j48825k6457K08918J10855
33036E75021l28805n45611k25911J96933K49844J66184L73575O26671L79313k03139
33026A264075m22770j92855j55386n36714p33217l44041J50932J89535l6250m7444
33016h64135J39642K13219J24006k5129k46839m02532j26185N18594Q04664L21007
33006D56312l09675l30394L4472J20719n606J43076L71883J03311l98216k76093
32996i0211M08428O02766n6322o35325m09254R7293J73238N1872K16218L91553
$$ plain form
33067 -152969 86095 261388 459410 666698 566116 22172 -542914 -588533 -131725 299686
33057 299686 338803 150978 102961 277803 448266 417530 223830 19988 -110685 -169338
33047 -169338 -172104 -137742 -81562 28795 228691 421659 430530 281705 255248 464166 575021
33036 575021 246216 -299395 -525306 -328373 -78529 87655 461230 1087901 1467214 1264075
33026 1264075 841305 648450 493064 -43650 -776867 -1120908 -969976 -780441 -816691 -864135
33016 -864135 -724493 -511274 -387268 -412397 -659236 -1061768 -1187953 -669359 135305 456312
33006 456312 146637 -183757 -149285 -28566 -34172 108904 480787 584098 185882 -90211
32996 -90211 318217 920983 864661 229336 -179918 -82625 90613 142485 358703 750256
32986G50256J15025l00704k75032J9770J5668k30202k35106l3137m4684j98317
32976d16463p3335J81465j2614n77638p38678k37536K64857K71878J27534K16019
32966i94511K42453j19967m63433k15224L85338N58673Q3945m50192m65619n449
32956a443986N02520P24864N99523L03070J07279J00709O6924j95562n05981m92770
32946b33410j25527K07976K05220k370j05946m1008l586j36091l33821l62009
32936i30572j15977K30553L50430R9473k78474l82058j11128K21918K96897J64732
32926d54206R3158J53245J75921Q8582M2937J30500J90399M8542k14580m00156
32916a45658m56197m26225k70840L2251L15890M01042L62321L55173K84777j1902
$$ plain form
32986 750256 865281 564577 289545 309315 324983 94781 -140325 -173462 -218146 -416463
32976 -416463 -489798 -308333 -320947 -898585 -1637263 -1874799 -1609942 -1338064 -1210530 -994511
32966 -994511 -752058 -872025 -1335458 -1550682 -1165344 -606671 -522726 -972918 -1438537 -1443986
32956 -1443986 -941466 -216602 382921 685991 793270 893979 960903 765341 259360 -233410
32946 -233410 -358937 -150961 54259 51889 -54057 -95065 -98651 -234742 -568563 -930572
32936 -930572 -1046549 -815996 -465566 -366093 -644567 -1026625 -1137753 -915835 -618938 -454206
32926 -454206 -361048 -207803 -31882 56700 99637 230137 420536 469078 254498 -145658
32916 -145658 -601855 -1028080 -1298920 -1266669 -950779 -549737 -187416 167757 452534 440632
32906D40632l34497l07376j1786N6189k23418l54898j8774L85042L50612J6430
32896a844j35561k0859P3926L8642M476Q470k086L4648J34303Q4974j91487l29490
32884c01888l7912L01975J30435l62327m59355j9761L30025J83176j35430k20020
32874e91082j31927m8236Q6212K59915K24816p0295k90219k26716r2218n4508
32864i34258O0729L02152L12812q0395m29240k83218J09699K17620M9093L1102
32854f43904K55765L80392K06784q8539k81938l07795j72170M0773J38260N3981
32844d18391M716J59732L20681K31125K0317k1249N6706n551j76844k10354j35826
32833a74938j93341k91749n3130M98789P86425M38694j82581m84076l69096j69570
$$ plain form
32906 440632 106135 -201241 -213027 -156838 -380256 -735154 -753928 -368886 -18274 -1844
32896 -1844 -137405 -158264 -84338 -45696 -41220 -32750 -34836 -188 134115 219089 27602 -301888
32884 -301888 -339800 -37825 92610 -269717 -729072 -748833 -418808 -235632 -371062 -591082
32874 -591082 -723009 -771245 -685033 -425118 -200302 -270597 -560816 -787532 -879750 -934258
32864 -934258 -873529 -571377 -258565 -338960 -768200 -1051418 -941719 -724099 -675006 -643904
32854 -643904 -388139 -7747 199037 110498 -171440 -479235 -651405 -610632 -472372 -418391
32844 -418391 -413675 -253943 66738 297863 318180 296931 353637 348086 171242 -39112 -174938
32833 -174938 -368279 -660028 -713158 -214369 572056 1010750 828169 344093 -25003 -194573
32823a94573p4671K4989J97349K94310J94839K4014j5340M7840j8717k72122m11752
32812b03834j54457K96014M23261P3306l24156l30823l1990J97054K18572J64651
32802C27598J10193L467j52609k85951l71638l88951k53163L5927K89866L61508
32792c23753L60244M46455N41469M52570J68768j62961m18722m73441k00805K58411
32782F48235M49566J41436k81739l14528l5239Q6221o2327j45304J0846J73296
32772F70463J04043j65693m83639o70940n09252p648L64863J46965m17623o04344
32762a572805j65908L97503N89926M48515K04667o3280k29454o7344L13170M06459
32752B61449J3781l76236k59408J75618L94819K74574Q5067m6812j98573l14733
$$ plain form
32823 -194573 -269244 -244255 -46906 247404 442243 466257 450917 498757 480040 207918 -203834
32812 -203834 -358291 -62277 360984 434290 110134 -220689 -252679 -55625 162947 327598
32802 327598 437791 441258 288649 2698 -368940 -757891 -1011054 -975127 -685261 -323753
32792 -323753 36491 482946 1024415 1476985 1645753 1482792 1064070 590629 389824 648235
32782 648235 1097801 1239237 957498 642970 607731 693952 631625 486321 497167 670463
32772 670463 774506 608813 125174 -545766 -1055018 -1062666 -697803 -550838 -968461 -1572805
32762 -1572805 -1738713 -1341210 -751284 -302769 -98102 -161382 -390836 -458180 -145010 261449
32752 261449 275230 -101006 -360414 -184796 210023 484597 569664 522852 324279 9546
32742I546k56402j31261j65132k61234r2006L24169N38333L04329n1765j18497
32732A00080K5041K3120j48020j58660J14572L74483L53427J57538k5779k56856
32722E58946n77102o84333l21030J76113K54601J6490P4966M68851M74450j82951
32712B59001o93434l22565M28066N85110J54550q1452P3603N2003l45898n92274
32702d83290l62160n601J46656K31992L46951K60982m8032j80825K0367J47154
32692G4194q7211l49675k48138P1086K55990K61711J83003j9310k74773k72082
32682d05205P9002M04522L93899K08941Q6583n0132k65050l24389j09715Q0659
32672I9115J4201q2567J4574Q4504j03515l04664k02881M7436J32630J06177J63344
$$ plain form
32742 9546 -246856 -378117 -543249 -804483 -896489 -572320 -33987 270342 218577 100080
32732 100080 125121 148241 221 -158439 -43867 330616 684043 841581 815802 558946
32722 558946 -18156 -702489 -1023519 -847406 -592805 -576315 -501349 -32498 441952 259001
32712 259001 -434433 -756998 -328932 256178 410728 329276 402879 454882 108984 -483290
32702 -483290 -845450 -851051 -704395 -472403 -125452 135530 87498 -93327 -72960 74194
32692 74194 -13017 -362692 -610830 -539744 -283754 -22043 160960 141650 -133123 -405205
32682 -405205 -326203 78319 472218 681159 767742 717610 452560 128171 18456 99115
32672 99115 113316 30749 45323 129827 26312 -278352 -481233 -433797 -301167 -194990 -31646
32661c1646K10961J09051L5005J58902K44059R749l74711n54561m68201k18055
32651h79447J82842N84200O31483L01629N2514P1966m8336m52955n45522J334
32641a00292M82640K14813l19070l17032k1259j31481l92542m5261O46469O69733
32631F86718n2692n57055m26600k17723k10765q659M07925M59116J00108K802
32621A83175K77719K02887l79640o20717j33557L02395J40209j7581L32675N75760
32611H63325J40177l45225j19264L53206K19220k81962l42978k3338K2233j76572
32601C08822p6334K14519R2967l57097m26697n540K44870O800k80781k32645J7809
32590d93307K58046M23343L33446j43617o30935n84057j10884J79635J32290J60847
$$ plain form
32661 -31646 179315 288366 323371 482273 726332 736081 361370 -193191 -661392 -879447
32651 -879447 -696605 -112405 519078 820707 873221 945187 896851 443896 -101626 -100292
32641 -100292 382348 597161 278091 -38941 -60200 -191681 -584223 -629484 16985 686718
32631 686718 634026 76971 -349629 -567352 -778117 -786776 -378851 80265 180373 183175
32621 183175 460894 663781 284141 -336576 -470133 -167738 -27529 -45110 287565 863325
32611 863325 1003502 658277 539013 892219 1111439 829477 486499 463161 485394 308822
32601 308822 232488 447007 539974 182877 -243820 -249360 -4490 2310 -278471 -511116 -493307
32590 -493307 -235261 188082 521528 377911 -253024 -837081 -947965 -768330 -636040 -475193
32580d75193L91288M33788J39213j20294j23479j12565k15713j69424J11880K42880
32570A02381l6558m15465m58686j47990K41535M75537M13832O8973k66192k84504
32560c07137j13753j16998k45180r3936L47809N95067M46885K51338J85873o1793
32550H88175n63406p69688l50993J56785J35398j60350r6545K52086K63111j48169
32540c93596l52624K9717N96820P55838M12888q2538l59949k80763k1908M4099
32530C47984k19028m41268k13873K38244K90540j37394l92876o2979L68907K57563
32520C5820j94868k42639K54418O16965L59392j49509k98521o1518J54678J66053
32510F40271P9436q8435l81606n80285l85707N6700K72848J58840R8012K67995
$$ plain form
32580 -475193 -83905 349883 489096 368802 245323 132758 -82955 -252379 -140499 102381
32570 102381 65823 -349642 -808328 -956318 -714783 -239246 174586 243559 -22633 -307137
32560 -307137 -420890 -537888 -783068 -877004 -529195 65872 512757 764095 949968 888175
32550 888175 324769 -444919 -795912 -639127 -503729 -664079 -760624 -508538 -245427 -393596
32540 -393596 -746220 -716503 -119683 636155 1049043 966505 606556 325793 303885 347984
32530 347984 128956 -312312 -526185 -287941 2599 -134795 -527671 -590650 -221743 35820
32520 35820 -159048 -401687 -147269 469696 829088 679579 381058 319540 474218 640271
32510 640271 719707 631272 249666 -330619 -716326 -659626 -386778 -227938 -129926 138069
32500A38069L43367J13073j21574j06319j00975l31621m23149K3853O16366O18638
32490G69728N2634l50303k54237p3116j37473j92761K3729K74899K32230j5062
32480C30268j79405k00749j83553j50336p3992L3958J82252L38447K99799m9515
32470C47174l61505j66401L45806M44329o1805m75494k74890R6020J4950k86876
32460c78692j75062K72452L91064L4878k15469j5905K44690J22717k37580m24522
32450c81429l36272j41174O6979K79619L97400L01000M2524j99068l18377l27914
32440f16712k44421n4519J87916L26284K52233O9925j0612J6493q2010l60879
32430e16302m42919M685O57628Q29013L95014m4804o1139N5323r7939l72241m22414
$$ plain form
32500 138069 481436 594509 472935 366616 265641 -65980 -489129 -465276 151090 769728
32490 769728 822362 472059 217822 144706 7233 -185528 -161799 113100 345330 330268
32480 330268 150863 -49886 -233439 -383775 -457767 -423809 -241557 96890 396689 347174
32470 347174 -14331 -180732 165074 609403 547598 72104 -202786 -106766 -91816 -378692
32460 -378692 -553754 -281302 109762 144640 -70829 -86734 157956 280673 43093 -381429
32450 -381429 -717701 -858875 -791896 -512277 -114877 186123 228647 29579 -288798 -616712
32440 -616712 -861133 -915652 -727736 -401452 -149219 -79294 -89906 -73413 -155423 -516302
32430 -516302 -959221 -954536 -296908 532105 927119 882315 821176 876499 778560 406319 -16095
32419a6095l09692k54825j28894K40548N16351K56003k62122k99513K41596O38803
32409F22160M12857l5520j17394J14277J82239r3585m33970m90054j69958L02491
32399B93543N36740L19844j30201m02768l68978k16334q0718N4964J41991R9780
32389B47863M9147J40177J93211l7567k93926r7248L62061L29119l17307p25962
32379a50432l33954K48660J99587k72463l65455O6320M61226M73092K21561j71026
32369C77116n79336n86419M4931P07948N57062k17030n39899p645N50249L65561
32359F72538j88867l04922O9038L20080R6170l69279o57130n25841m3270M09365
32349e22118M67673K50039J83996K82835R5366m19694n90389l5515N96503M95398
$$ plain form
32419 -16095 -325787 -580612 -709506 -468958 47393 303396 41274 -258239 -16643 622160
32409 622160 1035017 999497 882103 996380 1178619 1085034 651064 161010 -8948 293543
32399 293543 830283 1150127 1019926 617158 248180 31846 -48872 6092 148083 247863
32389 247863 297010 437187 630398 592831 298905 201657 563718 892837 575530 -150432
32379 -150432 -484386 -235726 -36139 -308602 -674057 -607737 -146511 326581 548142 377116
32369 377116 -202220 -788639 -743708 -35760 521302 304272 -235627 -243272 306977 672538
32359 672538 483671 178749 247787 567867 664037 294758 -362372 -888213 -931483 -522118
32349 -522118 -54445 195594 379590 662425 757791 338097 -252292 -287807 308696 804094
32339H04094j43589n00108l45394j35128r4354J793J80500J58543m3705m4337
32329a61685K13653L24512J17277q6575p7125m3469p1011N0617K71399J51523
32319F89116l64852o40853k60520K82277L33930M9891Q39J83810J23896k38427
32309A59107m48474k81113M784J74101K68953L08937J90816l8321j79949j99735
32299d0894k17308k04101n1963J02910M0051r0583O0323M00542M36769N2795k66845
32288B21696j72926P0021Q6679o1448j25046r4168o8383j2200P0123J4516j63078
32277b34214j21979K75375N89602L57444k06486m81482k68323O2852J67735P9694
32267B20218k3472p0717o8744m7958o1069r2750k8799J48559K53333J46389m7105
$$ plain form
32339 804094 660505 160397 -184997 -320125 -414479 -412686 -232186 -73643 -117348 -161685
32329 -161685 51968 376480 493757 407182 330057 286588 215577 266194 537593 689116
32319 689116 324264 -316589 -577109 -294832 39098 88989 89828 273638 397534 159107
32309 159107 -289367 -570480 -565696 -391595 -122642 186295 377111 338790 158841 -40894
32299 -40894 -258202 -462303 -514266 -411356 -371305 -461888 -401565 -1023 435746 488541 221696
32288 221696 48770 118791 205470 144022 18976 -75192 -143575 -155775 -85652 -71136 -234214
32277 -234214 -356193 -80818 508784 866228 659742 178260 -90063 -27211 140524 220218
32267 220218 196746 126029 57285 9327 -51742 -144492 -173291 -24732 228601 374990 327885
32256C27885j41978j45602j27284n0336N6623K1014j29937o8016K58904L33810
32246C35083j46702n70038j90873O20681P62495Q842o56101n08494k8845K9224
32236c44728k36393k65589j515J78886J62443J39154J51812R9119L1330L9717
32226d5764K4099p8779p0868J34788K13127n1157k57820J4781L81654J42359n29014
32215a22594p07586j17412M11463J91110l40509l72557Q9082L84745K27993l6726
32205c92991q6429n131J9796K266M3443J32097J56028K8187k00787l21209j58765
32194g83495J48119K33086j7344k57952j38874K16821M20335L44768J69684J5374
32184C50522j47056k59964j75511O7555K23700J62146J622j12932j54420j00579
$$ plain form
32256 327885 185907 40305 -86979 -137315 -80692 -59678 -189615 -257631 1273 335083
32246 335083 188381 -381657 -572530 48151 810646 819488 163387 -345107 -373952 -344728
32236 -344728 -581121 -846710 -848225 -669339 -506896 -367742 -215930 -116811 -85481 -45764
32226 -45764 -21665 -100444 -171312 -36524 176603 125446 -132374 -117593 264061 406420 -122594
32215 -122594 -830180 -947592 -536129 -345019 -685528 -1058085 -969003 -584258 -356265 -392991
32205 -392991 -479420 -484551 -464755 -462489 -419046 -286949 -130921 -102734 -303521 -624730 -783495
32194 -783495 -635376 -402290 -419634 -677586 -816460 -599639 -179304 165464 335148 350522
32184 350522 203466 -56498 -232009 -164454 59246 221392 223014 110082 -44338 -144917
32174a44917Q2683K71980K36171l4973k60410k41118r6372k53Q2374J98994J68764
32163B62923j67119n69833n96857j77892K60780L09087J6406k54222k59940o5426
32153a242093J09823J34713P9396J15723K90412M30594L45029R1981n9139N0647
32143C47086K74646L23777P5082l04667n17990m27940k05900j36871k53035k72935
32133a098747O306L86819N06071K95909n264k24377l70054m02011k08547J07176
32123a006719K28943O6166q4344L149J42507J00701L0734J87130M07666L14540
32113C90473m0959j90479M1761K67455J35665j53724j89234N2553K33235J43022
32103F89768r3910k54075k56203j72307j18993j35054j24411J7792K11998K73359
$$ plain form
32174 -144917 -62234 209746 445917 410944 150534 -90584 -186956 -187209 -104835 94159 262923
32163 262923 95804 -474029 -1070886 -1248778 -987998 -678911 -662505 -916727 -1176667 -1242093
32153 -1242093 -1132270 -997557 -918161 -802438 -512026 -81432 263597 355578 296439 347086
32143 347086 621732 945509 1020591 715924 197934 -230006 -435906 -572777 -825812 -1098747
32133 -1098747 -1092441 -705622 -199551 96358 91094 -133283 -503337 -905348 -1113895 -1006719
32123 -1006719 -777776 -711610 -795954 -792805 -650298 -549597 -518863 -331733 75933 390473
32113 390473 349514 159035 200796 468251 603916 450192 260958 313511 546746 689768
32103 689768 595858 341783 85580 -86727 -205720 -340774 -465185 -447393 -235395 37964
32093C7964K17794K60214L94279K66741k60036o84340m44309J93407L59637k07080
32083A34271p05538l46080N28876Q90342L94479k47867l16444K3178J44719q4572
32073D15364k15641J9380K93794J76163k49745n01028l23979L2947J90353R0409
32063g1983k6163J5220J28346J26267m1147k54527l63049l05390j38083P934L9518
32052h83057K2175J31120L90494N24260K44437k97829n67907k81697K06816L63151
32042a48037J65689L5079J38291J62123j11654l85554k72027J16377L30730J96224
32032B27241o3237k23752k51369j22837J92911N14577N23829J78774j97298l45814
32022D33025l40184l09706j87297O5340K38536J55778n235L5716K12339K24949
$$ plain form
32093 37964 255758 515972 910251 1176992 916956 232616 -211693 -18286 341351 134271
32083 134271 -571267 -917347 -388471 501871 896350 648483 332039 355217 499936 415364
32073 415364 199723 219103 512897 689060 439315 -61713 -385692 -352745 -162392 -71983
32063 -71983 -98146 -82926 45420 171687 130540 -123987 -487036 -792426 -930509 -922575 -883057
32052 -883057 -860882 -729762 -339268 184992 429429 131600 -436307 -718004 -511188 -148037
32042 -148037 17652 52731 191022 353145 241491 -144063 -416090 -299713 31017 227241
32032 227241 164004 -59748 -311117 -433954 -241043 273534 797363 976137 778839 433025
32022 433025 92841 -216865 -404162 -338822 -100286 55492 50257 85973 298312 523261
32012E23261M4282k1475J94410M44210L89598K6344l36845m37441l11790k17293
32002B97261l26078m98022m25133l9276L43538L93968J68652j5342o109P5091
31992c1450Q7928K9917l9901o2715N351R5833L4972j70840k01316J46337N31493
31981D25609M63813M4069j63900j0431M8996k11357l64183q3809K26954Q3421
31971D59182k33829j22504L10274L74650j02458n03500l73550l6485O110j88858
31961d10968k14858N7691L92834N29722L58635p5137n22551o32073l03707J62791
31951f57621M14547M07935K99899J55748m3267k20788k29359k3884K72038M22014
31941G97262K20387k48412n22645k27968L37679M60878k2815m59786l14890R3465
$$ plain form
32012 523261 567543 546068 740478 1184688 1574286 1600630 1263785 826344 514554 297261
32002 297261 -28817 -526839 -951972 -991248 -647710 -253742 -85090 -100432 -106541 -31450
31992 -31450 56478 86395 46494 -16221 -10870 84963 119935 -50905 -252221 -105884 425609
31981 425609 889422 933491 769591 759160 808156 596799 232616 148807 375761 459182
31971 459182 225353 102849 413123 787773 685315 181815 -191735 -228220 -222110 -410968
31961 -410968 -625826 -568135 -175301 354421 713056 637919 115368 -516705 -820412 -657621
31951 -657621 -243074 164861 464760 620508 577241 356453 127094 103210 375248 797262
31941 797262 1017649 769237 246592 18624 356303 817181 794366 334580 19690 113155
31931A13155J86278L471o0556l9418k26114m38898k19915K82348M01182O827k82060
31920b73700j26241N7854m3019o9129K47831M51231J18130l31841l10060o0564
31910c39508j66926m32322k03786L72060M58507m5149k32343L26256P84070K97574
31900H18433o40761r08578l23604K88270L71645K24200K84515M70468M29246O0776
31890A074610m03871o39823m64280q499L32941K97268O4031k1218N1246J1995
31880B94400j78952k41738n8422J07839L3487j28614j49749j05375j76846k66085
31870h70055j43560J15183K00563Q1973Q5168L35710M68461J56600l15394l76562
31860b61913K6289L46220K07665j20580k04904o7757j9852r3052k8742K35591
$$ plain form
31931 113155 299433 302904 242348 202930 -23184 -462082 -681997 -399649 1533 8360 -273700
31920 -273700 -399941 -342087 -385106 -454235 -206404 244827 362957 31116 -278944 -339508
31910 -339508 -506434 -938756 -1142542 -770482 -311975 -357124 -589467 -263211 520859 818433
31900 818433 177672 -730906 -1054510 -766240 -394595 -170395 114120 584588 1013834 1074610
31890 1074610 670739 30916 -433364 -441863 -108922 188346 252377 231159 282405 294400
31880 294400 115448 -126290 -184712 -76873 -43386 -172000 -321749 -427124 -603970 -870055
31870 -870055 -1013615 -898432 -697869 -615896 -530728 -195018 273443 430043 114649 -261913
31860 -261913 -235624 110596 318261 197681 -7223 -74980 -94832 -187884 -216626 18965
31850A8965M33695L56633P7272k46238n00062n10254j53834L12480L92073J8106
31840A98836k50813K1373N08151N83806J83091k28292l84223m36161m77701l48306
31830f30239k4891K08334J76176P9135J36834K35635J68228R265j6514Q5813Q8215
31819E15991j18296l78523m53500k24991K27060O29469O65270K71889k31066m40226
31809D63077k82610k4163R8038R0729L2727j21150m13280o51168n19030P556N13768
31798h05506N72546K49772j0448J0510O6342j03918l51233l57989j11722J36333
31788g05313K62190L22848L02284J33972m6374j1308J69195J90705K2029j9117
31778F21111J85781L13831J06021k31901l83050l62723l26111k22891K5303K44796
$$ plain form
31850 18965 452660 809293 886565 640327 140265 -369989 -523823 -211343 180730 198836
31840 198836 -51977 -30604 477547 1061353 1244444 1016152 631929 195768 -281933 -630239
31830 -630239 -655130 -446796 -270620 -191485 -54651 180984 349212 358477 341963 427776 515991
31819 515991 397695 19172 -434328 -659319 -432259 197210 862480 1134369 903303 463077
31809 463077 180467 156304 254342 345071 377798 256648 -156632 -807800 -1326830 -1319274 -805506
31798 -805506 -232960 16812 6364 16874 83216 -20702 -371935 -729924 -841646 -705313
31788 -705313 -443123 -120275 182009 315981 269607 258299 427494 618199 640228 621111
31778 621111 806892 1120723 1226744 994843 611793 249070 -77041 -299932 -274629 -29833
31768b9833K56475J91966K07511J06456l16358p32126o04751r686L95789K72869
31758b61688j5052m0905J20687J72725O0338r3040k24499k73477j27432J59212
31748e23131L13182K14973J05423J99202L06246J15659k87407m85432k68337J24268
31738a85354L11340J65655j17742k59401j86590q9271j42196k31953j18536J67934
31728f86114L30709K31566M6103p0504j73871k71683k03343L3007J54712L9813
31718e69605j9416J87947L57858J33207k60221l19850m8080Q5528q9877k27743
31708g70252o5985K04024K98536K12517R1752J3842J520K6160l5897k17618k77418
31697e18819j5993K86809J73876k57876m23148j28859J42103K0206k01835j12591
$$ plain form
31768 -29833 226642 418608 626119 732575 416217 -315909 -920660 -930346 -534557 -261688
31758 -261688 -276740 -317645 -196958 -24233 36105 -56935 -281434 -554911 -682343 -523131
31748 -523131 -209949 5024 110447 309649 615895 731554 444147 -41285 -309622 -185354
31738 -185354 125986 291641 173899 -85502 -272092 -361363 -503559 -735512 -854048 -686114
31728 -686114 -355405 -123839 -77736 -148240 -322111 -593794 -797137 -764130 -609418 -569605
31718 -569605 -589021 -401074 -43216 89991 -170230 -490080 -538160 -452632 -542509 -770252
31708 -770252 -836237 -632213 -333677 -121160 -29408 -15566 -14046 12114 -23783 -241401 -518819
31697 -518819 -534812 -248003 -74127 -332003 -755151 -884010 -741907 -721701 -923536 -1036127
31687a036127J87071L63355L71405L14865J34939j56721k58264k0436J91644L6928
31677A28659j95610m4877L14477L30908j8513k34447j54005j34243l12362l35948
31667f55961k5287K70924K55144J32556J76564K55759J34456q2660j51543r1467
31657B18485p6165j12574r5716k3074O2467J75950K60416J65365o4110j32125
31647C78919N1754J45466r9160l64239k21931J48074J87675j66833l53846j9162
31637c13283M66042N38222J73394j90735k73876j95880j51500j16215K3573K03921
31627A63663K20737K2587j79455j61844N3395K75040L70910L03782O7559k28616
31617I07758l33106j55226P698j46598m06686l08469J26013L93157K92335J51929
$$ plain form
31687 -1036127 -849056 -485701 -114296 200569 335508 178787 -79477 -99913 91731 128659
31677 128659 -66951 -111828 202649 533557 515044 280597 126592 -7651 -320013 -655961
31667 -655961 -681248 -410324 -155180 -22624 153940 409699 544155 461495 309952 218485
31657 218485 142320 29746 -65970 -89044 -26577 149373 409789 575154 511044 378919
31647 378919 430673 576139 476979 112740 -109191 38883 226558 59725 -294121 -313283
31637 -313283 152759 690981 864375 673640 399764 203884 52384 -63831 -40258 163663
31627 163663 384400 406987 227532 65688 119083 394123 765033 1068815 1136374 907758
31617 907758 574652 419426 427124 280526 -126160 -434629 -308616 84541 376876 528805
31607E28805J28681q8750n61282p16765j90912M75261N77492K51433P8590Q4201
31597E66754j01539l68483k72779O9675R6916k07625k83184n524J31997q508N1106
31586c31194M30413N43705J18159k83800k38335j36477l11327l09352K18633O36255
31576C36680K46273m74479n60168o0113J86666J475j7923K63219K89028n6571
31566A54087j58387J97842L70692k5869m09480j81872L04293L55155j6333k79517
31556C10611k40511j20419n2617j9724q0223k16990j72530J60476M21893K73001
31546B62967m7079j07098K4043m303j25170R195K90429K22934k12444m07552m5035
31535a39113L87485L07122j73615n06816m31404r8801K58446M40096K64554k04704
$$ plain form
31607 528805 657486 568736 7454 -709311 -900223 -424962 152530 403963 482553 566754
31597 566754 465215 96732 -176047 -106372 -9456 -217081 -500265 -505789 -373792 -382300 -331194
31586 -331194 99219 642924 761083 477283 238948 102471 -208856 -518208 -299575 336680
31576 336680 582953 108474 -451694 -511807 -325141 -323666 -341589 -78370 210658 154087
31566 154087 -4300 193542 564234 538365 128885 -52987 251306 606461 590128 310611
31556 310611 70100 -50319 -102936 -122660 -202883 -419873 -592403 -431927 -10034 262967
31546 262967 215888 108790 132833 128530 3360 12555 302984 525918 313474 -94078 -139113
31535 -139113 248372 555494 381879 -124937 -556341 -655142 -396696 43400 307954 103250
31525A03250n41279l82960J00785M35327M30446K49631Q528k94843m64546j84602
31515e40263M24298P28136L53163k56480m13976j20437J7404k65931n20179k91791
31505h86056K07140M40925K90509Q9583N2752M7679n3774j35971p2782M0618M6683
31494F7306l9680r9608r7060o1024K5343J73713K80935K03378o2311l45122m34971
31483c89101k32988J56837M47079L88637N4170k03666j64942J3285Q2644O9554
31473B21509J42762K42153J42044j31313k56290p5258J66804J84261L5514l2871
31463F39315L7042R7296N6432l3365j08419j61457k00500k40235k86278k59165
31453d59334m9922K46057L20864O6978j73535n0317K43581K32544r4008k51996
$$ plain form
31525 103250 -438029 -820989 -720204 -284877 145569 395200 403728 108885 -355661 -540263
31515 -540263 -115965 612171 965334 708854 294878 174441 191845 -74086 -594265 -886056
31505 -886056 -678916 -237991 52518 142101 194853 242532 188758 52787 -19995 20623 67306
31494 67306 27626 -71982 -169042 -230066 -204723 -31010 249925 453303 390992 45870 -389101
31483 -389101 -622089 -465252 -18173 370464 424634 220968 56026 69311 151955 221509
31473 221509 364271 606424 748468 617155 360865 285607 452411 636672 672186 639315
31463 639315 676357 773653 830085 796720 688301 526844 326344 86109 -200169 -459334
31453 -459334 -509256 -263199 57665 124643 -48892 -99209 144372 376916 282908 30912
31443C0912m2259J42936J5531r7995J55174M56472K66959k55055m27273r4646
31433A50756J41558j07074m18192k55766K07063M00902J90429o9717j37053r1286
31423A1620j0081J41255K64187J42669j82865l49675j40080J91740K36829m2046
31413B63553k67642j13659K89933M74578J76643k94426l84488j6817K60236K1416
31403D09327m02317l91956K8552K22627q6946m09537k61039J28484K56358J40365
31393c66082J74682L77163L32221q8059m43488l58666n7651J8387j32391j49135
31383f93019P6526K35429R6005j51196k07073r7351n9258j26148j04972N6369
31373i74688J66753J28933J11111K30819L06280J50880p0716o6646J20719J92880
$$ plain form
31443 30912 -11347 131589 147120 49125 204299 660771 927730 672675 245402 150756
31433 150756 292314 185240 -232952 -488718 -281655 119247 309676 239959 102906 11620
31423 11620 1539 142794 406981 549650 366785 17110 -122970 68770 305599 263553
31413 263553 -4089 -117748 172185 646763 823406 528980 144492 127675 387911 409327
31403 409327 7010 -384946 -356394 -133767 -220713 -630250 -891289 -762805 -506447 -366082
31393 -366082 -191400 185763 517984 429925 -13563 -372229 -429880 -411493 -543884 -693019
31383 -693019 -616493 -381064 -285059 -436255 -643328 -740679 -799937 -926085 -1031057 -974688
31373 -974688 -807935 -679002 -567891 -337072 -30792 120088 49372 -17274 103445 296325
31363B96325P7808l37O1147J02276M9219O4050K03100K32919j4768l51432m95720
31352B24587m14594k21618K3903K09556J30138j69137k67006P0878M31266K80936
31342B98909k11215l83796n8730K41999J42465o5349Q434K17932J91727l1464
31332C50912j00965O0252J65692L9360j47784j74418n9158M4869Q3723J13842
31322C76325J56162J41188N855j90951k86896j87433j430P0930m574n7113K0238
31311D2301Q6605l6184k50973k64015J0532K90767K66703p254k02632j62686p7475
31300c04311j45355k38310j10848J41332J31991k27464m83301k12423L62197O39931
31290d46561M28913J19196O7878J69236J59656L7904l8348n9893j17609j68698
$$ plain form
31363 296325 374133 373796 434943 537219 586438 650488 853588 1086507 1071739 720307 224587
31352 224587 -190007 -411625 -387722 -178166 -48028 -217165 -484171 -413293 17973 298909
31342 298909 87694 -296102 -354832 -112833 29632 -35717 -27283 190649 382376 350912
31332 350912 249947 310199 475891 515251 367467 193049 133891 178760 262483 376325
31322 376325 532487 673675 679530 488579 201683 14250 12820 83750 79176 22063 42301
31311 42301 128906 92722 -158251 -422266 -411734 -120967 145736 138482 -64150 -226836 -304311
31300 -304311 -449666 -687976 -798824 -657492 -525501 -752965 -1236266 -1448689 -1086492 -446561
31290 -446561 -17648 101548 169426 338662 498318 536222 497874 437981 320372 151674
31280A51674r3327O3927J17550Q043j16349j15247l7946l6265j45841k07681m7909
31269d59371K48629L38165K4314l97294m22325J4913M28999M09188R6628j24925
31259A56921j56356j52980j70858j43537r0954p0340j3677J24023J72158l054
31249c48654j79153p0170J65278J41989p8730n2071K58256L23405r8945n01049
31239d39844l74598L1951J58895j8731j06247J150P4792P7681J81575L04548J65692
31228E6864j64702k77124p6611O6183l2816o0166K02892M27033K36804j68722
31218B09635l09797j32011p490j22187k32524n6717L44606O32873N14638K1056
31208H62082m55188m98393j39077J53286N8112k00975k17642L5428K45499K16644
$$ plain form
31280 151674 58347 122274 239824 247867 131518 16271 -21675 -57940 -203781 -411462 -459371
31269 -459371 -210742 127423 151737 -245557 -667882 -652969 -223970 185218 281846 156921
31259 156921 565 -152415 -323273 -466810 -557764 -628104 -641781 -517758 -345600 -348654
31249 -348654 -527807 -597977 -432699 -290710 -369440 -421511 -163255 160150 61205 -439844
31239 -439844 -814442 -782491 -623596 -642327 -748574 -747424 -672632 -594951 -413376 -108828 56864
31228 56864 -107838 -384962 -461573 -395390 -428206 -488372 -285480 141553 378357 209635
31218 209635 -100162 -232173 -239663 -361850 -594374 -651091 -306485 326388 841026 862082
31208 862082 406894 -91499 -230576 -77290 -19178 -220153 -437795 -402367 -156868 59776
31198E9776L2474j41035j86132n7266J19860Q6340k09765m57539l85593j34216
31188a273096K8789J28000K79744L28278J27713m2978J11469K75393l4717n18465
31178e89870l79709L84612Q42393N08050O968m4011L2625k20243m30325p9399
31168C1091M10640K39848m34709o95383k83926J05934J5260j69605k5919K21537
31158e85232J79019r3419k89994l01771j68504R3003L83902N10469M28394K59744
31148D15611K9002k89651m60712j78038L51594N15889J55009j93211j40021j3436
31138A92036k21627n20438m00030J08658N01370N01041K81526J03175N6723Q6279
31128F88713K9692k41968n52548n08694o0704L08394K25163m2081l5587J95829
$$ plain form
31198 59776 92250 -48785 -234917 -292183 -172323 -85983 -295748 -753287 -1138880 -1273096
31188 -1273096 -1244307 -1116307 -836563 -508285 -380572 -423550 -312081 -36688 -71405 -589870
31178 -589870 -969579 -584967 257426 765476 772444 728433 761058 540815 110490 31091
31168 31091 441731 681579 246870 -448513 -732439 -626505 -611245 -780850 -806769 -585232
31158 -585232 -406213 -499632 -789626 -1091397 -1259901 -1166898 -782996 -272527 155867 415611
31148 415611 444613 154962 -305750 -483788 -132194 383695 538704 345493 205472 192036
31138 192036 -29591 -550029 -950059 -841401 -340031 161010 442536 545711 602434 688713
31128 688713 718405 476437 -76111 -584805 -645509 -337115 -111952 -154033 -189620 6209
31118F209K72790J21248l9687j77703m08809n63321l11333K44369N56148L16548
31108A6459j89347m94517m14038n6014L31695M74792L01631Q9178J37461L35565
31098E32865L48486J72839J14493K18781J76904j01444k74212j25475O0240m7412
31088A076065l13554l82809j97436K6896J62619K14763J33868j24700m12438n03614
31078c20340l75870j82245J1581K39989L94802K35310k28925n59471l36144K54379
31068h66934N37965J72823l77283m35832j8665K38230L0032k19748q5507K18286
31058h06633K82034J90200K70832M34952L39342N9398K038J86964K06700n6489
31048A109338k58128k39522k58205l86132k67825K18231N79512L78073j28013
$$ plain form
31118 6209 278999 400247 360560 182857 -225952 -789273 -1100606 -856237 -300089 16459
31108 16459 -172888 -667405 -1081443 -1137457 -805762 -330970 -29339 59839 197300 532865
31098 532865 881351 1054190 1168683 1387464 1564368 1462924 1188712 1063237 1123477 1076065
31088 1076065 762511 379702 182266 209162 371781 586544 720412 595712 183274 -320340
31078 -320340 -696210 -878455 -866874 -626885 -232083 3227 -225698 -785169 -1121313 -866934
31068 -866934 -328969 -156146 -533429 -969261 -987926 -749696 -719664 -939412 -1024919 -806633
31058 -806633 -524599 -334399 -63567 371385 710727 770125 772163 959127 1165827 1109338
31048 1109338 851210 611688 353483 -32649 -300474 -82243 497269 875342 747329
31039G47329l99135l34701k05455j51911j15611n7639M1821J98066K54728J2442
31029a0066l10514j93553L54008O05688J57912l89162l29960Q6616J83722n1P0484
31018B25124L54358L03892q4861k04374J11111L16099J16306q7008K0703J57072
31008A228422M2010j28689j56962k03892l18458j78795K86574N61803K91969j21227
30998A302755j65090L462k9093j59307l8281J96919J31520j77013k99081j73657
30988E93134j35149k48468k14178L5011J93183J14419l371n2230j60906l09027
30978a87582k66541n6327j1655j89357j92966J58683M32880K21598j79220j84189
30968d54676J99879L90280Q9843k95695k29340K40219N36541K57885l27230n57528
$$ plain form
31039 747329 348194 13493 -191962 -343873 -459484 -517123 -475302 -277236 -22508 -10066
31029 -10066 -320580 -514133 -160125 445563 603475 214313 -115647 -29031 154691 154640 225124
31018 225124 579482 883374 798513 594139 705250 1021349 1137655 1050647 1071350 1228422
31008 1228422 1270432 1141743 984781 780889 462431 283636 570210 1132013 1423982 1302755
30998 1302755 1137665 1141127 1112034 952727 914446 1111365 1242885 1065872 766791 593134
30988 593134 457985 209517 -4661 30350 223533 337952 334581 282351 121445 -187582
30978 -187582 -454123 -510450 -522105 -711462 -904428 -745745 -312865 -91267 -270487 -454676
30968 -454676 -254797 135483 225326 -70369 -299709 -59490 477051 734936 407706 -149822
30958a49822j35747M99048O57375J81349m30319o43926m12007m3035J96887K20039
30948f0158M8011k08230l74424l36498j14359J81939L80127L00517j6572j99133
30938c98780M8721M53516M69305J00585o1457K10566L57623o7127o03833n53217
30928d4098m2528K47820J59212J05859J77058P969l90585m86589j43103P5481
$$ plain form
30958 -149822 -285569 213479 870854 1052203 621884 -22042 -434049 -477084 -280197 -60158
30948 -60158 -12147 -220377 -594801 -931299 -1045658 -863719 -483592 -183075 -199647 -398780
30938 -398780 -350059 103457 572762 673347 611890 822456 1180079 1112952 509119 -44098
30928 -44098 -86626 161194 320406 426265 603323 611292 220707 -265882 -408985 -333504
$$ [...]
##END NTUPLES=NMR SPECTRUM
##END=
