##TITLE=31Pdec_LY-TMF-10.70.3
 D2O, 24 sc
 6.3.2020
##JCAMPDX= 6.0         $$ Bruker NMR JCAMP-DX V2.0
##DATA TYPE= NMR SPECTRUM
##DATA CLASS= NTUPLES
##ORIGIN= UXNMR, Bruker Analytische Messtechnik GmbH
##OWNER= root
$$ XWIN-NMR		Version 3.5
$$ Fri Mar  6 17:13:57 2020 Russian Standard Time (UT+4h)  she@DPX200
##.OBSERVE FREQUENCY= 81.013821
##.OBSERVE NUCLEUS= ^31P
##.ACQUISITION MODE= SIMULTANEOUS
##.ACQUISITION SCHEME= undefined
##.AVERAGES= 24
##.DIGITISER RES= 17
##SPECTROMETER/DATA SYSTEM= spect
##.PULSE SEQUENCE= zgpg30
##.SOLVENT NAME= CDCl3
##.SHIFT REFERENCE= (INTERNAL, CDCl3, 0, 182.463)
##AUDIT TRAIL= $$ (NUMBER, WHEN, WHO, WHERE, WHAT)
$$ ##TITLE= Audit trail, XWIN-NMR		Version 3.5
$$ ##JCAMPDX= 5.01
$$ ##ORIGIN= Bruker BioSpin GmbH
$$ ##OWNER= she
$$ F:/spectra/data/she/nmr/P31/1/pdata/1/auditp.txt
$$ ##AUDIT TRAIL=  $$ (NUMBER, WHEN, WHO, WHERE, WHAT)
(   1,<2020-03-06 17:12:58.39 +0400>,<she>,<DPX200>,
      <created by zg, POWCHK disabled, PULCHK disabled
       configuration hash MD5:
       00 E9 B6 7A A2 85 ED C7 34 08 36 98 17 FE 4E 26
       data hash MD5: 32K
       13 E2 B3 E9 7D 23 0E E8 43 BF 6B 59 A5 2D B8 63>)
(   2,<2020-03-06 17:13:01.09 +0400>,<she>,<DPX200>,
      <Start of raw data processing
       efp BC_mod = 2 LB = 1 FT_mod = 6 PKNL = 1 PHC0 = -1357.212 PHC1 = 150.6017 SI = 64K 
       data hash MD5: 64K
       41 67 3F 6A 60 81 F1 AD 8F EB BE AF 9B 4A 28 92>)
(   3,<2020-03-06 17:13:17.95 +0400>,<she>,<DPX200>,
      <pk PHC0 = 1.004759 PHC1 = 0 
       data hash MD5: 64K
       0A 86 2C 57 94 2C E9 4F 4B F3 FA F7 8C 6D 34 C5>)
(   4,<2020-03-06 17:13:21.95 +0400>,<she>,<DPX200>,
      <abs ABSG = 5 
       data hash MD5: 64K
       62 A3 97 90 B8 2A 86 2E F2 4C F9 36 08 A6 D3 92>)
$$ ##END=
$$ 
$$ hash MD5
$$ 5F F2 2C DA CF 29 7A 87 E6 81 27 16 00 2C D5 5B
##$RELAX= 
##$RELAX= 
##$RELAX= 
##$RELAX= 
##$RELAX= 
##$RELAX= 
##$RELAX= 
##$RELAX= 
$$ Bruker specific parameters
$$ --------------------------
##$DU= <F:/spectra>
##$EXPNO= 1
##$NAME= <P31>
##$PROCNO= 1
##$TYPE= <nmr>
##$USER= <she>
##$AMP= (0..31)
100 100 100 100 100 100 100 100 100 100 100 100 100 100 100 100 100 100 
100 100 100 100 100 100 100 100 100 100 100 100 100 100 
##$AQSEQ= 0
##$AQ_mod= 1
##$AUNM= <au_zg>
##$AUTOPOS= <>
##$BF1= 81.014009
##$BF2= 200.13
##$BF3= 200.13
##$BF4= 200.13
##$BF5= 200.13
##$BF6= 200.13
##$BF7= 200.13
##$BF8= 200.13
##$BYTORDA= 1
##$CFDGTYP= 0
##$CFRGTYP= 5
##$CHEMSTR= <none>
##$CNST= (0..31)
1 1 145 1 1 1 1 1 1 1 1 1 1 1 1 1 1 1 1 1 1 1 1 1 1 1 1 1 1 1 1 1 
##$CPDPRG= <waltz16>
##$CPDPRG1= <>
##$CPDPRG2= <waltz16>
##$CPDPRG3= <>
##$CPDPRG4= <mlev>
##$CPDPRG5= <mlev>
##$CPDPRG6= <mlev>
##$CPDPRG7= <mlev>
##$CPDPRG8= <mlev>
##$CPDPRGB= <>
##$CPDPRGT= <>
##$D= (0..31)
0 1 0 0 0 0 0 0 0 0 0 0.03 2e-05 3e-06 0 0 0 0 0 0 0 0 0 0 0 0 0 0 0 0 
0 0 
##$DATE= 1583500377
##$DBL= (0..7)
120 120 120 11 120 120 24 19 
##$DBP= (0..7)
150 150 150 150 150 150 150 150 
##$DBP07= 0
##$DBPNAM0= <>
##$DBPNAM1= <>
##$DBPNAM2= <>
$$ [...]
##$SUBNAM3= <"">
##$SUBNAM4= <"">
##$SUBNAM5= <"">
##$SUBNAM6= <"">
##$SUBNAM7= <"">
##$SUBNAM8= <"">
##$SUBNAM9= <"">
##$SW= 369.568048894756
##$SWIBOX= (0..15)
0 1 3 0 0 0 0 0 0 0 0 0 0 0 0 0 
##$SW_h= 29940.119760479
##$TD= 32768
##$TD0= 1
##$TE= 0
##$TE2= 300
##$TE3= 300
##$TEG= 300
##$TL= (0..7)
0 120 53 12 22 120 120 120 
##$TP= (0..7)
150 150 150 150 150 150 150 150 
##$TP07= 0
##$TPNAME0= <>
##$TPNAME1= <>
##$TPNAME2= <>
##$TPNAME3= <>
##$TPNAME4= <>
##$TPNAME5= <>
##$TPNAME6= <>
##$TPNAME7= <>
##$TPOAL= (0..7)
0.5 0.5 0.5 0.5 0.5 0.5 0.5 0.5 
##$TPOFFS= (0..7)
0 0 0 0 0 0 0 0 
##$TUNHIN= 0
##$TUNHOUT= 0
##$TUNXOUT= 0
##$USERA1= <user>
##$USERA2= <user>
##$USERA3= <user>
##$USERA4= <user>
##$USERA5= <user>
##$V9= 5
##$VALIST= <valist>
##$VCLIST= <CCCCCCCCCCCCCCC>
##$VD= 0
##$VDLIST= <DDDDDDDDDDDDDDD>
##$VPLIST= <PPPPPPPPPPPPPPP>
##$VTLIST= <TTTTTTTTTTTTTTT>
##$WBST= 1024
##$WBSW= 4
##$XGAIN= (0..3)
0 0 0 0 
##$XL= 0
##$YL= 0
##$YMAX_a= 8531
##$YMIN_a= -16841
##$ZGOPTNS= <>
##$ZL1= 120
##$ZL2= 120
##$ZL3= 120
##$ZL4= 120
##$ABSF1= 182.463
##$ABSF2= -187.1042
##$ABSG= 5
##$ABSL= 3
##$ALPHA= 0
##$AQORDER= 0
##$ASSFAC= 0
##$ASSFACI= 0
##$ASSFACX= 0
##$ASSWID= 0
##$AUNMP= <proc_1d>
##$AZFE= 0.1
##$AZFW= 0.5
##$BCFW= 0
##$BC_mod= 2
##$BYTORDP= 0
##$COROFFS= 0
##$CY= -3
##$DATMOD= 1
##$DC= 0
##$DFILT= <>
##$DTYPP= 0
##$F1P= 0
##$F2P= 0
##$FCOR= 1
##$FTSIZE= 65536
##$FT_mod= 6
##$GAMMA= 0
##$GB= 0
##$INTBC= 1
##$INTSCL= 5.30512e-09
##$ISEN= 30
##$LB= 1
##$LEV0= 0
##$LPBIN= 0
##$MAXI= 10000
##$MC2= 0
##$MEAN= 0
##$ME_mod= 0
##$MI= 50
##$NCOEF= 0
##$NC_proc= -6
##$NLEV= 6
##$NOISF1= 182.463
##$NOISF2= 159.3651
##$NSP= 0
##$NTH_PI= 0
##$NZP= 0
##$OFFSET= 182.463
##$PC= 4
##$PHC0= -1356.207
##$PHC1= 150.6017
##$PH_mod= 1
##$PKNL= yes
##$PPARMOD= 0
##$PSCAL= 0
##$PSIGN= 0
##$REVERSE= no
##$SF= 81.0140089999434
##$SI= 65536
##$SIGF1= 159.3651
##$SIGF2= -187.1042
##$SINO= 113.3802
##$SIOLD= 16384
##$SREGLST= <1H.CDCl3>
##$SSB= 0
##$STSI= 65536
##$STSR= 0
##$SW_p= 29940.119760479
##$SYMM= 0
##$S_DEV= 0
##$TDeff= 32768
##$TDoff= 0
##$TI= <>
##$TILT= no
##$TM1= 0
##$TM2= 0
##$TOPLEV= 0
##$USERP1= <user>
##$USERP2= <user>
##$USERP3= <user>
##$USERP4= <user>
##$USERP5= <user>
##$WDW= 1
##$XDIM= 65536
##$YMAX_p= 279464341
##$YMIN_p= -15085146
$$ End of Bruker specific parameters
$$ ---------------------------------
##NTUPLES= NMR SPECTRUM
##VAR_NAME=  FREQUENCY,     SPECTRUM/REAL,   SPECTRUM/IMAG
##SYMBOL=    X,             R,               I
##VAR_TYPE=  INDEPENDENT,   DEPENDENT,       DEPENDENT
##VAR_FORM=  AFFN,          ASDF,            ASDF
##VAR_DIM=   65536,         65536,           65536
##UNITS=     HZ,            ARBITRARY UNITS, ARBITRARY UNITS
##FACTOR=    0.456856943014862, 1,           1
##FIRST=     14782.0589164792, 0,            0
##LAST=      -15158.0608439998, 0,           0
##MIN=       -15158.0608439998, -15085146,   0
##MAX=       14782.0589164792, 279464341,    0
$$ Real data points
##PAGE= N=1
##DATA TABLE= (X++(R..R)), XYDATA
$$ [...]
36644A686878q59317j314101q44521M29481R07825j67816j353611j154052j13418
36635b782652M57199N42810Q74419J335148J274924P69129M24672L61427K22152
36626C479228j99469r04665j753859k181378j535627j13555R12045R86654P19340
36617e91286N59280N5027q96352j205903m9195J616484K087514J036676k87344
36608B324901o86685j43189M52339K21357q15873j568871j038170K86001R35587
36599c2603M83687K0102L06637O86944M60060R0575J14292j8961q17186j413751
36589a20204p57291N22829Q92390J80794l30410N8197O52468O41921N3244p07878
36579A086060j286211j226852l42851N98137M70262o82672j572342j400875p89209
$$ plain form
36644 1686878 827561 -486540 -1331061 -901580 6245 -161571 -1515182 -2669234 -2782652
36635 -2782652 -2325453 -1782643 -908224 426924 1701848 2470977 2895649 3257076 3479228
36626 3479228 3279759 2375094 621235 -1560143 -3095770 -3209325 -2297280 -1310626 -591286
36617 -591286 -32006 23021 -873331 -2079234 -2128429 -511945 1575569 2612245 2324901
36608 2324901 1638216 1495027 1947366 2168723 1352850 -216021 -1254191 -968190 -32603
36599 -32603 451084 471186 777823 1464767 1924827 2015402 2129694 2110733 1293547 -120204
36589 -120204 -877495 -354666 537724 718518 388108 446305 1098773 1740694 1793938 1086060
36579 1086060 -200151 -1427003 -1769854 -1171717 -701455 -1384127 -2956469 -4357344 -5146553
36570e146553n47980m19440K10705J005100J047402K72531m12584m69250k85387
36561d745456j08097O22144K070465K877413J584201r09537j850984j97402J721351
36552A064098J264518r10631j959961r23913L30348K50659l96664l71483n813
36543a658842j85808n89594l59767K75074M21309Q1373L2420L94614M77755L2785
36533a078681l29934j32911K81249K83705k38512p54290n96972L06929J150006
36524a109411J021710N3431p69070j061627j427519j957115j453510P70214L109253
36515b823644L163966Q73814j217798j112086L72837J057716K49433p87704q52009
36506a075475k51105J06318K78995J013096K066630K025382L63572j372026j518457
$$ plain form
36570 -5146553 -5694533 -6113973 -5903268 -4898168 -3850766 -3578235 -3990819 -4460069 -4745456
36561 -4745456 -4853553 -4231409 -2160944 716469 2300670 1391133 -459851 -657253 1064098
36552 1064098 2328616 1417985 -541976 -1465889 -1135541 -884882 -1281546 -1653029 -1658842
36543 -1658842 -1844650 -2434244 -2794011 -2518937 -2097628 -2016255 -1983835 -1589221 -1111466 -1078681
36533 -1078681 -1408615 -1541526 -1260277 -976572 -1215084 -1969374 -2566346 -2259417 -1109411
36524 -1109411 -87701 -34270 -803340 -1864967 -3292486 -5249601 -6703111 -5932897 -2823644
36515 -2823644 340322 1214136 -3662 -1115748 -742911 314805 564238 -223466 -1075475
36506 -1075475 -1326580 -1220262 -941267 71829 2138459 4163841 4527413 3155387 1636930
36497A636930o19057l37382o70373k10581R30808Q01458j113122k501422j440481
36488c523222P84202J675980R34248J39269J44628N79385J134462J593888J192634
36479D655474m04618j983579k163204j357919q66381o91955r634Q07573O19578
36470a394665l27756o45532q2714L10831K25578L86299P79269N22356l18893o50162
36460a195389k96662j97196m57593j32757P89669J175578Q23011O87663P29684
36451A926008j31410j441274j234070M92833J121392m00795j522370j65037J792682
36442D37959J595006o3466o86159j96623l02860q10466K0514J850555K259486
36433D103946O03863r96497j132914j033625k047563l268521k921037q05503J630900
$$ plain form
36497 1636930 1017873 680491 10118 -200463 730345 1531803 418681 -2082741 -3523222
36488 -3523222 -2739020 -1063040 -128792 10477 155105 734490 1868952 3462840 4655474
36479 4655474 4250856 2267277 104073 -1253846 -2120227 -2812182 -2821816 -2014243 -1394665
36470 -1394665 -1722421 -2367953 -2450667 -2139836 -1914258 -1527959 -748690 -226334 -545227 -1195389
36460 -1195389 -1492051 -1689247 -2146840 -2279597 -1489928 -314350 508661 1196324 1926008
36451 1926008 1794598 353324 -880746 -387913 733479 332684 -1189686 -1354723 437959
36442 437959 2032965 1969499 1283340 1086717 783857 -26609 -6095 1844460 4103946
36433 4103946 4707809 3711312 2578398 1544773 -502790 -3771311 -6692348 -7497851 -5866951
36424e866951K820403K179000N05099n26813j06211O08488J66999q08308n17227
36415a545521J018403J854111J179370L10452P4589m98959j749279j880516K60105
36406i77245K580325K179579n47222k476270k011104o11103m810M2796M78775
36397a346279J116321J173370O90608K72698q3347q31203j685211j594402k19937
36388b507382J260318J402730K42519q14083p64695l4330M37850M59464M25057
36379A07448L91769O9807m15921m89934L7939O38645P21184K50527l51743n95829
36369C63892k73554J97592m7057j238707k240327j664907K58124J772573J729825
36360a142546P92369K04858K48864M49511N23649M01716q9283p81927q71655R7447
$$ plain form
36424 -5866951 -3046548 -867548 -362449 -889262 -995473 -386985 -219986 -1028294 -1545521
36415 -1545521 -527118 1326993 2506363 2816815 2891404 2392445 643166 -1237350 -977245
36406 -977245 1603080 3782659 3235437 759167 -1251937 -1863040 -1867850 -1825054 -1346279
36397 -1346279 -229958 943412 1634020 1906718 1823371 992168 -693043 -2287445 -2507382
36388 -2507382 -1247064 155666 398185 -415898 -1180593 -1214923 -777073 -317609 107448
36379 107448 499217 569024 153103 -336831 -298892 339753 1060937 1311464 959721 363892
36369 363892 90338 287930 240873 -997834 -3238161 -4903068 -4644944 -2872371 -1142546
36360 -1142546 -350177 -145319 103545 553056 1076705 1478421 1389138 607211 -264444 -166997
36350a66997J252454J266104J09569q77132p09801J78993P63737O33674M8764
36341B499365o64862j262003j384863p85118J71592O07885M6648q96686j076608
36332b744650j49607R88209J310141Q51262L87125K49275J10628k03861m93146
36323C05376q20164j496104k148013j729548n0286J500395J562307N58011l6810
36314b354836K72460O87996O04599L46593L43664M67407M38771K60319N7542j7261
36304A107254K72015Q27681Q72460j79285j570869j928042j219924p87206j068211
36295c674127p43418R38224K353293J588996n15720j299159j4410J288535R34151
36286H56365j71439l74154K56604O19970O20666R06328J190445N50101p06357
$$ plain form
36350 -166997 1085457 2351561 2461130 1583998 874197 1053190 1816927 2450601 2499365
36341 2499365 1834503 572500 -812363 -1597481 -1425889 -818004 -771356 -1668042 -2744650
36332 -2744650 -2894257 -1906048 -595907 255355 642480 891755 1002383 798522 305376
36323 305376 -514788 -2010892 -4158905 -5888453 -5938739 -4438344 -2876037 -2318026 -2354836
36314 -2354836 -2082376 -1394380 -789781 -443188 -99524 367883 806654 1066973 1124515 1107254
36304 1107254 1379269 2206950 3079410 2900125 1329256 -598786 -1818710 -2605916 -3674127
36295 -3674127 -4417545 -3479321 -1126028 462968 -52752 -1351911 -1366321 -77786 856365
36286 856365 684926 310772 567376 1187346 1808012 2714340 3904785 4454886 3748529
36277C748529j092178j75239O52084K13708q44550j254469q96331m16565R4012
36268B9001Q92945J554470J308454K37941q07373j333898j364961p51528N63324
36259C28375J678242J384806p8573j062138o58254K65913O24859N15612L46501
36250C345343k55607j528458k413776j689731R0149J058517M05020p49406r32048
36241b669997J06747J548390K460196K326343J207073k79069j343812j515671
36233A840200p47335N94509J611111J315492k23002j631340j782103j123785p34220
36224h80473o56229k61251K08294j38069j168397j667848j110784k44664K93900
36215e625521O75774R18544N80168j07123r2128Q75131J646900J338789M45061
$$ plain form
36277 3748529 2656351 2481112 3133196 3346904 2502354 1247885 351554 -65011 29001
36268 29001 921946 2476416 3784870 4022811 3215438 1881540 516579 -234949 328375
36259 328375 2006617 3391423 3312850 2250712 1592458 1858371 2483230 2998842 3345343
36250 3345343 3089736 1561278 -852498 -2542229 -2452080 -1393563 -988543 -1737949 -2669997
36241 -2669997 -2563250 -1014860 1445336 3771679 4978752 4699683 3355871 1840200
36233 1840200 1092865 1687374 3298485 4613977 4390975 2759635 977532 -146253 -880473
36224 -880473 -1536702 -1797953 -1589659 -1727728 -2896125 -4563973 -5674757 -5919421 -5625521
36215 -5625521 -4949747 -4031203 -3451035 -3558158 -3650286 -2775155 -1128255 210534 655595
36206F55595l15691r91473j484893j029699L94913J398873J086702M39732N90127
36197G44186R78803O63391K11093N72001J151243Q82714K59654K65555K04049
36188E932689j060309k433566j864725M3632N79097q06043j684625o43225Q18098
36179a118977J261591J318182J465189O57136j081883j413839O84346K400555
36171D172300Q99783k206616l157973j433074K76731N86806O24540R51248N12314
36162A226059q17839j378302l30260R84015J160678M54864l12132q38128o45339
36153d96384Q93412K889650L002653M38087k435683k815401q47395R87124J128758
36144B744821K80114j59504J44448L80610k66565j506331k032222j083970K92139
$$ plain form
36206 655595 339904 -651569 -2136462 -3166161 -2771248 -1372375 -285673 154059 744186
36197 744186 1722989 2386380 2597473 3169474 4320717 5203431 5463085 5728640 5932689
36188 5932689 4872380 2438814 574089 617721 1196818 390775 -1293850 -1937075 -1118977
36179 -1118977 142614 1460796 2925985 3583121 2501238 1087399 1771745 4172300
36171 4172300 5072083 2865467 -292506 -1725580 -1448849 -862043 -237503 713745 1226059
36162 1226059 408220 -970082 -1300342 -316327 844351 1299215 987083 148955 -496384
36153 -496384 397028 3286678 6289331 6727418 4291735 1476334 628939 1616063 2744821
36144 2744821 3024935 2865431 3009879 3390489 3123924 1617593 -414629 -1498599 -1206460
36135a206460L80499q50622j646230r24924M12207J130602J315516J520210J436956
36126A567754O20300k71524k66866L16006K79582n89410j160621n82359N71307
36117D84169J053757L52815r02766j695036j579802r05950j82157M63591R80229
36108a931150R92212K97857n38101q22023o85102n74531k19188P00447J248321
36099a531258K73462j309690j250943O58855K015038J332693j2907m92325p73177
36090a090252j637668j722494K26570K437016K203330m6292j451250q70209K94743
36081a656506R87433J452293J415033J48013j348749r86111R87509J847959N16709
36072C363583q36371m87995J86954n25466j606233j160969M13347J364906J354390
$$ plain form
36135 -1206460 -825961 -1676583 -3322813 -4247737 -3835530 -2704928 -1389412 130798 1567754
36126 1567754 2188054 1916530 1649664 1965670 2245252 1655842 495221 -87138 484169
36117 484169 1537926 1890741 987975 -707061 -2286863 -3192813 -3374970 -2911379 -1931150
36108 -1931150 -938938 -641081 -1179182 -2001205 -2686307 -3260838 -3480026 -2779579 -1531258
36099 -1531258 -1257796 -2567486 -3818429 -3159574 -1144536 188157 175250 -317075 -1090252
36090 -1090252 -2727920 -4450414 -4223844 -1786828 416502 370210 -1081040 -1951249 -1656506
36081 -1656506 -669073 783220 2198253 2346266 997517 11406 998915 2846874 3363583
36072 3363583 2527212 2039217 2226171 1700705 94472 -1066497 -653150 711756 2066146
36063B066146J111041M72342r57531k075419j565446l33947k86681j070817o20311
36054c260623J063751J514309j07495j274632J9587J935497J555150n89764j413310
36045e57530n6682J024786J36896j069634m64207J074939J178564n1390j64169
36036A051573J515302K459308P70289j680230j930646l54671J39146j167245j713650
36027i10824R5635K147478J703874n77901j733677o26640J030139J442035O72384
36018C242503l31430j085329j420076j121523l88279M9265j52568l57016K33394
36009a331059J399640J973925J142030m85851j349332p04717L17836M3467j412006
36000d06067k121714j020832N57032Q78953K46571Q9362M95010M09572j52554
$$ plain form
36063 2066146 3177187 3649529 2691998 616579 -948867 -1282814 -1569495 -2640312 -3260623
36054 -3260623 -2196872 -682563 -790058 -2064690 -2045103 -109606 1445544 855780 -557530
36045 -557530 -614212 410574 547470 -522164 -986371 88568 1267132 1215742 1051573
36036 1051573 2566875 5026183 5796472 4116242 2185596 1830925 1970071 802826 -910824
36027 -910824 -815189 1332289 3036163 2458262 724585 97945 1128084 2570119 3242503
36018 3242503 2911073 1825744 405668 -715855 -1104134 -1054869 -1207437 -1564453 -1331059
36009 -1331059 68581 2042506 3184536 2698685 1349353 644636 962472 1005939 -406067
36000 -406067 -2527781 -3548613 -2991581 -2112628 -1866057 -1776695 -1281685 -872113 -1024667
35991a024667j20798L95052L3297j134833j058160R96357K608084J442436j202214
35982I34554k232948j115503L2251J91428N54341J545898J435044p31705k848212
35973b234852k298918L78398K272209J941975P05717K82008Q26641J536979J772718
35964E182875J096589o02245k366156k525099o40289J520165J769740m9404k044294
35955A341882k443543j201401M17138J264240J188264P60769L56145k41064j109367
35946C33063j491591o11871Q87120J343130K25372j091745j226223m82935Q1562
35937b034118L07916O02103P58911L88662k079L23827Q97898N92764n27867j179260
35927A28757o92564K66345Q43860P91414J60615o66384p35079M38850J655545
$$ plain form
35991 -1024667 -1145465 -750413 -717116 -1851949 -2910109 -1913752 694332 2136768 934554
35982 934554 -1298394 -2413897 -2381646 -2190218 -1635877 -89979 1345065 613360 -2234852
35973 -2234852 -4533770 -4155372 -1883163 58812 764529 1046537 1873178 3410157 5182875
35964 5182875 6279464 5677219 3311063 785964 145675 1665840 3435580 3386176 1341882
35955 1341882 -1101661 -2303062 -1885924 -621684 566580 1327349 1683494 1442430 333063
35946 333063 -1158528 -1770399 -883279 459851 685223 -406522 -1632745 -2115680 -2034118
35937 -2034118 -1726202 -1124099 -365188 23474 21395 345222 1243120 1835884 1308017 128757
35927 128757 -563807 -297462 546398 1337812 1498427 832043 96964 535814 2191359
35918B191359J250215m87426j653815j540499j302947j539214j246827L6577J035116
35909c257461Q45731N12932J133296J915788J620091N82602k33538r39829j811752
35900C67860j885362l81435J391416J557296M45004j25835J83268K4871j088901
35891D88182k033684j949562j159408j17061R94878J569131J028693N9433r4000
35882a213398M13928L02571o04981j088177o03283K5969K39495M08200N65294
35873a554382J41596o33257o98849N0501N71398N83972Q36411J094203Q2098j814950
35863a341259k200102k93426J437058J015491O7928Q54236K151710J157538j618278
35854A230896k689106o96716J839686K374449J291017J15397q37444j623557j382550
$$ plain form
35918 2191359 3441574 2954148 1300333 -240166 -1543113 -3082327 -4329154 -4292577 -3257461
35909 -3257461 -2411730 -1898798 -765502 1150286 2770377 3352979 3119441 2179612 367860
35900 367860 -1517502 -1898937 -507521 1049775 1494779 1368944 1552212 1577083 488182
35891 488182 -1545502 -3495064 -4654472 -4771533 -3776655 -2207524 -1178831 -1119398 -1213398
35882 -1213398 -799470 -496899 -1101880 -2190057 -2793340 -2767371 -2527876 -2119676 -1554382
35873 -1554382 -1412786 -2046043 -2744892 -2694391 -2122993 -1539021 -702610 391593 473691 -1341259
35863 -1341259 -3541361 -3834787 -2397729 -1382238 -1314310 -460074 1691636 2849174 1230896
35854 1230896 -1458210 -2154926 -315240 2059209 3350226 3465623 2628179 1004622 -377928
35845c77928K91789J865900J551530j56115j228390r65933m64718l86738j20622
35836H775M24326M8431j594486k610752j322809Q81711J213910m45496j446578
35827d842968m74403P53564P23661N04541J243360J588339L8555j838802j432794
35818c736947O77088J522296L14590p96078m61807L76139J003565J903306K609655
35809C411807J638133m88173j146310K11371Q28187p88575k145351q24180J538942
35800B235851K043358R53165L86876M73297j03050j138418j468650j356290j558554
35791D67585j194135O25315K223998J480016n13092j078422k83427j97991o76101
35782H53746K13508J890207J548369r51752k500737j745369p69326q23235l91401
$$ plain form
35845 -377928 -86139 1779761 3331291 3175176 1946786 980853 516135 129397 8775
35836 8775 433101 481532 -1112954 -3723706 -5046515 -4164804 -2950894 -3396390 -4842968
35827 -4842968 -5317371 -4563807 -3840146 -3335605 -2092245 -503906 -465351 -2304153 -3736947
35818 -3736947 -3059859 -1537563 -1222973 -2019051 -2480858 -2104719 -1101154 802152 3411807
35809 3411807 5049940 4561767 3415457 3626828 4455015 3666440 1521089 696909 2235851
35800 2235851 4279209 5232374 5619250 6092547 5989497 4851079 3382429 2026139 467585
35791 467585 -726550 -101235 2122763 3602779 3089687 2011265 1727838 1529847 853746
35782 853746 1067254 2957461 4505830 3554078 1053341 -692028 -1461354 -2284589 -2675990
35773b675990J035783J265204m48125j261688O59397K685057J798293o81307j623318
35764G53306r51573n95420m95923P11947K230684J861045k57002j698247j314507
35755B44310j70640P54870J321948R94276o23012k129028j669961K5138L80362
35746h71737j025548j664438O2246K389072K746966J077777o50300j126176p29794
35737B08068m44766o25822q12043m90752Q8645K44135J3419Q2275K95213l63470
35727a805098j548100j110985J561572L551733K106214j042170j958525k49528
35719d94887Q42926p9494o94040N84056J749241O49030j409367j759842k86477
35710h98854R34461P21496l41497j277586j437732n64703O44527Q03979l11156
$$ plain form
35773 -2675990 -1640207 -375003 -823128 -2084816 -1425419 1259638 3057931 2376624 753306
35764 753306 -198267 -793687 -1289610 -577663 1653021 3514066 3257064 1558817 244310
35755 244310 73670 828540 2150488 3144764 2521752 392724 -1277237 -1252099 -871737
35746 -871737 -1897285 -3561723 -3499477 -1110405 1636561 2714338 2064038 937862 208068
35737 208068 -236698 -862520 -1674563 -2165315 -2076670 -1832535 -1819116 -1736841 -1441628 -1805098
35727 -1805098 -3353198 -4464183 -2902611 649122 2755336 1713166 -245359 -494887
35719 -494887 348039 268545 -425495 158561 1907802 2556832 1147465 -612377 -898854
35710 -898854 35607 757103 415606 -861980 -2299712 -2864415 -2219888 -1415909 -1727065
35701a727065j120852m60870O86632Q98789N62538Q81146J608438J532671O21332
35692C482759m8940k07802o36403j550777k113901j675776m97228P44951J385268
35683a117849R92105n253l62043L89574R91526K13057j139418j393758n86214
35674b018273j24169k53781J25055J100720J328132M23873k53694j0378m4358
35665B73127j123132j876342r96615L95650N31377k6549N49234J957804J982892
35656A667446J80018j150620m88531O14670J73263j078331j085556J34036P13026
35647c20579P9377l79653O9537M30640J87488M77584J767603K212882K72969k315216
35637B482632k489461j86662J644959J259751l3163n82799n61258n07646N3649
$$ plain form
35701 -1727065 -2847917 -3308787 -2622155 -1723366 -1160828 -279682 1328756 2861427 3482759
35692 3482759 3433819 3226017 2589614 1038837 -1075064 -2750840 -3248068 -2503117 -1117849
35683 -1117849 -125744 -130997 -493040 -103466 888060 1101117 -38301 -1432059 -2018273
35674 -2018273 -2142442 -2396223 -2271168 -1170448 157684 581557 327863 317485 273127
35665 273127 -850005 -2726347 -3722962 -3327312 -2795935 -2822484 -2273250 -315446 1667446
35656 1667446 1847464 696844 208313 822983 996246 -82085 -1167641 -1033605 -320579
35647 -320579 -241202 -620855 -551318 -120678 66810 544394 2311997 4524879 4797848 2482632
35637 2482632 -6829 -193491 1451468 2711219 2678056 2095257 1533999 1026353 1080002
35628A080002J118902J225351l03625j697658j226338L1731O9128o25528j73455
35619e01490R35862L25270j930215k640840k59255K438392K193311k61075j672400
35610a372440q76017L24456L31400k76985j86863O70200J174834M92082q50924
35601e70257j343278j71659J544409J884914N61235q03009j087616r98959j256051
35592b240271j000445N66183K180153K006852M42962m86158j85148K4677n17255
35583G91550p53356N5148R37681O78193n50988j702854j990157j083073O57607
35574b960249J753365Q28425j159188j506975N00982K186461J242167p53986p05168
35565e74166J309375K353942J262800J04254M67702R21192l36740k204316k116806
$$ plain form
35628 1080002 2198904 3424255 3120630 1422972 196634 228365 297493 -328035 -501490
35619 -501490 434372 759642 -1170573 -3811413 -4070668 -1632276 561035 299960 -1372440
35610 -1372440 -2248457 -1924001 -1592601 -1869586 -2056449 -1386249 -211415 280667 -570257
35601 -570257 -1913535 -2085194 -540785 1344129 1905364 1102355 14739 -984220 -2240271
35592 -2240271 -3240716 -2674533 -494380 1512472 1955434 1469276 1284128 1308805 791550
35583 791550 38194 93342 1031023 1709216 1158228 -544626 -2534783 -3617856 -2960249
35574 -2960249 -1206884 -378459 -1537647 -3044622 -2543640 -357179 884988 131002 -574166
35565 -574166 735209 3089151 4351951 4456205 4923907 5845099 5508359 3304043 1187237
35556A187237J13011J883037J219445q91953k035391j279483R2153M29271k93882
35547D23445o37209K23530J162342N46615j263749k058482p70657R28022R72382
35538d73761j86460m40331P86644J885233J577965M61511l66100p37071p61713
35529A745917q6305J144624J638249N43036j007829j259862k88943K83592j85394
35520B527085n76316O7998J117872J339974M02893j005664j865995j472534j96495
35511C38818M03280o59016j927197r87939J802437L067469J008526j729650j696586
35502c79858M93545J510327M93206k40053M44396P39076n53685j688178r60676
35493a41900L18115O3998j078750r60543M33566J142279N45459K9031L06762M04376
$$ plain form
35556 1187237 1300248 3183285 4402730 3510777 1475386 195903 288056 717327 423445
35547 423445 -213764 9766 1172108 1718723 454974 -1603508 -2374165 -1446143 -473761
35538 -473761 -660221 -1100552 -313908 1571325 3149290 3610801 3244701 2507630 1745917
35529 1745917 1659612 2804236 4442485 4985521 3977692 2717830 2428887 2712479 2527085
35520 2527085 1950769 2018767 3136639 4476613 4879506 3873842 2007847 535313 338818
35511 338818 742098 83082 -1844115 -2832054 -1029617 2037852 3046378 1316728 -379858
35502 -379858 113687 1624014 2117220 1877167 2321563 3060639 2506954 818776 -141900
35493 -141900 176215 240213 -838537 -1799080 -1365514 -223235 322224 351255 658017 1062393
35483A062393k05343n07886J77369Q87360N74176l09445p53221o56722m08247
35474a39566Q5964R54649J604713J312448J53706j203628k087335j872079l82102
35465a573230J245482J258507l27165j258078q0163J609242J502341L2665n98566
35456A811035j04040k76224j506086j824710k38161J359666J039158k62856m54598
35447d56816M52567P63003j5198o69040m36814L6138N566m32774q63665r47819
35437b564852k86856J045079J905919J236166j89260n34463L86036P22696n18879
35428A201586j785655j262521M07553J109499K00440r86721j244282p77305m15842
35419c553248n74238j071809j257456m12925J270353K376411J770928J71992p25050
$$ plain form
35483 1062393 857050 349164 526533 1413893 1988069 1678624 925403 268681 -139566
35474 -139566 -53602 901047 2505760 3818208 3971914 2768286 680951 -1191128 -1573230
35465 -1573230 -327748 930759 603594 -654484 -734647 874595 2376936 2409601 1811035
35456 1811035 1706995 1430771 -75315 -1900025 -2138186 -778520 260638 -2218 -456816
35447 -456816 -4249 758754 743556 74516 -362298 -326160 -320594 -753368 -1617033 -2564852
35437 -2564852 -2851708 -1806629 99290 1335456 1146196 611733 997769 1720465 1201586
35428 1201586 -584069 -1846590 -1439037 -329538 -129098 -1115819 -2360101 -3137406 -3553248
35419 -3553248 -4127486 -5199295 -6456751 -6869676 -5599323 -3222912 -1451984 -1279992 -2005042
35410b005042m26324J79047N75933J088741J480034P48129r91870j876732o42970
35401a871054J389105J852384K53905j672057k139426r77799N90333J163324L91452
35392a019833o06134m72834N53044Q86150m0379r26985p91988m93050q71988r11473
35382d695470M73291K061244J941129O27458J64046P22345P48504J85433N36431
35373B764411J518086R01257j432731k525145r68889N60159m33161k199486j702373
35364c517872N09249J490364M95588p21838j224297j478295j271166K4419J468658
35355d225190J593864J073520J575318K387261J370573r02334j540504j91093
35347A141415K96973j027422j431865M83031J880319L97992j664066j156311P04551
$$ plain form
35410 -2005042 -2431366 -2252319 -1676386 -587645 892389 1640518 648648 -1228084 -1871054
35401 -1871054 -481949 1370435 1624340 -47717 -2187143 -3164942 -2574609 -1411285 -1019833
35392 -1019833 -1625967 -2098801 -1545757 -659607 -699986 -1626971 -2418959 -2912009 -3783997 -4695470
35382 -4695470 -4222179 -2160935 -219806 407652 571698 1294043 2042547 2227980 2764411
35373 2764411 4282497 5183754 3751023 1225878 256989 817148 383987 -1815499 -3517872
35364 -3517872 -3008623 -1518259 -1022671 -1744509 -2968806 -4447101 -5718267 -5693848 -4225190
35355 -4225190 -2631326 -1557806 17512 2404773 3775346 2873012 1332508 1141415
35347 1141415 1438388 410966 -1020899 -537868 1342451 1740443 76377 -1079934 -375383
35338c75383P17788p48408p33569R20589J363882k46561j403441n05166Q34708
35329a75561P43915k79964q23397n85539J9298O24860O32950k70768j012460k87970
35319a414636J041508Q39043p78341j305733J41546J417549J039089M61515R80024
35310B421564J116668n17175k112238j347580N71466P79944n27525o86529O69178
35301C67773J013170o15253j936073j226205J12809K53407k06275J38852R50504
35292a147291J153356J017946J223836R85264o77036k460801j949308P16954K536274
35283A399194J649924k08411m06650Q52888J133770n20467k252050k072919m95472
35274i20193M44629L3061m56434J32538J189174J314090K54019q74288j034880
$$ plain form
35338 -375383 342405 -406003 -1139572 -218983 1144899 898338 -505103 -1010269 -175561
35329 -175561 568354 288390 -535007 -1120546 -1101248 -476388 156562 -114206 -1126666 -1414636
35319 -1414636 -373128 465915 -312426 -1618159 -1476613 -59064 980025 1441540 2421564
35310 2421564 3538232 3021057 908819 -438761 132705 912649 385124 -301405 367773
35301 367773 1380943 765690 -1170383 -2396588 -2283779 -2030372 -2236647 -2097795 -1147291
35292 -1147291 6065 1024011 2247847 3233111 2556075 95274 -1854034 -1137080 1399194
35283 1399194 3049118 2840707 2434057 3286945 4420715 3900248 1648198 -424721 -920193
35274 -920193 -475564 -442503 -898937 -766399 422775 1736865 1990884 1116596 81716
35265H1716l20592M03757M51553j00486m99939r3817P87888J055887K96892n15257
35255A547602l64853K43010K2407j052101j605423q64695L09206P44948L59442
35246f60457k10508n27829m23225R9319N75115M29273m6345K6513N25240K77833
35236F4929p56697p82363J089689K773283J751361j170753k758485j661902K61743
35227a189195R87544N93625K1155m82932p98896l96003O05914J064990M33786
35218H39988l65457m90771l78911m97896k62690O06105R53859n9748j184594p80395
35208a620510N69729J021259L98880J13523M99703M43588k52308l31954N81397
35199A423307J130240N03673k24157m4677K99886k05779j031062j096884n47957
$$ plain form
35265 81716 -238876 164881 616434 515948 16009 -77808 710080 1765967 2062859 1547602
35255 1547602 1182749 1425759 1448166 396065 -1209358 -2074053 -1764847 -1019899 -660457
35246 -660457 -870965 -1398794 -1822019 -1722700 -1147585 -718312 -764657 -738144 -212904 64929
35236 64929 -691768 -1474131 -384442 2388841 4140202 2969449 210964 -1450938 -1189195
35227 -1189195 -201651 391974 413129 -69803 -868699 -1264702 -658788 406202 839988
35218 839988 474531 -16240 -395151 -893047 -1155737 -549632 404227 344479 -840115 -1620510
35208 -1620510 -1050781 -29522 369358 482881 982584 1426172 1173864 841910 1423307
35199 1423307 2553547 3057220 2833063 2788386 3088272 2882493 1851431 754547 206590
35190B06590k08345j06949J82618M36715K37477q0442p9959j74723p67865j145070
35180a499953n64784K08828J0959o03049j08573J342103J908251Q55093m38394
35171A110481p05243l55304j55936J12148P69053J265058J089202O59500M09030
35162D197989p1312j045453j693213j226237k31384J66982r5582l09553l39885
35153f47648n31285n96582J90257J658321K557549J954204K93376j022377q96887
35144B958928L67528J087079q7042k206964k743253q46026J287858J346273k6470
35135A137911o58774k72757l04476q76122n25281Q34492J236063j54973j403041
35126i86958p13345Q38039J120141Q4520o95064n93892k07340K60770J010654
$$ plain form
35190 206590 -1755 -108704 73914 510629 748106 667664 587705 412982 -354883 -1499953
35180 -1499953 -2064737 -1855909 -1844950 -2447999 -2556572 -1214469 693782 1548875 1110481
35171 1110481 405238 49934 -106002 6146 775199 2040257 3129459 3788959 4197989
35162 4197989 4126677 3081224 1388011 161774 -69610 97372 1790 -307763 -647648
35153 -647648 -1178933 -1775515 -1585258 73063 2630612 4584816 4878192 3855815 2958928
35144 2958928 3326456 4413535 4326493 2119529 -623724 -1469750 -181892 1164381 1137911
35135 1137911 479137 206380 -98096 -974218 -1499499 -665007 571056 416083 -986958
35126 -986958 -1700303 -862264 257877 342397 -352667 -946559 -1153899 -893129 117525
35117A17525J378325L82501j410152k181320j297837o2678L28699K57410N20681
35108a966846Q66262N68469k50762p56616n47164k7191K30899Q9673j31981m2408
35098a967665L57978O05891L51980j07430k19825J4662J06510p6127q4750L53360
35088f65416Q53276Q67757L20586l81117o44388q000J322746K164142J237067
35079E066653j201220l062792k411770K77104K330325J621852j070823k848778
35071a299449j949186K79639J237969M50543j62863N38720J198418M40799n54168
35062A80422R3686J546257J211067j034141k272636r06621R31312P60820n65644
35053e5478o14363O56822J095026o7594j151711p33088M07592O27935m31512j586432
$$ plain form
35117 117525 1495850 1878351 468199 -1713121 -3010958 -3073636 -2744937 -2487527 -1966846
35108 -1966846 -1100584 -532115 -782877 -1539493 -2086657 -2113848 -1882949 -1793276 -1925257 -1967665
35098 -1967665 -1609687 -1003796 -651816 -759246 -979071 -964409 -857899 -934026 -1018776 -665416
35088 -665416 187860 1055617 1376203 995086 350698 342698 1665444 3829586 5066653
35079 5066653 3865433 802641 -1609129 -1332025 998300 2620152 1549329 -1299449
35071 -1299449 -3248635 -2968996 -1731027 -1280484 -1443347 -904627 293791 734590 180422
35062 180422 274108 1820365 3031432 1997291 -275345 -1181966 -250654 510166 -55478
35053 -55478 -669841 -13019 1082007 1014413 -137298 -870386 -462794 165141 -266371 -1852803
35043a852803j360215O41351L043152L572250J406423j526397k506615j166898
35035B50248L16002J56686j035127j512471p08657L21894L65371n13306j038900
35026c398260l12358Q02612O20161p98123j212394P09042L064154L069631Q80777
35017C425242r06173j047452o56676n15383M7573J028398J012832k95411j002252
35008A090698J04769J551051J603003Q47402N41523J91014j000947j827563q57680
34999B243270O04851K17518j433884j629119m8325P44395k47675q17213M83673
34990A17491J779931J073659n36461j027744p58503j091985j356430o1021J805147
34981e5916J710805l67361j652349o88667P96495R23391K24790j4685K4163k77609
$$ plain form
35043 -1852803 -3213018 -2571667 471485 4043735 5450158 3923761 1417146 250248
35035 250248 566250 722936 -312191 -1824662 -2533319 -2211425 -1846054 -2359360 -3398260
35026 -3398260 -3710618 -2908006 -2287845 -3085968 -4298362 -3589320 -525166 2544465 3425242
35017 3425242 2519069 1471617 814941 299558 347131 1375529 2388361 2092950 1090698
35008 1090698 1195467 2746518 4349521 5196923 5738446 5929460 4928513 3100950 2243270
34999 2243270 2848121 3065639 1631755 2636 -45689 698706 451031 -366182 117491
34990 117491 1897422 2971081 2434620 1406876 648373 -443612 -1800042 -1861063 -55916
34981 -55916 1654889 1287528 -364821 -1053488 -256993 666398 891188 876503 900666 623057
34971F23057l01530O14547J392808N93980j033728j383786k04760M91895m49103
34962C43380j641213j395161j27784O48825O79394Q98117J515336J553629L60675
34953B835198j382932k405716k031991n67151R85075J564094R01697k12228q40772
34944a154726r02644q19076n20074L31429J241640J117196p9570r18387l87464
34935b091676O27597O27573l24350q21743l20571J02000m23399j005025k14801
34926c844395J585776K338249R90879r11092j204900k3804N90331j48154o61424
34917a288534K88346J441679J041793k56164n02497K20418L2995j192576j219529
34908a434069P30655K114145P96651j386668j217991J005280J897920O460k228093
$$ plain form
34971 623057 321527 936074 2328882 2922862 1889134 505348 300588 792483 343380
34962 343380 -1297833 -2692994 -2820778 -2171953 -1492559 -594442 920894 2474523 2835198
34953 2835198 1452266 -953450 -2985441 -3552592 -2567517 -1003423 -101726 -313954 -1154726
34944 -1154726 -2057370 -2876446 -3396520 -3065091 -1823451 -706255 -785825 -1704212 -2091676
34935 -2091676 -1464079 -836506 -1160856 -1982599 -2303170 -2201170 -2624569 -3629594 -3844395
34926 -3844395 -2258619 79630 1070509 159417 -1045483 -1069287 -478956 -627110 -1288534
34917 -1288534 -1000188 441491 1483284 1227120 724623 945041 978036 -214540 -1434069
34908 -1434069 -703414 1410731 2207382 820714 -397277 608003 2505923 2512383 284290
34899B84290k118012k79795O18696n39248k158348j982645L85923K972441L328071
34890E11373J087282j596451k439855j326731K97504J483869K098286J760417
34882A875694J45491j701212k015004o83027M36073R5343p60919p29155j2705
34873c349421L13996J96447M44616J034258Q25801p14566k278691j899979N88356
34864d839183K839083K436440n0431j564895n55380R30763L88674j262778j124616
34855b802323J056474K437264J463991n8282k56416M2888n04103j014561o7029
34846B97903J395812J316627j76069j057465n53348K01212M53779N99561N29058
34837C007070o12329k398001k766628p33274J927224K802707J682500K99239O703
$$ plain form
34899 284290 -1833722 -2113517 -1494821 -2034069 -4192417 -6175062 -5789139 -2816698 511373
34890 511373 1598655 2204 -2437651 -3764382 -3466878 -1983009 115277 1875694
34882 1875694 2021185 319973 -1695031 -2378058 -1941985 -1846642 -2607561 -3336716 -3349421
34873 -3349421 -3035425 -2838978 -2394362 -1360104 -534303 -1248869 -3527560 -5427539 -4839183
34864 -4839183 -2000100 436340 385909 -1178986 -1734366 -803603 -414929 -1677707 -2802323
34855 -2802323 -1745849 691415 2155406 2097124 1840708 1883596 1379493 364932 297903
34846 297903 1693715 3010342 2834273 1776808 1223460 1424672 1878451 2478012 3007070
34837 3007070 2394741 -3260 -2769888 -3503162 -1575938 1226769 2909269 3208508 3215211
34828C215211O52894J204063O67618j125523k921174k775697k98236K284888K403488
34819C307532K72188j476404j322425n46642p82460j405242q07239P30777J420217
34810f09698R25165P59327J343052R63527j126255k679191j510587R68962J696165
34801G30467M24077m41147L5619L09088l87627p58463k05608j00221j057575j474231
34791b925621l52455P30993L34572k90343M69227J550673J026382m68167q21909
34782g46648k8528O4776q62532j126855Q622J214707J287076O31025J89243L13959
34772I44845Q89625J383396Q72288q01217k203751j880586l29344Q47958J128121
34763H51335R96663N25014k59000l93840O57181J427475L94192j214474j002053
$$ plain form
34828 3215211 3868105 5072168 5739786 4614263 1693089 -1082608 -1380844 904044 3307532
34819 3307532 3579720 2103316 780891 234249 -548211 -1953453 -2760692 -2029915 -609698
34810 -609698 315467 1074794 2417846 3381373 2255118 -424073 -1934660 -965698 730467
34801 730467 1154544 713397 749016 1058104 670477 -87986 -293594 -393815 -1451390 -2925621
34791 -2925621 -3278076 -2547083 -2212511 -2502854 -2033627 -482954 543428 75261 -746648
34782 -746648 -775176 -710400 -1572932 -2699787 -2691165 -1476458 -189382 441643 630886 944845
34772 944845 1834470 3217866 4090154 3288937 1085186 -795400 -1124744 -276786 851335
34763 851335 1847998 2373012 2114012 1720172 2377353 3804828 4199020 2984546 1982493
34754A982493P56753J516315L96551r90805j477182j339140n49398R86925J590741
34745B873253m19681l015980k292805J434922L416718J451438j127784j192298
34737A127783k55884o14014j063341J74731J588108J099496o1612J15235M84757
34728B595259q16238k220204j194815R38837J046369l20314o3742J672831J674254
34719C312237n09635j644234l47990Q39997P8083j024759p60301R144J37202J32179
34709B21923K74970l59052j496967j133958R57695K042034O60739p56577J32081
34700E42888J619746Q51778j400060k107859p78416L88553M17951M82221J024811
34691A041613Q78070k89955j097893p74846l42669n85853o03505M56107J607124
$$ plain form
34754 1982493 2739246 4255561 4652112 3661307 2184125 844985 295587 1282512 2873253
34745 2873253 2453572 -562408 -2855213 -1420291 1996427 3447865 2320081 1127783
34737 1127783 871899 257885 -805456 -630725 957383 2056879 1995267 2110502 2595259
34728 2595259 1779021 -441183 -1635998 -697161 349208 28894 -34848 1637983 3312237
34719 3312237 2802602 1158368 810378 1650375 1728458 703699 -56602 -47458 89744 221923
34709 221923 496893 137841 -1359126 -2493084 -1535389 506645 1167384 410807 542888
34700 542888 2162634 3014412 1614352 -493507 -1271923 -883370 -465419 16802 1041613
34691 1041613 1919683 1629728 531835 -243011 -585680 -1171533 -1775038 -1318931 288193
34682B88193J365299J3849q60557o49826j87514k9564L24734J060588J161549
34673B486751q7397j527441j413163L5336Q46101J64289o67239m29659J82505
34664d09917J19170j62851J50790M67504n2569n70184J30860J115569M34638j460280
34654b37270j948935j76558J654422J619029M67022k96802o42975r87865p26682
34645a276614N47868J624114J111050m98443j546032j322535l41292P84173J581224
34636F63513J437351K37185j062883j398504q25571j22975L51045O95760Q07313
34627G82234M23747l64758j080689j171533l57477Q54032J199577P5088j268281
34618i08060j117052K60277J045458O81476L64839N21125M9344j184065j466394
$$ plain form
34682 288193 1653492 1667341 806784 156958 -30556 -60120 264614 1325202 2486751
34673 2486751 2399354 871913 -541250 -505914 340187 504476 -162763 -592422 -409917
34664 -409917 -290747 -453598 -302808 164696 112127 -458057 -327197 788372 1223010 -237270
34654 -237270 -2186205 -2362763 -708341 910688 1377710 1080908 437933 -549932 -1276614
34645 -1276614 -728746 895368 2006418 1507975 -38057 -1360592 -1701884 -917711 663513
34636 663513 2100864 2338049 1275166 -123338 -948909 -1071884 -720839 -25079 782234
34627 782234 1205981 841223 -239466 -1410999 -1768476 -914444 285133 360221 -908060
34618 -908060 -2025112 -1764835 -719377 -37901 326938 848063 897407 -286658 -1753052
34609a753052j12427J032002N81281n5057O59822J430427L88226j304046j054922
34600a87746Q98652J827870P59427m32969l26735J79971j42658r91472j360767
34591B23573q56548K66616J354079J572244P97767p434j98103m47021j189306
34582A515867j266412R5621J188322J21735j722585j445137O44911J287904n97713
34573a77487k322941j713252P9536J196487J664416J909117J277377j87865p28078
34564I97310M93317J646109R72677n19141j003477p32093q54883r20916J0851
34555H9754R27580R9629j868652k627391j443648J62691R84371J265552J239147
34546a170967N39142n17531p49649J80235J130584J077339L33321k47866l89358
$$ plain form
34609 -1753052 -1865479 -833477 -252196 -307253 352569 1782996 2171222 867176 -187746
34600 -187746 710906 2538776 3298203 2865234 2538499 2718470 2575812 1584340 223573
34591 223573 -632975 -366359 987720 2559964 3357731 3350297 3152194 2705173 1515867
34582 1515867 249455 345076 1533398 1655133 -67452 -1512589 -867678 420226 -177487
34573 -177487 -2500428 -4213680 -4134144 -2937657 -1273241 635876 1913253 1725388 997310
34564 997310 1490627 3136736 4109413 3590272 2586795 1854702 999819 78903 89754
34555 89754 1017334 1116963 -751689 -3379080 -4822728 -4660037 -3675666 -2410114 -1170967
34546 -1170967 -631825 -1149356 -1899005 -1718770 -588186 489153 822474 574608 185250
34537A85250k82056n5175K25356M02264K61190l92496j415076j915450q80805
34528c866998J256967K524145J727579N3379o90746n17397n68286q91996p71151
34519a744504o42765j444252k220977r19528J969601L133956R81018j805382j946115
34510d638948O0226J350640J065819P57669J091763Q51132m75851j420745p67687
34501b125982N90744J096778O38220J59088P2141J35884K56801L72879K8194r23002
34491C01745j588736j081952l342K73149l40672n78910R9261P57015P45460Q09462
34481f07520J540989J942691Q37130j053109j860539j084853l6539J49979k71946
34472d43717n51435m35075K5200P44498J313045J144353K57803o27992r72854
$$ plain form
34537 185250 -96806 -151981 73375 475639 736829 344333 -1070743 -2986193 -3866998
34528 -3866998 -2610031 -85886 1641693 1695072 1004326 486929 -81357 -973353 -1744504
34519 -1744504 -2387269 -3831521 -6052498 -6972026 -5002425 -1868469 -887451 -2692833 -4638948
34510 -4638948 -4578722 -3228082 -2162263 -1404594 -312831 538301 62450 -1358295 -2125982
34501 -2125982 -1535238 -438460 199760 358848 430989 566873 823674 1196553 1224747 301745
34491 301745 -1286991 -2368943 -2372285 -2099136 -2439808 -3018718 -2919457 -2162442 -1416982 -607520
34481 -607520 933469 2876160 3713290 2660181 799642 -285211 -321750 -171771 -443717
34472 -443717 -995152 -1430227 -1405027 -660529 652516 1796869 2054672 1426680 453826
34463D53826q60252n10922N215M78570O28366N62419N78652N40678J36440l57177
34453A655815m24768l23726p35568j450602j537575q51556j25884M81614J445236
34444a867014K287782J705231j58294j350704q84082j04959k47599m94354Q7505
34435a026488N44107j10291o83158K29720J385889O69180j166997j456153L8100
34426a576091Q08796j06781o21903N98407J634668L93051j869014k248344k82875
34417c270086J688405J810812O87160j2907K58728N82024j8273j207723j662988
34408a144848q43849J65638K41365m1847M85375J233608M74452j536088k150583
34399c116777l1139K487987K265965n24063k759224k287042r633J762624J778912
$$ plain form
34463 453826 -406426 -917348 -912133 -433563 194803 757222 1335874 1876552 2012992 1655815
34453 1655815 1231047 907321 171753 -1278849 -2816424 -3667980 -3793864 -3312250 -1867014
34444 -1867014 420768 2125999 1967705 617001 -267081 -372040 -619639 -1113993 -1026488
34435 -1026488 -482381 -592672 -1275830 -1046110 339779 1008959 -158038 -1614191 -1576091
34426 -1576091 -767295 -874076 -1495979 -897572 737096 1130147 -738867 -2987211 -3270086
34417 -3270086 -1581681 229131 916291 903384 1162112 1744136 1725863 518140 -1144848
34408 -1144848 -1988697 -1823059 -1581694 -1623541 -1138166 95442 569894 -966194 -3116777
34399 -3116777 -3147916 -659929 1606036 1081973 -1677251 -3964293 -3973926 -2211302 -432390
34390d32390N29810o32686p13475K15013J320934J960875K046675J580264N34436
34381F409456o06554r72167m11865J71520L6790m80135p18941o95726p82355r31637
34371A018386p95614k58751M75180R35513M85372r01795j948722j225519P93526
34362a422424K047104J599847O13581J02523n26800j686938k179826j150051N5622
34353b547362r2883o57695K07617J927229K152127L86857j374661j668516j070790
34344b738077m67502J46270O77819N70622L4960J27955J078279J861159J758239
34335C049724J002777j90934j617833k116308o83002J203635P70332j876719l329849
34326c788177j765644M18277N90295j18939O67773K230306K106318M72549j88293
$$ plain form
34390 -432390 97420 -535266 -1248741 -1033728 287206 2248081 4294756 5875020 6409456
34381 6409456 5802902 4830735 4418870 4590390 4627180 4147045 3428104 2732378 1950023 1018386
34371 1018386 222772 -35979 439201 1374714 1860086 958291 -990431 -2215950 -1422424
34362 -1422424 624680 2224527 2838108 2940631 2413831 726893 -1452933 -2602984 -2547362
34353 -2547362 -2640245 -3297940 -3090323 -1163094 989033 1375890 1229 -1667287 -2738077
34344 -2738077 -3205579 -3059309 -2381490 -1810868 -1775908 -1647953 -569674 1291485 3049724
34335 3049724 4052501 3861567 2243734 127426 -555576 648059 1418391 -458328 -3788177
34326 -3788177 -5553821 -5135544 -4545249 -4664188 -3996415 -1766109 340209 812758 624465
34317F24465P13231J212695L86361l80203k31183k31375j030586j512078q88939
34308a337612r9038Q9281M59912J471873J799815M68417j029007p51216N54532
34299A626957M89303j277507k464766j512663L89678J219127O49780j77663m25906
34290a483660j09239N82861J470072J916284J056717j051229k935059k997351
34282c550604j299431M99217J142618J045395J096914J005696n3371j540330j765448
34273c419344k35064J531632K051654J558446R61958L45955m70623q98783m11301
34264A014530K53854K6539q02018j060446n06442J07683M76978Q96821J143818
34255A551317O50794j55367j41287O57643Q39023k67826j587569j908634j322296
$$ plain form
34317 624465 1337696 2550391 2936752 2556549 2325366 2093991 1063405 -448673 -1337612
34308 -1337612 -1436650 -1347369 -887457 584416 2384231 2852648 1823641 1072425 1626957
34299 1626957 2116260 838753 -1626013 -3138676 -2748998 -1529871 -880091 -1057754 -1483660
34290 -1483660 -1592899 -1010038 460034 2376318 3433035 2381806 -553253 -3550604
34282 -3550604 -4850035 -4350818 -3208200 -2162805 -1065891 -60195 -113566 -1653896 -3419344
34273 -3419344 -3654408 -2122776 -71122 1487324 2449282 2795237 2324614 1425831 1014530
34264 1014530 1268384 1294923 492905 -567541 -1073983 -966300 -489322 407499 1551317
34255 1551317 2202111 2046744 1905457 2563100 3402123 3134297 1546728 -361906 -1684202
34246a684202m78790M20647J162821J117777J58119q18189j019309o87799l36634
34237b165559N9479M98660N41155J58713J8101K43590P0386m66414M0010J990601
34227I88722L312508K169728m6906o11969M56594O75987q13506k025926j413255
34218B691977n9809L14360k66238o98410m82077K22275J126431J617140J013195
34209E478844l25222j090368p48358j70501j35569l68563n26813q39638j187498
34200H6314r06174j71968j16987p75320n49552J164367K473481J615807l16608
34191B503360r92818n1596J042215J370781J027436Q7246j084160j304122j79838
34182B418504O23806k93460j437325n23818J582839J933550J84356r41107j63068
$$ plain form
34246 -1684202 -2162992 -1742345 -579524 538253 696372 -121817 -1141126 -1828925 -2165559
34237 -2165559 -2106080 -1607420 -1066265 -907552 -889451 -645861 -575475 -1041889 -1001879 988722
34227 988722 4301230 6470958 6424052 5812083 6268677 6944664 6131158 4105232 2691977
34218 2691977 2632168 2946528 2680290 1981880 1499803 1722078 2848509 4465649 5478844
34209 5478844 5153622 4063254 3314896 3144395 3008826 2640263 2113450 1273812 86314
34200 86314 -819860 -991828 -1108815 -1884135 -2433687 -1269320 1204161 2819968 2503360
34191 2503360 1510542 1458946 2501161 3871942 4899378 4986624 3902464 2598342 2418504
34182 2418504 3042310 2748850 1311525 787707 2370546 4304096 4488452 3547345 3384277
34173C384277O11591l1635p00242r2433N23008k88080j439976j204724n0339N25493
34163A236940N50888Q45181R76891J45835q70828q08909j59421k08785n69165
34154A138627P5386J271737J238440j40545j079560p76640l30304m46090l71548
34145E79503K83075O37596K56496K3579M22619N43051k29065r99244r18604o22290
34135b3284r18437j174250l41237J189777K005509J471365J77754r61990j319728
34126A05479p78154J6881J97917p9822K16128J130825J215760k46720j772733
34117E561j687887n22045J00982M7516L88124J137905J213888M93500R4978M50714
34107A723236P08570L40623r9109j87201k95817o53813r04051r04363q39198l82139
$$ plain form
34173 3384277 3995868 3964233 3263991 3171558 3694566 3406486 1966510 761786 711447 1236940
34163 1236940 1787828 2633009 3609900 3755735 2884907 2075998 1916577 1707792 1138627
34154 1138627 1214013 2485750 3724190 3583645 2504085 1727445 1397141 951051 579503
34145 579503 862578 1500174 1756670 1780249 2202868 2745919 2516854 1517610 599006 -23284
34135 -23284 -941721 -2115971 -2457208 -1267431 738078 2209443 2387197 1425207 105479
34126 105479 -672675 -655794 -457877 -537699 -321571 809254 2025014 1778294 5561
34117 5561 -1682326 -2204371 -2103389 -2055873 -1667749 -529844 684044 1177544 1272522 1723236
34107 1723236 2431806 2772429 2673320 2486119 2190302 1536489 632438 -271925 -1111123 -1493262
34097a493262Q90422K041311J394827p91691j978749o70352J413151J749479L31113
34088B886249q90280q83051k58148K67332N59701M83695m3543n23500m46382j78124
34078I73949l05097m19406L47649J797036K735974K454808J228878l64430j668604
34069F780757j898662j014679k65589o36984j245903p82990L048o56410k199493
34060a916905j959671O60972K781105K131237L26965J50646J320945J358113l43786
34051D509621j815780j651859o30004Q0547M99018R99389J253822P91599j52838
34042C883515q90392r26921k04503Q19015J329222R06882K8365o31979j017017
34033C296187j195416p16857M77541J126638J42145j313260j039127Q97204K050029
$$ plain form
34097 -1493262 -602840 1438471 2833298 2041607 62858 -607494 805657 2555136 2886249
34088 2886249 1995969 1112918 854770 1122102 1681803 2165498 2121955 1598455 1152073 973949
34078 973949 668852 249446 597095 2394131 5130105 7584913 8813791 8449361 6780757
34069 6780757 4882095 3867416 3601827 2964843 1718940 935950 938998 282588 -1916905
34060 -1916905 -3876576 -3215604 -434499 1696738 2023703 2174349 3495294 4853407 4509621
34051 4509621 2693841 1041982 411978 492525 991543 1990932 3244754 4036353 3883515
34042 3883515 2993123 2066202 1861699 2680714 4009936 4916818 4945183 4313204 3296187
34033 3296187 2100771 1383914 1861455 2988093 3130238 1816978 777851 1675055 3725084
34024C725084J202693k6602q9759J40298n13687r91592J95757J932193J857408
34015G431793J40449p59562n7825K96775q98995k086674j623045l65538M3381
34006B120759j63915K08871R67930J085295P85231R97768J224786J65134j602844
33997E789015j844109j6718J718321J629449N88300N5507j47919n44525k96084
33988F931237J138459K057030P23381j350572j104427J355616K661174J196817
33980A3608715p09528p14759J62505n2979p66790j61502J378487J828954Q40807
33971A5413910P3007M52917J287134K049169K897210L221458J893611l79727r94229
33962B5914460J178744L991441M825200L850612L134055L611974M552511N374851
$$ plain form
34024 3725084 4927777 4901175 4811416 4951714 4438027 3446435 3642192 5574385 7431793
34015 7431793 7572242 6812680 6754855 7051630 6152635 4065961 2442916 2077378 2120759
34006 2120759 1956844 2165715 3133645 4218940 5004171 6001939 7226725 7391859 5789015
33997 5789015 3944906 3928188 5646509 7275958 7864258 7919765 7771846 7227321 6931237
33988 6931237 8069696 10126726 10850107 9499535 8395108 9750724 12411898 13608715
33980 13608715 12899187 12184428 12346933 12293954 11527164 11365662 12744149 14573103 15413910
33971 15413910 15486917 15939834 17226968 19276137 22173347 25394805 27288416 26908689 25914460
33962 25914460 27093204 31084645 35909845 39760457 42894512 46506486 51058997 56433848
33954E6433848O362991P668729Q941006J0150855J1831267J4217960J6789176
33947A32395832J8887594K0373536K1492566K2297927K2195452K0005456J4812543
33940B72460906P003435j849546j0285469j7582330k2907113k4922767k3300961
33933A78616155k0040245j7922692j7562763j6987057j4354639j0240020o879259
33926G4629480n808636o594325p389457o486440l839052j336553j059520k929890
33918C9185607m603510m127268k198483j144176j999667l454254l737645k702384
33910A5218220j545380j019963p12549m4349P41074R46142L53995o20401j440861
33901A1875928j683760j045385K36899J066181L82673j394441k523027j927749
$$ plain form
33954 56433848 62796839 70465568 79406574 89557429 101388696 115606656 132395832
33947 132395832 151283426 171656962 193149528 215447455 237642907 257648363 272460906
33940 272460906 279464341 277614795 267329326 249746996 226839883 201917116 178616155
33933 178616155 158575910 140653218 123090455 106103398 91748759 81508739 74629480
33926 74629480 68820844 62226519 54837062 48350622 44511570 43175017 42115497 39185607
33918 39185607 34582097 30454829 28256346 27112170 25112503 21658249 17920604 15218220
33910 15218220 13672840 12652877 11940328 11895979 12637053 13583195 13937190 13316789 11875928
33901 11875928 10192168 9146783 9383682 10449863 10832536 9438095 6915068 4987319
33893D987319m20508N44669O81145O72809O77222J10153j082938j924130j540661
33884B705080k04507J090937J633612J306080L71779o51885j194711j078837o43732
33875C333816k65368Q420J77447J7657n20110q88818m54128N61157J120943N96642
33865C687658l73446o12482J10683P52556L27542p59458j141784k09887J059933
33856B841315J228263M8577j310163j533602l65051J309454K219059J634454k6694
33847F045612j433956j535656o38112J0164k25807p00779o09228j74804q7905
33838F49529j70506M01069J488832J704489L32905j326458j528140m52230K18707
33829A318197j07631k38835N65846J178367M16613q73165r49826K28049J011210
$$ plain form
33893 4987319 4566811 5111480 5792625 6465434 7142656 7252809 6169871 4245741 2705080
33884 2705080 2500573 3591510 5225122 6531202 6902981 6251096 5056385 3977548 3333816
33875 3333816 3068448 3076868 3254315 3271972 2751862 1863044 1408916 1970073 3091016 3687658
33865 3687658 3314212 2701730 2812413 3564969 3892511 3133053 1991269 1781382 2841315
33856 2841315 4069578 4118155 2807992 1274390 909339 2218793 4437852 6072306 6045612
33847 6045612 4611656 3076000 2437888 2448052 2222245 1521466 912238 737434 649529
33838 649529 479023 880092 2368924 4073413 4406318 3079860 1551720 1099490 1318197
33829 1318197 1210566 971731 1537577 2715944 3132557 2259392 1309566 1537615 2548825
33820B548825M57466o64888j333338j452503j318577j037279q42325j000601j051090
33811e694310j36044J512907K444708J856901O26511p3684k07862k90908l43070
33802c04851j92948J166K00091O00064P83779n4094j350067j155765R73381K631797
33792B132553J724696m52485j307119q35003q81684j431214p03013J154825J644923
33783A046479p5783j606027r71005N33714P53097r0333m13099Q413K61078K00184
33773c53282L30691M57547K0306o75008q20323k87054N09104J281135J532329
33764A995445N10954j365892k123013p46338Q95421M53849j354078j739768j8910
33755c492330J531792J207099L0213l64699p5793p142o7076L30377Q61752P03517
$$ plain form
33820 2548825 3006291 2341403 1008065 -444438 -1763015 -2800294 -3642619 -4643220 -5694310
33811 -5694310 -5830354 -4317447 -1872739 -15838 610673 536989 329127 38219 -304851
33802 -304851 -497799 -496633 -296542 303522 1087301 1033207 -316860 -1472625 -499244 2132553
33792 2132553 3857249 3404764 2097645 1262642 380958 -1050256 -1753269 -598444 1046479
33783 1046479 970696 -635331 -1606336 -1072622 -319525 -409858 -822957 -814544 -553466 -353282
33773 -353282 -22591 434956 455262 -219746 -1040069 -1327123 -818019 463116 1995445
33764 1995445 2506399 1140507 -982506 -1728844 -833423 -379574 -1733652 -3473420 -3492330
33755 -3492330 -1960538 -753439 -723226 -1087925 -1163718 -1170860 -1237936 -907559 -45807 657710
33745F57710p4810n54540k42097L96033N71761n8272j065882j447154n31579J018544
33735a330286J602281N10499j046238j270954R9002J524934J469956O8815j114880
33726E13129q37955M82047J332213R60749J78070k2625R215o52607j633405j544861
33716a216030l18844K84681o77354j555771m20515J757219K134115P0789j783383
33707a725093j146640Q02859J309051l1916r29431K36545K322066L125556J974511
33698E937508j00581j850314k554109j952701n36241M05007R4273m99384J40203
33689i16339J672420K065709N33749j171780j306144o21887q72379j810036j609547
33680d036234l606J053472L26012q60212o89949N68630J327460J094366O82544
$$ plain form
33745 657710 582900 28360 -213737 182296 754057 695785 -370097 -1817251 -2348830 -1330286
33735 -1330286 271995 782494 -263744 -1534698 -1435696 89238 1559194 1628009 513129
33726 513129 -324826 157221 1489434 2450183 2628253 2605628 2614843 1962236 328831 -1216030
33716 -1216030 -1534874 -1250193 -1927547 -3483318 -3903833 -2146614 -12499 58290 -1725093
33707 -1725093 -2871733 -2068874 -759823 -791739 -1721170 -1484625 837441 3962997 5937508
33698 5937508 5836927 3986613 1432504 -520197 -1056438 -651431 -557158 -1056542 -916339
33689 -916339 756081 2821790 3355539 2183759 877615 255728 -616651 -2426687 -4036234
33680 -4036234 -4039840 -2986368 -2660356 -3520568 -4210517 -3641887 -2314427 -1220061 -537517
33671e37517M81084M2871n62933m04517P79373J763150J334514o2461j006028
33662A827536r82556p05489p42072p85496m68413o4593N7163P2331K69666M18769
33652a103154J27478m58712q14248o27958J79323J570500K891178K798929P48275
33643E311611j702969k288926q03110P18910P74993K7903l14848l42704p03715
33634F77145j141467r70140l00606K90958P26405J066118Q37716j76734j080099
33625g0704r63912l28526j70612k45055K95008J027574P89001j38975k74496N00029
33615D19332N66343p34281j900618j617155o34354j93646L64Q73385K066851K340753
33605A186974J358552j488p22811l44132P99316J416169K39240k052678k943560
$$ plain form
33671 -537517 -56433 -13562 -576495 -981012 -201639 1561511 2896025 2833564 1827536
33662 1827536 844980 139491 -602581 -1388077 -1856490 -1921083 -1863920 -1791589 -1521923 -1103154
33652 -1103154 -975676 -1434388 -2248636 -2876594 -2697271 -1126771 1764407 4563336 5311611
33643 5311611 3608642 1319716 516606 1235516 2010509 2038412 1723564 1380860 677145
33634 677145 -464322 -1434462 -1735068 -1444110 -717705 348413 1186129 1009395 -70704
33625 -70704 -1034616 -1363142 -1533754 -1778809 -1483801 -456227 332774 193799 -80697 419332
33615 419332 985675 251394 -1649224 -3266379 -3900733 -4094379 -4094015 -3220630 -1153779 1186974
33605 1186974 2545526 2544038 1821227 1477095 2276411 3692580 3931820 1879142 -1064418
33596a064418j184226J264205J787255O67201K65752J241882J740487M91630j302177
33587C907591j916349j388362q60913p52869o66262m32559k40556n2973L16795
33578b086457P19809Q42860P11791N58830L65912Q752k83402j20709L94856O70406
33568A782648L97814m1053j42277N0789J42609L8518k212R3160P7936j13031k22042
33557B062859k71310p60021j769725k365525j643158j03875Q51245O95181J85740
33548c118589L4418J31955K37000M26958N57853K50454k13066J1719R01761J348572
33538E69035R20881N76654Q39051P13787l60596r64527J09657J333848M27085
33529D164875j831155k410639o22934Q30061Q9729j152054n80220J187628J834083
$$ plain form
33596 -1064418 -2248644 -984439 802816 1470017 1735769 2977651 4718138 5209768 3907591
33587 3907591 1991242 602880 -258033 -1010902 -1677164 -2109723 -2350279 -2403252 -2086457
33578 -2086457 -1366648 -523788 188003 746833 1112745 1121497 838095 717386 1112242 1782648
33568 1782648 2180462 2139409 1997132 2047921 2190530 2229048 2226836 2319996 2397932 2284901 2062859
33557 2062859 1791549 1031528 -738197 -3103722 -4746880 -4850755 -3999510 -3304329 -3118589
33548 -3118589 -3084171 -2952216 -2715216 -2288258 -1730405 -1479951 -1693017 -1681298 -779537 569035
33538 569035 1489916 2066570 2905621 3619408 3258812 2294285 2403942 3737790 4164875
33529 4164875 2333720 -76919 -699853 130208 219937 -932117 -1512337 -324709 1509374
33520A509374P37916p62491j589760j592146o18229J214352K572726K012595J48104
33511C632441q35962j24793P33422K68174q81584j240631o88028k34957k95095
33502C32987l83867k66020k60225l49439j0935P31274R36961K6146j155482j282223
33492a680823k56810Q09830J229842J433830J764201J527575J10272j499974j505200
33483A932743K78897J871894J563203N6849o97281k40102N4983p00744j626563
33474B493879j657281j211042j192704j177002q6590J622761K151256J018166
33466A961443j14634m6478J28675q84450k036612j437887L90249J074364R1804
33457h73526m88303M69445J245455J83692j420656j275900L24894J051979J39024
$$ plain form
33520 1509374 2247290 1484799 -104961 -1697107 -2315336 -1100984 1471742 3484337 3632441
33511 3632441 2796479 2671686 3405108 3673282 2791698 1551067 863039 628082 332987
33502 332987 -50880 -316900 -577125 -926564 -937499 -206225 730736 756882 -398600 -1680823
33492 -1680823 -1937633 -1127803 102039 1535869 3300070 4827645 4937917 3437943 1932743
33483 1932743 2211640 4083534 5646737 5703586 5006305 4766203 4821186 4120442 2493879
33474 2493879 836598 -374444 -1567148 -2744150 -2830740 -1207979 943277 1961443
33466 1961443 1846809 1800331 1929006 1044556 -992056 -2429943 -2039694 -965330 -873526
33457 -873526 -1361829 -892384 353071 536763 -883893 -2159793 -1834899 -782920 -643896
33448f43896o85539p224J319593J648469P28420l78725q59546q89597j033987
33439h02032j367782j336986n47189M72835P99827M45934L55945P83426P54894
33430d41128j05384m11623R60046K567963J925067r46293l237008k800130m04364
33421b892854J716461K184813R89301r76495k259818j763879N2742J563737J803433
33412D17441J138416J36727j043758j926928j699167m59614O01915P93334O62796
33403a378838P34598O79489L03621J63648M78304N32794p1529o27575n53198l61618
33393a00304n95825q36605o07036k19755Q8302O89518J362597R66393n04110j053120
33383h09945M76306K068932J156237j394660k316772n74261J465448J639116N30553
$$ plain form
33448 -643896 -1329435 -1336659 -17066 1631403 2359823 1981098 1121552 231955 -802032
33439 -802032 -2169814 -3506800 -4053989 -3581154 -2781327 -2335393 -1979448 -1196022 -441128
33430 -441128 -546512 -958135 1911 2569874 4494941 3548648 311640 -2488490 -2892854
33421 -2892854 -1176393 1008420 1997721 1021226 -1238592 -3002471 -2949729 -1385992 417441
33412 417441 1555857 1692584 648826 -1278102 -2977269 -3436883 -2834968 -2041634 -1378838
33403 -1378838 -644240 35249 338870 502518 980822 1513616 1442087 814512 261314 -100304
33393 -100304 -696129 -1532734 -2139770 -2359525 -2271223 -1581705 -219108 747285 243175 -809945
33383 -809945 -333639 1735293 2891530 1496870 -819902 -1394163 71285 1710401 2240954
33374B240954j98653j38271J34859K77812J80345l35013j017609j028999J13993
33365B29418J804483K816965K250780K02325j988546k571783j285721P595l96750
33356A068766j641574j559412Q3499J374727J258531P79662Q68110Q05549j63532
33347B874326j282129j474961q70721j19427O33524J103318N02859r31602j337290
33338i02103K59220J915342J207792j035977j703520M7856J588009P78673j027912
33329A127380j299235l6130O67871K904n96100L6900R99803Q03117m34814j311177
33319c9481j135246n54393k87061j97430R8964M37904L87908o7591n12978n34064
33309b403468n699P24843Q99928J61813o21656j86866J179533J610961K76184
$$ plain form
33374 2240954 2042301 1904030 2038889 2316701 2497046 2162033 1144424 115425 229418
33365 229418 2033901 4850866 7101646 7303971 5315425 2743642 1457921 1465516 1068766
33356 1068766 -572808 -2132220 -2048721 -673994 584537 1364199 2232309 3037858 2874326
33347 2874326 1592197 117236 -753485 -872912 -239388 863930 1366789 435187 -902103
33338 -902103 -642883 1272459 2480251 1444274 -259246 -211390 1376619 2155292 1127380
33329 1127380 -171855 -207985 459886 462790 -133310 -96410 903393 1706510 1271696 -39481
33319 -39481 -1174727 -1729120 -2016181 -2213611 -2114647 -1676743 -1288835 -1356426 -1869404 -2403468
33309 -2403468 -2409167 -1684324 -784396 -622583 -1244239 -1431105 -251572 1359389 1635573
33300A635573j116850o30060J009140J403536j14484j767422j903570o85249Q44932
33291a324454J804425J410186m61852k267977j997087O4010J414742Q43149j7837
33282e32695L33216P43702l81507j987241j813292l1913R85800L05512m42341
33273b820759J26954J181104J238775K46821p55545j047076n87496K52902P52706
33264a411614L20867n83079o97393L45520J258053P27639p33017j437961q02202
33255c013187k3207k75011j013657p74550O45354J693728J065227m97319j125393
33246c318015j89320J147625J642195J234998M49725l70739p65081j77690R69699
33237F23397J225200Q7730q95459k48931J040845Q76855o79607j402158k81651
$$ plain form
33300 1635573 518723 -111337 897803 2301339 2186855 419433 -1484137 -2169386 -1324454
33291 -1324454 479971 1890157 1428305 -839672 -2836759 -2772749 -1358007 -514858 -532695
33282 -532695 -199479 544223 162716 -1824525 -3637817 -3669730 -2683930 -2378418 -2820759
33273 -2820759 -2693805 -1512701 -273926 -27105 -782650 -1829726 -2417222 -2164320 -1411614
33264 -1411614 -1090747 -1673826 -2371219 -2025699 -767646 -40007 -773024 -2210985 -3013187
33255 -3013187 -3036394 -3311405 -4325062 -5099612 -4454258 -2760530 -1695303 -2192622 -3318015
33246 -3318015 -3507335 -2359710 -717515 517483 967208 596469 -168612 -346302 623397
33237 623397 1848597 1936327 1040868 791937 1832782 2709637 2030030 627872 346221
33228C46221R64095M76521j161942j983980j235865J79635J168881J295780N88798
33219F38144m97167j072418n71483M98811J149445J127510R33673P64928K71268
33210C242711m68669n96528K93299J160059O67781q36245j535972o37928L95106
33201A683614p4224j390294j569526l56158L78549m22466j357931p71437Q12337
33192c067536J741010J650033J336236J017469L82590j17263K14716P22981J01728
33183C981964j291147j665098o10920K17199j76960o35263n1628P12784N04724
33174I85655l8817K30718P70928L32920n98335m05545Q40885J178652l04599k038400
33164I54062k188417j030988k30274n71039j281098j204258j82J636227K569002
$$ plain form
33228 346221 1310316 1786837 624895 -1359085 -2594950 -2415315 -1246434 49346 638144
33219 638144 140977 -931441 -1502924 -1004113 145332 1272842 2206515 2971443 3242711
33210 3242711 2774042 2177514 2470813 3630872 4298653 3462408 1926436 1288508 1683614
33201 1683614 1609390 219096 -1350430 -1706588 -1328039 -1750505 -3108436 -3879873 -3067536
33192 -3067536 -1326526 323507 1659743 2677212 3059802 2942539 3157255 3880236 3981964
33183 3981964 2690817 1025719 414799 631998 455038 -180225 -231853 480931 985655
33174 985655 946838 1177556 1948484 2281404 1683069 1277524 2118409 3297061 2992462 954062
33164 954062 -1234355 -2265343 -2495617 -3066656 -4347754 -5552012 -5552194 -3915967 -1346965
33155a346965K188820J002411J07329K8457L17488K93816j65970o20560n44505
33146A260321J56013Q22369M67680r49359j939355j062620R11321J555393n7550
33137A164213j882562j542707M32240J408189L37437r86119p10115N64634J092000
33128a22790P25610Q16437J700837J947383N80871j248173j774358r76034k61392
33119A388391k15197j3360P59155J026155k02763j956448k162101l15884J679715
33110a2337J749104R3308j225786q77866L49707R29064N57194L1288l43143j066823
33100A83710k057046k148475p08675J109261J700489J036742L41713K00467K04057
33091a37757K02018M80814O39343k05535j686948k131518r40914L57003M17763
$$ plain form
33155 -1346965 841855 1844266 1951595 1980052 2297540 2591356 2425386 1804826 1260321
33146 1260321 1416334 2238703 2706383 1757024 -182331 -1244951 -333630 1221763 1164213
33137 1164213 -718349 -2261056 -1828816 -420627 -83190 -1069309 -1779424 -1214790 -122790
33128 -122790 602820 1419257 3120094 5067477 5648348 4400175 2625817 1649783 1388391
33119 1388391 1173194 1159834 1918989 2945144 2742381 785933 -1376168 -1692052 -12337
33110 -12337 1736767 1830075 604289 -273577 76130 1005194 1562388 1593676 1250533 183710
33100 183710 -1873336 -4021811 -4730486 -3621225 -1920736 -883994 -542281 -341814 -137757
33091 -137757 64261 545075 1184418 978883 -708065 -2839583 -3780497 -3423494 -3005731
33082c005731J17591R01139K159963K052300M60528p03570k28275R27762J255101
33073C936808M89227o98140j691533k016969j364989k09915L30096p2302l26613
33064a624330M89514J502210J054295q36555k159971j408220M75794J379800P72868
33055c54595J56886O84708J429441Q55542o93005j291922j73809J185860J170532
33046B969638L561j105656j652290j632837p23670R00207J757014Q23625m31898
33037I07694J61303J849416J573022j275832l320657j867233J145595K041994
33029A215302O06865l46546K50375M86169p66526j826969j204864k28650p04712
33020b519556j599233n36111K080363L072059R92623j639663j775450J74876J437127
$$ plain form
33082 -3005731 -2888140 -1987001 172962 2225262 2685790 1982220 1753945 2681707 3936808
33073 3936808 4426035 3727895 2036362 19393 -1345596 -1555511 -1225415 -1297717 -1624330
33064 -1624330 -1134816 367394 1421689 585134 -1574837 -2983057 -2507263 -1127463 -354595
33055 -354595 -197709 486999 1916440 2771982 2078977 787055 613246 1799106 2969638
33046 2969638 2973199 1867543 215253 -1417584 -2141254 -1241047 515967 1339592 907694
33037 907694 1068997 2918413 4491435 3215603 -105054 -1972287 -826692 1215302
33029 1215302 1822167 1475621 1725996 2212165 1445639 -381330 -1586194 -1814844 -2519556
33020 -2519556 -4118789 -4654900 -2574537 497522 1490145 -149518 -1924968 -1750092 -312965
33011c12965R22202J75055M91265J080568P17745k96274q34694o23567k02036
33002A117299R9805J84308k14593r78379j197873l65045N55207M15429k81270
32993f65112k67121K13319j73332j226903j099504O83023K082627J419122l23306
32984F42813j243257j061357n81350j3287O27417O50760j42712n17637K68747
32975a369863P46335n20517k045202j322610J040662J972053O07113o64643k55890
32966a812562N28918M56660M93256J355587J556914L7422j397853p39327P84750
32957A263765O09628r81894j421644m4149J097575O54056l12387n43161l95731
32948g3942o67335j183751j304573p46009M47044J741304J968795O02844r82204
$$ plain form
33011 -312965 609237 784292 1275557 2356125 3073870 2777596 1942902 1319335 1117299
33002 1117299 1217104 1401412 1186819 208440 -989433 -1354478 -799271 -383842 -665112
32993 -665112 -932233 -718914 -892246 -2119149 -3218653 -2535630 -453003 966119 642813
32984 642813 -600444 -1661801 -2243151 -2256438 -1629021 -978261 -1120973 -1638610 -1369863
32975 -1369863 -623528 -1144045 -3189247 -4511857 -3471195 -1499142 -892029 -1556672 -1812562
32966 -1812562 -1283644 -826984 -333728 1021859 2578773 2616195 1218342 479015 1263765
32957 1263765 1873393 891499 -530145 -574294 523281 1177337 864950 321789 -73942
32948 -73942 -741277 -1925028 -3229601 -3975610 -3528566 -1787262 181533 784377 -197827
32939a97827j056742j35717j39185j076244r91338M04947Q07314q28828k124983
32930e338603p97255J824863K934351K147139R98577O6975q87630j120320L3433
32921a38470J078138J13487j805241j874821R2757J435697R13179J93517M69594
32912D77837N76007l85528j248010j038215o28355o19076O9766J764360K536912
32903A505698J231038k13606J14037P38500n16432k302383j738387N23340J095998
32894D37803o29045j674281n49288O63744L36000j59375M13283O66219n34233
32885a029173j398708r0085J782834J447232o30782j544110l88394Q70560P34106
32876b46520j36002o98249q29856n15454L80133J142056P27997l20093j87234
$$ plain form
32939 -197827 -1254569 -1390286 -1529471 -2605715 -3597053 -3192106 -2384792 -3213620 -5338603
32930 -5338603 -6135858 -4310995 -1376644 770495 1769072 1836047 948417 -171903 -138470
32921 -138470 939668 1053155 -752086 -2626907 -2534150 -1098453 -185274 8243 477837
32912 477837 1053844 668316 -579694 -1617909 -2246264 -2865340 -2795574 -1031214 1505698
32903 1505698 2736736 2523130 2637167 3375667 2859235 556852 -1181535 -658195 437803
32894 437803 -191242 -1865523 -2414811 -1751067 -1415067 -1574442 -1161159 -494940 -1029173
32885 -1029173 -2427881 -2517966 -735132 712100 81318 -1462792 -1851186 -980626 -246520
32876 -246520 -382522 -1080771 -1910627 -2426081 -2045948 -903892 -175895 -495988 -683222
32867f83222J402454K359570J137009r69878j627091n34297O04131N78571j16000
32858B151247m23738p9145L71432L35266k60259r50820j190879q63609l18230
32849a228735K3002k5534l45448n53934l04130K28222M55792K39941J58084M95535
32839h57205O29455J25580k71497K05688Q52437N29760k88589j88559O88061P62033
32829B187164k32635p37937j76146l3072j024054j351093M40636K617692K476898
32820D167453K78114j314497j065761k16765M116k53974o59836j261626j523221
32811a845997o09363Q67839J081171l06039j188593K12123K762012L711659J928395
32802F613207j050830k773611k065347J29155J617108J022501p33653j457621
$$ plain form
32867 -683222 719232 3078802 4215811 3245933 1618842 1084545 1688676 2267247 2151247
32858 2151247 1727509 1648364 2019796 2355062 2094803 1143983 -46896 -910505 -1228735
32849 -1228735 -1205733 -1231267 -1576715 -2130649 -2434779 -2206557 -1750765 -1510824 -1352740 -857205
32839 -857205 -227750 -102170 -373667 -167979 684458 1214218 925629 737070 1425131 2187164
32829 2187164 1954529 1216592 1040446 1007374 -16680 -1367773 -927137 1690555 4167453
32820 4167453 4445567 3131070 2065309 1848544 1852660 1598686 938850 -322776 -1845997
32811 -1845997 -2455360 -1587521 -506350 -812389 -2000982 -1788859 973153 4684812 6613207
32802 6613207 5562377 2788766 723419 852574 2469682 3492183 2758530 1300909
32794A300909l49954J036983Q68364o55789j710720j183794J17319O51293R3646
32785A68257l11065N01198J713190J500871l02456j591691q05438P45661O73241
32776B291768j140250k552753k071836j43435K125992L748769L526748R67470
32768F752473k202396l303219j896067n6739O87625P10255M07282n51030j465552
32759i17368p63813J017301J124646j063784k408028p46893J526442J317365k72551
32750a186683k40512J129357J218943l4502k44594R03667J176873k6799p27703
32741A968047j78805j43334j350336j871675m66055J167988J086105j55871r49431
32732h93367r03455k82858J007940K446689K491716O20746j439500j710518j91583
$$ plain form
32794 1300909 950955 1987938 2856302 2200513 489793 -694001 -576682 74611 168257
32785 168257 -142808 358390 2071580 3572451 3269995 1678304 872866 1618527 2291768
32776 2291768 1151518 -1401235 -3473071 -3616506 -1490514 2258255 5785003 6752473
32768 6752473 4550077 1246858 -649209 -705948 -18323 691932 1099214 548184 -917368
32759 -917368 -1681181 -663880 460766 -603018 -3011046 -3757939 -2231497 -914132 -1186683
32750 -1186683 -1427195 -297838 921105 886603 642009 1545676 2722549 2695750 1968047
32741 1968047 1789242 1645908 295572 -1576103 -2042158 -874170 211935 56064 -893367
32732 -893367 -1796822 -2079680 -1071740 1374949 3866665 4487411 3047911 1337393 1145810
32723A145810J632178K332539J122341j584205l674229l071231n29503J060165
32715a566135O02153q1419L66082Q47981K92971l75665k13791N2679j88455j54763
32705d18362L71997J68152q23216o70560R53358J359207o11449j825106J80100
32696a315879K539011J430868j445852j589603Q21495J470510p00073k010105
32688g99628m73633J248252P23375o31480o66304J87420O86141J089372J807377
32679C170892J951478R09116l92132j009109j155169j107605p16464m55081r42357
32670B53569j190870K07252J933665J042190k139411l591039j379245J479994
32662c383895J728568K53005m73708l98590o46674p11916K34873J118135P42324
$$ plain form
32723 1145810 2777988 5110527 6232868 4648663 974434 -2096797 -2626300 -1566135
32715 -1566135 -963982 -1045401 -679319 168662 461633 85968 -127823 -75144 -263599 -418362
32705 -418362 -46365 121787 -701429 -1371989 -418631 940576 329127 -1495979 -1315879
32696 -1315879 1223132 2654000 1208148 -381455 440040 1910550 1210477 -799628
32688 -799628 -1273261 -25009 698366 66886 -599418 -411998 274143 1363515 3170892
32679 3170892 5122370 6031486 5639354 4630245 3475076 2367471 1651007 1195926 253569
32670 253569 -937301 -730049 1203616 2245806 106395 -3484644 -4863889 -3383895
32662 -3383895 -1655327 -1402322 -1876030 -2274620 -2921294 -3633210 -3398337 -2280202 -1537878
32653a537878J50594O60803J212071L02242j022816r12524k3858j70316q93284
32644b234966m67146O35460N24499m47046j17923J496287J888138J37513j610380
32635a95564j530222n05300j52806m76075n49833p9420N97040J046773Q80378
32626i65029K67441K50876J399703K414907J546554p73710k310851j954618o31224
32617g55951O33920J709034K225925J374309n56105j965450j937938j241764q95619
32608a409639r27540r52792q27039l43016O46183J496391J220703n5659j067793
32599b220201j016723k77835M83803Q65415M89795n82893j251415m44928J189495
32590b765487J917159J213228J58189l70743m90145l34958J99884O66883M64331
$$ plain form
32653 -1537878 -1387284 -726481 485590 787832 -234984 -1147508 -1171366 -1341682 -2234966
32644 -2234966 -2702112 -2066652 -1542153 -1989199 -2107122 -610835 1277303 1414816 -195564
32635 -195564 -1725786 -2231086 -2383892 -2859967 -3409800 -3489220 -2892180 -1845407 -965029
32626 -965029 -697588 -446712 952991 3367898 4914452 4140742 1829891 -124727 -755951
32617 -755951 -122031 1587003 3812928 5187237 4631132 2665682 727744 -514020 -1409639
32608 -1409639 -2337179 -3289971 -4117010 -4460026 -3813843 -2317452 -1096749 -1152408 -2220201
32599 -2220201 -3236924 -3514759 -3030956 -2165541 -1675746 -2258639 -3510054 -3954982 -2765487
32590 -2765487 -848328 364900 523089 152346 -337799 -672757 -472873 194010 658341
32581F58341N5547L18131P73365J79362j127064j403594k18833R52354J170362
32572A357971J061055R63843J79012j203194j766251r84280j10142M0743K72839
32563a88404J003315J108621N0684p62756k17577O39672N04432p7196j33187j68721
32553A758883q03969j022840J16303J267208N82609j171859j649317n46006J83918
32544a285070l63598q39644j77364O85285N26173j70674r6210Q02217J253598
32535C34713N36150m53789l90563O61943J342735R42366L22246L34279L73969
32526D004049l32548r56511l20067P35925M16746q62136q97464N11423R65521
32517C264938n27817j743746q78839N36974K98916r91391j274543k94706N87512
$$ plain form
32581 658341 713888 1032019 1805384 1984746 857682 -545912 -764745 187609 1357971
32572 1357971 2419026 3382869 3561881 2358687 592436 -391844 -501986 -461243 -188404
32563 -188404 814911 1923532 1974216 1211460 993883 1633555 2137987 2060791 1927604 1758883
32553 1758883 954914 -67926 48377 1315585 1898194 726335 -922982 -1468988 -1285070
32544 -1285070 -1648668 -2488312 -2665676 -1980391 -1454218 -1624892 -1721102 -918885 334713
32535 334713 870863 417074 26511 688454 2031189 2973555 3295801 3630080 4004049
32526 4004049 3671501 2714990 2394923 3130848 3547594 2685458 1787994 2299417 3264938
32517 3264938 2737121 993375 114536 651510 950426 -40965 -1315508 -1610214 -1022702
32508a022702O66888J81763n92621j059493l56424R88380J021510o43879j709489
32499b526067p03925N59921J39902o70210J97083J758367J702809L49657l32485
32490D75052l46251r83190j607978n87612J308927J838207J042404P74317J066216
32481B980092M43032o56912m68449M09769k27261j847399j664353L32416J078422
32472C79357k35065q83713K84816Q57539m36364j263199m1851J126345L26593
32463A14458q66547n31765L51699M06366N20383J279801Q04285j762873l446616
32454c130809j586350J591594K151819K50048q78210j47291Q15126J174576J418761
32445A659264J164633k61874j598453j016023P45567J374518N73398m6046l7523
$$ plain form
32508 -1022702 -355814 -174051 -766672 -1826165 -2182589 -1194209 -172699 -816578 -2526067
32499 -2526067 -3229992 -2670071 -2530169 -3200379 -3003296 -1244929 457880 807537 475052
32490 475052 128801 -854389 -2462367 -3049979 -1741052 97155 1139559 1913876 2980092
32481 2980092 3423124 2766212 2297763 2707532 2480271 632872 -1031481 -699065 379357
32472 379357 144292 -739421 -454605 402934 -33430 -1296629 -1338480 -212135 114458
32463 114458 -752089 -1283854 -932155 -525789 -5406 1274395 2078680 315807 -3130809
32454 -3130809 -4717159 -3125565 -973746 -723698 -1601908 -1749199 -934073 240503 1659264
32445 1659264 2823897 2562023 963570 -52453 693114 2067632 2641030 2594984 2557461
32436B557461l19573q21837o62174k05288l35807l48886O72782J248686m79011
32427A306353k821909k378378M45878J756296L18963p89403L11419J317121J33595
32418d00065j443786r78354O23937J126119O43742N31643M40715o20055j593336
32409a669440o82606J302049J646974k73645k056331j686001K117R66589O78424
32400a771870K53828N65701J150381J060476L08466r6640L01067N05759m81610
32391A795558j793445j573519K57113J560520Q51182o69602q69181M27202J405431
32382A391259P54632p53324j306105k54024J045020Q49643n95847j189516N2774
32373e488J342873O91834r76281j248923m4026M93637k19267l32323R28883J680025
$$ plain form
32436 2557461 2237888 1416051 753877 548589 212782 -136104 536678 1785364 1306353
32427 1306353 -1515556 -3893934 -3448056 -1691760 -1372797 -2162200 -1850781 -533660 -400065
32418 -400065 -1843851 -2822205 -2198268 -1072149 -428407 103236 543951 -76104 -1669440
32409 -1669440 -2352046 -1049997 596977 323332 -1732999 -3419000 -3416883 -2450294 -1771870
32400 -1771870 -1518042 -952341 198040 1258516 1566982 1470342 1771409 2277168 1795558
32391 1795558 2113 -1571406 -1314293 246227 1097409 427807 -441374 -14172 1391259
32382 1391259 2145891 1392567 86462 -167562 877458 1727101 1131254 -58262 -5488
32373 -5488 1337385 2029219 1052938 -195985 -240011 253626 34359 -297964 630919 2310944
32363B310944N77742q79094r18170k15517j60470l20698K29174O91703l4717j067800
32353B13097j012641n02478q03557j052714K76446K047073J810591O2193l23796
32344G14214R39889Q37318j739675l664660k304575N18264J696816J397674J571706
32335c3029J915374P12021j364785j774485k92148N14298n32557j420232l52200
32326b627743J472791J923775R31319j12509n25041m18223J87865Q67720N03686
32317B203640r82994j718135m46149J078492M92740j245195j140038Q83515J593415
32308G19291k61428j647494q6509K142875J497874j198863k089020k62425J216935
32299C1236L72408r95176p19127M66847P65104L21821L84996P80839K79919j111379
$$ plain form
32363 2310944 2888686 2009592 1091422 875905 715435 394737 623911 1315614 1280897 213097
32353 213097 -799544 -1302022 -2105579 -3158293 -2881847 -834774 975817 1038010 714214
32344 714214 1654103 2491421 751746 -2912914 -5217489 -4699225 -3002409 -1604735 -33029
32335 -33029 1882345 2594366 1229581 -544904 -837052 -322754 -855311 -2275543 -2627743
32326 -2627743 -1154952 768823 1700142 1587633 1062592 644369 832234 1699954 2203640
32317 2203640 1220646 -497489 -943638 134854 627594 -617601 -1757639 -874124 719291
32308 719291 457863 -1189631 -1276140 866735 2364609 1165746 -923274 -1185699 31236
32299 31236 403644 -591532 -1310659 -843812 -78708 243113 628109 1408948 1688867 577488
32289E77488j995577j618722p11870j84780R920M28147J164835J650583J288988
32280F09012K63012m36286j52833M30957J64127p55638r25654K4343O40008j38598
32270b77550j191771q92393L48168P58727j8709n12758J22512P89878K27057j007015
32260a653854j263731k1450J494496J871971J065956J22717k84197m68659p92155
32251G1094q03059l688R52515R00473l0703m62721Q5881M24423k64679r73147
32241a03611o10514J0976m55510j377413r19549R69157K281446J792086L84547
32232A971615p84613j624741j978374j016099J048009K186817J061524q19170
32224D4968j119879k3133L57418n36847r85429p526R84343N25890n17876l26489
$$ plain form
32289 577488 -1418089 -3036811 -3748681 -3933461 -3923541 -3495394 -2330559 -679976 609012
32280 609012 872024 435738 282905 713862 877989 122351 -803303 -778960 -138952 -277550
32270 -277550 -1469321 -2361714 -2013546 -1254819 -1273528 -1786286 -1663774 -873896 -646839 -1653854
32260 -1653854 -2917585 -2939035 -1444539 427432 1493388 1616105 1331908 863249 71094
32251 71094 -731965 -735653 216862 1117335 1086632 623911 709792 1134215 869536 -103611
32241 -103611 -714125 -703149 -1158659 -2536072 -3455621 -2486464 -205018 1587068 1971615
32232 1971615 1187002 -437739 -2416113 -3432212 -2384203 -197386 864138 44968
32224 44968 -1074911 -1098044 -740626 -1277473 -2262902 -2270428 -1286085 -760195 -1278071 -1604560
32214a604560J095673J999544J335607j58585j178391j118078j88896Q13734R45053
32205A941101J59838l10072L70726R87956j89046k387616k866795r22624Q54509
32196b362023M58788o06590j67638Q44771J84240j457459j291962Q12407J824950
32187a760516L49239j273734r05182K37457K24487k45308M33162J495441R97858
32178d47096o74648j165028K29233J579781J171106m96197j869765k060154j064034
32169d796802N11690J591989J416385M25715k79194k74147P9019N20920R57748
32160A53323R36133J23249q49384j033638m89897Q692L02123P32070R77150L40283
32150A200104q47622j424631j069125n34635j63916M94196J393004J667897J007541
$$ plain form
32214 -1604560 -508887 1490657 2826264 2667679 1489288 371210 182314 996048 1941101
32205 1941101 2100939 1790867 2161593 3149549 2960503 572887 -2293908 -3216532 -2362023
32196 -2362023 -1903235 -2509825 -2677463 -1832692 -1648452 -3105911 -4397873 -3585466 -1760516
32187 -1760516 -1411277 -2685011 -3590193 -3352736 -3128249 -3373557 -2940395 -1444954 -447096
32178 -447096 -1121744 -2286772 -2057539 -477758 693348 197151 -1672614 -3732768 -4796802
32169 -4796802 -4285112 -2693123 -1276738 -851023 -1130217 -1404364 -1325345 -804425 153323
32160 153323 1089456 1212705 363321 -670317 -1160214 -1151522 -849399 -117329 859821 1200104
32150 1200104 352482 -1072149 -2141274 -2675909 -2839825 -2345629 -952625 715272 1722813
32141A722813J87587j55415k55460m52777p32752j186466j801421j750218l04000
32132d728109J417016J341151m44922j363768j1818J700063J429871j79361p30706
32123a570583L94877J628512J737454J012508J67591m67695o97230n49555n34215
32114A121664r01612j001578l65676J37429m19750j064993k1143K244276L015957
32105B744574J050541j406011j527834L77521J567523O36425j005167j397326
32097A040246l50735R66430J637766J383552J35390j638127k491930j175349J472595
32088I79838K873726J580544j004054k460763k100352r60085J11971R41071J050650
32079A012546m5276j433816j366889K25415J313867O56341l79032n8285R68775
$$ plain form
32141 1722813 1910400 1754985 1499525 1046748 313996 -872470 -2673891 -4424109 -4728109
32132 -4728109 -3311093 -1969942 -2414864 -3778632 -3790450 -2090387 -660516 -839877 -1570583
32123 -1570583 -1175706 452806 2190260 3202768 3370359 2902664 2205434 1655879 1121664
32114 1121664 220052 -781526 -1147202 -1009773 -1429523 -2494516 -2515659 -271383 2744574
32105 2744574 3795115 2389104 861270 1238791 2806314 3442739 2437572 1040246
32097 1040246 689511 1655941 3293707 4677259 4812649 3174522 682592 -492757 979838
32088 979838 3853564 5434108 4430054 1969291 -131061 -1091146 -979175 -38104 1012546
32079 1012546 967270 -466546 -1833435 -1608020 -294153 362188 -16844 -75129 893646
32070H93646Q40989l94876q07451L20680J263530L95703j365149j779457l46653
32061i79038J055804P36568n67379q30336K63991P41395p10577k407666j716533
32052d413771J108922K962336J956242l08951j262358n43609M65344R57252J092667
32043B014074R49757N15929J71784P391o62918j892018k106625j87497K161518
32034I71395K171408j10126j849336j496091n78609p40492j162599l19992J328575
32025a785867K112184J605692O86241j99580j188709j762178j039687N19122J166917
32016A14135J57102j135259j078879R0861Q81992O95598L30381N06464Q96558
32007A458953Q53681L14467m07236j088305j404463q96596K44001R28399N34121
$$ plain form
32070 893646 1734635 1339759 532308 852988 2116518 2512221 1147072 -632385 -979038
32061 -979038 76766 813334 245955 -584381 -320390 421005 -289572 -2697238 -4413771
32052 -4413771 -3304849 -342513 1613729 1304778 42420 -501189 -35845 921407 2014074
32043 2014074 2963831 3479760 3651544 3658935 2996017 1103999 -1002626 -1190123 971395
32034 971395 3142803 3032677 1183341 -312750 -891359 -1631851 -2794450 -3114442 -1785867
32025 -1785867 326317 1932009 2618250 2418670 1229961 -532217 -1571904 -1052782 114135
32016 114135 271237 -864022 -1942901 -1852040 -970048 -274450 55931 562395 1458953
32007 1458953 2312634 2627101 2219865 1131560 -272903 -1169499 -925498 2901 537022
31998E37022K8386O62810J884712J905944L48136j188571j549853j422200j534566
31989c28180j097937N53537K012883J347137r60871k388990j579350L57317J737238
31980c47216J995944J277095j59398j511135j623820m18513O79545M63209n41166
31971a85455r66520m70728Q4043M5349k43130j74047K03796M02109L87823O99460
31961b17300J459652J788286Q58781o99110j368625q02915k77667p02681j295787
31952a257366j006061k35392k6559k76389l0586Q43245J468815J255017M13445
31943A148169n80879j200219r14079J02587P80002N45933K51922P10238J174048
31934B017722O08124l98081o04957k15629j93874l00899J10699J91370r75816
$$ plain form
31998 537022 565408 1228218 3112930 5018874 5367010 4178439 2628586 1206386 -328180
31989 -328180 -1426117 -872580 1140303 2487440 1526569 -862421 -2441771 -2084454 -347216
31980 -347216 1648728 2925823 2766425 1255290 -368530 -787043 -107498 355711 -185455
31971 -185455 -1151975 -1622703 -1538660 -1493311 -1736441 -1910488 -1706692 -1304583 -916760 -217300
31961 -217300 1242352 3030638 3889419 3190309 1821684 1018769 741102 38421 -1257366
31952 -1257366 -2263427 -2498819 -2525378 -2801767 -2832353 -1989108 -520293 734724 1148169
31943 1148169 567290 -632929 -1547008 -1444421 -664419 -118486 133436 843674 2017722
31934 2017722 2625846 2227765 1622808 1407179 1213305 912406 1023105 1214475 238659
31925B38659j775679l1876K735401K687419l23434k085525n28272J216332L42151
31916B475176j049753q1594J596945P29932j687975j977203P7710J107616j81451
31907A009403j431365j057794m07336n62772l89600Q22329J576761O75958o81144
31898d45560q84342k04264L27043O79349J024075O74444o01870j423335n55048
31889a409508J061260J547085O80218j79972k53939k1190J9550k0366n4692k55244
31879A113202n08202m24731n1373N8050l36642p48114n79279J45290Q41427R96608
31869E06236O13448P8086l13546n84405p85877o81619j8197R02634J242323M55412
31859A414495r01828j388841q0731K049538K650023O09743k161503k692000o66353
$$ plain form
31925 238659 -1537020 -1568896 1166505 3853924 3530490 1444965 916693 2133025 2475176
31916 2475176 1425423 1343829 2940774 3670706 1982731 5528 83238 1190854 1009403
31907 1009403 -421962 -1479756 -1887092 -2449864 -2839464 -2017135 -440374 235584 -445560
31898 -445560 -1329902 -1534166 -1207123 -527774 496301 1170745 568875 -854460 -1409508
31889 -1409508 -348248 1198837 1879055 1699083 1445144 1423954 1443504 1423138 1368446 1113202
31879 1113202 605000 180269 128896 186946 -149696 -897810 -1477089 -1331799 -490372 506236
31869 506236 1119684 1197770 884224 299819 -486058 -1167677 -1185874 -283240 959083 1414495
31859 1414495 512667 -876174 -956905 1092633 3742656 4352399 2190896 -501104 -1167457
31850a167457J249177J147407J73453Q7188M18968r8865p68089p1626J250457
31841B220613R83609r10379k103756j561257p18895m75109K13810J657676K062816
31832A369128N10008j048041p88000K5570n76500j673653j031993Q83564J500257
31823h29660L04609n39659P0161N68117l64977j582513j374975N8620J255436
31814b434841J440376Q24696p8088n57520n242J070704J158059l00655j840344
31805g22855j781676m37427N14397L76945J0959K08051N84167L67981m41450j110732
31795b431640j021698k22031O92373J111495R44622O65967P44245J076204J137530
31786B697067O74197N8860j46084Q4537J28054m93502j297222j247411k13920
$$ plain form
31850 -1167457 81720 1229127 1402580 1489768 1908736 1809871 1041782 970156 2220613
31841 2220613 3204222 2293843 190087 -1371170 -2090065 -2565174 -2351364 -693688 1369128
31832 1369128 1879136 831095 43095 68665 -507835 -2181488 -3213481 -2329917 -829660
31823 -829660 -525051 -1064710 -994549 -426432 -791409 -2373922 -3748897 -3690277 -2434841
31814 -2434841 -994465 -169769 -247857 -805377 -810619 260085 1418144 1117489 -722855
31805 -722855 -2504531 -2941958 -2427561 -2050616 -2039657 -1831606 -1247439 -879458 -1320908 -2431640
31795 -2431640 -3453338 -3675369 -2982996 -1871501 -926879 -260912 483333 1559537 2697067
31786 2697067 3371264 3430124 3284040 3368577 3496631 3003129 1705907 458496 244576
31777B44576M84147l30638j838215j970360j93583J555172J391748k0905o43130
31768a321188p2886J80528o21829j242445o34610K09563j21655j041476q25779
31759e491777N98646J519485J127539N59041P34671Q40468q884r53673o14108
31750a688592P55121J726322J706400J154132L40379o59349j154708o16861k1167
31741A541677o97889j929845j638600L17771J664349J158028K84172L81551L63367
31732A444581q44391j622276k5303K471717K576627O2412j911135j533177n16030
31723A03025p14413j263352o45655M96309O04624j15100k63803L30324O18572
31714h49469K73099o6145j81557l35342j67899Q36282J888295J644360N04911
$$ plain form
31777 244576 728723 398085 -1440130 -3410490 -3604073 -2048901 -657153 -678058 -1321188
31768 -1321188 -1394074 -1213546 -1835375 -3077820 -3712430 -3502867 -3624522 -4665998 -5491777
31759 -5491777 -4893131 -3373646 -2246107 -1687066 -952395 -111927 -120811 -1074484 -1688592
31750 -1688592 -933471 792851 2499251 3653383 3993762 3334413 2179705 1562844 1541677
31741 1541677 843788 -1086057 -2724657 -2406886 -742537 415491 699663 1081214 1444581
31732 1444581 600190 -1022086 -1047389 1424328 4000955 4063367 2152232 619055 103025
31723 103025 -611388 -1874740 -2520395 -2024086 -1419462 -1534562 -1798365 -1468041 -849469
31714 -849469 -576370 -642515 -824072 -1159414 -1327313 -491031 1397264 3041624 3546535
31705C546535K41786R23866L98588k082247l873717k476774N66280J744683N54607
31696d56393l54968L07359Q35972k656p49817J2951J065557O94980l28842k16529
31686H07614O53583N09906n61389p24703L81187R93596J36457j015845j281079
31677a00673j011176p40120r8981R79736J537131J060603L65515J73637J39006
31668B304678J4004K50090O11934o0257j611176j960277k01637J520124J081265
31659A948748l83105n44470L03252J55520r76437j139270J19284J079201O58483
31650A221206m46310j465025k159683j752402L57640K656442K731158P46273o97622
31641A191677m99244k19699p95421j007662k58501L7421o92340p24973P20614
$$ plain form
31705 3546535 3788321 4712187 5110775 3028528 -845189 -3321963 -2755683 -1011000 -456393
31696 -456393 -811361 -504002 331970 329314 -420503 -407552 658005 1352985 1024143 807614
31686 807614 1461197 1971103 1409714 685011 1066198 2059794 2196251 1180406 -100673
31677 -100673 -1111849 -1851969 -1950950 -971214 565917 1626520 1992035 2165672 2304678
31668 2304678 2318682 2568772 3180706 3120449 1509273 -451004 -652641 867483 1948748
31659 1948748 1565643 1021173 1324425 1479945 503508 -635762 -516478 562723 1221206
31650 1221206 774896 -690129 -2849812 -4602214 -4244574 -1588132 1143026 1889299 1191677
31641 1191677 692433 472734 -322687 -1330349 -1588850 -1551429 -2243769 -2968742 -2248128
31632b248128J502232J14251j271814j64257J903597J650270p28503k045799j123578
31623b411729N9985J10757n6400L41219N66638K07094J22638O77845R28868L95457
31613I42372m7389J86361M43009K75020K81979O50168L56819j061462k170861
31604a43984j334965R89362K704257K389106N01313j278954j456131l3526J236892
31595C573370N83664j527781k703494j551419O34997J677138J090140J04983j77149
31586A704449K16182O09368M58960k05116p63800o32449j2076L59982K18897l1773
31576A922624j26032k05933k43177l8068J08466l16192r16941o65278M05755R86057
31566I11281M51365k23603k19039k40229j078398j890322j245333P28842K430902
$$ plain form
31632 -2248128 -745896 -631645 -1903459 -2067716 -164119 1486151 757648 -1288151 -2411729
31623 -2411729 -2351744 -2240987 -2297387 -1956168 -1389530 -1182436 -1059798 -381953 546915 942372
31613 942372 894983 1081344 1524353 1799373 2081352 2731520 3088339 2026877 -143984
31604 -143984 -1478949 -489587 2214670 4603776 5105089 3826135 2370004 2336478 3573370
31595 3573370 4157034 2629253 -74241 -1625660 -990663 686475 1776615 1881598 1704449
31586 1704449 1920631 2529999 2988959 2783843 2020043 1387594 1375518 1735500 1954397 1922624
31576 1922624 1796592 1590659 1347482 1309414 1417880 1101688 184747 -480531 -74776 911281
31566 911281 1362646 1139043 920004 679775 -398623 -2288945 -3534278 -2805436 -374534
31557c74534K656573J514740q4946j079774q74734j7342K72731k54046n73690
31548A184978k67832l74034j346760j680559k21422J455158J137821m50885o70077
31539a233612Q66967J823918R94229r4664j59067j55368r90127j472929l37381
31530g58034J372107J860562J294870R93965Q45447l13835k138670k737504j406408
31521i87500L43219R58627O11690J82507k50656r70944j516630j107232P9590
31512b657329R09586O40865k62821q21030o69586k27160R4902M22172R53027J292598
31502c24776P98067l69524j117197p09182K09792L79172m83707j369166j231134
31493d217655j11917J059988J423778Q15018k25855q62080o16396J25863M19551
$$ plain form
31557 -374534 2282039 3796779 3711833 2632059 1757325 1739983 2012714 1758668 1184978
31548 1184978 917146 543112 -803648 -2484207 -2705629 -1250471 -112650 -563535 -1233612
31539 -1233612 -366645 1457273 2451502 2356838 2197771 2042403 1052276 -420653 -758034
31530 -758034 614073 2474635 3769505 4763470 5608917 5295082 3156412 418908 -987500
31521 -987500 -644281 314346 926036 1108543 857887 -113057 -1629687 -2736919 -2657329
31512 -2657329 -1747743 -1106878 -1369699 -2190729 -2860315 -3087475 -2992573 -2570401 -1617374 -324776
31502 -324776 473291 103767 -1013430 -1722612 -1512820 -1133648 -1617355 -2986521 -4217655
31493 -4217655 -4329572 -3269584 -1845806 -1030788 -1256643 -2118723 -2735119 -2609256 -2189705
31484b189705j58697q50467n43631P12608J562973J042043j26232n78489k16981
31475a346578l4706k29408Q9853J004471J208954K41713l08671O60342J484359
31466B770329J64237k003836k031760l2715Q30346m53829j098011N95344K151152
31457H91257J100805p48820m44369J024746O27087j186577j159749J017643K016186
31448C138209M58715r69225l51417L66459p58398k017258j033493J094030J608934
31439A536556L11992q91554j305576j521254j264378L1350J279732J106917M94912
31430b21303J234848K350613J328361j244064j885480L18477K074125J070116
31422E025693n87905k48912R38350L72351j478019k057869r45241m265J7288J24652
$$ plain form
31484 -2189705 -2348402 -3198869 -3742500 -3029892 -1466919 -424876 -551108 -1129597 -1346578
31475 -1346578 -1381284 -1610692 -1520839 -516368 692586 934299 625628 1285970 2770329
31466 2770329 2934566 930730 -1101030 -1133745 -303399 -757228 -1855239 -1259895 891257
31457 891257 1992062 1243242 798873 1823619 2450706 1264129 104380 1122023 3138209
31448 3138209 3596924 2627699 2276282 2642741 1884343 -132915 -1166408 -72378 1536556
31439 1536556 1848548 956994 -348582 -1869836 -3134214 -3102864 -1823132 -716215 -221303
31430 -221303 1013545 3364158 4692519 3448455 1562975 1881452 3955577 5025693
31422 5025693 4437788 4188876 5127226 5499577 4021558 1963689 1018448 1014183 1031471 1156123
31412A156123M97052M8637j117959j312313l2982R50191K46168j115776j346615
31403b027474k79389R35468J480932J272778N21504k75651n13757k12908L0128
31394I31631O7665K38918J66825j071122k922698l106924o55760K125959K437166
31385a788340P71951k8317R96649J854047R39128o55242j066264l36479Q0528
31376G67661m22386j063666j017846l68204K11153J87177l32485n71794J54303
31367b456087J431405J959794J123941j53738o02365j57239K89489K55585k1428
31358A669357l84263r05678j193569n36936Q36689J475183M01199j391085j973074
31349b002177q37856O12993R91632M68652L8362P0089L42539R22074J910542K495377
$$ plain form
31412 1156123 1653175 1701812 583853 -728460 -761442 188749 434917 -680859 -2027474
31403 -2027474 -2306863 -1371395 109537 1382315 1903819 1628168 1114411 901503 931631
31394 931631 999296 1238214 1405039 333917 -2588781 -5695705 -6351465 -4225506 -1788340
31385 -1788340 -1016389 -1044706 -48057 1805990 2745118 2089876 1023612 687133 767661
31376 767661 345275 -718391 -1736237 -2104441 -1893288 -1706111 -2038596 -2610390 -2456087
31367 -2456087 -1024682 935112 2059053 1905315 1302950 1145711 1435200 1690785 1669357
31358 1669357 1285094 379416 -814153 -1351089 -514400 960783 1361982 -29103 -2002177
31349 -2002177 -2840033 -2227040 -1235408 -766756 -728394 -658305 -315766 606308 2516850 5012227
31339E012227J515564o71448k040607j381868j0620O2126j020330j339390j77476
31330e1822R91907Q62955J59797J96584O73803K61848j109488j983020j517734
31321a515170o82840p40890j399676j348030k43563Q07899Q70572M21340M34888
31312c395470Q16281O39589j83775n06070L75435J471741J321553j0585j055316
31303e26617r23970l09652l38280j063325j420926m16447J717947L391949K954175
31294C064854N08399j910158k499501j582543o26727k8078Q51000J827350J787588
31285A392184O30308l22237l85070m47875j115889j439757n76416N96285Q05304
31276h63163K93511J29311M84390Q33124J015783Q65519k78119k239739l120134
$$ plain form
31339 5012227 6527791 5856343 3815736 2433868 2423248 2485374 1465044 125654 -51822
31330 -51822 940085 1803040 1962837 2159421 2833224 3095072 1985584 2564 -1515170
31321 -1515170 -2198010 -2938900 -4338576 -5686606 -5930169 -5122270 -4251698 -3830358 -3395470
31312 -3395470 -2579189 -1939600 -2123375 -2629445 -2254010 -782269 539284 528699 -526617
31303 -526617 -1450587 -1760239 -2098519 -3161844 -4582770 -4999217 -3281270 110679 3064854
31294 3064854 3573253 1663095 -836406 -2418949 -3045676 -3073754 -2222754 -395404 1392184
31285 1392184 2022492 1700255 1315185 867310 -248579 -1688336 -2264752 -1668467 -863163
31276 -863163 -569652 -440341 44049 877173 1892956 2758475 2480356 240617 -2879517
31267b879517j484227J219793K270501J265339K14010L12142O58469L14984k88617
31258A602877m94097m05187k38627N8110K21621j25387n55348l35036J75675J883
31248i3516o35170n57154L19880Q67709P29984O04951M84025l22942j203837o29648
31238d35718R62895J147386p73065k485666k207038j009047k82319M73574J532645
31229c076353J275512r28948k447255q38889K122447K828468R53197p39517p29687
$$ plain form
31267 -2879517 -4363744 -3143951 -873450 391889 605899 918041 1576510 1891494 1602877
31258 1602877 1108780 703593 464966 523076 744697 619310 63962 -271074 -95399 -93516
31248 -93516 -728686 -1285840 -965960 -98251 631733 1236684 1720709 1397767 193930 -435718
31238 -435718 527177 1674563 901498 -1584168 -3791206 -4800253 -5082572 -4608998 -3076353
31229 -3076353 -1800841 -2729789 -5177044 -6015933 -3893486 -1065018 -111821 -851338 -1581025
$$ [...]
##END NTUPLES=NMR SPECTRUM
##END=
