##TITLE=31Pdec_LY-TMF-10.5.R.t
 D2O, 24 sc
 5.3.2020
##JCAMPDX= 6.0         $$ Bruker NMR JCAMP-DX V2.0
##DATA TYPE= NMR SPECTRUM
##DATA CLASS= NTUPLES
##ORIGIN= UXNMR, Bruker Analytische Messtechnik GmbH
##OWNER= root
$$ XWIN-NMR		Version 3.5
$$ Thu Mar  5 14:34:03 2020 Russian Standard Time (UT+4h)  she@DPX200
##.OBSERVE FREQUENCY= 81.013821
##.OBSERVE NUCLEUS= ^31P
##.ACQUISITION MODE= SIMULTANEOUS
##.ACQUISITION SCHEME= undefined
##.AVERAGES= 24
##.DIGITISER RES= 17
##SPECTROMETER/DATA SYSTEM= spect
##.PULSE SEQUENCE= zgpg30
##.SOLVENT NAME= DMSO
##.SHIFT REFERENCE= (INTERNAL, DMSO, 0, 182.463)
##AUDIT TRAIL= $$ (NUMBER, WHEN, WHO, WHERE, WHAT)
$$ ##TITLE= Audit trail, XWIN-NMR		Version 3.5
$$ ##JCAMPDX= 5.01
$$ ##ORIGIN= Bruker BioSpin GmbH
$$ ##OWNER= she
$$ F:/spectra/data/she/nmr/P31/1/pdata/1/auditp.txt
$$ ##AUDIT TRAIL=  $$ (NUMBER, WHEN, WHO, WHERE, WHAT)
(   1,<2020-03-05 14:33:08.29 +0400>,<she>,<DPX200>,
      <created by zg, POWCHK disabled, PULCHK disabled
       configuration hash MD5:
       00 E9 B6 7A A2 85 ED C7 34 08 36 98 17 FE 4E 26
       data hash MD5: 32K
       30 81 AB 74 6C A5 DC EC A1 EF 5E 40 1E AB E4 AC>)
(   2,<2020-03-05 14:33:10.85 +0400>,<she>,<DPX200>,
      <Start of raw data processing
       efp BC_mod = 2 LB = 1 FT_mod = 6 PKNL = 1 PHC0 = -1362.17 PHC1 = 150.6017 SI = 64K 
       data hash MD5: 64K
       00 D1 61 64 3A C8 05 50 28 EB 0D AC CB 96 62 AC>)
(   3,<2020-03-05 14:33:26.06 +0400>,<she>,<DPX200>,
      <pk PHC0 = 2.724797 PHC1 = 0 
       data hash MD5: 64K
       78 D5 E2 D8 E9 77 0E 93 3A A4 B3 68 9C FD B3 E8>)
(   4,<2020-03-05 14:33:29.29 +0400>,<she>,<DPX200>,
      <abs ABSG = 5 
       data hash MD5: 64K
       A7 EE ED D6 84 CB F4 BA 4C 73 D0 9C 56 5C FD FD>)
$$ ##END=
$$ 
$$ hash MD5
$$ BE 86 99 14 43 39 F9 E8 43 35 8B 36 D4 A5 FE 9A
##$RELAX= 
##$RELAX= 
##$RELAX= 
##$RELAX= 
##$RELAX= 
##$RELAX= 
##$RELAX= 
##$RELAX= 
$$ Bruker specific parameters
$$ --------------------------
##$DU= <F:/spectra>
##$EXPNO= 1
##$NAME= <P31>
##$PROCNO= 1
##$TYPE= <nmr>
##$USER= <she>
##$AMP= (0..31)
100 100 100 100 100 100 100 100 100 100 100 100 100 100 100 100 100 100 
100 100 100 100 100 100 100 100 100 100 100 100 100 100 
##$AQSEQ= 0
##$AQ_mod= 1
##$AUNM= <au_zg>
##$AUTOPOS= <>
##$BF1= 81.014009
##$BF2= 200.13
##$BF3= 200.13
##$BF4= 200.13
##$BF5= 200.13
##$BF6= 200.13
##$BF7= 200.13
##$BF8= 200.13
##$BYTORDA= 1
##$CFDGTYP= 0
##$CFRGTYP= 5
##$CHEMSTR= <none>
##$CNST= (0..31)
1 1 145 1 1 1 1 1 1 1 1 1 1 1 1 1 1 1 1 1 1 1 1 1 1 1 1 1 1 1 1 1 
##$CPDPRG= <waltz16>
##$CPDPRG1= <>
##$CPDPRG2= <waltz16>
##$CPDPRG3= <>
##$CPDPRG4= <mlev>
##$CPDPRG5= <mlev>
##$CPDPRG6= <mlev>
##$CPDPRG7= <mlev>
##$CPDPRG8= <mlev>
##$CPDPRGB= <>
##$CPDPRGT= <>
##$D= (0..31)
0 1 0 0 0 0 0 0 0 0 0 0.03 2e-05 3e-06 0 0 0 0 0 0 0 0 0 0 0 0 0 0 0 0 
0 0 
##$DATE= 1583404387
##$DBL= (0..7)
120 120 120 11 120 120 24 19 
##$DBP= (0..7)
150 150 150 150 150 150 150 150 
##$DBP07= 0
##$DBPNAM0= <>
##$DBPNAM1= <>
##$DBPNAM2= <>
$$ [...]
##$SUBNAM3= <"">
##$SUBNAM4= <"">
##$SUBNAM5= <"">
##$SUBNAM6= <"">
##$SUBNAM7= <"">
##$SUBNAM8= <"">
##$SUBNAM9= <"">
##$SW= 369.568048894756
##$SWIBOX= (0..15)
0 1 3 0 0 0 0 0 0 0 0 0 0 0 0 0 
##$SW_h= 29940.119760479
##$TD= 32768
##$TD0= 1
##$TE= 0
##$TE2= 300
##$TE3= 300
##$TEG= 300
##$TL= (0..7)
0 120 53 12 22 120 120 120 
##$TP= (0..7)
150 150 150 150 150 150 150 150 
##$TP07= 0
##$TPNAME0= <>
##$TPNAME1= <>
##$TPNAME2= <>
##$TPNAME3= <>
##$TPNAME4= <>
##$TPNAME5= <>
##$TPNAME6= <>
##$TPNAME7= <>
##$TPOAL= (0..7)
0.5 0.5 0.5 0.5 0.5 0.5 0.5 0.5 
##$TPOFFS= (0..7)
0 0 0 0 0 0 0 0 
##$TUNHIN= 0
##$TUNHOUT= 0
##$TUNXOUT= 0
##$USERA1= <user>
##$USERA2= <user>
##$USERA3= <user>
##$USERA4= <user>
##$USERA5= <user>
##$V9= 5
##$VALIST= <valist>
##$VCLIST= <CCCCCCCCCCCCCCC>
##$VD= 0
##$VDLIST= <DDDDDDDDDDDDDDD>
##$VPLIST= <PPPPPPPPPPPPPPP>
##$VTLIST= <TTTTTTTTTTTTTTT>
##$WBST= 1024
##$WBSW= 4
##$XGAIN= (0..3)
0 0 0 0 
##$XL= 0
##$YL= 0
##$YMAX_a= 12779
##$YMIN_a= -16685
##$ZGOPTNS= <>
##$ZL1= 120
##$ZL2= 120
##$ZL3= 120
##$ZL4= 120
##$ABSF1= 182.463
##$ABSF2= -187.1042
##$ABSG= 5
##$ABSL= 3
##$ALPHA= 0
##$AQORDER= 0
##$ASSFAC= 0
##$ASSFACI= 0
##$ASSFACX= 0
##$ASSWID= 0
##$AUNMP= <proc_1d>
##$AZFE= 0.1
##$AZFW= 0.5
##$BCFW= 0
##$BC_mod= 2
##$BYTORDP= 0
##$COROFFS= 0
##$CY= -3
##$DATMOD= 1
##$DC= 0
##$DFILT= <>
##$DTYPP= 0
##$F1P= 0
##$F2P= 0
##$FCOR= 1
##$FTSIZE= 65536
##$FT_mod= 6
##$GAMMA= 0
##$GB= 0
##$INTBC= 1
##$INTSCL= 5.30512e-09
##$ISEN= 30
##$LB= 1
##$LEV0= 0
##$LPBIN= 0
##$MAXI= 10000
##$MC2= 0
##$MEAN= 0
##$ME_mod= 0
##$MI= 50
##$NCOEF= 0
##$NC_proc= -5
##$NLEV= 6
##$NOISF1= 182.463
##$NOISF2= 159.3651
##$NSP= 0
##$NTH_PI= 0
##$NZP= 0
##$OFFSET= 182.463
##$PC= 4
##$PHC0= -1359.445
##$PHC1= 150.6017
##$PH_mod= 1
##$PKNL= yes
##$PPARMOD= 0
##$PSCAL= 0
##$PSIGN= 0
##$REVERSE= no
##$SF= 81.0140089999434
##$SI= 65536
##$SIGF1= 159.3651
##$SIGF2= -187.1042
##$SINO= 113.3802
##$SIOLD= 16384
##$SREGLST= <1H.CDCl3>
##$SSB= 0
##$STSI= 65536
##$STSR= 0
##$SW_p= 29940.119760479
##$SYMM= 0
##$S_DEV= 0
##$TDeff= 32768
##$TDoff= 0
##$TI= <>
##$TILT= no
##$TM1= 0
##$TM2= 0
##$TOPLEV= 0
##$USERP1= <user>
##$USERP2= <user>
##$USERP3= <user>
##$USERP4= <user>
##$USERP5= <user>
##$WDW= 1
##$XDIM= 65536
##$YMAX_p= 416366344
##$YMIN_p= -12259644
$$ End of Bruker specific parameters
$$ ---------------------------------
##NTUPLES= NMR SPECTRUM
##VAR_NAME=  FREQUENCY,     SPECTRUM/REAL,   SPECTRUM/IMAG
##SYMBOL=    X,             R,               I
##VAR_TYPE=  INDEPENDENT,   DEPENDENT,       DEPENDENT
##VAR_FORM=  AFFN,          ASDF,            ASDF
##VAR_DIM=   65536,         65536,           65536
##UNITS=     HZ,            ARBITRARY UNITS, ARBITRARY UNITS
##FACTOR=    0.456856943014862, 1,           1
##FIRST=     14782.0589164792, 0,            0
##LAST=      -15158.0608439998, 0,           0
##MIN=       -15158.0608439998, -12259644,   0
##MAX=       14782.0589164792, 416366344,    0
$$ Real data points
##PAGE= N=1
##DATA TABLE= (X++(R..R)), XYDATA
$$ [...]
36798E48656n11070n5285J21575l71713o98991k20235L98349K89603j60276J0873
$$ 548656 37586 -17699 103876 -267837 -966828 -1187063 -788714 -499111 -659387 -648514
36788f48514O60427O99878j29078p67867m31859K64467L40262j02520k18508J91164
$$ -648514 11913 711791 582713 -185154 -617013 -352546 -12284 -114804 -333312 -142148
36778a42148M59981J71220k64117l60198k80114l93252n43395l39651L1445k3505
$$ -142148 317833 489053 224936 -135262 -415376 -808628 -1352023 -1691674 -1660229 -1683734
36768a683734m65467m80511K81871J005516Q55896K66290K05727N60842L91904
$$ -1683734 -2149201 -2629712 -2347841 -1342325 -486429 -220139 -14412 546430 938334
36759I38334l02729m26800L07830P02799P735p67436n28157Q0659q9724n96324
$$ 938334 635605 208805 516635 1219434 1227169 459733 -68424 12235 -77489 -673813
36749f73813k56740N53120M23033n11175o13892M27254R47231J14217o31373k1112
$$ -673813 -930553 -377433 45600 -465575 -1079467 -652213 295018 409235 -222138 -243250
36739b43250R38013P09831l43989q41104n99619m02849l62420n9410K85664K17980
$$ -243250 694763 1404594 1060605 219501 -380118 -782967 -1145387 -1204797 -919133 -701153
36729g01153J12748N08358R09581N77193n9725j65847o4321n11944j002067n14856
$$ -701153 -588405 -80047 829534 1406727 1347002 1181155 1116834 604890 -397177 -912033
36719i12033N05290P76589M21948N78964J021408M29097r24077j164268P5341
$$ -912033 -406743 369846 791794 1370758 2392166 2821263 1897186 732918 808259
36710H08259R28883L97471j75275K73355P25323K23150l35060j04169j3820q24059
$$ 808259 1737142 2134613 1959338 2232693 2958016 3181166 2846106 2741937 2728117 1904058
36700A904058j321261m66643L53105m62995j687609j036315R85728J736877M90978
$$ 1904058 582797 116154 469259 6264 -1681345 -2717660 -1731932 4945 495923
36691D95923p97034p52357j72082l4305n0730K22405N20659O40268P17784N02675
$$ 495923 -301111 -1053468 -1225550 -1259855 -1310585 -1088180 -567521 72747 790531 1293206
36681A293206l14116j007270n53742N11218O28768k90271p04442l0864N24006
$$ 1293206 979090 -28180 -581922 -70704 558064 267793 -436649 -467513 56493
36672E6493K27895m0408K81170K70272o05848j163577m32895N14819K25557p43022
$$ 56493 284388 243980 525150 795422 189574 -974003 -1406898 -892079 -666522 -1409544
36662a409544p34068L95650J173608P39156j85655n66551k89177M8920j1033k97092
$$ -1409544 -2143612 -1747962 -574354 164802 -20853 -587404 -876581 -827661 -838694 -1135786
36652a135786k20456L99027Q66082N05849j74985j65973L09258O4001q59132q88992
$$ -1135786 -1356242 -957215 -91133 414716 239731 73758 383016 447017 -412115 -1301107
36642a301107N18516J660342J032811m26092r11347l60547O8478J39101M10900
$$ -1301107 -782591 877751 1910562 1484470 573123 212576 281054 420155 831055
36633H31055O33267N6666r51705j244172p30235l96926n45917m45604J84053O87872
$$ 831055 1464322 1520988 569283 -674889 -1405124 -1802050 -2347967 -2793571 -2609518 -1921646
36623a921646O68654M77681L20172k9127m36946m09375p8657j46768o14476o11842
$$ -1921646 -1252992 -775311 -455139 -484266 -921212 -1330587 -1409244 -1556012 -2170488 -2782330
36613b782330J81892R33891Q81126L03002j43435k99667k99505j44763J05173
$$ -2782330 -2600438 -1666547 -785421 -482419 -625854 -925521 -1225026 -1369789 -1264616
36604a264616K24514J80010J66020J88902J16082J15054M18968P10190M76098
$$ -1264616 -1040102 -860092 -694072 -505170 -389088 -274034 144934 855124 1331222
36595A331222o5132k30167l6876j47345n90441o14870l6593L58745J22748k01594
$$ 1331222 1266090 1035923 999047 851702 261261 -353609 -390202 -31457 91291 -110303
36585a10303j81592j98424m82506m75943J22599O06112L68680n2019P9323M32923
$$ -110303 -291895 -490319 -972825 -1448768 -1326169 -720057 -351377 -403396 -324073 108850
36575A08850K65644k36643k88807J77507M77932K68742j19031l15505k46260J8477
$$ 108850 374494 137851 -150956 26551 504483 773225 654194 338689 92429 110906
36565A10906K34845N4384m12307m86755R4621N74203K27409m59493n01002Q5732
$$ 110906 345751 400135 -12172 -498927 -404306 169897 397306 -62187 -563189 -477457
36555d77457M33174K29190k0633l5024o5227j20253J47433O05174N98599M1774
$$ -477457 -44283 184907 164274 129250 64023 -56230 91203 696377 1294976 1336750
36545A336750k82074R2606N69566M38052o2377k39633o4250r1708m56672o12879
$$ 1336750 1054676 1147282 1716848 2154900 2092523 1852890 1788640 1696932 1240260 627381
36535F27381j88543L66044K95204m50993j041574p24680K42782R23468Q74161
$$ 627381 438838 804882 1100086 649093 -392481 -1117161 -874379 49089 923250
36526I23250N36331L60557J35083m05456q33494n67745J28989M11400n200o27390
$$ 923250 1459581 1820138 1955221 1549765 716271 148526 277515 688915 683715 56325
36516E6325j012771j103927p86838N9476R54247J073490L72909k85879l84046
$$ 56325 -956446 -2060373 -2847211 -2787735 -1833488 -759998 -387089 -672968 -1057014
36507a057014l08628l38739m0395O89500R23032L8174r55810o61754N24806Q43333
$$ -1057014 -1365642 -1704381 -1744776 -1055276 -132244 -94070 -1049880 -1711634 -1186828 -343495
36497c43495k27295j164351o25341P02475J231497O00774k38166n41498m26129
$$ -343495 -570790 -1735141 -2360482 -1658007 -426510 174264 -63902 -605400 -1031529
36488a031529k05542M8070K14641R1863j68401j10204L41095O75216M97891O4884
$$ -1031529 -1237071 -1189001 -974360 -882497 -1050898 -1161102 -820007 -144791 353100 417984
36478D17984j36890l7662O6590j1302k07328l86780m20353j96547K22086N45348
$$ 417984 281094 243432 310022 298720 91392 -295388 -715741 -912288 -690202 -144854
36468a44854N37572K67574l9074k34966k18134P5130M29931L98980q8661m51777
$$ -144854 392718 660292 621218 386252 168118 243248 673179 1072159 983498 531721
36458E31721k14276K34104J95010k30497l14663O2439J88221k71688o67398m10518
$$ 531721 317445 551549 746559 516062 201399 263838 452059 180371 -487027 -897545
36448h97545R1495J54722j05440j48688l6341k45456o60626o09006O3292O96046
$$ -897545 -806050 -651328 -756768 -905456 -941797 -1187253 -1847879 -2456885 -2393593 -1697547
36438a697547P60927M83718L08620K84931K57388K17391J73167K9162j50145r9344
$$ -1697547 -936620 -452902 -144282 140649 398037 615428 788595 817757 667612 568268
36428E68268J75188K38561j52318o00586n98630k26049P3226J65976K26773K44486
$$ 568268 743456 982017 829699 229113 -369517 -595566 -522340 -356364 -129591 114895
36418A14895O7736j18097O3632M72683M68206j18928n70474k65513L52614L84521
$$ 114895 182631 64534 128166 600849 1069055 950127 379653 114140 466754 851275
36408H51275k09748o05954l83770m5340n9064j13415J99914N40282L33711k17275
$$ 851275 641527 35573 -348197 -393537 -452601 -566016 -366102 174180 507891 290616
36398B90616l95465j03054L2552k62644m61600j06863M81926P07339M44517j3973
$$ 290616 -104849 -207903 -175351 -437995 -899595 -1006458 -524532 182807 627324 613351
36388F13351l67582l99643n9783L03523K22472j60980j80969K71755M35277j05841
$$ 613351 245769 -153874 -213657 89866 312338 151358 -29611 242144 677421 571580
36378E71580o25083l75751J62797Q6524m04123l83229J82205L94030k4174l23661
$$ 571580 -53503 -429254 -266457 -179933 -584056 -967285 -785080 -391050 -415224 -738885
36368g38885q0509J55015p0134l74558l45279k04340j65881M5742M75234N55622
$$ -738885 -819394 -664379 -734513 -1109071 -1454350 -1658690 -1824571 -1778829 -1303595 -747973
36358g47973J20374m409P32354J448183R78132k97673r30063m86102K5381j20662
$$ -747973 -627599 -632008 100346 1548529 2526661 2228988 1298925 812823 838204 717542
36348G17542l65358o763N87804N96165K9686l19798n4214L10415J17946m91125
$$ 717542 352184 345421 933225 1529390 1559076 1239278 1185064 1495479 1613425 1122300
36338A122300p10710j23972O30310N43120m30033j136819o09602O45083J218672
$$ 1122300 411590 287618 917928 1461048 1031015 -105804 -715406 -70323 1148349
36329A148349N49947m35716n71903J08634N32481N797r21161j146749l58962O24317
$$ 1148349 1698296 1262580 690677 799311 1331792 1337589 416428 -730321 -1089283 -464966
36319d64966Q84758M26416q4926k79037k79723j35383K62513O47502M94483j00371
$$ -464966 419792 846208 761282 482245 202522 67139 329652 977154 1471637 1371266
36309A371266l72659o7885J00845l01709n38718J17082R72602P77176l53405j024981
$$ 1371266 998607 930722 1031567 729858 191140 308222 1280824 2058000 1704595 679614
36299F79614n29480L25777M91277j11916q53002j110578n65346N18216J188883
$$ 679614 150134 475911 967188 855272 2270 -1108308 -1673654 -1155438 33445
36290C3445P25164k63901m91874J48170L99556l77410j149975p83080K85125Q01872
$$ 33445 758609 494708 2834 151004 550560 173150 -976825 -1759905 -1474780 -672908
36280f72908M50684o9238k61920k48826k00503r8252M1594K16046N21129P96389
$$ -672908 -222224 -291462 -553382 -802208 -1002711 -1100963 -1059369 -843323 -322194 474195
36270D74195N48963k88374r42642p31463k2066L74896L75453M35966N35151K42082
$$ 474195 1023158 734784 -207858 -939321 -961387 -586491 -211038 224928 760079 1002161
36260A002161l25496n09203j56630J06483j63844o06841o14226q2456N45700P16299
$$ 1002161 676665 167462 10832 117315 -46529 -653370 -1267596 -1350052 -804352 -88053
36250h8053K62434k99309k03019N17892Q35494J13141q10980p45688N9287L10117
$$ -88053 174381 -124928 -327947 189945 1025439 1138580 327600 -418088 -358801 -48684
36240d8684l34257q67985o21977j37254l3384j08986m4345j3745n4787K49787
$$ -48684 -382941 -1250926 -1872903 -2010157 -2043541 -2152527 -2196872 -2210617 -2265404 -2015617
36230b015617Q57568R41475K03149l52115J52091R90535Q51845j76680p70749
$$ -2015617 -1158049 -216574 -13425 -365540 -213449 777086 1628931 1452251 681502
36221F81502l03380M49825N88619J83062j43639j13524J0996j54637o20924q72175
$$ 681502 378122 827947 1416566 1599628 1455989 1342465 1353461 1198824 577900 -294275
36211b94275m10716M35932P00917O5782n88612m04374K57328N22652L63429L56357
$$ -294275 -704991 -269059 431858 497640 -90972 -495346 -238018 284634 648063 1004420
36201A004420M88168K56923k07228k19286K18527L03647k26929o25612l54995
$$ 1004420 1492588 1749511 1542283 1322997 1541524 1845171 1618242 992630 637635
36192F37635J06208J43906p1613r2706J3899k6485r6106J4001P8397k10356o27203
$$ 637635 743843 887749 816136 723430 737329 710844 614738 628739 707136 496780 -130423
36181a30423o83244l39038N100J04876O0644J2760J0437J13474K98313L12648
$$ -130423 -813667 -1152705 -1147605 -1042729 -982085 -969325 -958888 -845414 -547101 -234453
36171b34453o0579n93131p61438l90482Q4752J66562l3931O6573O63340J128680
$$ -234453 -295032 -888163 -1649601 -2040083 -1955331 -1788769 -1822700 -1756127 -1092787 35893
36161C5893P55366k07842p57473m41699R8717J61733m9450J2280K76819L69875
$$ 35893 791259 583417 -174056 -615755 -517038 -355305 -404755 -392475 -115656 254219
36151B54219M25001O99255P22498r8383j168864j208104j89216M60514r437n65805
$$ 254219 679220 1378475 2100973 2002590 833726 -374378 -563594 -103080 -112517 -678322
36141f78322j11248P80942Q47198O8005n00748l95347j55204k05447k73468k0673
$$ -678322 -789570 -8628 838570 906575 405827 10480 -144724 -350171 -623639 -644312
36131f44312M13122O54325M92254K805m53115m71177j07631N7708l55250r77759
$$ -644312 -231190 423135 915389 918194 465079 -6098 -113729 -56021 -411271 -1389030
36121a389030j151629o74911J65955R61745J296975R26910K02793j03043K20261
$$ -1389030 -2540659 -3215570 -3049615 -2087870 -790895 136015 338808 235765 456026
36112D56026M78356J24065l96647l99745k4493J33334l807j02870j18459j67658
$$ 456026 934382 1058447 661800 262055 237562 370896 367089 264219 145760 -21898
36102b1898o4543L03757N01809J92064j30714J29773N85400M29377k15880m96030
$$ -21898 -86441 217316 719125 911189 780475 910248 1495648 1925025 1709145 1213115
36092A213115j66586K29825L71307L88194K31992k27260o15743n26330l64840
$$ 1213115 1046529 1276354 1647661 2035855 2267847 2040587 1424844 898514 533674
36083E33674o86823r81520l90381N81512N80212l75367q11958j69553M33794K66820
$$ 533674 -153149 -1134669 -1525050 -943538 -363326 -738693 -1550651 -1720204 -1286410 -1019590
36073a019590R1502M46586M95121l29716r93239m88353L84201K78715n53594q00408
$$ -1019590 -928088 -481502 13619 -316097 -1309336 -1797689 -1413488 -1134773 -1688367 -2488775
36063b488775j07591P68636J318150J529676J192630J63667r03078j136235n79453
$$ -2488775 -2596366 -1827730 -509580 1020096 2212726 2376393 1473315 337080 -242373
36054b42373O9019M87943O90433M58082k10541n59502l5569O40076M62919k16493
$$ -242373 -173354 314589 1005022 1463104 1252563 693061 657492 1297568 1760487 1543994
36044A543994k81988K53873L24818l35880q16619o07862k52033j67418l5219K81097
$$ 1543994 1262006 1515879 1840697 1504817 688198 80336 -171697 -339115 -374334 -93237
36034i3237L09040q8717l01895J3666L35438J58662k37437l49749j52318J40259
$$ -93237 215803 127086 -174809 -161143 174295 332957 95520 -254229 -406547 -266288
36024b66288M33267N62673L08243j43434l11296j85088k43176n27429m55260J38876
$$ -266288 166979 729652 1037895 894461 583165 398077 154901 -372528 -827788 -688912
36014f88912N41883K00864m30037n98423k78387L0288J02011R0164J41077L03864
$$ -688912 -147029 53835 -376202 -974625 -1253012 -1222724 -1120713 -1030549 -889472 -585608
36004e85608N78151P77981O25607J78730j72331k98257n03482q94128j026191
$$ -585608 -7457 770524 1396131 1574861 1402530 1104273 600791 -293337 -1319528
35995a319528n11680L55330Q93284P47982J29537m61888o38471m34310k22137
$$ -1319528 -1831208 -1475878 -582594 165388 294925 -166963 -805434 -1239744 -1461881
35986a461881j80841o5358K25329K67859j47409l42235L43348J291784J296566
$$ -1461881 -1642722 -1708080 -1482751 -1214892 -1362301 -1704536 -1361188 -69404 1227162
35977A227162L63449l30066k83177k13877n42732o73492k77117k5963l32852m68993
$$ 1227162 1590611 1260545 977368 763491 220759 -452733 -729850 -755813 -1088665 -1557658
35967a557658K10210J074944J134071M14403l38397o66405m64181K09444P62747
$$ -1557658 -1347448 -272504 861567 1275970 937573 271168 -193013 16431 779178
35958G79178L63128p54102j230565n50439P7841k75816o70541j9901Q25380M69171
$$ 779178 1142306 388204 -842361 -1392800 -1314959 -1590775 -2261316 -2281217 -1455837 -986666
35948i86666m91382l65932P02350Q93269k37962j004076l27083O55582N25597
$$ -986666 -1478048 -1843980 -1141630 -248361 -486323 -1490399 -1817482 -1161900 -636303
35939f36303l83548q42025m96472J43934O83024R72254Q54243M38460J89806K73842
$$ -636303 -1019851 -1861876 -2358348 -2214414 -1531390 -559136 295107 733567 923373 1197215
35929A197215K54642j91513p20092q12953m34739N8198L26950K47238J9754L7544
$$ 1197215 1451857 1260344 540252 -272701 -707440 -649242 -322292 -75054 -55300 -17756
35919a7756K82830J30307o72344j227299n92269O45451J040129L95213r0804J62152
$$ -17756 265074 395381 -276963 -1504262 -2096531 -1451080 -410951 -15738 -106542 55610
35909E5610L71353j8170m13250l21399k18234m29230l30896M66023J170280R62385
$$ 55610 426963 408793 -4457 -325856 -544090 -973320 -1304216 -838193 332087 1294472
35899A294472K03894l57409o86159q86050n10686M73188R31171K7950j251681
$$ 1294472 1498366 1140957 454798 -431252 -941938 -468750 462421 490371 -761310
35890g61310j357798m01066K28870N9576q5456K53706N40601L97622K09149L11597
$$ -761310 -2119108 -2520174 -2291304 -2231728 -2317184 -2063478 -1522877 -1125255 -916106 -604509
35880f04509M97614N30005L95136j6419p26185j176173p39402K49106P71990M76201
$$ -604509 -106895 423110 818246 801827 75642 -1100531 -1839933 -1590827 -818837 -342636
35870c42636l6014k54622k59228j37288K12008N63875M79041O8259j17551k0531
$$ -342636 -378650 -633272 -892500 -1029788 -817780 -253905 225136 293395 175844 155313
35860A55313p1984k33166j2996M42577L53600l23994o11489k2161O48437N65023
$$ 155313 83329 -149837 -162833 279744 633344 309350 -302139 -324300 324137 889160
35850H89160m8234n77245q47717p32675N2177J069728J122078l6105r42741m21251
$$ 889160 840926 263681 -584036 -1316711 -1264534 -194806 927272 891167 -51574 -472825
35840d72825O25051O50942j60344m67031p7523L0648k75342n5704P82104J044220
$$ -472825 152226 803168 642824 175793 98270 128918 -146424 -202128 579976 1624196
35830A624196K00045p17158p85943m36367k79564J3539O97642R62215J68163p89328
$$ 1624196 1824241 1107083 321140 -115227 -394791 -381252 316390 1278605 1446768 657440
35820F57440o81201J05989K32829l54975l95190M69314R78319K43770q33873r34350
$$ 657440 -23761 82228 315057 -39918 -435108 34206 1012525 1256295 422422 -511928
35810e11928j79942K94429M6784l48069m11866l17257l11459k78408o6542J88934
$$ -511928 -691870 -397441 -350657 -698726 -1110592 -1427849 -1739308 -2017716 -2084258 -1895324
35800a895324K76076J97809J37520K61258N39230O65698L29103k50773l46014
$$ -1895324 -1619248 -1421439 -1283919 -1022661 -483431 182267 511370 260597 -85417
35791h5417L29228R70911O04260m74350r52226l09191M80195M48808m478k245
$$ -85417 243811 1214722 1818982 1344632 392406 83215 563410 1012218 1007740 1005495
35781A005495K46500j37978j001544j096454N3687J286841J329559L87545m48867
$$ 1005495 1251995 1114017 112473 -983981 -930294 356547 1686106 2073651 1624784
35772A624784p49567q75523r70695p53678k48151J01909J67630K99031N72996
$$ 1624784 875217 -306 -971001 -1724679 -1972830 -1870921 -1703291 -1404260 -831264
35763h31264N44608O9909k32133J60034P82011P47134k2030p03148o70112j83130
$$ -831264 -286656 -216747 -448880 -288846 493165 1240299 1218269 515121 -154991 -338121
35753c38121Q6394j65508o83518r47857n64831L72854J208078J245856N02389
$$ -338121 -251727 -417235 -1100753 -2048610 -2613441 -2240587 -1032509 213347 715736
35744G15736k57460l60517P2562M07278K96019k9120j82831q9762M7672P1973
$$ 715736 458276 97759 170321 577599 873618 844498 661667 571905 619577 691550
35734F91550k540j37622l37163m63790k00375N05030J050271O97367l82142j059964
$$ 691550 689010 551388 214225 -249565 -449940 55090 1105361 1802728 1420586 360622
35724C60622o00925L45572O03294k465o10136o21392k93520n0452M0479k1259
$$ 360622 -240303 105269 708563 706098 95962 -525430 -818950 -869402 -828923 -850182
35714h50182k60814l48557J30553Q01070P24630j38823o19897o7662N49538J24537
$$ -850182 -1110996 -1459553 -1329000 -527930 196700 57877 -562020 -629682 -80144 44393
35704D4393q29511r86658j77986O22441Q70175Q02667N15045n0586l68997R1723
$$ 44393 -785118 -1771776 -1949762 -1327321 -457146 345521 860566 809980 440983 532706
35694E32706O39411J34030r70199r86839K77876R22596j73585j559716j456618
$$ 532706 1172117 1306147 335948 -650891 -373015 549581 375996 -1183720 -2640338
35685b640338l24999K89602K96161O68291J268032R92779r8354o03335M1232P00146
$$ -2640338 -2965337 -2675735 -2379574 -1711283 -443251 549528 451174 -152161 -110929 589217
35675E89217L40319n11622p40731j97634L85748M94648K73586J20426J92253K60737
$$ 589217 929536 417914 -322817 -520451 -134703 359945 633531 753957 946210 1206947
35665A206947L4267l33933l60868n3391o5169n70535o77605J91902R98641L99343
$$ 1206947 1241214 907281 546413 493022 427853 -142682 -820287 -628385 370256 769599
35655G69599j044400j470331m70113L82167P8936l88973Q0378Q55079P88715J85339
$$ 769599 -274801 -1745132 -2215245 -1833078 -1754142 -2143115 -2062737 -1207658 -418943 -233604
35645b33604J44211N95469M44137n13818j132963n87406M83589R14608M79141
$$ -233604 -89393 506076 950213 436395 -696568 -1283974 -800385 114223 593364
35636E93364n2465l4160L12450L47338k9124k16101J59544N68513L23048l01036
$$ 593364 540899 506739 819189 1166527 1137403 921302 1080846 1649359 1972407 1671371
35626A671371m32083J1234K05323j84454m67530j38557L23503L91829L23004L84625
$$ 1671371 1239288 1250522 1455845 1271391 803861 665304 988807 1380636 1703640 2088265
35616B088265J27738p08772j328066r34795j01200J2077n78155p89811j64685
$$ 2088265 2216003 1507231 179165 -755630 -856830 -844753 -1422908 -2212719 -2377404
35607b377404N90355P30446K79546k89355m77289K3076Q67242J083315L14616
$$ -2377404 -1787049 -1056603 -777057 -1066412 -1543701 -1520625 -653383 429932 744548
35598G44548l63218J24649R98278N66414j074856j850600n92245J312895J859747
$$ 744548 381330 505979 1504257 2070671 995815 -854785 -1447030 -134135 1725612
35589A725612Q47426m72739j192632j208888o14275K98006P84798L42654m84484
$$ 1725612 2573038 2100299 907667 -301221 -915496 -617490 167308 509962 25478
35580B5478o81835m9336O42089O78570J19146m36024m38272J38976O76954M77064
$$ 25478 -656357 -705693 -63604 614966 734112 298088 -140184 -1208 675746 1152810
35570A152810l34332q15900m13444K83519M18569O5306o7240J73428K28583j64096
$$ 1152810 818478 2578 -410866 -127347 291222 356528 289288 462716 691299 527203
35560E27203m80830j34253P29988J369025J163964J42289j012589j457575r27672
$$ 527203 46373 -87880 642108 2011133 3175097 3317386 2304797 847222 -80450
35551h0450l6476L25654p3185o07346n35501K04613R86982J167796O64667j02355
$$ -80450 -116926 208728 135543 -471803 -1007304 -802691 184291 1352087 2016754 1914399
35541A914399o83812q54053n15825K43160Q80336O75910l24086j058762p04338
$$ 1914399 1230587 376534 -139291 103869 984205 1660115 1336029 277267 -427071
35532d27071J84491M92003J66924P2169L78001K99411l92291q23352m53923O7069
$$ -427071 -242580 249423 416347 488516 866517 1165928 773637 -49715 -503638 -436569
35522d36569J17268R0127L74665M12784j86648n52647J48707J077952Q47228k16986
$$ -436569 -319301 -229174 145491 558275 371627 -181020 -32313 1045639 1892867 1675881
35512A675881n14193L14031Q97556L10343p15540j115380q05580k41468K66488
$$ 1675881 1161688 1475719 2373275 2683618 1968078 852698 47118 -194350 72138
35503G2138L63803k24397r47553p64602L42516J155947R65201M61441L18300M9566
$$ 72138 435941 211544 -736009 -1500611 -1158095 -2148 963053 1424494 1742794 1792360
35493A792360q08646j418932p79995N15549R48595J91724o17818o33084k40672
$$ 1792360 983714 -435218 -1215213 -699664 248931 440655 -177163 -810247 -1050919
35484a050919j00703j49518N5955N31898P96177M54064k85226p07359l65779K84115
$$ -1050919 -1151622 -1301140 -1245185 -713287 82890 536954 251728 -455631 -821410 -537295
35474e37295M22142L2567j30769J06094l1464p83924j058328p1433J100577R25170
$$ -537295 -115153 -82586 -213355 -107261 -138725 -922649 -1980977 -2052410 -951833 -26663
35464b6663k26632o29117J57780Q02926M37958k22151l99410l87236m74811j11053
$$ -26663 -253295 -882412 -724632 78294 516252 294101 -105309 -492545 -967356 -1078409
35454a078409Q83919J413225N91063o96502r59192k30974K48776O9208k3154K81965
$$ -1078409 -194490 1218735 1809798 1113296 154104 -76870 171906 241114 217960 499925
35444D99925L43350j01195l49981n613K34746k26883p70778n27552J63508K99789
$$ 499925 843275 742080 392099 386486 621232 394349 -376429 -903981 -740473 -440684
35434d40684j27773j55570M83360Q50583L26591l68521l60860j8647k05537o73200
$$ -440684 -568457 -724027 -240667 609916 936507 567986 207126 188479 -17058 -690258
35424f90258l92292O36018J148569M87182m32582n89015k92889l42790n80938
$$ -690258 -1082550 -446532 702037 1189219 756637 167622 -125267 -468057 -1048995
35415a048995l55306J45043K02957p7269N6086N64141N73161j04249n77227l03581
$$ -1048995 -1404301 -1259258 -1056301 -1133570 -1077484 -513343 59818 -44431 -621658 -925239
35405i25239J82205L48136L93875M28470L7775o82323p83117j678M48807k85633
$$ -925239 -743034 -394898 -1023 427447 465222 -217101 -1000218 -1001896 -553089 -838722
35395h38722j084834m60012J008699J463193N54530k75725j85989J28888R4829
$$ -838722 -1923556 -2383568 -1374869 88324 642854 367129 181140 310028 404857
35386D04857J51559M57898K78274n22408p59427K50247J311431J018378j27173
$$ 404857 556416 1014314 1292588 770180 10753 261000 1572431 2590809 2463636
35377B463636o33089l74891m99982j264848j551407p36692L10111O00432L47021
$$ 2463636 1830547 1455656 955674 -309174 -1860581 -2597273 -2287162 -1686730 -1339709
35368a339709K73856M00885K67104j18917k83066l8830L24014N12840M74891K45651
$$ -1339709 -1065853 -664968 -397864 -516781 -799847 -838677 -514663 -1823 473068 718719
35358G18719p8341k70567k07795j15847k41025l35057P5112Q16243R86634J01860
$$ 718719 640378 369811 162016 46169 -194856 -529913 -454801 361442 1348076 1449936
35348A449936j054977j265820m12821M03774L31734k50127m86239k39103k1380
$$ 1449936 394959 -870861 -1283682 -879908 -548174 -798301 -1284540 -1523643 -1545023
35339a545023o6067p6231J70375M89951O15730M66375P7704l74866n27019k23335
$$ -1545023 -1611090 -1687321 -1516946 -1026995 -411265 55110 132814 -242052 -769071 -992406
35329i92406P8384j78535p23754o91983O2807O03016K50939l60517k01425O53483
$$ -992406 -914022 -1092557 -1816311 -2508294 -2445487 -1842471 -1591532 -1952049 -2153474 -1499991
35319a499991J180843Q58928K28735j9272J07643J82287N2274n7015K5104J36684
$$ -1499991 -319148 539780 768515 749243 856886 1039173 1091447 1034432 1059536 1196220
35309A196220J6761k50779k35906K13443N67890K80347k65267j48231O41085R76175
$$ 1196220 1212981 962202 726296 939739 1507629 1787976 1522709 1374478 2015563 2991738
35299B991738K33669o76503o45721q577J45161k24368k17452K95105M04497k16945
$$ 2991738 3225407 2548904 1903183 1894606 2039767 1815399 1597947 1893052 2297549 2080604
35289B080604o78251l29437K10157J51611k19864k10807O4210N9914p5598K31795
$$ 2080604 1402353 1072916 1283073 1434684 1214820 1004013 1068223 1128137 1052539 1284334
35279A284334P78764O71863k36054q80422l96672O00290P49547k91138j415663
$$ 1284334 2063098 2734961 2498907 1618485 1221813 1822103 2571650 2280512 864849
35270H64849j480096o56372k0141n5053j57982K43909O88905L35820o97524j361683
$$ 864849 -615247 -1271619 -1291760 -1346813 -1504795 -1260886 -571981 -236161 -933685 -2295368
35260b295368j034378j79834N09577R58032J313551J296681N72209m95215j067963
$$ -2295368 -3329746 -3509580 -3000003 -2041971 -728420 568261 1140470 645255 -422708
35251d22708p94280j07358M26109O47580O24259L24043k43728p28563o21417J28558
$$ -422708 -1216988 -1324346 -898237 -250657 373602 697645 453917 -274646 -896063 -767505
35241g67505Q55887Q15553Q8675m69620l28731P1162J17701L1634L96833R37399
$$ -767505 88382 903935 992610 522990 194259 265421 383122 414756 811589 1748988
35231A748988O90441m72610j392881j108853q1651N78676N14453J63893r2310
$$ 1748988 2439429 1966819 573938 -534915 -616566 -37890 476563 640456 548146
35222E48146j63543J8546L53111M07083k0275m22880k56249J91546K38894j28805
$$ 548146 384603 403149 756260 1163343 1143068 720188 463939 655485 894379 765574
35212G65574l60333l10409k97024k69536J77626Q46722Q96646R5177o70514o02996
$$ 765574 405241 94832 -202192 -471728 -294102 552620 1449266 1544443 873929 270933
35202B70933p0906P3050k63606m83918k90252L7530K16214K52268J77049m3679
$$ 270933 200027 273077 9471 -474447 -764699 -727169 -510955 -258687 -81638 -125317
35192a25317k73410k53715o36J36140n4313l29157l02903O9327M70986O01400
$$ -125317 -398727 -652442 -653078 -516938 -571251 -900408 -1203311 -1133984 -662998 -61598
35182f1598M32083J31806j17159k15479j76632r3590N748K43139O59007R11144
$$ -61598 370485 502291 385132 169653 -6979 -100569 -94821 148318 807325 1718469
35172A718469N26087l92232j056312r20553l88902j35250m3637M46005J087341
$$ 1718469 2244556 1852324 796012 -124541 -513443 -648693 -692330 -246325 841016
35163H41016Q84846l56290j428358j196948j6004R06311R99225N74210O7954k74078
$$ 841016 1725862 1369572 -58786 -1255734 -1271738 -365427 633798 1208008 1275962 1001884
35153A001884k97147j37130k28635o16975o98002j88692K34087J4697k02845L84768
$$ 1001884 704737 567607 338972 -278003 -976005 -1164697 -930610 -915913 -1118758 -733990
35143g33990J151755Q09755m73545j141159n21530L16282K99544k90546o69460
$$ -733990 417765 1227520 753975 -387184 -908714 -592432 -292888 -583434 -1252894
35134a252894o60225l95229J27307O03239M13562l53734o93063q2422P11534Q39692
$$ -1252894 -1913119 -2308348 -2181041 -1577802 -1164240 -1517974 -2211037 -2293459 -1581925 -742233
35124g42233N50923M58984M33484O5699m17203n62091m69790l76501l0217O74357
$$ -742233 -191310 267674 701158 766857 349654 -212437 -682227 -1058728 -1088945 -414588
35114d14588J015032L66702o42391r00988l99907m2902j49059k07220K413J09635
$$ -414588 600444 967146 324755 -576233 -976140 -1019042 -1168101 -1375321 -1372908 -1263273
35104a263273L3833J95663O60030Q71454M81515j86497o68582q16898o40983k23629
$$ -1263273 -1229440 -1033777 -373747 497707 979222 792725 124143 -692755 -1333738 -1557367
35094a557367J34191J64665N0509J57645M34705N48723M65077L58398J49614k40998
$$ -1557367 -1423176 -1258511 -1208002 -1050357 -615652 -66929 398148 756546 906160 665162
35084F65162m02766M4764O00524M05620m27563q87318n11383J08652L81898L88556
$$ 665162 262396 307160 907684 1313304 885741 -1577 -512960 -404308 -22410 366146
35074C66146K95539j4056m05859l83588J13520M89467L94687J81206J64890J51715
$$ 366146 661685 647629 241770 -141818 -28298 461169 855856 1037062 1201952 1353667
35064A353667K4166M4426J83243p4931p72587j100529n87411M4062o5848n97512
$$ 1353667 1377833 1422259 1605502 1530571 757984 -342545 -929956 -885894 -951742 -1549254
35054a549254n99949P9783P37519R08927P46791M45689J4002l73855l90877l8009
$$ -1549254 -2149203 -2069420 -1331901 -422974 323817 769506 783508 409653 18776 -19233
35044a9233K71043J99849j52239l96353k51765J35847K73806q7224n21728m54702
$$ -19233 251810 451659 299420 -96933 -348698 -212851 60955 -26269 -547997 -1002699
35034a002699k0293J66444L9989J04201L28426J754r20357j323610m72020Q11082
$$ -1002699 -1022992 -856548 -816559 -712358 -383932 -382178 -1302535 -2626145 -3098165 -2287083
35024b287083J309816J028286P48422O56704M43043K29289K86081K08820m97336
$$ -2287083 -977267 51019 799441 1456145 1899188 2128477 2414558 2623378 2126042
35015B126042j293222j211408l90372J64972K22313M64640R96591J056919M60748
$$ 2126042 832820 -378588 -768960 -603988 -381675 82965 1079556 2136475 2597223
35006B597223K0254R9999l723o50288j008863m42662K71318R7077o36730q08276
$$ 2597223 2617477 2717476 2713753 2063465 1054602 611940 883258 980335 343605 -464671
34996d64671j87318M65488O63869N92791L87341p7308o20570p24508k49897L21908
$$ -464671 -651989 -186501 477368 1070159 1457500 1380192 759622 35114 -214783 107125
34986A07125N05576K97879j5576j90584r4551K51423O01525O38993K57620l71152
$$ 107125 612701 910580 895004 704420 609869 861292 1462817 2101810 2359430 1988278
34976A988278r20302j037721n83050J04307M18182J80637j28738p8830R4366n2927
$$ 1988278 1067976 30255 -552795 -448488 -30306 150331 21593 -57237 37129 -15798
34966a5798l75569l14488K42325P78048Q44034N06103K5525m94881r59456j073315
$$ -15798 -391367 -705855 -463530 314518 1158552 1664655 1690180 1195299 235843 -837472
34956h37472n73697L67626J118115J065743K33653o03585o39720L7470N06476
$$ -837472 -1411169 -1043543 74572 1140315 1373968 770383 130663 168133 674609
34947F74609J76207m27133l80698L69655R26635N61116m85818j322192j210801
$$ 674609 850816 423683 42985 412640 1339275 1900391 1414573 92381 -1118420
34938a118420j10521J217033J657360P07748r06588j871298j587844n83258L11825
$$ -1118420 -1228941 -11908 1645452 2353200 1446612 -424686 -2012530 -2595788 -2283963
34929b283963P54304Q02355N42959J04158k40510k64472J177L19616L81045l8569
$$ -2283963 -1529659 -727304 -184345 -80187 -320697 -585169 -583992 -264376 116669 78100
34919G8100p55597j096797n78964L37318O93820K84146j58527j38805J5074M9495
$$ 78100 -677497 -1774294 -2353258 -2015940 -1322120 -1037974 -1196501 -1335306 -1320232 -1270737
34909a270737L56658J005866J090591N3271j016090o93502N46015Q81989r8009
$$ -1270737 -914079 91787 1182378 1235649 219559 -473943 72072 954061 856052
34900H56052q04521k24977N04906O4994q47875o87451M01147P96327j05674j078774
$$ 856052 51531 -173446 331460 396454 -451421 -1138872 -737725 58602 -47072 -1125846
34890a125846r04565J51172J019008J067012L43480o19408r34023o2735J252476
$$ -1125846 -2030411 -1879239 -860231 206781 550261 -69147 -1003170 -1065905 186571
34881A86571J520133L69065q68127r42090k73209n1671m60428p24102m57320M5683
$$ 186571 1706704 2075769 1207642 265552 -7657 -59328 -519756 -1243858 -1701178 -1655495
34871a655495O10229J243859J486547P58193n01018j044444n08416L3473l08333
$$ -1655495 -1045266 198593 1685140 2443333 1942315 897871 389455 422928 114595
34862A14595r35039p92401O483N17929M78174M45029N93372M36234r8902l08717
$$ 114595 -820444 -1612845 -1606362 -1088433 -610259 -165230 428142 864376 765474 456757
34852D56757J32156M80726M0012o61172o26180N1163L32466j37597n29286k13704
$$ 456757 588913 1069639 1109651 448479 -177701 -126538 205928 68331 -460955 -674659
34842f74659K41534M8725m88287m57488J87708N28542R1608m36956k45820M17025
$$ -674659 -433125 -384400 -872687 -1330175 -1142467 -613925 -522317 -959273 -1205093 -788068
34832g88068O14265L9320n49221l08777N71779J018496L64247p49955j078776
$$ -788068 -173803 -134483 -683704 -992481 -420702 597794 962041 212086 -866690
34823h66690l22536N06483M62821j31700l53706o2714J48986J13372K42697N23708
$$ -866690 -1189226 -682743 -219922 -351622 -705328 -768042 -619056 -505684 -262987 260721
34813B60721L46491l86977q89633o64094k37290j82849j86008K20224O60834N06904
$$ 260721 607212 220235 -669398 -1333492 -1570782 -1753631 -1939639 -1719415 -1058581 -551677
34803e51677j4588j69108J19748K61700k0553m11913n75954m23632J484M05119
$$ -551677 -566265 -735373 -615625 -353925 -374478 -786391 -1362345 -1785977 -1784493 -1379374
34793a379374L35988q6457l8919P54027J278640O74377k33633r5062P71950Q63069
$$ -1379374 -1043386 -1129843 -1168762 -414735 863905 1538282 1304649 1209587 1981537 2844606
34783B844606o9350p27509m98082k49100n21286o18843j63432M4842l98708n50813
$$ 2844606 2775256 2047747 1549665 1300565 779279 160436 -2996 41846 -356862 -907675
34773i07675J95422Q44189M62724j26739K37075J001434Q76296N1534k81636o4856
$$ -907675 -712253 131936 594660 467921 704996 1706430 2582726 2634260 2352624 2287768
34763B287768k44528q07201p54894m8279J68118m48357q38340l90058J00858j6913
$$ 2287768 2043240 1236039 481145 432866 600984 152627 -685713 -1075771 -974913 -991826
34753i91826r0669N38183J160642P12523n15470j220964q10490O9252N65905N02446
$$ -991826 -1082495 -544312 616330 1328853 813383 -407581 -1218071 -1148819 -582914 -80468
34743h0468K16448L797j19287k45864k88675m4464L29326K56516m07499q32105
$$ -80468 135980 139777 20490 -225374 -514049 -558513 -229187 27329 -380170 -1212275
34733a212275k49429P06128O83721l44027q55547M1884J286742J387434L91475
$$ -1212275 -1461704 -755576 -71855 -415882 -1271429 -1229545 57197 1444631 1836106
34724A836106n24414p79517p24489o12433k35360M04523Q23215O43220K7645n59926
$$ 1836106 1311692 532175 -192314 -804747 -1040107 -635584 187631 830851 858496 298570
34714B98570p39899l92344K55712P31334P16914L11416k04799o59685q88221o42444
$$ 298570 -441329 -833673 -577961 153373 870287 1181703 976904 317219 -571002 -1213446
34704a213446P2738P53730Q27779K88499l01247m07634m0229K56139n0927p78226
$$ -1213446 -1140708 -386978 440801 729300 428053 20419 -19810 236329 185402 -592824
34694e92824j022720k34920Q68164J087003L90050n3970L37755P38732L80317
$$ -592824 -1615544 -1850464 -982300 104703 494753 440783 778538 1517270 1897587
34685A897587j67951p1294K56541q2218p20851m59176O65305J176138L43881p11999
$$ 1897587 1729636 1658342 1914883 1832665 1111814 652638 1317943 2494081 2837962 2125963
34675B125963p44419j31752l402m02134m62376n1400n473o20133j002607m39956
$$ 2125963 1381544 1249792 1246390 844256 381880 330480 325007 -295126 -1297733 -1737689
34665a737689M16759N09058k6397j81817K12976K49417l77370o38215J48466R33477
$$ -1737689 -1320930 -811872 -838269 -1020086 -807110 -557693 -935063 -1573278 -1424812 -491335
34655d91335M34260o66270n72877P56661J330453J11057j357931j242598O503
$$ -491335 -57075 -723345 -1296222 -539561 790892 901949 -455982 -1698580 -1692077
34646a692077O46198K39845k14272k04832k25257m73136l90834K83875J024405
$$ -1692077 -1045879 -806034 -1020306 -1225138 -1450395 -1923531 -2314365 -2030490 -1006085
34637a006085J296167J055221M18712l62646o38749l810P66577M60432p46632
$$ -1006085 290082 1345303 1764015 1401369 762620 758810 1525387 1985819 1239187
34628A239187j340841o57742J88749J60510j17080L94217J245168J136791l792
$$ 1239187 -101654 -759396 -570647 -410137 -527217 -133000 1112168 2248959 2245167
34619B245167q82460p33505k26666k25705n54420n01311K8768M53802L66045m6077
$$ 2245167 1362707 629202 402536 176831 -377589 -878900 -850132 -396330 -30285 -76362
34609g6362l96012n36021m82677j94691L08877P32367P33907L98675J59740J56849
$$ -76362 -472374 -1008395 -1491072 -1685763 -1376886 -644519 89388 488063 647803 804652
34599H04652N8925k81098m59865j94867R5239m9150k83688k2975M39043L05583
$$ 804652 863577 582479 122614 -72253 22986 -26164 -309852 -332827 106216 411799
34589D11799k98959l25292N59233J321883J027972J11490m32709m43381m48078
$$ 411799 112840 -212452 346781 1668664 2696636 2808126 2375417 1932036 1483958
34580A483958n96148n23351j06721K85033L08856L3676k03079j40422J43130K69221
$$ 1483958 887810 364459 257738 542771 851627 885303 682224 541802 684932 954153
34570I54153K9917k62178k25390n3168j55875l17317k5555L91721L8312r04720
$$ 954153 984070 721892 496502 443334 287459 -29858 -55413 336308 374620 -530100
34560e30100j021861K30276J414151J056547k37776p60108j06889O04588N28145
$$ -530100 -1551961 -1321685 92466 1149013 911237 151129 44240 648828 1176973
34551A176973n7138m97574m16942K16230Q94635P58588k53979r27610l57800N56535
$$ 1176973 1119835 622261 205319 421549 1316184 2074772 1820793 893183 535383 1091918
34541A091918L77532o46083j053846n31709j56699l32868k13332N04903Q56721
$$ 1091918 1469450 823367 -230479 -762188 -918887 -1251755 -1465087 -960184 -103463
34532a03463K90428l52988k85995L2729n1653k39658k3052L44997M34501L76364
$$ -103463 186965 -166023 -452018 -419289 -470942 -710600 -733652 -388655 45846 422210
34522D22210L05258q3497p10757p62455J7514N76394L4092q91637r61990k16157
$$ 422210 727468 643971 -66786 -829241 -811727 -235333 -201241 -1092878 -2054868 -2271025
34512b271025L80834M99404N41934O19818N12561L38076L13196J68615l11873
$$ -2271025 -1890191 -1390787 -848853 -229035 283526 621602 934798 1103413 791540
34503G91540n83466j37320M20600J73433n65218o83292l6346M14435J78567j94396
$$ 791540 208074 70754 491354 664787 99569 -583723 -620069 -205634 -27067 -221463
34493b21463j94621K5062K11579K91824O3374n05998p41693k9478R43919Q56552
$$ -221463 -416084 -391022 -179443 112381 175755 -330243 -1071936 -1101414 -157495 699057
34483F99057k87431j054926o22281K84256P65733Q42681P42255K87088m11147
$$ 699057 411626 -643300 -1265581 -981325 -215592 627089 1369344 1656432 1245285
34474A245285o88641l67443j13378k33562j53065L29650M22702k31047o47657
$$ 1245285 556644 189201 75823 -157739 -310804 18846 441548 210501 -437156
34465d37156m2369P45231N59122j96883l26249J57553K22903l48980p23654m93306
$$ -437156 -479525 265706 824828 627945 301696 459249 682152 333172 -390482 -883788
34455h83788j39060J2148J72547L40395J75111k29098l38313p2346J24071J59065
$$ -883788 -1022848 -1010700 -838153 -497758 -322647 -551745 -890058 -962404 -838333 -679268
34445f79268L58272N83360K70419m48215o71534j45859K27003j61704n80896j26122
$$ -679268 -320996 262364 532783 84568 -586966 -732825 -505822 -667526 -1248422 -1374544
34435a374544P72262R38600J69772n67905n82018k62536k54700m70952l60326
$$ -1374544 -602282 336318 506090 -61815 -643833 -906369 -1161069 -1632021 -1992347
34426a992347J58014N35519L87959M1876L5287L41117N08453M55883N49242Q01604
$$ -1992347 -1834333 -1298814 -910855 -868979 -833692 -492575 15878 471761 1021003 1822607
34416A822607O59283p1091p11066o58663k86729k23374k68606R2550N14843K23344
$$ 1822607 2481890 2410799 1699733 1041070 754341 530967 262361 354911 869754 1093098
34406A093098n50081p33059j04195L33909k3775m80688k61669L18180N54621M38854
$$ 1093098 543017 -190042 -294237 39672 15897 -464791 -726460 -408280 146341 585195
34396E85195L37558K22862o3315k76449j79954p2622k80005n11910l46886Q834
$$ 585195 922753 1145615 1082300 805851 625897 553275 273270 -238640 -585526 -576692
34386e76692P6749j04230j72199j30438j95743k11179J22670O04214P57232N73484
$$ -576692 -499943 -604173 -776372 -906810 -1102553 -1313732 -1191062 -586848 170384 743868
34376G43868M32229M04297K39730m9304k03072k50904m33666o27284m55774P705
$$ 743868 1176097 1580394 1820124 1770820 1567748 1316844 883178 255894 -199880 -192175
34366a92175K61778J66053J18770L24330M47542J91136k60551n67678n95950l26933
$$ -192175 69603 235656 354426 678756 1126298 1317434 1056883 489205 -106745 -433678
34356d33678J43663L98961K5899o30317o02432M10443J373982J106604j36885
$$ -433678 -290015 108946 134845 -495472 -1097904 -687461 686521 1793125 1656240
34347A656240r02114l42454P77711J102994L03670p12274j023215o48170j67092
$$ 1656240 754126 411672 1189383 2292377 2596047 1883773 860558 212388 45296
34338D5296J50275M00142M72230N2162p08391j094650p03351N236L49823K29936
$$ 45296 195571 595713 1067943 1120105 411714 -682936 -1386287 -1381051 -1031228 -801292
34328h01292o4132m08240p22808o69140o2270O58823R42212Q65996P92523N97768
$$ -801292 -865424 -1273664 -1996472 -2665612 -2727882 -2069059 -1126847 -260851 531672 1129440
34318A129440J4703n00188k14284N78541P22698j12189q86255p30156j11740J16079
$$ 1129440 1144143 643955 429671 1008212 1730910 1618721 732466 2310 -109430 6649
34308F649L084M9950J07862l08018r15484q35722J11559J044168J130323N19240
$$ 6649 9733 59683 167545 -140473 -1055957 -1891679 -1780120 -735952 394371 913611
34298I13611n3409j68163L8443K64311L62885L26683J62057j20326m19785n47811
$$ 913611 860202 692039 730482 994793 1357678 1684361 1846418 1726092 1306307 758496
34288G58496l98108p9916J94432L02589K18644m0050l13851l09620L6844L48082
$$ 758496 360388 280472 474904 777493 996137 956087 642236 332616 369460 717542
34278G17542K66923j1124o2848L5574j70096o85565r50546o71506k17981J6220
$$ 717542 984465 973341 910493 946067 775971 90406 -860140 -1531646 -1749627 -1733407
34268a733407J27420L12526M53149M27263M27667O00046O79494L44831k78866
$$ -1733407 -1605987 -1293461 -840312 -413049 14618 614664 1294158 1638989 1360123
34259A360123p32714o62953l6762P96261J184134P10769k18608p42335n98289
$$ 1360123 627409 -35544 -72306 723955 1908089 2618858 2400250 1657915 1059626
34250A059626l36573l88811n42039n20345l97002j48307M48641J081553Q85817
$$ 1059626 723053 334242 -207797 -728142 -1125144 -1273451 -824810 256743 1142560
34241A142560k55896j166473q48950J72590P64240P48590O26786L71032l36861
$$ 1142560 886664 -279809 -1128759 -956169 -191929 556661 1183447 1554479 1217618
34232A217618j040074r12955j28353K99842N0168j76976N4309L25784K76603J72223
$$ 1217618 177544 -735411 -863764 -563922 -513754 -690730 -636421 -310637 -34034 138189
34222A38189K48616K70562N8367k07211m36480p26353q22148k26982Q67299J469572
$$ 138189 386805 657367 715734 508523 72043 -654310 -1476458 -1703440 -836141 633431
34212F33431R83100o6930p98994q87081m44656L22118R43611Q01472o6779p52060
$$ 633431 1616531 1549601 750607 -136474 -581130 -259012 684599 1486071 1419292 667232
34202F67232n52368J31822M33441J63722j76404k30017j06978j5817l504k4454
$$ 667232 114864 246686 680127 843849 667445 437428 330450 314633 311129 286675
34192B86675K425J56295L69737M21845K02909j19747k75960j38331J83511L66812
$$ 286675 289100 445395 815132 1236977 1439886 1320139 1044179 905848 1089359 1456171
34182A456171J22529l76578n42750j84684L2732n06582j269985j156080r5843
$$ 1456171 1578700 1202122 659372 474688 507420 838 -1269147 -2425227 -2521070
34173b521070P90574P55429K82608J14897K49285L33708L53485L95882K84195
$$ -2521070 -1730496 -975067 -692459 -577562 -328277 5431 358916 754798 1038993
34164A038993m4527k50510j32302l2684k73611n81769m99158k4167N18763R06994
$$ 1038993 994466 743956 611654 578970 305359 -276410 -775568 -799735 -280972 626022
34154F26022R96683O41635k5031n39152o08426l85842j10838J30688K02641k3135
$$ 626022 1622705 2264340 2239309 1700157 1091731 705889 595051 725739 928380 905245
34144I05245l11083l16459k19571m04820n28423J01469J065547R69715m65078
$$ 905245 594162 277703 58132 -346688 -875111 -773642 291905 1261620 796542
34135G96542j638581j158783L37526J299118J238049O74110L4640l44250L9617
$$ 796542 -842039 -2000822 -1663296 -364178 873871 1547981 1582621 1238371 1277988
34126A277988R92063J267716K15687j000335j050186m59565n18088r64859n72610
$$ 1277988 2270051 3537767 3753454 2753119 1702933 1243368 725280 -239579 -812189
34117h12189M60792P10417R353k58377M26937R19582N17714Q6864L22478M94546
$$ -812189 -351397 359020 368373 109996 536933 1456515 1974229 2061093 2383571 2878117
34107B878117r3979p38824n39140P2188J35828k74735l85427n7011K04047K00475
$$ 2878117 2784138 2045314 1506174 1578362 1714190 1439455 1054028 997017 1201064 1401539
34097A401539J54061J00367j20459m13333m94136k92818L4420L06344L29764J4055
$$ 1401539 1555600 1655967 1535508 1122175 628039 335221 369641 675985 1005749 1019804
34087A019804l61909l58655K7164L85666N41227O20894M82925j41378q09953o07314
$$ 1019804 657895 299240 326404 712070 1253297 1874191 2357116 2215738 1405785 798471
34077G98471M20129R98320L64568n72868n51536K63820O79718J96039n35449p66093
$$ 798471 1218600 2216920 2581488 2008620 1457084 1720904 2400622 2596661 2061212 1295119
34067A295119m44335o549J35218o8710k19984J01105O73247P70902J71272m50460
$$ 1295119 850784 844235 979453 910743 690759 791864 1465111 2236013 2407285 1956825
34057A956825m49582o3019O0387k30811n56567n48769r9991O05886J068456Q51783
$$ 1956825 1507243 1444224 1504611 1273800 717233 168464 68473 674359 1742815 2594598
34047B594598J79384k77255k95446k10442r6235L10338O95183K52987q46905j210449
$$ 2594598 2773982 2496727 2201281 1990839 1894604 2204942 2900125 3153112 2306207 1095758
34037A095758k00073Q92910O73803k89539m83354J86000N07984P9105k36624N510
$$ 1095758 895685 1788595 2462398 2172859 1689505 1875505 2383489 2462594 2225970 2231480
34027B231480R6606m77614j067746q34912M5562P41022Q63166O96860N66954M24046
$$ 2231480 2328086 1850472 782726 -52186 -6624 734398 1597564 2294424 2861378 3285424
34017C285424J00351k50774k10458K91401O48896K81878m36442n58631P3328N71644
$$ 3285424 3385775 3135001 2924543 3215944 3864840 4146718 3710276 3151645 3224973 3796617
34007C796617L36715j53283k92262k60744l95136m14944l2714L13957J52377j53668
$$ 3796617 4133332 3980049 3687787 3427043 3031907 2616963 2584249 2898206 3050583 2896915
33997B896915l9527K60591J92412j01119j07982J07481J40850O7182K03056M09584
$$ 2896915 2857388 3117979 3310391 3209272 3101290 3208771 3349621 3416803 3619859 4029443
33987D029443M19469M51918P11920P62608K64154j88275O0025N30695L80209j18540
$$ 4029443 4448912 4900830 5612750 6375358 6639512 6451237 6511262 7041957 7422166 7303626
33977G303626o8126M43641N00849o6670m89914l61983k5327K80871O45703R29102
$$ 7303626 7235500 7679141 8179990 8113320 7623406 7261423 7236096 7516967 8162670 9091772
33967I091772Q77918O51305M60980O7505n57844o73087J49120J063484J180431
$$ 9091772 9969690 10620995 11081975 11149480 10591636 9918549 10067669 11131153 12311584
33958A2311584R69423J219120J525846J246946R63357J390481J920543J987164
$$ 12311584 13281007 14500127 16025973 17272919 18236276 19626757 21547300 23534464
33950B3534464K547119M176540N329408N019071N339484Q110413J1125989J1893439
$$ 23534464 26081583 30258123 35587531 40606602 45946086 54056499 65182488 77075927
33942G7075927J2917596J7946609K5241244L1751817M1739897N9978964P4773728
$$ 77075927 89993523 107940132 133181376 164933193 206673090 266652054 341425782
33935C41425782O1646650J3293912m3451565p2568957o6203815m6317314l3410763
$$ 341425782 403072432 416366344 372914779 300345822 234142007 187824693 154413930
33928A54413930k7669890k1379649j4783563j2123091j1710013r111045n368142
$$ 154413930 126744040 105364391 90580828 78457737 66747724 57636679 52268537
33921E2268537m551374o105835o048883l906865k779003l484122l627175k214166
$$ 52268537 47717163 41611328 35562445 31655580 28876577 25392455 21765280 19551114
33913A9551114r74377r23903j081255r06875j109560j679539j594349q10386m36000
$$ 19551114 18576737 17652834 16571579 15664704 14555144 12875605 11281256 10470870 10034870
33904A0034870p17178p62446l60508k23864l69691q9581L84602K7706r71658j175133
$$ 10034870 9317692 8555246 8194738 7970874 7601183 7511602 7896204 7923910 6952252 5777119
33894E777119k44375L94669j98980j114725j188349o44608l13791k43902K8633
$$ 5777119 5532744 5927413 5728433 4613708 3425359 2780751 2466960 2223058 2251691
33885B251691M94406O94684L72496k91199p87048n45034M32154J214763Q48688
$$ 2251691 2746097 3440781 3813277 3522078 2735030 2189996 2622150 3836913 4685601
33876D685601l58184j117831p88355k8173K73143M790m25111p22744q00785o80307
$$ 4685601 4327417 3209586 2421231 2393058 2666201 2670991 2245880 1523136 722351 42044
33866D2044m95087l02098P1133O40278R30021N38924j71842n38759m96668l56469
$$ 42044 -453043 -755141 -684008 -43730 886291 1425215 1253373 714614 217946 -138523
33856a38523k8699O27660R69394K43273r46544j100069L8107J042425R12851L64115
$$ -138523 -167222 460438 1429832 1673105 726561 -373508 -335401 707024 1619875 1983990
33846A983990L45244M68156o8843q90498r94978l99270n5421l13014n26092k24734
$$ 1983990 2329234 2797390 2728547 1838049 843071 443801 388380 75366 -450726 -675460
33836f75460K42177M40701M76811N52920M67275p57n31609n58693n3517L59013
$$ -675460 -433283 7418 484229 1037149 1504424 1503667 972058 413365 359848 718861
33826G18861J92974k44398k70023J91638M46812J3176o43752p54505l35374p7378
$$ 718861 911835 667437 397414 589052 1035864 1049040 405288 -349217 -684591 -761969
33816g61969k72146m77630l06738N6305L00840M14002M39470K98118Q5968J00645
$$ -761969 -1034115 -1511745 -1818483 -1762178 -1461338 -1047336 -607866 -309748 -223780 -123135
33806a23135L51758M94815M23716L91318L67762l2770o92561q54032l27950j7062
$$ -123135 228623 723438 1147154 1538472 1906234 1873464 1180903 326871 -1079 -18141
33796a8141n45457j156741q71095l1232L80304L54097N13994O45535P8010o73200
$$ -18141 -563598 -1720339 -2591434 -2622666 -2242362 -1888265 -1374271 -728736 -650726 -1323926
33786a323926l31151R24197J371611L59686o73749n56385q9190k60640l26162
$$ -1323926 -1655077 -730880 640731 1000417 326668 -229717 -318907 -579547 -905709
33777i05709P08589J887347J521112p7843j026995p08806k56205k79900q8852
$$ -905709 -197120 1690227 3211339 3133496 2106501 1397695 1141490 861590 772738
33768G72738N12865N47259l41024j043429p81807l02497l54918l53928L11038
$$ 772738 1285603 1832862 1491838 448409 -333398 -635895 -990813 -1344741 -1033703
33759a033703Q57740L51874n60384n69454K85442Q50741O39925J51255k17914
$$ -1033703 -175963 175911 -384473 -953927 -668485 182256 822181 973436 755522
33750G55522m28759l07314J50966L53512k0629k54534K13895N31444k39035j206593
$$ 755522 326763 19449 170415 523927 503298 248764 462659 994103 755068 -451525
33740d51525q25121M84416Q89972J46039j65988M36284N18743n08853j113721
$$ -451525 -1276646 -792230 97742 243781 77793 514077 1032820 523967 -589754
33731e89754k55289P54872M57735m04420l71864L10329M73454J11259k9304n2976
$$ -589754 -845043 -90171 367564 -36856 -408720 -98391 375063 486322 457018 404042
33721D04042m56517q13889n15646j32041m50955q32033k07466Q65279R49383R2635
$$ 404042 -52475 -866364 -1382010 -1514051 -1965006 -2797039 -3004505 -2139226 -1189843 -1097208
33711a097208m00407k50230l28057o48645k71621O64506Q30833J4510l93281K14009
$$ -1097208 -1497615 -1747845 -2075902 -2724547 -2996168 -2331662 -1500829 -1486319 -1879600 -1665591
33701a665591O50404J09254m28091j0662O03969L47566l13357k61372M26391P64255
$$ -1665591 -1015187 -905933 -1334024 -1344686 -740717 -393151 -706508 -967880 -541489 222766
33691B22766L88317k35008o56422o83021k40881L48701M78294J51650J05862N77476
$$ 222766 611083 376075 -280347 -963368 -1204249 -855548 -377254 -225604 -119742 457734
33681D57734Q17019L99531J0404J68398K17918m26687j027556o95264L6851J18161
$$ 457734 1274753 1674284 1684688 1853086 2071004 1644317 616761 -78503 -41652 76509
33671G6509k40731j09875L67840K41765m60251p16314k62794L1428k87591n68300
$$ 76509 -164222 -274097 93743 335508 -124743 -841057 -1103851 -1072423 -1360014 -1928314
33661a928314k07716N04528R70666Q95782K08621p84255j156569k63452J039650
$$ -1928314 -2136030 -1631502 -660836 234946 443567 -340688 -1497257 -1760709 -721059
33652g21059J158254n9204j020858o24747L47711O42885K74748L7354J08457R2315
$$ -721059 437195 377991 -642867 -1267614 -919903 -277018 -2270 35084 143541 235856
33642B35856n3101l2209J03247J8042k94928n17126m87361k67845O6176L24919
$$ 235856 182755 150546 253793 271835 -23093 -540219 -1027580 -1295425 -1229249 -904330
33632i04330J78377l40665o21824k72290J80831J4229m94371l76886N19175J162647
$$ -904330 -725953 -1066618 -1688442 -1960732 -1779901 -1765672 -2260043 -2636929 -2117754 -955107
33622i55107P67158j15399m39376r2719J88658O8530K409L19813O24652M60382
$$ -955107 -187949 -303348 -742724 -835443 -646785 -578255 -575846 -256033 368619 829001
33612H29001N1108j16681r8386k81115n57601l90621K65070P59804O61732K83049
$$ 829001 880109 763428 665042 383927 -173674 -564295 -299225 460579 1122311 1405360
33602A405360J5220k68348p06274q78166l66530M30395P03838L17734j00708j10914
$$ 1405360 1420580 1152232 445958 -432208 -798738 -368343 335495 653229 552521 441607
33592D41607M1076o1202m12480o35767m00901K08788O19331K65147o17309j028642
$$ 441607 482683 421481 9001 -626766 -1027667 -818879 -199548 65599 -551710 -1580352
33582a580352m10842N51483Q49886N01484K68473L12042N8851n87552q64505k90102
$$ -1580352 -1991194 -1439711 -589825 -88341 180132 492174 551025 -36527 -901032 -1191134
33572a191134N73707R05150N88217J0258n69864r97527r85309m08563L51803P20998
$$ -1191134 -617427 287723 875940 886198 316334 -681193 -1666502 -2075065 -1723262 -1002264
33562a002264M93385n7977m48731l00052L17749P92443N69579q8224l51533Q0359
$$ -1002264 -508879 -566856 -1015587 -1315639 -997890 -205447 364132 275908 -75625 4734
33552D734O14117O45056K86806k9868j88315k78834k71461j48101n1926m4921
$$ 4734 618851 1263907 1550713 1520845 1332530 1053696 782235 634134 582208 537287
33542E37287k5596m5995k89578n83879m82709n2423O7163k90189m35237K6832
$$ 537287 511691 465696 176118 -407761 -890470 -942893 -875730 -1165919 -1601156 -1574324
33532a574324M25446J05428m13488k56742L61185N33243J45684j03097K5485J12173
$$ -1574324 -1148878 -1043450 -1456938 -1713680 -1352495 -819252 -673568 -776665 -751180 -639007
33522f39007R6202L67197P40934M81353l60678p22972j15013N78291M75615m8161
$$ -639007 -542805 -175608 565326 1046679 686001 -36971 -151984 426307 901922 853761
33512H53761k28334j75713l51385m76313n7321M62419K52786m23074m67889K99203
$$ 853761 625427 449714 98329 -377984 -435305 27114 279900 -143174 -611063 -311860
33502c11860Q17375M42472j68611k61883o6919o6538q9668Q3468j9316p41638
$$ -311860 505515 947987 779376 517493 450574 384036 294368 377836 358520 -383118
33492c83118j325136q50758K15806O01053J86621J16271Q23471J290048P69294
$$ -383118 -1708254 -2559012 -2343206 -1742153 -1555532 -1439261 -615790 674258 1443552
33483A443552K1828L938L22308O4567n50585n88209p4057L7257m62115o27442
$$ 1443552 1465380 1469318 1791626 1856193 1305608 717399 643342 680599 218484 -408958
33473d08958N8722P49681M58729n08819j018812n90961J88341N40296K82864k14299
$$ -408958 -350236 399445 858174 349355 -669457 -1260418 -1072077 -531781 -248917 -463216
33463d63216m95722l54133J19276O71287J010898Q55312J05943q51803j269631
$$ -463216 -958938 -1313071 -1193795 -522508 488390 1343702 1449645 597842 -671789
33454f71789p85584P6460M77695K23024j72341k34877K8918L43445M35911J85679
$$ -671789 -1457373 -1380913 -903218 -680194 -852535 -1087412 -1058494 -715049 -279138 -93459
33444i3459j79096k17588P2639R6589l85224o42634o1976O37173L31757o55226
$$ -93459 -272555 -490143 -417504 -320915 -706139 -1348773 -1410749 -773576 -441819 -1097045
33434a097045r11129j06493N71771M06318J52781N02825Q67901N27685r6466k43529
$$ -1097045 -2008174 -2114667 -1542896 -1136578 -983797 -480972 386929 914614 818148 574619
33424E74619j8077P9881L2021j13238o79207j486166j434074m8248J353893J265309
$$ 574619 556542 636423 668444 555206 -124001 -1610167 -3044241 -3092489 -1738596 -473287
33414d73287J17970m67663m4364L90396J50604m13029p65516o26370K08251J379314
$$ -473287 -355317 -822980 -867344 -476948 -326344 -739373 -1504889 -2131259 -1923008 -543694
33404e43694J658743L81119j168907j211716k6590N51056L3600j71577O53796
$$ -543694 1115049 1496168 327261 -884455 -911045 -359989 -326389 -497966 155830
33395A55830J313483P53099k94901o62825m39178l25904l53449j89242Q4828K88082
$$ 155830 1469313 2222412 1927511 1264686 825508 499604 146155 -43087 41741 329823
33385C29823N13536O23108K10954m49361m50304K11330L32723n43517j179112
$$ 329823 843359 1466467 1677421 1228060 777756 989086 1321809 778292 -400820
33376d00820o23697J52562j02715q14750o60920J57574M44104J75638L33331Q92066
$$ -400820 -1024517 -871955 -974670 -1789420 -2450340 -2292766 -1848662 -1673024 -1339693 -447627
33366d47627Q06392k96l68291J15808M51712O166m51147j43967M44889M46552
$$ -447627 358765 358469 -9822 105986 557698 563864 112717 -31250 413639 860191
33356H60191j42528p52793j048350q68172q4217Q76728J029076J6668j192826
$$ 860191 717663 -35130 -1083480 -1951652 -2035869 -1159141 -130065 -113397 -1306223
33347a306223j416622o42445K47480O99505P85693O02346J16214m22936n16518
$$ -1306223 -2722845 -3365290 -3117810 -2418305 -1632612 -1030266 -914052 -1336988 -1853506
33338a853506k1022O09002Q15062N14425J18869L1818J54964j7122o89617j293629
$$ -1853506 -1874528 -1265526 -450464 63961 182830 214648 369612 352490 -337127 -1630756
33328a630756j038441P2148J125841J289965O21845j70229m60976j33798L91928
$$ -1630756 -2669197 -2597049 -1471208 -181243 440602 270373 -190603 -324401 67527
33319F7527M74158q1575o32411m04135L75398O37060m1273p78350o50279J8938
$$ 67527 541685 460110 -172301 -576436 -201038 436022 394749 -383601 -1033880 -1014942
33309a014942K86153L6264m4278K66380M00393N3601k47909N996N00230O04243
$$ -1014942 -728789 -692525 -736803 -470423 -70030 -16429 -264338 -258342 241888 846131
33299H46131K87030J2240l9890j10446k85235k95015k1495J97703K5550l55905
$$ 846131 1133161 1145401 1105511 995065 709830 414815 393320 591023 616573 260668
33289B60668m73345j96039J35061J92163K3263j23550j24020j4487J35207K47806
$$ 260668 -212677 -408716 -273655 -81492 -58229 -181779 -305799 -320286 -185079 62727
33279F2727K47282J77667K21847M46188N92581L21330l17591q25876p70473k78749
$$ 62727 310009 487676 709523 1155711 1748292 2069622 1752031 926155 155682 -123067
33269a23067R0731k0341l60954l98179l5694J95949j58091p37736o94533J81891
$$ -123067 -32336 -52677 -413631 -811810 -847504 -651555 -809646 -1547382 -2241915 -2060024
33259b060024J046665R84343J49032m72202l25840J36319K43821K5630k676K66806
$$ -2060024 -1013359 -29016 120016 -352186 -678026 -541707 -297886 -272256 -274932 -8126
33249h126L36009j20269o73494o54076n6775M51882M13199O4176j66266k31877
$$ -8126 327883 207614 -465880 -1119956 -1176731 -724849 -311650 -247474 -413740 -645617
33239f45617k62597j53140K12859N70621N82919L79992K99787K44580j11400n68360
$$ -645617 -908214 -1061354 -848495 -277874 305045 685037 984824 1229404 1118004 549644
33229E49644n66481j48446N941l13365m95782j86475Q9720j26659m15280k54753
$$ 549644 -16837 -165283 -159342 -472707 -968489 -1154964 -1065244 -1191903 -1607183 -1861936
33219a861936M1373o8724l49100k18772K27842M86686N78470Q14428R17694L81841
$$ -1861936 -1820563 -1889287 -2238387 -2457159 -2229317 -1742631 -1164161 -349733 567961 949802
33209I49802m33374o06051p6520K43619p1363l92026k06200Q8225J2388j82723
$$ 949802 516428 -89623 -166143 77476 6113 -385913 -592113 -503888 -491500 -674223
33199f74223q3298J46971J63402J05402L30750P89232J058382P95619q009r09193
$$ -674223 -757521 -610550 -447148 -341746 -10996 778236 1836618 2632237 2624228 1715035
33189A715035j123921k94589P82998Q82653l3966p14195m20712P7235j35138o84578
$$ 1715035 591114 296525 1079523 1962176 1928210 1214015 793303 870538 735400 50822
33179E0822o88334k41280r1461k92885k60648O7416J84935P2653K68439P65294
$$ 50822 -637512 -878792 -970253 -1263138 -1523786 -1456370 -1271435 -1198782 -930343 -165049
33169a65049Q18864J63147m45656l55311M3125Q0536q7205J06409M83417K73090
$$ -165049 653815 816962 371306 15995 59120 139656 52451 158860 642277 915367
33159I15367n54821r47792j85220R36548J003571j50469j221338j172420m50945
$$ 915367 360546 -587246 -772466 164082 1167653 1017184 -204154 -1376574 -1827519
33150a827519n9472r2235M0520L60022K96768j38478j90410L80820Q03351N03161
$$ -1827519 -1886991 -1979226 -1938706 -1578684 -1281916 -1420394 -1610804 -1229984 -426633 76528
33140G6528j3490o5983J52739J38366K5111J27065P8558n60423j191116p85171
$$ 76528 63038 -2945 149794 288160 313271 440336 518894 -41529 -1232645 -2017816
33130b017816M63446J175042O32672l63579p72342n55668k24493O7417L72416
$$ -2017816 -1554370 -379328 253344 -110235 -882577 -1438245 -1662738 -1595321 -1222905
33121a222905M69422K02142n2087J37300N26381N21743J10840j01358J86209N29400
$$ -1222905 -753483 -551341 -603428 -466128 60253 581996 692836 591478 777687 1307087
33111A307087M11071k8624k35753q373L12137L65313J74265n1901k38997l80501
$$ 1307087 1718158 1689534 1453781 1445408 1757545 2122858 2297123 2245222 2006225 1625724
33101A625724l71578j93811j16904l70448o99302o44102k34212N6459O5690J07227
$$ 1625724 1254146 1060335 943431 572983 -126319 -770421 -1004633 -948174 -882484 -775257
33091g75257K63278J55473k86088m79701q3366L67119K93641J380P4180L43188
$$ -775257 -511979 -356506 -642594 -1122295 -1205661 -838542 -544901 -543521 -469341 -126153
33081a26153K85062L4370N1893J05128l30090q31648m41636O23887J003751K82329
$$ -126153 158909 193279 245172 350300 20210 -811438 -1253074 -629187 374564 656893
33071F56893k80069K19906Q17735K54839r04013j054087O2191J082806J000159
$$ 656893 376824 596730 1414465 1669304 765291 -288796 -226605 856201 1856360
33062A856360K17487m47220p42849o99563k83755K31357K61650k63473o47798
$$ 1856360 2073847 1626627 883778 184215 -99540 131817 393467 129994 -517804
33053e17804m33203q1054j19237j87160K89617Q71216N62091n27416j029979k09057
$$ -517804 -951007 -1032061 -1151298 -1338458 -1048841 -177625 384466 -142950 -1172929 -1381986
33043a381986R08756R74729J99411j50240K56280M55092j43233q40276q37865
$$ -1381986 -473230 501499 700910 550670 806950 1262042 1118809 278533 -559332
33034e59332m30499l27509m36132j42024N54259R89235Q09298L28785n3880k47963
$$ -559332 -989831 -1317340 -1753472 -1895496 -1341237 -352002 457296 786081 732201 484238
33024D84238k86951k18779j68246j47966O9316N29875Q06108N94801K90723L48157
$$ 484238 197287 -21492 -189738 -337704 -268388 261487 1067595 1662396 1953119 2301276
33014B301276M09788j12107q47477q73526k38322L0534m11999o91588k06798M24720
$$ 2301276 2711064 2598957 1751480 877954 639632 670166 258167 -433421 -640219 -215499
33004b15499M70266J67098L0991o4785l64342n26636k52254K1668j48166l79332
$$ -215499 254767 421865 452856 388071 23729 -502907 -755161 -733493 -881659 -1260991
32994a260991j75593J27895L0179j04771K79010P16987L71753m15402m90971K73356
$$ -1260991 -1436584 -1308689 -1278510 -1383281 -1104271 -387284 -15531 -430933 -921904 -648548
32984f48548P67438L88114j95367l07172j86794k05622j48691J53874K93081o027
$$ -648548 118890 507004 311637 4465 -182329 -387951 -536642 -382768 -89687 -95714
32974i5714k96268j39365J34096J4622k91975k04667K87867O04804L59785k42041
$$ -95714 -391982 -531347 -397251 -382629 -674604 -879271 -591404 13400 373185 131144
32964A31144o77386n13842K50275J022824J050508K55854o07672q30553m78986
$$ 131144 -546242 -1060084 -809809 213015 1263523 1519377 911705 81152 -397834
32955c97834q2903K3314j72500m78689m89001J05960R22016J110120N24558N9841
$$ -397834 -480737 -457423 -629923 -1108612 -1597613 -1491653 -569637 540483 1065041 1124882
32945A124882L27346O55295J60707p48636r49223l68406n1085m54040p72448k82401
$$ 1124882 1452228 2107523 2268230 1519594 570371 201965 150880 -303160 -1075608 -1358009
32935a358009N62712Q76574N09667m4993m11307m90288k46521J72402L55212P8501
$$ -1358009 -795297 81277 590944 545951 134644 -355644 -602165 -429763 -74551 3950
32925C950l40074m43136j88546J49850L89499M72437L34923L7236j75726j85725
$$ 3950 -336124 -779260 -967806 -817956 -428457 43980 378903 416139 240413 54688
32915E4688j54934j79280j04326Q6251R7615j42660k19633P5901K58040q2470
$$ 54688 -100246 -279526 -383852 -297601 -199986 -342646 -562279 -486378 -228338 -310808
32905c10808m70797k47769K98770L96889J33291K81733Q41599R16873K79162j36825
$$ -310808 -781605 -1029374 -730604 -333715 -200424 81309 922908 1839781 2118943 1982118
32895A982118J80292L52512m38292j431817j277874l79J085982J148371N69064
$$ 1982118 2162410 2514922 2076630 644813 -633061 -633440 452542 1600913 2169977
32886B169977L9798j90329j49866K5521K9913k67893m52994j06923M07886L86295
$$ 2169977 2209775 2019446 1869580 1895101 1925014 1657121 1204127 1097204 1505090 1891385
32876A891385j05354l41775j46293j07179m43209n56759p8969M30398L30004j65988
$$ 1891385 1786031 1444256 1297963 1190784 747575 190816 111847 542245 872249 706261
32866G06261m23837l00552j17480o7928r4711j21576q9126L1857R8054m4171j85635
$$ 706261 282424 -18128 -135608 -203536 -298247 -419823 -508949 -477092 -379038 -423209 -608844
32855f08844J6161L70840L18970r3882j47436L38268N34840r2503p65063m51013
$$ -608844 -592683 -221843 97127 3245 -144191 194077 728917 636414 -128649 -579662
32845e79662N86729J146030O87949j65124n48413j63070O39241J065792M54930
$$ -579662 7067 1153097 1841046 1675922 1127509 964439 1603680 2669472 3124402
32836C124402q59081j619470j124758j68345J40002q8380o0704J64751j00664
$$ 3124402 2265321 645851 -478907 -647252 -507250 -595630 -656334 -491583 -592247
32827e92247o85082o25095K02621P83762N78254K49165L43616L64059j87846p81421
$$ -592247 -1277329 -1902424 -1699803 -916041 -337787 -88622 254994 619053 431207 -350214
32817c50214o82729j36069R0302j29329l14913k52563j39954n9867R7371K78975
$$ -350214 -1032943 -1169012 -1078710 -1208039 -1522952 -1775515 -1915469 -1975336 -1877965 -1598990
32807a598990K85468Q0486k01557m18819l83451Q4970Q04662J190386Q61207R3493
$$ -1598990 -1313522 -1233036 -1434593 -1853412 -2236863 -2151893 -1347231 -156845 704362 797855
32797G97855n39479p36446n15710l7273L94762M81227K96469J80032J41784j20133
$$ 797855 258376 -478070 -993780 -1031053 -636291 -155064 141405 321437 463221 343088
32787C43088m42950j63550P17745J102177K46170r68785j138306k85381L25852
$$ 343088 -99862 -263412 454333 1556510 1802680 833895 -304411 -589792 -263940
32778b63940J12420k24340j02110M6311l01330q14318q77041m95233o6657K93741
$$ -263940 -151520 -375860 -477970 -431659 -732989 -1547307 -2424348 -2919581 -2986238 -2692497
32768b692497O40980P75159N17478J88956K47137N51861N25897L9259l67269k47836
$$ -2692497 -2051517 -1276358 -758880 -569924 -322787 229074 754971 794230 426961 179125
32758A79125J82292M32044L51388J23261j12175l31395m45343l25192j7738K42527
$$ 179125 361417 793461 1144849 1268110 1155935 824540 379197 54005 36267 278794
32748B78794K66015O6350j83019k74887j36377K8047r8596m71229n67051o2445
$$ 278794 544809 611159 428140 153253 16876 44923 -53673 -524902 -1091953 -1154398
32738a154398N32776M12181l47408p24990j11561Q12652R85440L35378k91703
$$ -1154398 -621622 -209441 -556849 -1281839 -1393400 -580748 404692 740070 448367
32729D48367l20786J6998K33462J21777k65258p11621q53225m73242J68472O05934
$$ 448367 127581 144579 378041 499818 234560 -477061 -1330286 -1803528 -1635056 -1029122
32719a029122P30614P51098O88352L62934j35755m43965m45575l83023m07356
$$ -1029122 -298508 452590 1140942 1503876 1368121 924156 478581 95558 -311798
32710c11798m24647l93140l30916o1154N16046R22169N36049l77675p98930l33367
$$ -311798 -736445 -1129585 -1460501 -1521655 -1005609 -83440 452609 74934 -723996 -1057363
32700a057363K65813K85642P872k7299P00l29800p44654o39428j13044J62036
$$ -1057363 -791550 -505908 -498036 -525335 -524635 -854435 -1599089 -2238517 -2351561 -2189525
32690b189525K0032J2626M43457Q23413N68854j59283o40412m33882K34248Q45072
$$ -2189525 -2169493 -2156867 -1713410 -889997 -321143 -480426 -1120838 -1554720 -1320472 -475400
32680d75400J063907P75065k5060r94719j314993m62189P99196J011856p468p36262
$$ -475400 588507 1363572 1338512 343793 -971200 -1433389 -634193 377663 370195 -366067
32670c66067k01971M08895l08334j392739q32711R88258J535650O8251j118037
$$ -366067 -568038 -159143 -467477 -1860216 -2692927 -1704669 -169019 -100768 -1218805
32661a218805l16986J026749Q89713j83645m48910O9590J56431j55073L2824M17511
$$ -1218805 -1535791 -509042 380671 197026 -251884 -182294 -25863 -180936 -148112 269399
32651B69399N6091n36833j23039P65860M59186p96266r33942M43086J225915K73110
$$ 269399 325490 -211343 -334382 431478 890664 94398 -839544 -396458 829457 1102567
32641A102567p06434o3595J099972Q90361l11455o89036Q0261O21191J43711o70096
$$ 1102567 396133 332538 1432510 2322871 2011416 1322380 1402641 2023832 2167543 1497447
32631A497447r64889o80895j91296J69638K04468L7797N5528K77493J87773l93749
$$ 1497447 532558 -148337 -339633 -169995 34473 72270 127798 405291 593064 199315
32621A99315q21074n37522R0627M50025N76287O78900M16050m44831j129755o65883
$$ 199315 -621759 -1159281 -1068654 -618629 -42342 636558 1052608 607777 -521978 -1187861
32611a187861O13904J332860Q25769j67323o27536l87274L8610K41565K78805
$$ -1187861 -573957 758903 1584672 1417349 789813 402539 441149 682714 961519
32602I61519M22775O61423N36308k56133j150182j149508j53236P65453P16930
$$ 961519 1384294 2045717 2582025 2325892 1175710 26202 -127034 638419 1355349
32593A355349J3350n48752p38524o98178l80011J42516L63814N5628k10546O2072
$$ 1355349 1368699 819947 81423 -616755 -996766 -854250 -490436 -434808 -645354 -583282
32583e83282M36635L14629O900J39808M77421L30427k22066n30330n01072m98144
$$ -583282 -146647 167982 174882 314690 792111 1122538 900472 370142 -130930 -629074
32573f29074l76931K58048R66409Q17684j32427q08652o69125k42200M411K12448
$$ -629074 -1006005 -747957 218452 1036136 903709 95057 -574068 -816268 -811857 -599409
32563e99409L30290n8497o77672m68032P98105J786523J275100j89827j113973
$$ -599409 -269119 -327616 -1005288 -1473320 -675215 1111308 2386408 2196581 1082608
32554A082608r46063l48249j8858m9286k22806k82306j5235M51319O07712K10673
$$ 1082608 136545 -211704 -230562 -279848 -502654 -784960 -800195 -348876 258836 469509
32544D69509k67250k49411J48259L78405K59899J8031k48976n79013p37254l79325
$$ 469509 202259 -47152 101107 479512 739411 757442 508466 -70547 -807801 -1187126
32534a187126L40852Q03709O53899J31852l59328o36135o35929l51849K731J34894
$$ -1187126 -846274 -42565 611334 743186 383858 -252277 -888206 -1240055 -1237324 -1102430
32524a102430J13854K77085N37201L09601m90750r20907j68396J096167J411477
$$ -1102430 -988576 -711491 -174290 135311 -355439 -1276346 -1444742 -348575 1062902
32515A062902N07671l88106m32368k73260o88801j141721p08893K70211O99170
$$ 1062902 1570573 1182467 750099 476839 -211962 -1353683 -2062576 -1792365 -1093195
32506a093195M56658L35989M88214L15386j10890j0013N27540M66045k49753l27323
$$ -1093195 -636537 -300548 187666 503052 392162 382149 909689 1375734 1125981 798658
32496G98658O06793J062708R6237r67931o94598N5945k52352j002630m72079R87221
$$ 798658 1405451 2468159 2564396 1596465 901867 957812 705460 -297170 -769249 217972
32486B17972J253617j66561j357320r73034M6292L79273J59247O0769J5447k22236
$$ 217972 1471589 1305028 -52292 -1025326 -979034 -599761 -440514 -379745 -364298 -586534
32476e86534l24241j4797M05513O92807R51815R72589L25892n71004o90550o8204
$$ -586534 -910775 -925572 -520059 172748 1124563 2097152 2423044 1852040 1161490 1093286
32466A093286R5227n25813p31108J10724Q62341N08214j98443j85550J43420o4557
$$ 1093286 1188513 662700 -68408 42316 904657 1412871 1214428 1028878 1172298 1107741
32456A107741m24483j49396L43555J92751k79387k02873K05451J45122j86018
$$ 1107741 683258 533862 877417 1070168 790781 587908 793359 938481 752463
32447G52463n1492K47174j42858q75974p73604J92108Q42037O84060L44888R0234
$$ 752463 700971 948145 805287 -70687 -844291 -652183 189854 873914 1218802 1309036
32437A309036n10154j240870j116785j6118R26365J007971P71952O91889L55989
$$ 1309036 798882 -441988 -1558773 -1574891 -648526 359445 1131397 1823286 2179275
32428B179275m18701q77537n13240L2324J3957l23246m02676k58778j14819K05649
$$ 2179275 1760574 883037 369797 402121 416078 92832 -309844 -568622 -683441 -477792
32418d77792O96723P14414q3504r26001q69081q6657N27871O25418N06329L15720
$$ -477792 218931 933345 849841 -76160 -945241 -1031898 -504027 121391 627720 943440
32408I43440o5599m95451o27584m34448j58987J39935N15906P42212N01876m8769
$$ 943440 877841 382390 -245194 -679642 -838629 -698694 -182788 559424 1061300 1012531
32398A012531l30269k0442N65377Q09453L95597l65642p82628n03874L0741J24724
$$ 1012531 682262 661820 1227197 2036650 2432247 2066605 1283977 780103 810844 935568
32388I35568k44342m47462j58791K48354L71238K62310M1361l62050p70144o81422
$$ 935568 691226 243764 84973 333327 704565 966875 1008236 646186 -123958 -805380
32378h05380o2079L56316Q0120l59860k10968L55253N70599K42207r1940m7628
$$ -805380 -867459 -511143 -431023 -790883 -1001851 -646598 -75999 166208 74268 26640
32368B6640J68423J95527m7799l75529n04157k80172J07250L40171M65759P53570
$$ 26640 195063 390590 342791 -32738 -536895 -817067 -709817 -369646 96113 849683
32358H49683R63623M56039o27125j114683m01244M88875L57439l26402k55934
$$ 849683 1813306 2269345 1642220 527537 126293 615168 972607 646205 390271
32349C90271M86132N11236n59346j363317q59208J45882L22034k53645m46799
$$ 390271 876403 1387639 828293 -535024 -1394232 -1248350 -926316 -1179961 -1626760
32340a626760J76563Q68711Q29739J23657n79223p50952m14595k93J64354J95231
$$ -1626760 -1450197 -581486 248253 371910 -207313 -958265 -1372860 -1373153 -1208799 -1013568
32330a013568L51371N20726L74845j1786j98236j01821j30186m13705m94805r0117
$$ -1013568 -662197 -141471 233374 221588 23352 -78469 -208655 -622360 -1117165 -1207282
32320a207282L89879M70721K53677M094l55314p90087p23745J91114J223507J294685
$$ -1207282 -817403 -346682 -93005 -88911 -444225 -1234312 -1958057 -1766943 -543436 751249
32310G51249L80124n77354r98326j066852q76885j92126P17630R81920L77118
$$ 751249 1131373 554019 -444307 -1511159 -2388044 -2580170 -1862540 -880620 -503502
32301e03502j34607K36640Q70968O60409k94036q32540m09022L00300N41074M01499
$$ -503502 -638109 -401469 469499 1129908 835872 3332 -405690 -105390 435684 837183
32291H37183K80935J21137l14694p91701p81953j80574N43379Q82950P20319K70198
$$ 837183 1118118 1239255 924561 132860 -649093 -829667 -286288 596662 1316981 1587179
32281A587179j44378k64795q5741O9784j49616o56264r05781n02741K41777N63435
$$ 1587179 1442801 1178006 1092265 1162049 1012433 356169 -549612 -1052353 -810576 -247141
32271b47141J36876m54717l67906M30370J051806P77847l5854m44111j06054M03009
$$ -247141 -110265 -564982 -932888 -502518 549288 1327135 1291281 847170 741116 1144125
32261A144125M18042q7450o55915q58056n45392O2490M13234R0476n98193q60803
$$ 1144125 1562167 1474717 818802 -39254 -584646 -522156 -108922 -18446 -616639 -1477442
32251a477442m22199J27900K27755J00707K18458M70064M45444K20768J97197
$$ -1477442 -1899641 -1771741 -1543986 -1443279 -1224821 -754757 -309313 -88545 108652
32242A08652L40666K68400K1684N2638L93124N16405J75420k60426n14406q02272
$$ 108652 449318 717718 739402 792040 1185164 1701569 1876989 1616563 1102157 299885
32232B99885j192236j178978m10140N80989R24274M79833r7358k16300J16693
$$ 299885 -892351 -2071329 -2481469 -1900480 -976206 -496373 -593731 -810031 -693338
32223f93338N27757O86854M96196J02312k50556m38337m60687k85500M7267J97115
$$ -693338 -165581 521273 1017469 1119781 869225 430888 -29799 -315299 -268032 -70917
32213g0917j74347p72671q29869j17525O88932R49671Q23597O85424L88856k29029
$$ -70917 -245264 -1017935 -1847804 -1965329 -1276397 -326726 496871 1182295 1571151 1342122
32203A342122o22925k10850N00983M39745m22059r57038n61427K2820j6734l42710
$$ 1342122 719197 508347 1009330 1449075 1027016 69978 -491449 -468629 -485363 -828073
32193h28073j95689L23412N43348M03802M34468O66384M77214k85015q20050m72772
$$ -828073 -1023762 -700350 -157002 246800 681268 1347652 1824866 1539851 719801 247029
32183B47029K52069L69607k09406o33657l58956J93854L61814P8443k89297n09495
$$ 247029 499098 868705 659299 25642 -333314 -139460 222354 300797 11500 -497995
32173d97995n17731k12135L33778O55545L58910k91664o49363m73141o2453K67043
$$ -497995 -1015726 -1227861 -894083 -238538 120372 -171292 -820655 -1293796 -1356249 -1089206
32163a089206L93629K16039j71088k32069L93604J041625O07202q41019j875745
$$ -1089206 -695577 -479538 -650626 -882695 -489091 552534 1159736 318717 -1557028
32154a557028j496274k91407O38828J065881J255635J023608J54535p28427p31291
$$ -1557028 -3053302 -3344709 -2705881 -1640000 -384365 639243 793778 65351 -665940
32145f65940Q8662Q84154J156714R58567L01364o81507j225255o62196L95300
$$ -665940 -577278 306876 1463590 2422157 2723521 2042014 816759 154563 549863
32136E49863O61805R568l99651L3966N28619L39407j13097j48699P3926J04448
$$ 549863 1211668 1221236 821585 855551 1384170 1723577 1610480 1461781 1535707 1640155
32126A640155R2420L22695M27768r1554q95916j121266n11338L43023P84002O57346
$$ 1640155 1732575 2055270 2483038 2391484 1495568 374302 -137036 205987 989989 1647335
32116A647335K17003j79513l60569n02339q10392j001591n61246L37827P80226
$$ 1647335 1864338 1684825 1324256 821917 11525 -990066 -1551312 -1213485 -433259
32107d33259L15148l71164m55173r4896K9008j81815k71908n5321K32939M12623
$$ -433259 -118111 -489275 -944448 -1039344 -1010336 -1192151 -1464059 -1519380 -1286441 -873818
32097h73818M43639K25301j99206m29192j52554L71465O42685M98317P4957m25081
$$ -873818 -430179 -204878 -404084 -833276 -985830 -614365 28320 526637 601594 176513
32087A76513o34276k31600L67219K37823n91045p70807M11982J598452J125185
$$ 176513 -457763 -689363 -322144 -84321 -675366 -1446173 -1034191 564261 1689446
32078A689446m49112j112750l29622M75510L28701j17174j43168p0814j90025
$$ 1689446 1240334 127584 -202038 273472 602173 484999 341831 271017 80992
32069H0992k5816N35838O60330k0257n59148k15525K74594L5430l78977n9628
$$ 80992 55176 591014 1251344 1231087 671939 456414 731008 766438 387461 327833
32059C27833M83899J53346p07614p59416P6856M55403j72732p21012l07193M09239
$$ 327833 811732 965078 257464 -501952 -425096 30307 -142425 -863437 -1170630 -761391
32049g61391M47010J1479q6743J95232K38851j46709n25294n56792l12493N5529
$$ -761391 -314381 -302902 -389645 -194413 44438 -102271 -627565 -1184357 -1496850 -1441321
32039a441321M74842P95492Q47229O74577M44547J32062m20477j071152j276745
$$ -1441321 -966479 -170987 676242 1350819 1795366 1927428 1506951 435799 -840946
32030h40946o59080L86793R17455M52032l89817n72799N2890N68852K80086l08708
$$ -840946 -1500026 -1113233 -195778 256254 -133563 -706362 -653472 -84620 195466 -113242
32020a13242k69173L72751P14397L22113k15784k25307J68871L92013K20639r3164
$$ -113242 -382415 -9664 704733 1026846 811062 585755 754626 1146639 1367278 1274114
32010A274114k26979o1112K58414L77828O5710m34525o50074n19565m23171n08284
$$ 1274114 1047135 986023 1244437 1622265 1687975 1253450 603376 83811 -339360 -847644
32000h47644m65337j54832P3173O922K017L25508N39653J49862m66973m88982
$$ -847644 -1312981 -1467813 -1394640 -1387718 -1385701 -1060193 -520540 -370678 -837651 -1326633
31990a326633J45246O65025O04959L40102L39653M87378M18296P3861l77114q14777
$$ -1326633 -1181387 -516362 88597 428699 768352 1255730 1674026 1747887 1370773 555996
31980E55996j075877q92468k46861M15096O20093L95394J52394J79820M41319
$$ 555996 -519881 -1412349 -1659210 -1244114 -624021 -228627 -76233 103587 544906
31971E44906P22446P65464L91721k77379q04699q51275n49641k95883k51073k38645
$$ 544906 1267352 2032816 2424537 2147158 1342459 491184 -58457 -354340 -605413 -844058
31961h44058p2425K16571M62161N11442L17459J6434j51531j44257k29376n73651
$$ -844058 -916483 -699912 -237751 273691 591150 607584 456053 311796 82420 -491231
31951d91231q32027n00209K90932P20245K51566n78436o78906L11633J514031
$$ -491231 -1323258 -1823467 -1532535 -812290 -560724 -1139160 -1818066 -1506433 7598
31942G598J701954O20166p26821j156919n70179Q4416R2752j74763r271M20367
$$ 7598 1709552 2329718 1602897 445978 -124201 -39785 52967 -121796 -131067 289300
31932B89300K94574m56346q28606k03048O26032N88489m6707j57835L99430O10775
$$ 289300 583874 127528 -701078 -904126 -278094 310395 263688 105853 505283 1116058
31922A116058Q2237k19560L81939R32762K07045j242249j666270n94497N31489
$$ 1116058 1198295 978735 1360674 2293436 2500481 1258232 -408038 -1002535 -471046
31913d71046M55666k63508l22507M44756J062616Q54822J05849n58701q01567
$$ -471046 -15380 -278888 -601395 -156639 905977 1760799 1866648 1307947 506380
31904E06380o00743j63280J33416P6828j02987q8683P501j13605k90102m0860
$$ 506380 -94363 -257643 -124227 -47399 -150386 -239069 -231568 -345173 -635275 -676135
31894f76135N96185R30350N39101j42614m37638k47692M9300J79066R1488k06113
$$ -676135 -79950 850400 1389501 1246887 809249 561557 610857 789923 881411 675298
31884F75298n29033m52666J79044Q15085P33666j4730o36711n90884j24640K61404
$$ 675298 146265 -306401 -127357 687728 1421394 1406664 769953 179069 54429 315833
31874C15833M28443M60060L02149r5887m82538m98213j23859K92180M27999K54372
$$ 315833 744276 1204336 1506485 1410598 928060 429847 305988 598168 1026167 1280539
31864A280539l3454k01626j49329j3530k1856j42318m8041L77650O88979L62741
$$ 1280539 1247085 1045459 896130 882600 860744 718426 670385 1048035 1737014 2099755
31854B099755m44778j009784r40132n70734l38573j80771J53857N27635N72281
$$ 2099755 1654977 645193 -294939 -865673 -1204246 -1385017 -1231160 -703525 -131244
31845a31244K66184n8987k25474l28274l60635j47677K55553N06631M84110M67138
$$ -131244 134940 75953 -149521 -477795 -838430 -986107 -730554 -223923 260187 727325
31835G27325N76777M50491j36451o74455n11533J13278K64631l93119j096632
$$ 727325 1304102 1754593 1618142 943687 432154 545432 810063 416944 -679688
31826f79688j034605l80124J41794L21233N22560Q49859Q98411M63641k3730p3907
$$ -679688 -1714293 -2094417 -1952623 -1631390 -1108830 -258971 639440 1103081 1079351 1005444
31816A005444J91806K99967J28863m7186j03207j99757l36349k28567J63155L79333
$$ 1005444 1197250 1497217 1626080 1578894 1475687 1275930 939581 711014 874169 1253502
31806A253502P5521m06666n06198k69817j99541l73736l32593O5594K96618j6900
$$ 1253502 1329023 922357 416159 146342 -53199 -426935 -759528 -693934 -397316 -414216
31796d14216m58701m08415J02373N73741P64283P43656M75385q3312n81182n28301
$$ -414216 -872917 -1281332 -1178959 -605218 159065 902721 1378106 1294794 713612 185311
31786A85311L3023N43517O10690L10615j07608m01147l22383R6394L43384K4752
$$ 185311 218334 761851 1372541 1683156 1575548 1174401 852018 948412 1291796 1316548
31776A316548m56660m20116J7842J31532j95043l19070k0213J24407j55618k98220
$$ 1316548 859888 439772 457614 589146 394103 75033 54820 179227 23609 -274611
31766b74611N3353L93592K99880J49907K38177R3968m89355o66778J39677R52155
$$ -274611 -221258 172334 472214 622121 860298 954266 464911 -201867 -62190 889965
31756H89965N78320l90858m43320L63951M69760o05144j422183q25101M71132
$$ 889965 1468285 1077427 634107 998058 1467818 862674 -559509 -1384610 -913478
31747i13478J155142R74071L66256m77657j274349j234722l5170J317227J538026
$$ -913478 241664 1215735 1581991 1104334 -170015 -1404737 -1439907 -122680 1415346
31738A415346O84956n9156O498M34788M72277m1477o48576p84312l30977J67457
$$ 1415346 2100302 2041146 2047644 2482432 2954709 2913232 2264656 1480344 1149367 1316824
31728A316824L2827o69784j121003q07847j73498Q5784n9474j54796j8353J20448
$$ 1316824 1349651 679867 -441136 -1248983 -1422481 -1336697 -1396171 -1550967 -1569320 -1448872
31718a448872M2203k08419l41751j2456P00995J041945L89143o40528p38108K09672
$$ -1448872 -1406669 -1615088 -1956839 -1969295 -1268300 -226355 162788 -477740 -1215848 -1006176
31708a006176P71560L6731j008838j025238k97989j5905k72140j51768N42202
$$ -1006176 -234616 -197885 -1206723 -2231961 -2529950 -2545855 -2817995 -2969763 -2427561
31699b427561J026951R32046O97899N28533J38582l10856k14347K68078J85427
$$ -2427561 -1400610 -468564 229335 757868 896450 585594 371247 639325 824752
31690H24752n97470r46474k49277M65946J27572o01053l48755P26940J087454
$$ 824752 227282 -719192 -968469 -502523 -374951 -976004 -1324759 -597819 489635
31681D89635J15659r91610r79607j86943K02058j00172l25298m791L63891K09537
$$ 489635 605294 -386316 -1365923 -1552866 -1350808 -1450980 -1776278 -1781069 -1417178 -1207641
31671a207641k07681k57811R3361L79268M79175O49097P17801J13521r73756j299772
$$ -1207641 -1415322 -1673133 -1579772 -1200504 -721329 -72232 645569 759090 -214666 -1514438
31661a514438j44507J403955J640164M24110p50502q00781k26752l5571l39401
$$ -1514438 -1658945 -254990 1385174 1809284 1058782 258001 31249 -4322 -343723
31652c43723n20523k60314J70635M45284N37797N25863L26180j77758p66681q81863
$$ -343723 -864246 -1124560 -953925 -508641 29156 555019 881199 703441 -63240 -945103
31642i45103k62671N26191O56077J48823j51878J14724K93198j01041m70569j48563
$$ -945103 -1207774 -681583 -25506 123317 -28561 86163 379361 278320 -192249 -340812
31632c40812L81350K62870k42230j74787M83248P71380L09608k22225k76101r4536
$$ -340812 40538 303408 61178 -113609 369639 1141019 1450627 1228402 952301 857765
31622H57765J0264J23968K55032J85570l4122j49749k74938o34816q63332n02547
$$ 857765 868029 991997 1247029 1432599 1398477 1248728 973790 338974 -524358 -1026905
31612a026905m6016l21876r28545o64675M11579Q97109L12687j74036J62391M57524
$$ -1026905 -1072921 -1394797 -2323342 -2988017 -2576438 -1679329 -1366642 -1540678 -1378287 -920763
31602i20763K1205l54161O4916N44094K60165j84976L5673M11761J55536k13073
$$ -920763 -899558 -1253719 -1188803 -644709 -384544 -569520 -533847 -122086 33450 -179623
31592a79623J42305O96460M61553j81465j63093L70964M41926J3092k11440l00908
$$ -179623 -37318 659142 1120695 939230 776137 1147101 1589027 1602119 1390679 1089771
31582A089771p78275j191324p06653J77157K71060j72610J66636J242422J538586
$$ 1089771 311496 -879828 -1586481 -1409324 -1138264 -1310874 -1144238 98184 1636770
31573A636770N77715l89778n52386n05762n76799j10365Q40648R89630l4845p49225
$$ 1636770 2214485 1824707 1272321 766559 189760 79395 920043 1909673 1874828 1125603
31563A125603j89058M18445k13272j093946n38379R39820J274690m3206j310813
$$ 1125603 936545 1354990 1141718 47772 -490607 449213 1723903 1680697 369884
31554C69884j117849n5204M28366j25379r07526q82214J35819J206849J162493
$$ 369884 -747965 -803169 -374803 -500182 -1407708 -2289922 -2154103 -947254 215239
31545B15239M058r19174m94492P68986J428596Q61774k18544p96961n71820N347
$$ 215239 219297 -699877 -1194369 -425383 1003213 1864987 1646443 849482 277662 283009
31535B83009L19660J82762o0724q5159j00768m41237q03277n76983Q7080L88344
$$ 283009 602669 785431 724707 639548 538780 97543 -705734 -1282717 -1195637 -807293
31525h07293J85265K17284P00961P90694M6649o05667k54460N33564O39381Q7391
$$ -807293 -622028 -404744 296217 1086911 1133560 527893 273433 806997 1446378 1533769
31515A533769k70047k34045k97815n48884o20542n29552n57476m74388J16234
$$ 1533769 1263722 1029677 731862 182978 -437564 -967116 -1524592 -1998980 -1882746
31506a882746P91400P23020P1203j07755M89819Q88262L22993o24252r14194m38150
$$ -1882746 -1091346 -368326 -297123 -404878 84941 973203 1296196 671944 -242250 -680400
31496f80400O5437J04748r1818o6049K87645O74302P72576N49316J60704l21070
$$ -680400 -614963 -510215 -602033 -668082 -380437 293865 1066441 1615757 1776461 1455391
31486A455391q06184r06836l03138M92960M33157o07831j351117p21659O53312
$$ 1455391 649207 -257629 -560767 -67807 365350 -242481 -1593598 -2315257 -1661945
31477a661945J338441R85640L96129M3850l59941q82688j018185n39925J08118
$$ -1661945 -323504 662136 1058265 1102115 742174 -140514 -1158699 -1698624 -1590506
31468a590506N05969O76190O56415L28658j39807l06490q6350J75994L33442M88041
$$ -1590506 -1084537 -408347 248068 576726 436919 130429 44079 220073 553515 1041556
31458A041556L75143m54606j589738j799410o63294N84260N73373l47508o25368
$$ 1041556 1416699 962093 -627645 -2427055 -3090349 -2506089 -1932716 -2280224 -2905592
31449b905592L33707J386388J236424J31450n58217j95141L71081J43755n08577
$$ -2905592 -2571885 -1185497 50927 182377 -375840 -570981 -199900 -56145 -564722
31440e64722m02411N98345J241664O91003k68078m69475k1908J75771l6505j24011
$$ -564722 -967133 -368788 872876 1563879 1295801 826326 804418 980189 943684 819673
31430H19673m8115k27625m59507p8113P54144J063366N58360K4189l1571m1896
$$ 819673 771558 543933 84426 6313 760457 1823823 2382183 2406372 2374801 2332905
31420B332905l35784n15614l72653l93249p41620p10708P9420Q20109O95477J61163
$$ 2332905 1997121 1481507 1108854 715605 -26015 -736723 -657303 162806 858283 1019446
31410A019446J09352L88998J99604m47081p24202l21463J38112P3457l51319o11316
$$ 1019446 1128798 1517796 1717400 1270319 546117 224654 362766 436223 84904 -526412
31400e26412m32155N7729M79924N29158L15551K07738K24464k2949n71612q15304
$$ -526412 -958567 -900838 -420914 108244 423795 631533 855997 833048 261436 -553868
31390e53868l62495L02412M90676K09097r2637k27213k02191Q5973M99740M68903
$$ -553868 -916363 -613951 -123275 85822 -6815 -234028 -436219 -350246 149494 618397
31380F18397j72738o06972q0840Q26257Q78855p2469r22682q33784r9165N40116
$$ 618397 445659 -161313 -242153 584104 1462959 1390490 467808 -365976 -465141 74975
31370G4975O86610L12305l30224p14719n28345j82072k72974n95919l88423M13380
$$ 74975 761585 1073890 743666 28947 -499398 -681470 -954444 -1550363 -1938786 -1525406
31360a525406R35089N96831p6159j97036L96819J073791J099249K69225q53203
$$ -1525406 -590317 6514 -69645 -266681 130138 1203929 2303178 2572403 1719200
31351A719200j347245r05722k47507j39473l11632l0924N39547N48600l1538k35284
$$ 1719200 371955 -533767 -781274 -920747 -1232379 -1263303 -723756 -175156 -206694 -441978
31341d41978L15888P77448M96767J7530n535N0692l83211q28464m18223O21027
$$ -441978 -126090 651358 1148125 1165655 1160120 1210812 827601 -863 -419086 201941
31331B01941J186229Q38456K21749l6459l5844j02737k56001m00353n82444q18697
$$ 201941 1388170 2226626 2448375 2411916 2376072 2273335 2017334 1616981 1034537 215840
31321B15840r42402p70780k91581K98862O30960M03484k13802o26901n05949j85202
$$ 215840 -726562 -1497342 -1788923 -1490061 -859101 -455617 -669419 -1296320 -1802269 -1987471
31311a987471j07181j85068j03825O2576M8960k0457J74202N09355N61141L33109
$$ -1987471 -2094652 -2279720 -2383545 -2320969 -2272009 -2292466 -2118264 -1608909 -1047768 -714659
31301g14659K55615M32116M44054K0870n54963q28197n94644P1494Q30119J148396
$$ -714659 -459044 -26928 417126 437996 -116967 -945164 -1539808 -1468314 -638195 510201
31291E10201P86603J59977k02435l70011o07147n45052L21643J400764J400390
$$ 510201 1296804 1456781 1254346 884335 277188 -267864 53779 1454543 2854933
31282B854933J86864q97197r94216q06401j024852r52422J51032J365239J242685
$$ 2854933 3041797 2144600 1150384 343983 -680869 -1633291 -1482259 -117020 1125665
31273A125665O4170n77040j83175J82904j55553n67474m25660j3335L17175P15669
$$ 1125665 1189835 612795 429620 612524 456971 -110503 -536163 -549498 -232323 483346
31263D83346J064165P37119k81716j042924r91666p02486o40847k88707O54794
$$ 483346 1547511 2284630 2002914 959990 -31676 -734162 -1375009 -1663716 -1008922
31254a008922J281573P95947o2272j58807K10790J9490n40656l74684M84289P51251
$$ -1008922 272651 1068598 1006326 847519 1058309 1077799 537143 162459 646748 1397999
31244A397999p6652r65714r38352k27117N04843R92672J035344L88173n36977
$$ 1397999 1321347 355633 -582719 -809836 -304993 687679 1723023 2111196 1574219
31235A574219q09166k91234R0450j45092k48879L83459J011253O29203m40958
$$ 1574219 765053 473819 564269 419177 170298 553757 1565010 2194213 1753255
31226A753255j005212o36321L252K37436M2710k41227l04046l3872L58400N20845
$$ 1753255 748043 111722 114974 352410 395120 153893 -150153 -184025 174375 695220
31216F95220M34449L79450L27100n9279o04785n50742K67407R18346O47105l3493
$$ 695220 1129669 1509119 1836219 1776940 1172155 621413 888820 1807166 2454271 2420778
31206B420778k10115J02200K67582J14258r6013l06632m86719k92669K97907N48001
$$ 2420778 2210663 2312863 2580445 2694703 2598690 2292058 1805339 1512670 1810577 2358578
31196B358578K2600n05018k19643K89062o754p13532o41855M7482O3915o50252
$$ 2358578 2381178 1876160 1656517 1945579 1938825 1225293 583438 630920 694835 44583
31186D4583o42599N25345J271289L83566j090743j481725q26566k85912j29096
$$ 44583 -598016 -72671 1198618 1582184 491441 -990284 -1816850 -2102762 -2231858
31177b231858K77593R37312J046799L28029n03196p40158m35353l2985J89637
$$ -2231858 -1954265 -1016953 29846 357875 -145321 -885479 -1320832 -1353817 -1164180
31168a164180J97207J13218J48762L76425O00226O09467M15234R5657l23772o44172
$$ -1164180 -966973 -853755 -704993 -328568 271658 881125 1296359 1392016 1068244 424072
31158D24072n05041O6679M54527J87300m03969o86421o31970p05623r66991q62566
$$ 424072 -80969 -14290 440237 627537 223568 -462853 -1094823 -1800446 -2767437 -3630003
31148c630003o4816Q96331J161170N74171j06399j31042L30841N12060J89380
$$ -3630003 -3694819 -2798488 -1637318 -1063147 -1169546 -1300588 -969747 -457687 -268307
31139b68307k6618K66465N57238K84864j47174k9001L78914K42418l50461m39876
$$ -268307 -294925 -28460 528778 813642 666468 637467 1016381 1258799 908338 468462
31129D68462J74412N23798K1589o67822p81017m70524j34534K71896O28602L48463
$$ 468462 642874 1166672 1188261 520439 -260578 -731102 -865636 -593740 34862 383325
31119C83325n56578j047870n40339J10222K4572k65733O6441N37256K65835k71820
$$ 383325 -173253 -1221123 -1761462 -1651240 -1626668 -1892401 -1825960 -1288704 -1022869 -1294689
31109a294689j0671P12153O68525n3929k03328L05154J63353q79492j297470k98811
$$ -1294689 -1305360 -593207 75318 21389 -181939 123215 286568 -592924 -1890394 -2189205
31099b189205P28964M34308l56050j75275N65713L42505q22813j273573k83899
$$ -2189205 -1460241 -1025933 -1381983 -1557258 -991545 -649040 -1471853 -2745426 -3029325
31090c029325Q42532O84389m09742r99158m47280N15609Q55600L82323j54982
$$ -3029325 -2186793 -1502404 -1912146 -2911304 -3358584 -2842975 -1987375 -1605052 -1760034
31081a760034O6054R80667J574764R39667o15990j726186j350517J13562J215884
$$ -1760034 -1693980 -713313 861451 1801118 1185128 -541058 -1891575 -1778013 -562129
31072e62129R37388k84404j074954o43378L87175Q06228K86061l35363k41919
$$ -562129 375259 90855 -984099 -1627477 -1240302 -434074 -148013 -483376 -725295
$$ [...]
##END NTUPLES=NMR SPECTRUM
##END=
