##TITLE=31Pdec_LY-TMF-10.40.3
 D2O, 24 sc
 6.3.2020
##JCAMPDX= 6.0         $$ Bruker NMR JCAMP-DX V2.0
##DATA TYPE= NMR SPECTRUM
##DATA CLASS= NTUPLES
##ORIGIN= UXNMR, Bruker Analytische Messtechnik GmbH
##OWNER= root
$$ XWIN-NMR		Version 3.5
$$ Fri Mar  6 14:44:41 2020 Russian Standard Time (UT+4h)  she@DPX200
##.OBSERVE FREQUENCY= 81.013821
##.OBSERVE NUCLEUS= ^31P
##.ACQUISITION MODE= SIMULTANEOUS
##.ACQUISITION SCHEME= undefined
##.AVERAGES= 24
##.DIGITISER RES= 17
##SPECTROMETER/DATA SYSTEM= spect
##.PULSE SEQUENCE= zgpg30
##.SOLVENT NAME= CDCl3
##.SHIFT REFERENCE= (INTERNAL, CDCl3, 0, 182.463)
##AUDIT TRAIL= $$ (NUMBER, WHEN, WHO, WHERE, WHAT)
$$ ##TITLE= Audit trail, XWIN-NMR		Version 3.5
$$ ##JCAMPDX= 5.01
$$ ##ORIGIN= Bruker BioSpin GmbH
$$ ##OWNER= she
$$ F:/spectra/data/she/nmr/P31/1/pdata/1/auditp.txt
$$ ##AUDIT TRAIL=  $$ (NUMBER, WHEN, WHO, WHERE, WHAT)
(   1,<2020-03-06 14:43:51.45 +0400>,<she>,<DPX200>,
      <created by zg, POWCHK disabled, PULCHK disabled
       configuration hash MD5:
       00 E9 B6 7A A2 85 ED C7 34 08 36 98 17 FE 4E 26
       data hash MD5: 32K
       E1 0E DD A2 AF 5A 0D D7 CB C3 92 67 EB EC 33 B3>)
(   2,<2020-03-06 14:43:54.01 +0400>,<she>,<DPX200>,
      <Start of raw data processing
       efp BC_mod = 2 LB = 1 FT_mod = 6 PKNL = 1 PHC0 = -1362.121 PHC1 = 150.6017 SI = 64K 
       data hash MD5: 64K
       D3 B6 DC 27 18 7E 8C B7 4C 84 1C 3F 41 48 5A A1>)
(   3,<2020-03-06 14:44:08.39 +0400>,<she>,<DPX200>,
      <pk PHC0 = 6.039975 PHC1 = 0 
       data hash MD5: 64K
       B7 1D BB 2A C0 DE 0C 8C B1 78 2B 8E 7A 56 6E 8E>)
(   4,<2020-03-06 14:44:11.51 +0400>,<she>,<DPX200>,
      <abs ABSG = 5 
       data hash MD5: 64K
       1A 1D A7 28 3E 7E FB 32 4C 86 B6 79 B0 55 EE 0F>)
$$ ##END=
$$ 
$$ hash MD5
$$ C7 25 6A 08 F3 5D D7 D0 42 29 73 D7 3F 10 EF 7C
##$RELAX= 
##$RELAX= 
##$RELAX= 
##$RELAX= 
##$RELAX= 
##$RELAX= 
##$RELAX= 
##$RELAX= 
$$ Bruker specific parameters
$$ --------------------------
##$DU= <F:/spectra>
##$EXPNO= 1
##$NAME= <P31>
##$PROCNO= 1
##$TYPE= <nmr>
##$USER= <she>
##$AMP= (0..31)
100 100 100 100 100 100 100 100 100 100 100 100 100 100 100 100 100 100 
100 100 100 100 100 100 100 100 100 100 100 100 100 100 
##$AQSEQ= 0
##$AQ_mod= 1
##$AUNM= <au_zg>
##$AUTOPOS= <>
##$BF1= 81.014009
##$BF2= 200.13
##$BF3= 200.13
##$BF4= 200.13
##$BF5= 200.13
##$BF6= 200.13
##$BF7= 200.13
##$BF8= 200.13
##$BYTORDA= 1
##$CFDGTYP= 0
##$CFRGTYP= 5
##$CHEMSTR= <none>
##$CNST= (0..31)
1 1 145 1 1 1 1 1 1 1 1 1 1 1 1 1 1 1 1 1 1 1 1 1 1 1 1 1 1 1 1 1 
##$CPDPRG= <waltz16>
##$CPDPRG1= <>
##$CPDPRG2= <waltz16>
##$CPDPRG3= <>
##$CPDPRG4= <mlev>
##$CPDPRG5= <mlev>
##$CPDPRG6= <mlev>
##$CPDPRG7= <mlev>
##$CPDPRG8= <mlev>
##$CPDPRGB= <>
##$CPDPRGT= <>
##$D= (0..31)
0 1 0 0 0 0 0 0 0 0 0 0.03 2e-05 3e-06 0 0 0 0 0 0 0 0 0 0 0 0 0 0 0 0 
0 0 
##$DATE= 1583491430
##$DBL= (0..7)
120 120 120 11 120 120 24 19 
##$DBP= (0..7)
150 150 150 150 150 150 150 150 
##$DBP07= 0
##$DBPNAM0= <>
##$DBPNAM1= <>
##$DBPNAM2= <>
$$ [...]
##$SUBNAM3= <"">
##$SUBNAM4= <"">
##$SUBNAM5= <"">
##$SUBNAM6= <"">
##$SUBNAM7= <"">
##$SUBNAM8= <"">
##$SUBNAM9= <"">
##$SW= 369.568048894756
##$SWIBOX= (0..15)
0 1 3 0 0 0 0 0 0 0 0 0 0 0 0 0 
##$SW_h= 29940.119760479
##$TD= 32768
##$TD0= 1
##$TE= 0
##$TE2= 300
##$TE3= 300
##$TEG= 300
##$TL= (0..7)
0 120 53 12 22 120 120 120 
##$TP= (0..7)
150 150 150 150 150 150 150 150 
##$TP07= 0
##$TPNAME0= <>
##$TPNAME1= <>
##$TPNAME2= <>
##$TPNAME3= <>
##$TPNAME4= <>
##$TPNAME5= <>
##$TPNAME6= <>
##$TPNAME7= <>
##$TPOAL= (0..7)
0.5 0.5 0.5 0.5 0.5 0.5 0.5 0.5 
##$TPOFFS= (0..7)
0 0 0 0 0 0 0 0 
##$TUNHIN= 0
##$TUNHOUT= 0
##$TUNXOUT= 0
##$USERA1= <user>
##$USERA2= <user>
##$USERA3= <user>
##$USERA4= <user>
##$USERA5= <user>
##$V9= 5
##$VALIST= <valist>
##$VCLIST= <CCCCCCCCCCCCCCC>
##$VD= 0
##$VDLIST= <DDDDDDDDDDDDDDD>
##$VPLIST= <PPPPPPPPPPPPPPP>
##$VTLIST= <TTTTTTTTTTTTTTT>
##$WBST= 1024
##$WBSW= 4
##$XGAIN= (0..3)
0 0 0 0 
##$XL= 0
##$YL= 0
##$YMAX_a= 29309
##$YMIN_a= -30529
##$ZGOPTNS= <>
##$ZL1= 120
##$ZL2= 120
##$ZL3= 120
##$ZL4= 120
##$ABSF1= 182.463
##$ABSF2= -187.1042
##$ABSG= 5
##$ABSL= 3
##$ALPHA= 0
##$AQORDER= 0
##$ASSFAC= 0
##$ASSFACI= 0
##$ASSFACX= 0
##$ASSWID= 0
##$AUNMP= <proc_1d>
##$AZFE= 0.1
##$AZFW= 0.5
##$BCFW= 0
##$BC_mod= 2
##$BYTORDP= 0
##$COROFFS= 0
##$CY= -3
##$DATMOD= 1
##$DC= 0
##$DFILT= <>
##$DTYPP= 0
##$F1P= 0
##$F2P= 0
##$FCOR= 1
##$FTSIZE= 65536
##$FT_mod= 6
##$GAMMA= 0
##$GB= 0
##$INTBC= 1
##$INTSCL= 5.30512e-09
##$ISEN= 30
##$LB= 1
##$LEV0= 0
##$LPBIN= 0
##$MAXI= 10000
##$MC2= 0
##$MEAN= 0
##$ME_mod= 0
##$MI= 50
##$NCOEF= 0
##$NC_proc= -5
##$NLEV= 6
##$NOISF1= 182.463
##$NOISF2= 159.3651
##$NSP= 0
##$NTH_PI= 0
##$NZP= 0
##$OFFSET= 182.463
##$PC= 4
##$PHC0= -1356.081
##$PHC1= 150.6017
##$PH_mod= 1
##$PKNL= yes
##$PPARMOD= 0
##$PSCAL= 0
##$PSIGN= 0
##$REVERSE= no
##$SF= 81.0140089999434
##$SI= 65536
##$SIGF1= 159.3651
##$SIGF2= -187.1042
##$SINO= 113.3802
##$SIOLD= 16384
##$SREGLST= <1H.CDCl3>
##$SSB= 0
##$STSI= 65536
##$STSR= 0
##$SW_p= 29940.119760479
##$SYMM= 0
##$S_DEV= 0
##$TDeff= 32768
##$TDoff= 0
##$TI= <>
##$TILT= no
##$TM1= 0
##$TM2= 0
##$TOPLEV= 0
##$USERP1= <user>
##$USERP2= <user>
##$USERP3= <user>
##$USERP4= <user>
##$USERP5= <user>
##$WDW= 1
##$XDIM= 65536
##$YMAX_p= 272509468
##$YMIN_p= -6718820
$$ End of Bruker specific parameters
$$ ---------------------------------
##NTUPLES= NMR SPECTRUM
##VAR_NAME=  FREQUENCY,     SPECTRUM/REAL,   SPECTRUM/IMAG
##SYMBOL=    X,             R,               I
##VAR_TYPE=  INDEPENDENT,   DEPENDENT,       DEPENDENT
##VAR_FORM=  AFFN,          ASDF,            ASDF
##VAR_DIM=   65536,         65536,           65536
##UNITS=     HZ,            ARBITRARY UNITS, ARBITRARY UNITS
##FACTOR=    0.456856943014862, 1,           1
##FIRST=     14782.0589164792, 0,            0
##LAST=      -15158.0608439998, 0,           0
##MIN=       -15158.0608439998, -6718820,    0
##MAX=       14782.0589164792, 272509468,    0
$$ Real data points
##PAGE= N=1
##DATA TABLE= (X++(R..R)), XYDATA
$$ [...]
$$ plain form
36786 732953 533904 867603 1258963 1658985 2181441 2537935 2452280 2093126 1559945 597447
36776 597447 -599956 -1040229 -192929 965820 1043131 6055 -964640 -1150478 -967139
36767 -967139 -1002919 -1194551 -1198973 -1047449 -1080564 -1431436 -1806894 -1792021 -1332975 -848290
36757 -848290 -750478 -929162 -929076 -579603 -117987 303929 808955 1375360 1647489 1380292
36747 1380292 741503 -23774 -890267 -1787389 -2371091 -2370876 -1957656 -1512936 -1197740 -954115
36737 -954115 -766428 -693683 -705584 -633503 -310635 200762 510688 231488 -466812 -935084
36727 -935084 -921231 -941257 -1334085 -1472002 -703914 331513 440497 -216462 -228267 851944
36717 851944 1717430 1294769 304878 -15643 271270 333998 110434 75482 -31305 -915616
$$ packed form
36786G32953j99049L33699L91360M00022N22456L56494q5655l59154n33181r62498
36776E97447j197403m40273Q47300J158749P7311j037076r70695j85838J83339
36767i67139l5780j91632m422J51524l3115l50872l75458J4873M59046M84685
36757h48290R7812j78684Q6L49473M61616M21916N05026N66405K72129k67197
36747A380292o38789p65277q66493q97122n83702K15M13220M44720L15196K43625
36737i54115J87687P2745j1901P2081L22868N11397L09926k79200o98300m68272
36727i35084J3853k0026l92828j37917P68088J035427J08984o56959j1805J080211
36717H51944Q65486m22661r89891l20521K86913O2728k23564l4952j06787q84311
$$ plain form
36707 -915616 -2272630 -2809490 -1896479 -301330 896822 1338816 1154943 504288 -272479
36698 -272479 -609369 -244979 493427 1128548 1454424 1445978 1172467 949085 1142502 1596620
36688 1596620 1632003 895334 -107765 -642872 -657123 -688490 -1002737 -1242321 -1016913 -516257
36678 -516257 -266741 -387603 -420122 -32388 380851 167433 -589636 -1018574 -573016 216854
36668 216854 471259 151334 22991 501139 1054816 975035 402093 219831 925325 1864793
36658 1864793 1843528 528472 -1004264 -1379459 -456934 596083 723970 833 -873131
36649 -873131 -1510384 -1873486 -1843388 -1367120 -840781 -740001 -880509 -568945 423945 1478717
36639 1478717 1853924 1441555 652225 -112261 -643314 -831345 -678744 -356716 -94081
$$ packed form
36707i15616j357014n36860R13011J595149J198152M41994j83873o50655p76767
36698b72479l36890L64390P38406O35121L25876q446k73511k23382J93417M54118
36688A596620L5383p36669j003099n35107j4251l1367l14247k39584K25408N00656
36678e16257K49516j20862l2519L87734M13239k13418p57069m28938M45558P89870
36668B16854K54405l19925j28343M78148N53677p9781n72942j82262P05494R39468
36658A864793k1265j315056j532736l75195R22525J053017J27887p23137q73964
36649h73131o37253l63102L0098M76268N26339J00780j40508L11564R92890J054772
36639A478717L75207m12369p89330p64486n31053j88031J52601L22028K62635
$$ plain form
36630 -94081 -28606 -212975 -667013 -1323210 -1964290 -2302985 -2156332 -1567164 -789374 -142386
36620 -142386 161164 76317 -309267 -767567 -923768 -461896 536928 1546035 1980900 1624235
36610 1624235 718428 -209786 -647568 -491637 -250200 -610412 -1647340 -2659844 -2943627
36601 -2943627 -2511152 -1863188 -1304263 -803838 -386499 -271908 -561043 -1008027 -1209602
36592 -1209602 -968476 -471291 -123753 -135641 -265403 -110310 361177 792680 976431 1083852
36582 1083852 1227754 1148854 632403 -999 -165738 303820 970938 1260082 997720 589374
36572 589374 678456 1416937 2088686 1831376 785736 20957 135763 532049 445202 64475
36562 64475 10519 206496 75006 -403906 -643148 -383164 32204 291258 371508 191799
$$ packed form
36630i4081O5475j84369m54038o56197o41080l38695J46653N89168P77790O46988
36620a42386L03550q4847l85584m58300j56201M61872R98824J009107M34865l56665
36610A624235r05807r28214m37782J55931K41437l60212j036928j012504k83783
36601b943627M32475O47964N58925N00425M17339J14591k89135m46984k01575
36592a209602K41126M97185L47538j1888j29762J55093M71487M31503J83751J07421
36582A083852J43902p8900n16451o33402j64739M69558O67118K89144k62362m08346
36572E89374Q9082P38481O71749k57310j045640p64779J14806L96286q6847l80727
36562F4475n3956J95977j31490m78912k39242K59984M15368K59054Q0250j79709
$$ plain form
36552 191799 -292933 -619899 -196799 680032 921391 66550 -1044964 -1425517 -1187767
36543 -1187767 -1115585 -1407226 -1473119 -858797 142094 862370 952866 594089 153907 -217845
36533 -217845 -552348 -681350 -237714 720108 1419215 1202476 475042 247317 801299 1452642
36523 1452642 1661701 1633313 1606456 1337149 740877 363614 581139 849763 487311 -157105
36513 -157105 -132115 658648 1263424 1051559 520602 405103 576285 363013 -337511 -851574
36503 -851574 -635001 61857 616064 818997 949206 1202255 1411644 1385739 1185269 888408
36493 888408 387723 -272111 -607326 -206805 550566 789859 236048 -440023 -561024 -298445
36483 -298445 -246378 -456327 -390968 197621 792550 736693 107715 -356804 -224993 78993
$$ packed form
36552A91799m84732l26966M23100Q76831K41359q54841j111514l80553K37750
36543a187767P2182k91641o5893O14322J000891P20276R0496l58777m40182l71752
36533b17845l34503j29002M43636R57822O99107k16739p27434k27725N53982O51343
36523A452642K09059k8388k6857k69307n96272l77263K17525K68624l62452o44416
36513a57105K4990P90763O04776k11865n30957j15499J71182k13272p00524n14063
36503h51574K16573O96858N54207K02933J30209K53049K09389k5905k00470k96861
36493H88408n00685o59834l35215M00521P57371K39293n53811o76071j21001K62579
36483b98445N2067k09949O5359N88589N94929n5857o28978m64519J31811L03986
$$ plain form
36473 78993 -35032 -346334 -97770 753975 1278155 905985 341216 500911 1128742 1361766
36463 1361766 1268247 1656303 2424259 2383426 1070056 -415870 -981436 -953614 -1129386 -1263243
36453 -1263243 -555322 816241 1691431 1334188 77319 -1305737 -2179667 -2142235 -1290644
36444 -1290644 -416074 -317776 -863941 -1208747 -904550 -313529 16756 -127721 -672444 -1297956
36434 -1297956 -1495705 -1094638 -631932 -633392 -688943 -11888 1128560 1472451 520419 -646372
36424 -646372 -768094 61476 812874 913023 602042 290101 181819 335661 593225 591555
36414 591555 220534 -133653 -141625 -32638 -125130 -191812 127667 533356 402303 -147179
36404 -147179 -287881 275847 809014 612425 -15021 -344908 -263986 -130302 123084 968196
$$ packed form
36473G8993j14025l11302K48564Q51745N24180l72170n64769J59695O27831K33024
36463A361766r3519L88056P67956m0833j313370j485926n65566K7822j75772j33857
36453a263243P07921J371563Q75190l57243j256869j383056q73930L7432Q51591
36444a290644Q74570R8298n46165l44806L04197N91021L30285j44477n44723o25512
36434a297956j97749M01067M62706j460n5551O77055J140448L43891r52032j166791
36424f46372j21722Q29570P51398J00149l10981l11941j08282J53842K57564j670
36414E91555l71021l54187p972J08987r2492o6682L19479M05689j31053n49482
36404a47179j40702N63728N33167j96589o27446l29887Q0922J33684K53386Q45112
$$ plain form
36394 968196 2266361 2925502 2018918 3770 -1586605 -1682153 -669398 212955 269893
36385 269893 -50202 105139 925090 1808952 2174831 2054106 1791032 1492501 1083519 696573
36375 696573 565766 554814 245961 -366946 -708636 -425139 18791 -29976 -436300 -460083
36365 -460083 155062 827150 983114 774142 694560 875775 1117370 1366970 1731230 2049102
36355 2049102 1849190 914313 -282976 -934830 -747711 -321290 -493710 -1291663 -1804734
36346 -1804734 -1322583 -345736 -37987 -760486 -1664087 -1834149 -1330647 -831766 -682164
36337 -682164 -692609 -622184 -468730 -389543 -568927 -1018591 -1365598 -1114118 -299805 472386
36327 472386 866327 1204704 1648159 1581643 526985 -769398 -1080195 -369771 198001
$$ packed form
36394I68196J298165O59141r06584k015148j590375r5548J012755Q82353N6938
36385B69893l20095J55341Q19951Q83862L65879j20725k63074k98531m08982l86946
36375F96573j30807j0952l08853o12907l41690K83497M43930m8767m06324k3783
36365d60083O15145O72088J55964k08972p9582J81215K41595K49600L64260L17872
36355B049102j99912r34877j197289o51854J87119M26421j72420p97953n13071
36346a804734M82151R76847L07749p22499r03601j70062N03502M98881J49602
36337f82164j0445P0425J53454P9187j79384m49664l47007K51480Q14313P72191
36327D72386L93941L38377M43455o6516j054658j296383l10797P10424N67772
$$ plain form
36318 198001 -76080 -694737 -1045051 -1217558 -1334670 -969140 101491 1201094 1506693
36309 1506693 1045809 358752 -345859 -1024481 -1250382 -680873 166856 437429 124674
36300 124674 -55880 81991 -52961 -709557 -1297682 -1343836 -1194929 -1300334 -1400479 -1010422
36290 -1010422 -302090 97185 -15983 -249683 -237692 -32431 112654 93241 74655 329818
36280 329818 832308 1048992 505838 -394906 -678504 -160344 137559 -573676 -1607097
36271 -1607097 -1746941 -978832 -344295 -324233 -430821 -422328 -795268 -1677235 -2180446 -1510140
36261 -1510140 -118647 850698 858219 218184 -543994 -1068852 -1181093 -985283 -766677 -552875
36251 -552875 -99986 471417 533366 -178635 -1032893 -1277863 -901869 -311766 275236 598996
$$ packed form
36318A98001k74081o18657l50314j72507j17112L65530J070631J099603L05599
36309A506693m60884o87057p04611o78622k25901N69509Q47729K70573l12755
36300A24674j80554J37871j34952o56596n88125m6154J48907j05405j00145L90057
36290a010422P08332L99275j13168k33700J1991K05261J45085j9413j8586K55163
36280C29818N02490K16684n43154r00744k83598N18160K97903p11235j033421
36271a607097j39844P68109O34537K0062j06588Q493l72940q81967n03211O70306
36261a510140J391493R69345P521o40035p62178n24858j12241J95810K18606K13802
36251e52875M52889N71403O1949p12001q54258k44970L75994N90103N87002L23760
$$ plain form
36241 598996 176820 -897632 -1562025 -1077210 -210638 -153101 -735879 -900352 -568763 -629389
36231 -629389 -1139571 -1061025 -60415 839289 896207 647666 649595 454284 -324211 -1014455
36221 -1014455 -959445 -716646 -1112384 -1750145 -1564346 -457312 613198 933689 592754
36212 592754 -32246 -605032 -842011 -808237 -966271 -1453341 -1745459 -1556080 -1429704 -1710726
36202 -1710726 -1640154 -524613 776985 819248 -273309 -941797 -427334 426386 742423
36193 742423 737499 920584 1228461 1426729 1534288 1457355 971272 390193 441535 1106324
36183 1106324 1408430 803450 -22791 -264915 -135242 -247906 -537580 -550145 -340976 -334294
36173 -334294 -576858 -767317 -804756 -770967 -605608 -321090 -294711 -770815 -1246631 -977207
$$ packed form
36241E98996m22176j074452o64393M84815Q66572N7537n82778j64473L31589o0626
36231f29389n10182P8546J000610Q99704N6918k48541J929j95311p78495o90244
36221a014455N5010K42799l95738o37761J85799J107034J070510L20491l40935
36212E92754o25000n72786k36979L3774j58034m87070k92118J89379J26376k81022
36202a710726P0572J115541J301598M2263j092557o68488N14463Q53720L16037
36193G42423m924J83085L07877J98268J07559p6933m86083n81079N1342O64789
36183A106324L02106o04980q26241k42124J29673j12664k89674j2565K09169O682
36173c34294k42564j90459l7439L3789J65359K84518K6379m76104m75816K69424
$$ plain form
36163 -977207 -70582 498861 90051 -860641 -1501666 -1594644 -1537003 -1550920 -1320914 -606871
36153 -606871 142838 257660 -162958 -314534 87917 320856 -142690 -603398 -140303 822173
36143 822173 1036772 343406 -164022 -8630 -77976 -987213 -1880710 -1741640 -1006361 -817889
36133 -817889 -1237821 -1303944 -609750 209991 563135 580368 550279 389819 -45407 -621175
36123 -621175 -1159266 -1645624 -1968697 -1766701 -859548 303611 959179 873423 647828 942700
36113 942700 1499541 1355570 174117 -1128105 -1510465 -1137921 -915336 -1002263 -709864
36104 -709864 139571 738482 462632 -336190 -1078670 -1692374 -2134735 -1982349 -1138352 -303212
36094 -303212 -54747 9672 539656 1336555 1711687 1533791 1190421 814840 248017 -453335
$$ packed form
36163i77207R06625N69443m08810r50692o41025r2978N7641j3917K30006P14043
36153f06871P49709J14822m20618j51576M02451K32939m63546m60708M63095R62476
36143H22173K14599o93366n07428J55392o9346r09237q93497J39070P35279J88472
36133h17889m19932o6123O94194Q19741L53144J7233l0089j60460m35226n75768
36123f21175n38091m86358l23073K01996R07153J163159O55568q5756k25595K94872
36113I42700N56841j43971j181453j302222l82360L72544K22585q6927K92399
36104g09864Q49435N98911k75850p98822p42480o13704m42361J52386Q43997Q35140
36094c03212K48465O4419N29984P96899L75132j77896l43370l75581n66823p01352
$$ plain form
36084 -453335 -1067245 -1541775 -1799461 -1562944 -888847 -424797 -518676 -550845 117698 997972
36074 997972 1130210 524722 52566 179912 691001 1379047 2058306 2151694 1325576 372726
36064 372726 357958 974744 935981 17566 -576694 -127745 598604 722404 453749 311671
36054 311671 169913 -173191 -302884 158269 826277 1144723 1135672 1009410 662745 169425
36044 169425 117274 756769 1394487 1356914 994103 941388 953895 437915 -290199 -377181
36034 -377181 123146 284012 -183334 -509552 -203759 141184 -169282 -883989 -1274222 -1107596
36024 -1107596 -625908 12437 685040 991074 615585 -46620 -160025 558178 1461892
36015 1461892 1689410 999514 -141753 -1025087 -1184831 -734929 -361077 -701343 -1576603
$$ packed form
36084d53335o13910m74530k57686K36517O74097M64050r3879l2169O68543Q80274
36074I97972J32238o05488m72156J27346N11089O88046O79259R3388q26118r52850
36064C72726j4768O16786l8763r18415n94260M48949P26349J23800k68655j42078
36054C11671j41758l43104j29693M61153O68008L18446r051j26262l46665m93320
36044A69425n2151O39495O37718l7573l62811n2715J2507n15980p28114q6982
36034c77181N00327J60866m67346l26218L05793L44943l10466p14707l90233J66626
36024a107596M81688O38345O72603L06034l75489o62205j13405P18203R03714
36015A461892K27518o89896j141267q83334j59744M49902L73852l40266q75260
$$ plain form
36006 -1576603 -2131396 -1914531 -1409934 -1155279 -819273 174006 1410538 1789207 1103408
35997 1103408 423636 609933 1255608 1557124 1468570 1355843 1146796 618653 101992 96500
35987 96500 451315 638962 587590 542106 398126 -9332 -195373 453241 1512542 1827428
35977 1827428 1073722 135827 -229583 -242650 -369744 -589589 -773877 -1070815 -1445476 -1425921
35967 -1425921 -799063 -138658 -202060 -1056614 -2051450 -2402923 -1721907 -330375 862341
35958 862341 1171290 843240 587740 575667 479779 293344 279041 203895 -397494 -1169986
35948 -1169986 -1241025 -739514 -784527 -1560364 -1703333 -346963 1379011 1853479 1035186
35939 1035186 17684 -665146 -1171210 -1452857 -1431712 -1626055 -2429073 -3063186 -2418731
$$ packed form
36006a576603n54793K16865N04597K54655L36006R93279J236532L78669o85799
35997A103408o79772J86297O45675L01516q8554j12727k09047n28143n16661n492
35987I6500L54815J87647n1372m5484j43980m07458j86041O48614J059301L14886
35977A827428p53706r37895l65410j3067j27094k19845j84288k96938l74661J9555
35967a425921O26858O60405o3402q54554r94836l51473O81016J391532J192716
35958H62341L08949l28050k55500j2073r5888j86435j4303p5146o01389p72492
35948a169986p1039N01511m5013p75837j42969J356370J725974M74468q18293
35939A035186j017502o82830n06064k81647K1145j94343q03018o34113O44455
$$ plain form
35930 -2418731 -788996 352864 303313 -206030 -407929 -516192 -950437 -1366499 -1070172
35921 -1070172 -30062 1007563 1357500 1117963 973949 1289415 1604323 1345081 825179
35912 825179 856233 1351015 1233941 85693 -1082970 -1310853 -1014834 -1008226 -1063234 -542532
35902 -542532 223885 447868 313466 601575 1158372 1060111 223699 -440343 -564659 -784864
35892 -784864 -1444692 -1986883 -1988172 -1809155 -1821236 -1850003 -1764987 -1834877 -2127120 -2269724 -2140259
35881 -2140259 -2105242 -2276480 -2230655 -1796600 -1445629 -1531754 -1736363 -1605177 -1109155 -426947
35871 -426947 268845 609190 250069 -462354 -699453 -297926 -42612 -481973 -1112122 -1146579
35861 -1146579 -554047 67358 216179 -192394 -805159 -966932 -376773 307084 141933
$$ packed form
35930b418731J629735J141860m9551n09343k01899j08263m34245m16062K96327
35921a070172J040110J037625L49937k39537j44014L15466L14908k59242n19902
35912H25179L1054M94782j17074j148248j168663k27883K96019O608n5008N20702
35902e42532P66417K23983j34402K88109N56797r8261q36412o64042j24316k20205
35892g84864o59828n42191j289J79017j2081k8767Q5016o9890k92243j42604J29465
35881b140259L5017j71238M5825M34055L50971q6125k04609J31186M96022O82208
35871d26947O95792L40345l59121p12423k37099M01527K55314m39361o30149l4457
35861a146579N92532O21405J48821m08573o12765j61773N90159O83857j65151
$$ plain form
35852 141933 -753523 -1308956 -1090105 -840753 -1129019 -1452579 -1236680 -808484 -679711 -633390
35842 -633390 -282124 120452 202156 245492 665216 1192168 1326677 1165417 1029586 695835
35832 695835 -177042 -1153977 -1386681 -747966 72288 505850 571524 517366 509478 596498
35822 596498 634036 433480 223352 533378 1288629 1608828 1034135 327455 347463 728388
35812 728388 611944 220874 561388 1711412 2546129 2332516 1656372 1438381 1730794
35803 1730794 1867143 1364447 386421 -462397 -734453 -691495 -1071203 -2038953 -2744870 -2422678
35793 -2422678 -1560944 -1296644 -1908250 -2677301 -3050891 -3068959 -2712780 -1809506 -753303
35784 -753303 -393535 -821317 -1019984 -203743 1070174 1639873 1195717 503663 372555
$$ packed form
35852A41933q95456n55433K18851K49352k88266l23560K15899M28196J28773M6321
35842f33390L51266M02576Q1704M3336M19724N26952J34509j61260j35831l33751
35832F95835q72877r76935k32704O38715Q20254M33562O5674n4158p888Q7020
35822E96498L7538k00556k10128L10026P55251L20199n74693p06680K0008L80925
35812G28388j16444l91070L40514J150024Q34717k13613o76144k17991K92413
35803A730794J36349n02696r78026q48818k72056M2958l79708r67750p05917L22192
35793b422678Q61734K64300o11606p69051l73590j8068L56179R03274J056203
35784g53303L59768m27782j98667Q16241J273917N69699m44156o92054j31108
$$ plain form
35775 372555 796955 1101243 723258 -212724 -1121526 -1668975 -1950981 -1917208 -1215703 -28937
35765 -28937 577068 -57783 -984300 -717104 714692 1855149 1873569 1342642 857048 198779
35755 198779 -644368 -889054 -218469 351606 -137586 -1044105 -1018710 26769 892834 807902
35745 807902 206206 -177812 -168784 2222 84852 -89898 -474086 -756170 -804623 -1004089
35735 -1004089 -1666450 -2271486 -1936933 -649076 616778 1136980 1197149 1360591 1542368
35726 1542368 1265730 519474 -123904 -184538 236863 633630 561657 -23925 -705413 -877890
35716 -877890 -277890 676142 1178342 787799 -135440 -837845 -994445 -963357 -1156194 -1377518
35706 -1377518 -1067499 -126926 844819 1228014 1013389 601392 239902 -83020 -366488
$$ packed form
35775C72555M24400L04288l77985r35982r08802n47449k82006L3773P01505J186766
35765b8937O06005o34851r26517K67196J431796J140457J8420n30927m85594o58269
35755A98779q43147k44686O70585N70075m89192r06519K5395J045479Q66065q4932
35745H07902o01696l84018R028J71006Q2630j74750l84188k82084m8453j99466
35735a004089o62361o05036L34553J287857J265854N20202O0169J63442J81777
35726A542368k76638p46256o43378o0634M21401L96767p1973n85582o81488j72477
35716h77890O00000R54032N02200l90543r23239p02405j56600L1088j92837k21324
35706a377518L10019R40573R71745L83195k14625m11997l61490l22922k83468
$$ plain form
35697 -366488 -527629 -561080 -523232 -364708 11427 499218 765973 532654 -191073 -1097617
35687 -1097617 -1687404 -1497162 -505222 642077 1064477 474424 -545667 -1179506 -1131735
35678 -1131735 -655540 -101240 262971 183772 -326328 -643982 8240 1474603 2504385
35669 2504385 2153188 1004792 379729 549424 556523 -131306 -711959 -272281 795655
35660 795655 1342688 1048843 698828 986851 1724340 2308775 2442228 2198846 1731182 1120908
35650 1120908 393529 -392156 -1063503 -1474618 -1733862 -1976815 -1873365 -943404 355575
35641 355575 600539 -848194 -2654005 -2956465 -1614943 -39320 836141 1195102 1162993
35632 1162993 477795 -425996 -450900 472295 995539 369907 -358278 -70344 658088 693603
$$ packed form
35697c66488j61141l3451L7848J58524L76135M87791K66755k33319p23727r06544
35687a097617n89787J90242R91940J147299M22400n90053j020091o33839M7771
35678a131735M76195N54300L64211p9199n10100l17654O52222J466363J029782
35669B504385l51197j148396o25063J69695P099o87829n80653M39678J067936
35660G95655N47033k93845l50015K88023P37489N84435J33453k43382m67664o10274
35650A120908p27379p85685o71347m11115k59244k42953J03450R29961J298979
35641C55575K44964j448733j805811l02460J341522J575623Q75461L58961l2109
35632A162993o85198r03791k4904R23195N23244o25632p28185K87934P28432L5515
$$ plain form
35622 693603 296410 533767 1392440 1963066 2134406 2582210 3169429 2877005 1552610
35613 1552610 373386 146428 320924 202330 65399 378281 811053 790905 390932
35604 390932 -38262 -542269 -1167524 -1434703 -989887 -360708 -242570 -351757 106244 972627
35594 972627 1115987 38194 -1339206 -1864444 -1504164 -1047440 -921568 -853737 -510624
35585 -510624 33315 486222 657682 499593 50516 -521616 -903533 -802260 -224155 383753
35575 383753 395583 -378572 -1325211 -1525669 -764169 177826 444888 107978 -95154 144100
35565 144100 381990 247478 31167 134726 371196 299715 7886 16734 467224 901318
35555 901318 910706 582450 201875 -107645 -316243 -390003 -393482 -404928 -280719 116175 409582
$$ packed form
35622F93603l97193K37357Q58673N70626J71340M47804N87219k92424j324395
35613A552610j179224k26958J74496j18594j36931L12882M32772k0148l99973
35604C90932m29194n04007o25255k67179M44816O29179J18138j09187M58001Q66383
35594I72627J43360j077793j377400n25238L60280M56724J25872O7831L43113
35585e10624N43939M52907J71460j58089m49077n72132l81917J01273N78105O07908
35575C83753J1830p74155r46639k00458P61500R41995K67062l36910k03132K39254
35565A44100K37890j34512k16311J03559K36470p1481k91829Q848M50490M34094
35555I01318R388l28256l80575l09520k08598p3760l479j1446J24209L96894K93407
$$ plain form
35544 409582 -7325 -939327 -1243740 -241745 1146083 1335845 -9437 -1605260 -2060340
35535 -2060340 -1247611 -108939 433730 193953 -324348 -470161 -65554 454569 611881
35526 611881 505753 651769 1255243 1902350 2007637 1409493 532830 65652 359185 1012704
35516 1012704 1243235 852070 536945 919756 1590241 1655981 1028568 460798 308158 18549
35506 18549 -873265 -1899546 -2283631 -1982976 -1593262 -1450316 -1322765 -927417 -333933 206027
35496 206027 556518 704628 600785 128642 -697936 -1511287 -1730283 -1133891 -226809 239265
35486 239265 122638 -3806 354263 1023751 1479662 1457740 1096451 725212 673921 1043821
35476 1043821 1493525 1499196 1006471 554465 546118 711739 602655 304927 210371 271568
$$ packed form
35544D09582m16907r32002l04413J001995J387828J89762j345282j595823m55080
35535b060340Q12729J138672N42669k39777n18301j45813M04607N20123J57312
35526F11881j06128J46016O03474O47107J05287n98144q76663m67178K93533O53519
35516A012704K30531l91165l15125L82811O70485O5740o27413n67770j52640k89609
35506A8549q91814j026281l84085L00655L89714J42946J27551L95348N93484N39960
35496B06027L50491J48110j03843m72143q26578q13351k18996N96392R07082M66074
35486B39265j16627j26444L58069O69488M55911k1922l61289l71239n1291L69900
35476A043821M49704N671m92725m52006q347J65621j09084k97728r4556O1197
$$ plain form
35466 271568 31439 -586023 -998622 -654480 316532 1300583 1794568 1646236 950854 -32468
35456 -32468 -951756 -1550114 -1781739 -1686321 -1273748 -666637 -217326 -217972 -493368 -544474 -195389
35445 -195389 148967 79697 -216590 -264505 -52431 -3365 -170448 -21567 687271 1309385
35435 1309385 1071504 139071 -632528 -826919 -742560 -618620 -278677 309060 739146 718830
35425 718830 418170 4164 -648712 -1409751 -1578973 -698037 644483 1402459 1287807
35416 1287807 870944 634599 539804 516989 754625 1273881 1653273 1478103 860384 315218
35406 315218 219182 459315 541431 96101 -613653 -854243 -315024 372961 385897 -205678
35396 -205678 -609370 -471865 -219215 -169245 -43999 302822 362722 -236534 -898558 -720176
$$ packed form
35466B71568k40129o17462m12599L44142R71012R84051M93985j48332o95382r83322
35456c2468r19288n98358k31625R5418M12573O07111M49311o46k75396n1106L49085
35445a95389L44356o9270k96287m7915K12074M9066j67083J48881P08838O22114
35435A309385k37881r32433p71599j94391Q4359J23940L39943N87737M30086k0316
35425G18830l00660m14006o52876p61039j69222Q80936J342520P57976j14652
35416A287807m16863k36345r4795k2815K37636N19256L79392j75170o17719n45166
35406C15218r6036K40133Q2116m45330p09754k40590N39219O87985J2936n91575
35396b05678m03692J37505K52650M9970J25246L46821N9900n99256o62024J78382
$$ plain form
35386 -720176 257767 1133312 1358002 1205824 1046892 855045 616510 595185 843052 917602
35376 917602 484563 -139401 -429760 -348692 -198014 -56665 127093 53906 -698342 -1887658
35366 -1887658 -2587521 -2218290 -1269846 -734626 -1030040 -1694218 -1976489 -1527142 -630056
35357 -630056 72059 173232 -67181 -28780 448573 789668 441019 -332853 -765042 -590670
35347 -590670 -316599 -412949 -618737 -334575 462797 1029957 675841 -382741 -1159652 -918002
35337 -918002 76653 916720 1041331 658704 258297 50697 12999 162860 494607 810023
35327 810023 910573 904732 1093386 1559514 2023498 2097811 1641692 965293 662515 968728
35317 968728 1263227 664636 -698945 -1586397 -1219251 -365048 -185716 -560133 -524703 -23732
$$ packed form
35386g20176R77943Q75545K24690j52178j58932j91847k38535k1325K47867P4550
35376I17602m33039o23964k90359Q1068J50678J41349J83758p3187p52248j189316
35366a887658o99863L69231R48444N35220k95414o64178k82271M49347Q97086
35357f30056P02115J01173k40413L8401M77353L41095l48649p73872m32189J74372
35347e90670K74071r6350k05788K84162P97372N67160l54116j058582p76911K41650
35337i18002R94655Q40067J24611l82627m00407k07600l7698J49861L31747L15416
35327H10023J00550n841J88654M66128M63984P4313m56119o76399l02778L06213
35317I68728K94499n98591j363581q87452L67146Q54203J79332l74417L5430N00971
$$ plain form
35307 -23732 32269 -519812 -658336 91296 680990 77762 -1147245 -1697689 -1343266 -861125
35297 -861125 -703156 -756961 -1085967 -1783951 -2180953 -1303308 665286 2268889 2419403
35288 2419403 1452074 318152 -520701 -1015454 -1041321 -576994 -1412 277073 282319 267541
35278 267541 316694 413062 607117 828826 821517 557781 426268 676522 973632 898023
35268 898023 625795 641512 953466 1123952 1031563 1071297 1500437 2046457 2356309 2457569
35258 2457569 2507143 2361369 1738536 720573 -178898 -482045 -167801 369682 710312
35249 710312 762418 742904 784207 672855 197168 -293663 -75826 1003529 2117914 2358494
35239 2358494 1785868 1149524 789512 448508 104690 187715 721284 1021516 735148 496546
$$ packed form
35307b3732N6001n52081j38524P49632N89694o03228j225007n50444L54423M82141
35297h61125J57969n3805l29006o97984l97002Q77645J968594J603603J50514
35288B419403r67329j133922q38853m94753k5867M64327N75582K78485N246j4778
35278B67541M9153R6368J94055K21709p309k63736j31513K50254K97110p5609
35268H98023k72228J5717L11954J70486r2389L9734M29140N46020L09852J01260
35258B457569M9574j45774o22833j017963q99471l03147L14244N37483L40630
35249G10312N2106j9514M1303j11352m75687m90831K17837J079355J114385K40580
35239B358494n72626o36344l60012l41004l43818Q3025N33569L00232k86368k38602
$$ plain form
35229 496546 879451 1305083 915253 112644 102451 1019532 1709015 1530239 1172060 1250590
35219 1250590 1298718 905908 782364 1582338 2427676 1905409 195046 -1052046 -920185
35210 -920185 -217246 -124242 -807887 -1618702 -1882732 -1245410 85710 1208625 1256338 430207
35200 430207 -304279 -592012 -915158 -1298293 -876717 654032 2089971 2092983 920083
35191 920083 -74928 -222401 58008 319061 599611 916635 1071905 1083959 1169428 1188170
35181 1188170 719059 -141869 -631188 -254435 544482 948604 707728 246143 49172
35172 49172 195256 391717 310917 -54073 -325893 -145528 362422 714543 691872 616008
35162 616008 902623 1540661 2162595 2456405 2294895 1577892 277461 -1250262 -2252621
$$ packed form
35229D96546L82905M25632l89830q02609j0193R17081O89483j78776l58179P8530
35219A250590M8128l92810j23544P99974Q45338n22267j710363j247092J31861
35210i20185P02939R3004o83645q10815k64030O37322J331120J122915M7713q26131
35200D30207p34486k87733l23146l83135M21576J530749J435939L012j172900
35191I20083r95011j47473K80409K61053K80550L17024J55270J2054Q5469J8742
35181A188170m69111q60928m89319L76753P98917M04122k40876m61585j96971
35172D9172J46084J96461q0800l64990k71820J80365N07950L52121k2671p5864
35162F16008K86615O38038O21934K93810j61510p17003j300431j527723j002359
$$ plain form
35153 -2252621 -2181094 -1295453 -427160 -95851 -126288 -222100 -485783 -1007047 -1334183 -1004040
35143 -1004040 -412960 -371706 -764326 -538185 674226 1816702 1851594 1135086 587173
35134 587173 217472 -484881 -1206646 -1109886 -312319 180887 100009 236175 876298 1165927
35124 1165927 590363 -70486 -75969 7668 -574513 -1188605 -645008 814636 1681642 1253535
35114 1253535 352730 -129065 -266555 -355270 -162408 490935 1124922 1186984 758831 210517
35104 210517 -374798 -970534 -1277485 -1150618 -960007 -1012669 -1011464 -648765 -317939 -524929
35094 -524929 -933337 -843333 -417703 -455969 -938196 -851214 215900 1282151 1354059 787867
35084 787867 532359 644877 466386 -95913 -425641 -260858 -45103 -119818 -291158 -372922
$$ packed form
35153b252621P1527Q85641Q68293L31309l0437r5812k63683n21264l27136L30143
35143a004040N91080M1254l92620K26141J212411J142476L4892p16508n47913
35134E87173l69701p02353p21765R6760P97567M93206q0878J36166O40123K89629
35124A165927n75564o60849n483Q3637n82181o14092N43597J459644Q67006m28107
35114A253535r00805m81795j37490q8715J92862O53343O33987O2062m28153n48314
35104B10517n85315n95736l06951J26867J90611n2662J205L62699L30826k06990
35094e24929m08408R0004M25630l8266m82227Q6982J067114J066251P1908n66192
35084G87867k55508J12518j78491n62299l29728J64783K15755p4715j71340q1764
$$ plain form
35074 -372922 -515849 -764063 -865814 -803826 -962449 -1414177 -1556686 -929581 18055 520544
35064 520544 573042 823089 1505209 2072136 1966644 1319964 740520 710596 1293211 2149745
35054 2149745 2698268 2469991 1504246 343899 -424455 -610191 -476588 -474470 -835263 -1277187
35044 -1277187 -1218477 -482608 338733 525882 131511 -170681 -117161 -188835 -713179 -1193062
35034 -1193062 -1020501 -486262 -414589 -886123 -1016406 -204854 955961 1408428 915292
35025 915292 179711 -117121 65652 416690 722129 912383 976699 961441 841851 394470
35015 394470 -457930 -1146646 -834858 421926 1399406 1082792 -65303 -830729 -921163
35006 -921163 -1070393 -1559667 -1668592 -968088 -256240 -472758 -1236352 -1307941 -302158 816034
$$ packed form
35074c72922j42927k48214j01751O1988j58623m51728j42509O27105R47636N02489
35064E20544N2498K50047O82120N66927j05492o46680n79444k9924N82615Q56534
35054B149745N48523k28277r65745j160347p68354j85736J33603K118l60793m41924
35044a277187N8710P35869Q21341J87149l94371l02192N3520p1674n24344m79883
35034a193062J72561N34239P1673m71534j30283Q11552J160815M52467m93136
35025I15292p35581k96832J82773L51038L05439J90254O4316j5258j19590m47381
35015C94470q52400o88716L11788J256784R77480l16614j148095p65426r0434
35006i21163j49230m89274j08925P00504P11848k16518p63594p1589J005783J118192
$$ plain form
34996 816034 942431 -48950 -1434287 -2336411 -2171489 -902509 862694 2251853 2773894
34987 2773894 2507384 1782176 990406 589526 786868 1160952 1083118 638193 607040 1321086
34977 1321086 2102542 2229717 1919743 1776508 1713014 1233378 586396 671684 1588121 2143407
34967 2143407 1361470 -114477 -832656 -423566 91791 -183216 -990048 -1612794 -1878674
34958 -1878674 -1954956 -1683716 -865282 3447 89102 -544292 -775631 106083 1303297 1433619
34948 1433619 256298 -1120328 -1646356 -1333275 -772784 -266580 195392 481797 368507
34939 368507 -15930 -200644 55611 444324 507085 205071 -89678 -105886 34988 96021
34929 96021 111043 306377 690118 930822 726382 172406 -338541 -528655 -463847 -389689
$$ packed form
34996H16034J26397r91381j385337r02124J64922J268980J765203J389159N22041
34987B773894k66510p25208p91770m00880J97342L74084p7834m44925l1153P14046
34977A321086P81456J27175l09974j43235o3494m79636o46982Q5288R16437N55286
34967B143407p81937j475947p18179M09090N15357k75007q06832o22746k65880
34958a878674p6282K71240Q18434Q68729Q5655o33394k31339Q81714J197214J30322
34948A433619j177321j376626n26028L13081N60491N06204M61972K86405j13290
34939C68507l84437j84714K56255L88713O2761l02014k94749j6208J40874O1033
34929I6021J5022J95334L83741K40704k04440n53976n10947j90114O4808P4158
$$ plain form
34919 -389689 -398826 -313552 32372 404839 261046 -590663 -1572241 -1865917 -1307309 -451463
34909 -451463 184733 526281 580269 235777 -334631 -584469 -294718 46175 10418 -7414
34899 -7414 621890 1678816 2274523 2043049 1517453 1253143 1144785 797323 160019 -400070
34889 -400070 -417106 281776 1218023 1431785 495704 -707094 -816539 329217 1474452
34880 1474452 1566240 943862 593928 829195 1197138 1264634 959926 395096 -189425 -471633
34870 -471633 -393962 -293499 -414456 -546228 -453871 -357167 -554506 -827035 -744768 -446690
34860 -446690 -548238 -1178690 -1573538 -910339 620253 1821418 1646281 320409 -827515
34851 -827515 -793122 13865 429704 116773 -144780 164881 417220 -169349 -1241152 -1741391
$$ packed form
34919c89689r137Q5274L45924L72467j43793q51709r81578k93676N58608Q55846
34909d51463O36196L41548N3988l44492n70408k49838K89751L40893l5757j7832
34899g414O29304J056926N95707k31474n25596k64310j08358l47462o37304n60089
34889d00070j7036O98882R36247K13762r36081j202798j09445J145756J145235
34880A474452R1788o22378l49934K35267L67943O7496l04708n64830n84521k82208
34870d71633P7671J00463j20957j31772R2357R6704j97339k72529Q2267K98078
34860d46690j01548o30452l94848O63199J530592J201165j75137j325872j147924
34851h27515L4393Q06987M15839l12931k61553L09661K52339n86569j071803n00239
$$ plain form
34841 -1741391 -1320488 -593463 -128272 119377 330939 404533 189161 -270677 -862031 -1475265
34831 -1475265 -1898508 -1928928 -1617827 -1173006 -684223 -197835 95696 106752 121743 409113
34821 409113 702292 578585 222016 192961 477911 475277 43595 -170368 243998 776378
34811 776378 807462 576407 741146 1299910 1597436 1332906 997384 1159539 1679615 1899786
34801 1899786 1510683 972330 922714 1285484 1310888 639488 -69335 24607 768669 1269319
34791 1269319 1181358 1032564 1181250 1196070 615809 -266666 -829224 -904222 -708029 -346007
34781 -346007 158318 582991 652300 305129 -394809 -1304677 -1939483 -1656834 -549658 286645
34771 286645 -30167 -1002970 -1433928 -1005793 -448265 -259834 -119537 261802 463617 -39760
$$ packed form
34841a741391M20903P27025M65191K47649K11562P3594k15372m59838n91354o13234
34831a475265m23243l0420L11101M44821M88783M86388K93531J1056J4991K87370
34821D09113K93179j23707l56569k9055K84950k634m31682k13963M14366N32380
34811G76378L1084k31055J64739N58764K97526k64530l35522J62155N20076K20171
34801A899786l89103n38353m9616L62770K5404o71400p08823R3942P44062N00650
34791A269319q7961j48794J48686J4820n80261q82475n62558p4998J96193L62022
34781c46007N04325M24673O9309l47171o99938r09868o34806K82649J107176Q36303
34771B86645l16812r72803m30958M28135N57528J88431J40297L81339K01815n03377
$$ plain form
34761 -39760 -1029752 -1706379 -1511342 -579961 440375 891258 625841 144293 51404 372792
34751 372792 622575 481755 60079 -482908 -1103330 -1558095 -1427409 -707916 37179 422349
34741 422349 732851 1294285 1741134 1474821 643220 42621 36086 124159 -264195 -1028268
34731 -1028268 -1687208 -2023090 -2085393 -1821767 -1142995 -303604 164177 3731 -491784 -826723
34721 -826723 -733942 -209216 620792 1472963 1935131 1788508 1261372 770668 471003 261173
34711 261173 135803 195167 302976 134449 -280896 -442908 -85279 326660 193329 -356021
34701 -356021 -684184 -631238 -726039 -1311466 -1963940 -2060024 -1560256 -899030 -354081 97956
34691 97956 448595 590900 586940 648311 756749 598724 43321 -552542 -763304 -677021
$$ packed form
34761c9760r89992o76627J95037R31381J020336M50883k65417m81548r2889L21388
34751C72792K49783j40820m21676n42987o20422m54765J30686P19493P45095L85170
34741D22349L10502N61434M46849k66313q31601o00599o535Q8073l88354p64073
34731a028268o58940l35882o2303K63626O78772Q39391M67781j60446m95515l34939
34721h26723R2781N24726Q30008Q52171M62168j46623n27136m90704k99665k09830
34711B61173j25370N9364J07809j68527m15345j62012L57629M11939j33331n49350
34701c56021l28163N2946r4801n85427o52474r6084M99768O61226N44949M52037
34691I7956L50639J42305l960O1371J08438j58025n55403n95863k10762Q6283
$$ plain form
34681 -677021 -750893 -1097388 -1248781 -794923 8761 563645 715306 852532 1232496 1618735
34671 1618735 1737378 1694447 1638901 1354387 644909 -83583 -186637 309928 736153 794075
34661 794075 919838 1352728 1480320 692943 -526692 -1094705 -756848 -314684 -406563 -791802
34651 -791802 -1063924 -1352815 -1815984 -1976181 -1283470 -119011 469864 70626 -634681
34642 -634681 -830307 -455901 87771 616176 1137840 1488569 1466578 1202053 999795 895244
34632 895244 729145 592494 782432 1286350 1701666 1761072 1578565 1270352 745707 87403
34622 87403 -279155 -160517 -9515 -301866 -721102 -526174 316824 962040 801813 243547
34612 243547 53063 313944 483340 276387 4074 15338 201116 204796 -112259 -547159
$$ packed form
34681f77021p3872l46495j51393M53858Q03684N54884J51661J37226L79964L86239
34671A618735J18643m2931n5546k84514p09478p28492j03054M96565M26225N7922
34661G94075J25763M32890J27592p87377j219635n68013L37857M42164r1879l85239
34651g91802k72122k88891m63169j60197O92711J164459N88875l99238p05307
34642f34681j95626L74406N43672N28405N21664L50729k1991k64525k02258j04551
34632H95244j66099j36651J89938N03918M15316N9406j82507l08213n24645o58304
34622H7403l66558J18638J51002k92351m19236J94928Q42998O45216j60227n58266
34612B43547j90484K60881J69396k06953k72313J1264J85778L680l17055m34900
$$ plain form
34602 -547159 -717700 -266037 844718 2042689 2387359 1432326 -209250 -1432997 -1718537
34593 -1718537 -1341862 -631294 430301 1692814 2508744 2403706 1750838 1269333 1086440
34584 1086440 840676 496353 340970 234910 -303397 -1092278 -1221311 -410029 350832
34575 350832 151632 -490461 -438369 391324 1083374 1165658 992274 757242 182987 -585761
34565 -585761 -746297 22528 908458 996337 414151 -62657 -81987 158220 476163 813732
34555 813732 1010889 997663 1050549 1404134 1772453 1709757 1297758 999314 932979 785042
34545 785042 417534 105171 134314 545763 1270377 2123474 2666180 2510646 1834835 1200550
34535 1200550 802614 327040 -360896 -886324 -939447 -732103 -590076 -487384 -328575 -319567
$$ packed form
34602e47159j70541M51663J110755J197971L44670r55033j641576j223747k85540
34593a718537L76675P10568J061595J262513Q15930j05038o52868m81505j82893
34584A086440k45764l44323j55383j06060n38307p88881j29033Q11282P60861
34575C50832j99200o42093N2092Q29693O92050Q2284j73384k35032n74255p68748
34565e85761j60536P68825Q85930Q7879n82186m76808j9330K40207L17943L37569
34555H13732J97157j3226N2886L53585L68319o2696m11999k98444o6335j47937
34545G85042l67508l12363K9143M11449P24614Q53097N42706j55534o75811o34285
34535A200550l97936m75574o87936n25428n3123K07344J42027J02692J58809R008
$$ plain form
34525 -319567 -611527 -862307 -677414 -325673 -447924 -1065558 -1435729 -1022918 -116200 740074
34515 740074 1445182 2091692 2416170 2072856 1315779 839317 890291 1033187 920423 774424
34505 774424 818352 727110 157600 -494333 -498447 139873 629987 484145 79852 -66738
34495 -66738 -76072 -407678 -1113974 -1717615 -1661558 -743284 640330 1614487 1599626 1069517
34485 1069517 1023441 1576954 1820275 1396389 1254128 2069664 2831900 2203888 683318
34476 683318 -48051 344028 570519 51554 -205733 359936 595696 -494402 -1854830
34467 -1854830 -1740353 -224086 1011478 969815 174819 -566693 -1044074 -1269067 -1231597
34458 -1231597 -1178750 -1394998 -1659214 -1575474 -1338861 -1403851 -1496965 -867316 439204 1479864
$$ packed form
34525c19567k91960k50780J84893L51741j22251o17634l70171M12811R06718Q56274
34515G40074P05108O46510L24478l43314p57077m76462N0974J42896j12764j45999
34505G74424M3928r1242n69510o51933m114O38320M90114j45842m04293j46590
34495f6738r334l31606p06296o03641N6057R18274J383614R74157j4861n30109
34485A069517m6076N53513K43321m23886j42261Q15536P62236o28012j520570
34476F83318p31369L92079K26491n18965k57287N65669K35760j090098j360428
34467a854830J14477J516267J235564m1663p94996p41512m77381k24993L7470
34458a231597N2847k16248k64216Q3740K36613o4990r3114O29649J306520J040660
$$ plain form
34448 1479864 1754924 1751026 1884723 1813663 1271655 821519 1141154 2019617 2600376 2355830
34438 2355830 1510531 798985 995257 2268816 3768218 4236198 3282411 1748708 731696
34429 731696 623440 1105356 1557443 1451328 897859 731952 1365900 1791518 829766 -722329
34419 -722329 -737030 1073183 2340273 1357611 -373529 -401269 1090506 1796529 723654
34410 723654 -770909 -1198049 -517637 591771 1597452 2012515 1636956 1126392 1294106
34401 1294106 1781036 1529101 618313 347110 1229226 2176702 2129614 1391095 834873 763386
34391 763386 1047874 1518037 1784617 1525896 1249042 1780150 2725496 2662918 1332431 300651
34381 300651 703215 1631536 1749211 1298045 1266904 1579193 1510901 1187496 1249357 1524686
$$ packed form
34448A479864K75060l898J33697p1060n42008m50136L19635Q78463N80759k44546
34438B355830q45299p11546J96272J273559J499402M67980r53787j533703j017012
34429G31696j08256M81916M52087j06115n53469j65907O33948M25618r61752j552095
34419g22329j4701J810213J267090r82662j731140k7740J491775P06023j072875
34410G23654j494563m27140O80412J109408J005681M15063l75559n10564J67714
34401A294106M86930k51935r10788k71203Q82116R47476m7088p38519n56222p1487
34391G63386K84488M70163K66580k58721k76854N31108R45346o2578j330487j031780
34381C00651M02564R28321J17675m51166l1141L12289o8292l23405O1861K75329
$$ plain form
34371 1524686 1391280 1099197 1408394 2132626 2327523 1852228 1554109 1865079 2271639
34362 2271639 2255713 1834167 1127290 261265 -309951 -243556 -18736 -331754 -867642 -647980
34352 -647980 414157 1326140 1465629 1221087 1035476 801552 472361 383994 657323 996137
34342 996137 1249189 1461656 1355241 631017 -198404 -288654 169748 203282 -210664 -13347
34332 -13347 974756 1431538 596103 -402785 -280472 488672 647850 110013 -340237 -593979
34322 -593979 -1130629 -1800904 -1957482 -1598455 -1278551 -1017407 -328663 726958 1497668
34313 1497668 1775115 1982960 2266798 2250836 1861005 1609515 1789416 2001351 1768464 1168630
34303 1168630 637172 504410 865585 1567945 2208184 2416117 2205134 1847054 1489438
$$ packed form
34371A524686j33406k92083L09197P24232J94897m75295k98119L10970M06560
34362B271639j5926m21546p06877q66025n71216O6395K24820l13018n35888K19662
34352f47980J062137R11983J39489k44542j85611k33924l29191q8367K73329L38814
34342I96137K53052K12467j06415p24224q29421r0250M58402L3534m13946J97317
34332a3347R88103M56782q35435r98888J22313P69144J59178n37837m50250k53742
34322e93979n36650o70275j56578L59027L19904K61144O88744J055621P70710
34313A497668K77447K07845K83838j5962l89831k51490J79901K11935k32887n99834
34303A168630n31458j32762L61175P02360O40239K07933k10983l58080l57616
$$ plain form
34294 1489438 1158001 973150 986874 930470 547535 100364 103856 576753 999716 1083263
34284 1083263 1193903 1861119 3070715 4159307 4364759 3559489 2498765 2162379 2764586
34275 2764586 3644316 4149475 4189093 3811733 2898017 1676408 946926 1203929 1954086
34266 1954086 2430129 2529950 2518506 2385245 2217710 2606215 3710858 4404696 3503520 1615319
34256 1615319 578155 1090914 2039821 2249462 1768856 1221477 982843 1327660 2369341
34247 2369341 3463567 3625746 2942342 2618870 3209556 3831010 3678776 3220661 3075530
34238 3075530 2739304 1536463 99057 -335339 301268 992554 1286901 1726112 2583866
34229 2583866 3200930 2910195 1948196 1104954 877555 1184946 1606868 1743280 1523330
$$ packed form
34294A489438l31437j84851J3724n6404l82935m47171L492M72897M22963Q3547
34284A083263J10640O67216J209596J088592K05452q05270j060724l36386O02207
34275B764586Q79730N05159L9618l77360r13716j221609p29482K57003P50157
34266A954086M76043R9821j1444j33261j67535L88505J104643O93838r01176j888201
34256A615319j037164N12759R48907K09641m80606n47379k38634L44817J041681
34247B369341J094226J62179o83404l23472N90686O21454j52234m58115j45131
34238C075530l36226j202841j437406m34396O36607O91286K94347M39211Q57754
34229B583866O17064k90735r61999q43242k27399L07391M21922J36412k19950
$$ plain form
34220 1523330 1197530 918893 506872 -139381 -619964 -408752 448794 1341936 1724293
34211 1724293 1483441 856069 318597 424268 1346981 2583620 3367107 3338576 2669666
34202 2669666 1769048 1164118 1383677 2447051 3556679 3788786 3135134 2477438 2485888
34193 2485888 2920417 3130342 2896220 2538829 2367776 2288303 2033173 1690856 1776297 2565299
34183 2565299 3491561 3621933 2823281 2045314 2222526 3249079 4281314 4659509 4204318
34174 4204318 3031948 1589710 600511 438208 692890 750420 564065 417702 270821
34165 270821 -10997 -25977 755350 1985936 2642520 2345858 1746617 1426822 1198554 821194
34155 821194 632538 902335 1181412 1003575 817315 1440483 2778738 3843546 4048513
$$ packed form
34220A523330l25800k78637m12021o46253m80583K11212Q57546Q93142L82357
34211A724293k40852o27372n37472J05671R22713J236639P83487k8531o68910
34202B669666r00618o04930K19559J063374J109628K32107o53652o57696Q450
34193B485888M34529K09925k34122l57391j71053p9473k55130l42317Q5441P89002
34183B565299R26262J30372p98652p77967J77212J026553J032235L78195m55191
34174D204318j172370j442238r89199j62303K54682N7530j86355j46363j46881
34165B70821k81818j4980P81327J230586O56584k96662n99241l19795k28268l77360
34155H21194j88656K69797K79077j77837j86260O23168J338255J064808K04967
$$ plain form
34146 4048513 3816275 3778065 3991274 4205415 4365237 4469037 4338896 3973107 3802691 4082119
34136 4082119 4275190 3700602 2705713 2428523 3206476 3988618 3787973 3052819 2894241
34127 2894241 3431268 3796265 3588881 3374323 3626314 4013807 4049782 3811644 3672916 3795002
34117 3795002 4131663 4481860 4397374 3617489 2746635 2767946 3603366 3990881 3274658 2458739
34107 2458739 2742601 3751569 4175506 3673886 3143113 3333153 4088872 4838372 5095271
34098 5095271 4633823 3829816 3573139 4154799 4606090 3972855 2846286 2584430 3304862
34089 3304862 3850279 3626152 3187949 2953871 2685163 2504213 3067613 4239365 4878761
34080 4878761 4611531 4611632 5790786 7297956 7814758 7427222 7101718 7024944 6652145 5925309
$$ packed form
34146D048513k32238l8210K13209K14141J59822J03800j30141l65789j70416K79428
34136D082119J93071n74588r94889k77190P77953P82142k00645p35154j58578
34127B894241N37027L64997k07384k14558K51991L87493L5975k38138j38728J22086
34117C795002L36661L50197q4486p79885q70854K1311Q35420L87515p16223q15919
34107B458739K83862J008968M23937n01620n30773J90040P55719P49500K56899
34098E095271m61448q04007k56677N81660M51291o33235j126569k61856P20432
34089C304862N45417k24127m38203k34078k68708j80950N63400J171752O39396
34080D878761k67230J01J179154J507170N16802l87536l25504p6774l72799p26836
$$ plain form
34070 5925309 5300896 4870106 4489364 4524871 5414466 6631126 7114950 6725168 6314682
34061 6314682 6338628 6359563 6082433 5913669 6139473 6368592 6262896 6184430 6605660 7339087
34051 7339087 7837885 7933367 7850810 7757267 7701063 7820368 8224166 8732822 9039525 9118806
34041 9118806 9252149 9636405 10140293 10497005 10617769 10618704 10575794 10393682 10020572 9693587
34031 9693587 9746993 10175445 10668316 11161973 11983282 13160757 13959208 13661550 12710616
34022 12710616 12428910 13390395 14598258 14714479 13768972 13050028 13366975 14109717 14330683
34013 14330683 14147303 14383062 15133990 15639268 15695797 16212427 17797627 19609451 20443951
34004 20443951 20351874 20177534 20022440 19492465 19225930 20556296 23355678 25759198 26699000
$$ packed form
34070E925309o24413m30790l80742L5507Q89595J216660M83824l89782m10486
34061F314682K3946K0935k77130j68764K25804K29119j05696p8466M21230P33427
34051G339087M98798R5482q2557r3543n6204J19305M03798N08656L06703P9281
34041I118806J33343L84256N03888L56712J20764R35m2910j82112l73110l26985
34031I693587N3406M28452M92871M93657Q21309J177475P98451k97658r50934
34022A2710616k81706R61485J207863J16221r45507p18944L16947P42742K20966
34013A4330683j83380K35759P50928N05278N6529N16630J585200J811824Q34500
34004B0443951r2077j74340j55094n29975k66535J330366K799382K403520R39802
$$ plain form
33995 26699000 27288281 28750517 30364988 30879897 30898542 32076750 34438674 36289454 36796059
33986 36796059 37040220 38189799 40024450 41831814 43620851 45719471 47984564 50151661
33978 50151661 52455697 55292045 58589734 61970021 65285145 68696357 72417126 76540738
33970 76540738 80931763 85293048 89615635 94446915 100306485 106977727 113872728 120917378
33962 120917378 128464405 136535303 144911563 153798839 163483704 173449223 182909039 192197256
33954 192197256 202364059 213238952 223333085 232073504 240554499 249298166 256902079
33947 256902079 262158436 266032678 269826194 272509468 271962656 268287103 263716374 259292435
33939 259292435 253695627 245732910 236100080 225979887 215539602 204768702 194433666
$$ packed form
33995B6699000N89281J462236J614471N14909J8645J178208K361924J850780N06605
33986C6796059K44161J149579J834651J807364J789037K098620K265093K167097
33978E0151661K304036K836348L297689L380287L315124L411212L720769M123612
33970G6540738M391025M361285M322587M831280N859570O671242O895001P044650
33962A20917378P547027Q070898Q376260Q887276R684865R965519R459816R288217
33954A92197256J0166803J0874893J0094133Q740419Q480995Q743667P603913
33947B56902079N256357L874242L793516K683274n46812l675553m570729m423939
33939B59292435n596808p962717r632830j0120193j0440285j0770900j0335036
$$ plain form
33932 194433666 185066007 176034230 166744233 157895448 150363770 143550262 136151340 128139957
33924 128139957 120671749 114227369 108161187 102147330 96798672 92478280 88541618 84268500
33916 84268500 79705800 75066604 70130960 64978937 60633251 58002557 56496498 54607398
33908 54607398 51771982 48813210 46530489 44762095 43105916 41691953 40654763 39467842
33900 39467842 37552870 35236990 33400905 32321508 31506351 30590234 29699422 28862128 27768031
33891 27768031 26385555 25233952 24677910 24407482 23960911 23292004 22414148 21014699 19066414
33882 19066414 17420885 16957128 17263358 17010002 15726150 14402462 14059120 14478031 14848359
33873 14848359 15029177 15437739 16019234 16124914 15435954 14411806 13673756 13358944 13222200
$$ packed form
33932A94433666r367659r031777r289997q848785p531678o813508p398922q011383
33924A28139957p468208o444380o066182o013857n348658m320392l936662m273118
33916H4268500m562700m639196m935644n152023m345686k630694j506059j889100
33908E4607398k835416k958772k282721j768394j656179j413963j037190j186921
33900C9467842j914972k315880j836085j079397q15157r16117q90812q37294j094097
33891B7768031j382476j151603n56042k70428m46571o68907q77856j399449j948285
33882A9066414j645529m63757L06230k53356j283852j323688l43342M18911L70328
33873A4848359J80818M08562N81495J05680o88960j024148p38050l14812j36744
$$ plain form
33864 13222200 13011835 12549735 11709838 10544558 9316909 8302646 7664940 7514156 7862032
33855 7862032 8474396 9023681 9446631 9847848 9971560 9221427 7527608 5834600 5248946
33846 5248946 5849835 6750145 7195732 7155455 6929743 6729725 6709384 6905436 6986632 6508996
33836 6508996 5614144 5052439 5267697 5833577 6052421 5741053 5140349 4446518 3832958
33827 3832958 3625136 4003238 4699307 5311754 5693250 5744448 5214242 4189183 3444464
33818 3444464 3677817 4562127 5163115 5174626 5105837 5310624 5527792 5460959 5166043 4708469
33808 4708469 4033539 3376987 3228685 3608916 3882238 3615023 3205894 3330235 4079156
33799 4079156 4956917 5491931 5597529 5493218 5420680 5329818 4893980 4038214 3248177 2954448
$$ packed form
33864A3222200k10365m62100q39897j165280j227649j014263o37706j50784L47876
33855G862032O12364N49285M22950M01217J23712p50133j693819j693008n85654
33846E248946O00889R00310M45587m0277k25712k00018k0341J96052Q1196m77636
33836F508996q94852n61705K15258N65880K18844l11368o00704o93831o13560
33827C832958k07822L78102O96069O12447L81496N1198n30206j025059p44719
33818C444464K33353Q84310O00988J1511o8789K04787K17168o6833k94916m57574
33808D708469o74930o56552j48302L80231K73322k67215m09129J24341P48921
33799D079156Q77761N35014J05598j04311p2538r0862m35838q55766p90037k93729
$$ plain form
33789 2954448 2865359 2527734 2295443 2822396 3653579 3467092 2020204 728095 732899 1424143
33779 1424143 1639404 1391432 1413518 1726191 1775291 1522398 1322330 1061667 475848 58316
33769 58316 546631 1598418 2047162 1522004 841239 702388 925927 1167907 1463758 1785733
33759 1785733 1886469 1906177 2380092 3290341 3824843 3492769 2843689 2628802 2806663 2856919
33749 2856919 2596082 2173165 1640772 1062964 810963 1255336 2217253 3026432 3111198 2446771
33739 2446771 1563136 1135270 1324337 1519088 1058230 206337 -47624 735516 1875066
33730 1875066 2486845 2476281 2294633 2163106 2030022 2047311 2563014 3603280 4648350
33721 4648350 5012876 4406592 3198199 2175690 1918590 2302920 2651813 2380960 1519526
$$ packed form
33789B954448q9089l37625k32291N26953Q31183j86487j446888j292109M804O91244
33779A424143K15261k47972K2086L12673M9100k52893k00068k60663n85819m17532
33769E8316M88315J051787M48744n25158o80765j38851K23539K41980K95851L21975
33759A785733J00736J9708M73915R10249N34502l32074o49080k14887J77861N0256
33749B856919k60837m22917n32393n77808k52001M44373R61917Q09179Q4766o64427
33739B446771q83635m27866J89067J94751m60858q51893k53961P83140J139550
33730A875066O11779j0564j81648j31527j33084J7289N15703J040266J045070
33721D648350L64526o06284j208393j022509k57100L84330L48893k70853q61434
$$ plain form
33712 1519526 754747 974298 2409607 4051315 4374034 3048156 1505982 1275411 2189053
33703 2189053 2940684 2959528 2743384 2606903 2296422 1887511 1876025 2123513 1846659 1045095
33693 1045095 815517 1669537 2584633 2474518 1703081 1283268 1310174 1119971 497235 -144853
33683 -144853 -471251 -444510 -130101 237270 368461 428731 852618 1370266 1092948 14574
33673 14574 -647370 -297986 56782 -326516 -391113 906101 2362240 2045398 377558
33664 377558 -396677 419232 1254955 1041812 591053 692578 806461 521029 613702 1564846
33654 1564846 2413331 2260613 1727148 1690383 1631340 628460 -794740 -1308693 -827666
33645 -827666 -494796 -766304 -826161 -55767 996945 1463915 1230215 823338 713429 962438
$$ packed form
33712A519526p64779K19551J435309J641708L22719j325878j542174k30571R13642
33703B189053P51631J8844k16144j36481l10481m08911j1486K47488k76854q01564
33693A045095k29578Q54020R15096j10115p71437m19813K6906j90203o22736o42088
33683a44853l26398K6741L14409L67371J31191O0270M23887N17648k77318j078374
33673A4574o61944L49384L54768l83298o4597J297214J456139l16842j667840
33664C77558p74235Q15909Q35723k13143m50759J01525J13883k85432R2673R51144
33654A564846Q48485j52718n33465l6765n9043j002880j423200n13953M81027
33645h27666L32870k71508n9857P70394J052712M66970k33700m06877j09909K49009
$$ plain form
33635 962438 1260644 1225941 895215 809208 1292505 1841134 1697109 923708 380882 623934
33625 623934 1343925 2014299 2592687 3279745 3899257 3928136 3148623 2025349 1277385 1117510
33615 1117510 1087195 733847 261078 247371 816808 1429513 1508983 967628 118118 -553566
33605 -553566 -514863 404044 1553849 1898604 1171781 196394 -195186 -103662 -96670 -276484
33595 -276484 -309760 -77836 203043 344920 292156 29722 -303967 -413803 -213914 73983
33585 73983 404179 1053058 1953437 2421820 2083167 1562329 1561673 1693871 1105565 -23366
33575 -23366 -607274 -238855 345548 533900 623140 993747 1330652 1164071 572239 -113554
33565 -113554 -755457 -1122412 -744872 357673 1272618 1181073 443469 73715 385208 819750
$$ packed form
33635I62438K98206l4703l30726q6007M83297N48629j44025p73401n42826K43052
33625F23934P19991O70374N78388O87058O19512K8879p79513j123274p47964j59875
33615A117510l0315l53348m72769j3707N69437O12705P9470n41355q49510o71684
33605e53566L8703R18907J149805L44755p26823r75387l91580R1524O992j79814
33595b76484l3276K31924K80879J41877n2764k62434l33689j09836J99889K87897
33585G3983L30196O48879R00379M68383l38653n20838o56J32198n88306j128931
33575b3366n83908L68419N84403J88352Q9240L70607L36905j66581n91832o85793
33565a13554o41903l66955L77540J102545R14945r1545p37604l69754L11493M34542
$$ plain form
33555 819750 934209 820648 594878 239315 68794 577811 1515590 1828962 1027649 18714
33545 18714 -59091 635102 1077011 1031478 1268315 2082825 2657084 2360318 1815528 1922977
33535 1922977 2427439 2368691 1628528 1024264 879100 502522 -569742 -1627101 -1649933
33526 -1649933 -648811 422776 836886 696012 506516 561223 768079 878946 847334
33517 847334 936939 1326412 1687315 1513195 879304 403319 324590 173050 -358643 -779742
33507 -779742 -525512 123924 435929 252694 46059 137133 423113 749169 998787 905460
33497 905460 352891 -146888 137275 1146258 1932239 1770975 989536 469245 615781
33488 615781 1051294 1151881 684539 -47773 -580623 -724166 -547889 -50010 804005 1636258
$$ packed form
33555H19750J14459j13561k25770l55563j70521N09017R37779L13372q01313j008935
33545A8714p7805O94193M41909m5533K36837Q14510N74259k96766n44790J07449
33535A922977N04462n8748p40163o04264j45164l76578j072264j057359k2832
33526a649933J001122J071587M14110j40874j89496N4707K06856J10867l1612
33517H47334Q9605L89473L60903j74120o33891m75985p8729j51540n31693m21099
33507g79742K54230O49436L12005j83235k06635R1074K85980L26056K49618r3327
33497I05460n52569m99779K84163J008983P85981j61264p81439n20291J46536
33488F15781M35513J00587m67342p32312n32850j43543J76277M97879Q54015Q32253
$$ plain form
33478 1636258 1708355 746981 -610582 -1535072 -1834780 -1701815 -1076226 113206 1347888
33469 1347888 1863000 1541324 928159 464170 238105 330913 742916 1046299 776218 167764
33459 167764 -114229 50738 186867 101171 80675 194387 175020 74786 235154 483194
33449 483194 223868 -458911 -697884 -152585 478756 643924 690192 920773 869654 234204
33439 234204 -350583 -329668 -249339 -787686 -1416587 -1143128 -153991 422831 184978 -190897
33429 -190897 -190475 -45541 -3707 100052 372390 645690 824543 868382 517350 -270727
33419 -270727 -769190 -279691 569476 416090 -752559 -1298059 -263193 1095262 1020487
33410 1020487 -308711 -1202600 -894803 -307264 -353538 -640916 -365000 322770 617392
$$ packed form
33478A636258P2097r61374j357563r24490k99708J32965O25589J189432J234682
33469A347888N15112l21676o13165m63989k26065R2808M12003L03383k70081o08454
33459A67764k81993J64967J36129q5696k0496J13712j9367j00234J60368K48040
33449D83194k59326o82779k38973N45299O31341J65168M6268K30581n1119o35450
33439B34204n84787K0915Q0329n38347o28901K73459R89137N76822k37853l75875
33429a90897M22J44934M1834J03759K72338K73300J78853M3839l51032p88077
33419b70727m98463M89499Q49167j53386j168649n45500J034866J358455p4775
33410A020487j329198q93889L07797N87539m6274k87378K75916O87770K94622
$$ plain form
33401 617392 362534 252782 714825 1256836 1223891 729202 407217 540326 909281 1294913
33391 1294913 1550909 1308636 352473 -633862 -533779 633240 1401229 699038 -683485
33382 -683485 -1212751 -603848 215874 669127 939010 1027267 628495 81018 304880 1401537
33372 1401537 2274432 2149766 1651859 1771456 2455967 2889200 2638586 1867827 850319
33363 850319 -59868 -323377 223100 907644 946534 472737 259821 556207 827320 658038
33353 658038 321989 316935 771976 1455126 2021567 2136506 1659081 840559 124675 -323470
33343 -323470 -704384 -1206906 -1795324 -2381253 -2900737 -3127977 -2719740 -1667447 -529657
33334 -529657 33619 -69516 -323552 -254158 15747 -37896 -633618 -1345355 -1582772 -1286662
$$ packed form
33401F17392k54858j09752M62043N42011l2945m94689l21985J33109L68955L85632
33391A294913K55996k42273r56163r86335J00083J167019P67989p02191j382523
33382f83485n29266O08903Q19722M53253K69883Q8257l98772n47477K23862J096657
33372A401537Q72895j24666m97907J19597O84511M33233k50614p70759j017508
33363H50319r10187k63509N46477O84544L8890m73797k12916K96386K71113j69282
33353F58038l36049n054M55041O83150N66441J14939m77425q18522p15884m48145
33343c23470l80914n02522n88418n85929n19484k27240M08237J052293J137790
33334e29657N63276j03135k54036O9394K69905n3643n95722p11737k37417K96110
$$ plain form
33324 -1286662 -936882 -934413 -1268795 -1806923 -2507399 -3139211 -3155698 -2242970 -825004 329832
33314 329832 891204 1047016 991329 801019 742111 1118937 1680321 1709360 989715 213792
33304 213792 12965 -9690 -653615 -1723370 -2029866 -975509 506712 1035056 375959
33295 375959 -565308 -1062703 -1205015 -1242058 -1009015 -311695 602572 1347727 1841106 2093603
33285 2093603 1924384 1371556 1086475 1667530 2691359 3066758 2414179 1461256 915621
33276 915621 623176 199976 -128006 88310 677512 1039473 1034691 1115049 1580621 2170352
33266 2170352 2442269 2199569 1502878 592692 -150108 -471828 -541159 -720632 -1018304 -1060638
33256 -1060638 -661335 -96687 296571 487902 556345 432942 95042 -215726 -289914 -337465
$$ packed form
33324a286662L49780K469l34382n38128p00476o31812j6487R12728J417966J154836
33314C29832N61372J55812n5687j90310n8908L76826N61384K9039p19645p75923
33304B13792k00827k2655o43925j069755l06496J054357J482221N28344o59097
33295C75959r41267m97395j42312l7043K33043O97320R14267P45155M93379K52497
33285B093603j69219n52828k85081N81055J023829L75399o52579r52923n45635
33276I15621k92445m23200l27982K16316N89202L61961m782Q0358M65572N89731
33266B170352K71917k42700o96691r10186p42800l21720o9331j79473k97672m2334
33256a060638L99303N64648L93258J91331O8443j23403l37900l10768p4188m7551
$$ plain form
33246 -337465 -738275 -1419300 -1806882 -1516186 -854495 -454996 -529345 -663558 -316995 619635
33236 619635 1753096 2547241 2746696 2556397 2412604 2470220 2349815 1607868 505448
33227 505448 10364 771201 2243334 3146666 2769229 1555908 409939 -273710 -737581
33218 -737581 -1269230 -1774874 -1991331 -1953460 -1998266 -2164581 -1834701 -463102 1318198 2002267
33208 2002267 1035282 -271102 -377138 419540 575841 -282904 -856526 -322059 348750
33199 348750 -5715 -870367 -879677 138568 1095664 1296222 1067881 832579 556168 221546
33189 221546 -112 -219456 -743531 -1355946 -1381837 -686871 45039 289662 310528 492834
33179 492834 656826 486516 179382 158681 404672 511497 278075 -69880 -179566 64427
$$ packed form
33246c37465m00810o81025l87582K90696O61691L99499p4349j34213L46563R36630
33236F19635J133461P94145J99455j90299j43793N7616j20405p41947j102420
33227E05448m95084P60837J472133R03332l77437j213321j145969o83649m63871
33218g37581n31649n05644k16457L7871m4806j66315L29880J371599J781300O84069
33208B002267r66985j306384j06036P96678J56301q58745n73622N34467O70809
33199C48750l54465q64652r310J018245R57096K00558k28341k35302k76411l34622
33189B21546k21658k19344n24075o12415k5891O94966P31910K44623K0866J82306
33179D92834J63992j70310l07134k0701K45991J06825k33422l47955j09686K43993
$$ plain form
33169 64427 390487 349601 -131276 -493960 -217496 339007 320329 -360519 -841735 -641941
33159 -641941 -414989 -849636 -1465720 -1297144 -413584 115254 -252847 -811206 -642882 157022
33149 157022 669748 333988 -395981 -619293 -70427 568001 543171 -2115 -312809 -146072
33139 -146072 -14739 -209612 -304646 -42868 -17478 -753474 -1606548 -1490241 -498341 146059
33129 146059 -171183 -651986 -326511 625000 1262276 1118745 561160 199694 359110 974927
33119 974927 1662539 1947134 1665413 1123541 739161 588442 393917 -95707 -746672 -1020406
33109 -1020406 -425118 827975 1754926 1545726 587644 158934 975944 2367984 3046927
33100 3046927 2393861 822894 -784757 -1722797 -1798883 -1397239 -1149577 -1348336 -1745789
$$ packed form
33169F4427L26060m0886m80877l62684K76464N56503j8678o80848m81216J99794
33159f41941K26952m34647o16084J68576Q83560N28838l68101n58359J68324P99904
33149A57022N12726l35760p29969k23312N48866O38428k4830n45286l10694J66737
33139a46072J31333j94873r5034K61778K5390p35996q53074J16307R91900O44400
33129A46059l17242m80803L25475R51511O37276j43531n57585l61466J59416O15817
33119I74927O87612K84595k81721n41872l84380j50719j94525m89624o50965k73734
33109a020406N95288J253093R26951k09200r58082m28710Q17010J392040O78943
33100C046927o53066j570967j607651r38040p6086M01644K47662j98759l97453
$$ plain form
33091 -1745789 -1984527 -1983037 -1761220 -1219404 -410861 207885 209288 -210316 -440033 -256816
33081 -256816 -98900 -465557 -1255554 -1778620 -1350688 40235 1541383 2082814 1458720
33072 1458720 603420 481745 878328 751399 -282678 -1416170 -1764417 -1447399 -1178178
33063 -1178178 -1193691 -1123581 -739396 -309867 -177613 -352635 -605166 -696632 -461352 90124
33053 90124 649074 770310 258632 -674203 -1584721 -1980706 -1477294 -157838 1180445
33044 1180445 1559812 823235 -189414 -656598 -597470 -378786 128490 1217681 2362342
33035 2362342 2445785 1267175 125916 329018 1509221 2094581 1332284 179813 20041
33026 20041 1009229 2052235 2125194 1225583 113601 -488636 -330407 430879 1407685 2093946
$$ packed form
33091a745789k38738J490K21817N41816Q08543O18746J403m19604k29717J83217
33081b56816J57916l66657p89997n23066M27932J390923J501148N41431o24094
33072A458720q55300j21675L96583j26929j034077j133492l48247L17018K69221
33063a178178j5513P0110L84185M29529J32254j75022k52531r1466K35280N51476
33053I0124N58950J21236n11678r32835r10518l95985N03412J319456J338283
33044A180445L79367p36577j012649m67184N9128K18684N07276J089191J144661
33035B362342Q3443j178610j141259K03102J180203N85360p62297j152471j59772
33026B0041R89188J043006P2959q99611j111982o02237J58229P61286R76806O86261
$$ plain form
33016 2093946 2052723 1226834 89860 -638568 -524245 320065 1444685 2405904 2905885
33007 2905885 2821911 2281465 1610819 1051036 610942 323464 421817 933650 1280692 832977
32997 832977 -85684 -373473 341846 955465 258536 -1331272 -2221586 -1715683 -744704
32988 -744704 -359264 -398219 -195289 137309 -16572 -602781 -902739 -642700 -305420 -285950
32978 -285950 -491081 -912488 -1782734 -2811283 -3041865 -2060077 -749362 -159009 -91602
32969 -91602 382818 1343474 1913752 1695313 1336350 1405567 1531548 1152010 503559 242208
32959 242208 418156 439072 -48076 -728654 -1103165 -1044402 -776678 -540544 -444441 -573356
32949 -573356 -1057650 -1873811 -2602541 -2654565 -1917704 -954811 -310995 104009 571157 846345
$$ packed form
33016B093946m1223q25889j136974p28428J14323Q44310J124620R61219M99981
33007B905885q3974n40446o70646n59783m40094k87478R8353N11833L47042m47715
32997H32977r18661k87789P15319O13619o96929j589808q90314N05903R70979
32988g44704L85440l8955K02930L32598j53881n86209k99958K60039L37280J9470
32978b85950k05131m21407q70246j028549k30582R81788J310715N90353O7407
32969i1602M74420R60656N70278k18439l58963O9217J25981l79538o48451k61351
32959B42208J75948K0916m87148o80578l74511N8763K67724K36134R6103j28915
32949e73356m84294q16161p28730n2024P36861R62893O43816M15004M67148K75188
$$ plain form
32939 846345 548456 53803 126413 619438 521317 -410095 -1068581 -627458 200187 370701
32929 370701 178425 623015 1628420 2094022 1530304 553292 -184297 -531959 -349147
32920 -349147 435121 1157182 894437 -149967 -771830 -555568 -411556 -877867 -1109195
32911 -1109195 -361752 598762 658729 114423 54613 539697 687420 300878 122266 458865
32901 458865 731818 578979 348141 183259 -395178 -1517883 -2399365 -2327246 -1597747 -911340
32891 -911340 -402747 109582 401365 131155 -392547 -458046 68538 571160 499369 -110654
32881 -110654 -911064 -1553021 -1702293 -1268303 -753206 -875653 -1609853 -2051848 -1570840 -672416
32871 -672416 -242404 -267033 20440 789659 1156442 375341 -1041289 -1864015 -1540395 -616455
$$ packed form
32939H46345k97889m94653P2610M93025r8121r31412o58486M41123Q27645J70514
32929C70701j92276M44590J005405M65602n63718r77012p37589l47662J82812
32920c49147P84268P22061k62745j044404o21863K16262J44012m66311k31328
32911a109195P47443R60514N9967n44306n9810M85084J47723l86542j78612L36599
32901D58865K72953j52839k30838j64882n78437j122705q81482P2119P29499O86407
32891i11340N08593N12329K91783k70210n23702o5499N26584N02622p1791o10023
32881a10654q00410o41957j49272M33990N15097j22447p34200m41995M81008Q98424
32871f72416M30012k4629K87473P69219L66783p81101j416630q22726L23620R23940
$$ plain form
32861 -616455 83404 263489 167746 176262 496976 1029255 1464701 1644143 1717777 1755668
32851 1755668 1427627 514999 -398459 -396194 490713 1116722 638476 -502826 -1459497 -2235567
32841 -2235567 -3343010 -4587812 -5108019 -4612835 -3789472 -3296737 -3023717 -2632565 -2243822
32832 -2243822 -2146220 -2231206 -2181311 -1973174 -1764696 -1448245 -757051 213064 976413 1249677
32822 1249677 1311769 1622907 2209569 2577112 2262248 1438001 880715 1213462 2187561 2883295
32812 2883295 2697947 1974853 1528660 1706444 2138117 2342943 2300718 2310314 2459786 2461120
32802 2461120 2043727 1358398 835151 665898 609671 385217 74858 -38532 95282 262722
32792 262722 322008 318219 305225 331294 556292 1005610 1194007 508353 -814444 -1610419
$$ packed form
32861f16455O99859J80085r5743Q516L20714N32279M35446J79442P3634L7891
32851A755668l28041r12628r13458K265Q86907O26009m78246j141302r56671p76070
32841b235567j107443j244802n20207M95184Q23363M92735K73020L91152L88743
32832b243822R7602q4986M9895K08137K08478L16451O91194R70115P63349K73264
32822A249677O2092L11138N86662L67543l14864q24247n57286L32747R74099O95734
32812B883295j85348p23094m46193J77784M31673K04826m2225R596J49472J334
32802B461120m17393o85329n23247j69253n6227k24454l10359j13390J33814J67440
32792B62722N9286l789j2994K6069K24998M49318J88397o85654j322797p95975
$$ plain form
32782 -1610419 -1137099 -119153 127471 -608465 -1266081 -995803 -131019 484463 525312
32773 525312 206644 -241376 -675426 -906856 -889675 -864890 -973048 -910374 -343606 495135
32763 495135 1050767 1191505 1276601 1511149 1698414 1698029 1670037 1687750 1499358 921940 196693
32752 196693 -266654 -291218 34800 431781 415871 -379028 -1604732 -2303546 -1951554 -1068937
32742 -1068937 -443325 -144741 192652 508658 471555 308118 655651 1499832 1983784 1508816
32732 1508816 446611 -485452 -1012716 -1171264 -890991 -114281 962135 2025942 2763639
32723 2763639 2751332 1719997 144107 -950824 -1080404 -749097 -569831 -543095 -553971
32714 -553971 -838716 -1344717 -1321061 -375137 622412 655538 159751 398554 1488585 2262384
$$ packed form
32782a610419M73320J017946K46624p35936o57616K70278Q64784O15482M0849
32773E25312l18668m48020m34050k31430J7181K4785j08158O2674N66768Q38741
32763D95135N55632J40738Q5096K34548J87265l85k7992J7713j88392n77418p25247
32752A96693m63347k4564L26018L96981j5910p94899j225704o98814L51992Q82617
32742a068937O25612K98584L37393L16006l7103j63437L47533Q44181M83952m74968
32732A508816j062205r32063n27264j58548K80273P76710J076416J063807P37697
32723B763639j2307j031335j575890j094931j29580L31307J79266K6736j0876
32714e53971k84745n06001K3656R45924R97549L3126m95787K38803J090031P73799
$$ plain form
32704 2262384 2097169 1620197 1338052 830497 -101362 -607545 -19618 868153 772752 -238701
32694 -238701 -856525 -340111 620779 943090 415296 -279617 -416426 93326 694060 780304
32684 780304 374881 126470 497789 1100144 1080091 146073 -987518 -1272234 -433352 651271
32674 651271 848935 117270 -362914 303857 1453960 1698487 787417 -199261 -512690
32665 -512690 -596399 -981277 -1317974 -1155329 -867060 -963673 -1080997 -588320 185444 299826
32655 299826 -392914 -1076802 -1159481 -829096 -411895 44305 405819 352758 -123519 -602945
32645 -602945 -762480 -626632 -290604 141369 365344 161322 -114991 131169 870600 1472511
32635 1472511 1612214 1552574 1465899 1146957 570672 113189 13703 168872 561664 1213420
$$ packed form
32704B262384j65215m76972k82145n07555r31859n06183N87927Q87771r5401j011453
32694b38701o17824N16414R60890L22311n27794o94913j36809N09752O00734Q6244
32684G80304m05423k48411L71319O02355k0053r34018j133591k84716Q38882J084623
32674F51271J97664p31665m80184O66771J150103K44527r11070r86678l13429
32665e12690q3709l84878l36697J62645K88269r6613j17324M92677P73764J14382
32655B99826o92740o83888q2679L30385M17201M56200L61514n3061m76277m79426
32645f02945j59535J35848L36028M31973K23975k04022k76313K46160P39431O01911
32635A472511J39703n9640q6675l18942n76285m57483r9486J55169L92792O51756
$$ plain form
32625 1213420 1589966 917513 -578209 -1607645 -1460916 -860591 -584206 -183684 972039
32616 972039 2157811 2075560 841136 -82286 68254 530629 456781 119956 195054 620837
32606 620837 793971 441809 -201611 -779869 -983391 -620459 91817 507958 186826 -559021
32596 -559021 -1015093 -872358 -453118 -221807 -316865 -552957 -673847 -530734 -122658 431653
32586 431653 941142 1211922 1159782 882476 546045 194202 -185085 -401485 -178334 304316
32576 304316 349157 -372242 -1137602 -944538 123801 932466 782260 224928 124334 496559
32566 496559 734062 530931 50390 -501210 -897438 -752764 -32468 430003 -298233 -1852197
32556 -1852197 -2687198 -1914333 -364700 643972 990865 1475682 2269216 2614382 2108035
$$ packed form
32625A213420L76546o72453j495722j029436J46729O00325K76385M00522J155723
32616I72039J185772q2251j234424r23422J50540M62375p3848l36825P5098M25783
32606F20837J73134l52162o43420n78258k03522L62932P12276M16141l21132p45847
32596e59021m56072J42735M19240K31311r5058k36092j20890J43113M08076N54311
32586D31653N09489K70780n2140k77306l36431l51843l79287k16400K23151M82650
32576C04316M4841p21399p65360J93064J068339Q08665j50206n57332j00594L72225
32566D96559K37503k03131m80541n51600l96228J44674P20296M62471p28236j553964
32556a852197q35001P72865J549633J008672L46893M84817P93534L45166n06347
$$ plain form
32547 2108035 1370491 1061881 945203 513096 43368 265520 1147223 1760966 1469110
32538 1469110 655346 60225 -124322 -185589 -289672 -332973 -192826 174954 717450 1121129
32528 1121129 925480 151482 -429025 -143859 584763 661832 -241881 -1263203 -1531519
32519 -1531519 -1190715 -882691 -741143 -466723 -78033 63946 -121011 -376519 -661265
32510 -661265 -1161216 -1673349 -1615019 -905447 -257625 -208180 -379040 -200512 131794 125807
32500 125807 46443 567183 1421976 1403440 36764 -1560684 -2023559 -1341161 -527656 -178826
32490 -178826 -66810 102794 266190 311533 265062 150290 49980 192942 554713 576284
32480 576284 -152061 -1114541 -1491951 -1439220 -1831009 -2644255 -2665247 -1303143 257602 538260
$$ packed form
32547B108035p37544l08610j16678m32107m69728K22152Q81703O13743k91856
32538A469110q13764n95121j84547o1267j04083m3301J40147L67780N42496M03679
32528A121129j95649p73998n80507K85166P28622P7069r03713j021322k68316
32519a531519L40804L08024J41548K74420L88690J41979j84957k55508k84746
32510f61265m99951n12133N8330P09572O47822M9445j70860J78528L32306n987
32500A25807p9364N20740Q54793j8536j366676j597448m62875O82398Q13505L48830
32490a78826J12016J69604J63396M5343m6471j14772j00310J42962L61771K1571
32480E76284p28345r62480l77410N2731l91789q13246k0992J362104J560745K80658
$$ plain form
32470 538260 -246869 -614480 143520 1273381 1783500 1482171 738919 -18311 -366610
32461 -366610 -76823 481609 589979 93249 -320584 -932 834640 1399469 1204539 409182
32451 409182 -435341 -737570 -173353 1030932 2150817 2522188 2119010 1535200 1393584
32442 1393584 1757673 2079380 1765578 860141 74853 27226 569508 1062176 1179307 1144127
32432 1144127 1224590 1360268 1367581 1200532 857930 282313 -443888 -945214 -807101 1273
32422 1273 1011996 1587585 1443394 912691 605697 731610 913468 780644 477653 331488
32412 331488 295804 137998 -29365 75572 293879 163601 -306525 -565149 -337894 8396
32402 8396 84127 -52685 -252343 -593005 -1062869 -1363978 -1327734 -1147435 -968462 -677478
$$ packed form
32470E38260p85129l67611P58000J129861N10119l01329p43252p57230l48299
32461c66610K89787N58432J08370m96730m13833L19652Q35572N64829j94930p95357
32451D09182q44523l02229N64217J204285J119885L71371m03178n83810j41616
32442A393584L64089L21707l13802r05437p85288m7627N42282M92668J17131l5180
32432A144127Q0463J35678P313j67049l42602n75617p26201n01326J38113Q08374
32422A273J010723N75589j44191n30703l06994J25913J81858j32824l02991j46165
32412C31488l5684j57806j67363J04937K18307j30278m70126k58624K27255L46290
32402H396P5731j36812j99658l40662m69864l01109L6244J80299J78973K90984
$$ plain form
32392 -677478 -324458 -245236 -476774 -608311 -570378 -935474 -1909992 -2652246 -2300639 -1177850
32382 -1177850 -199335 447404 1104083 1497509 965707 -176095 -636050 154748 1230356
32373 1230356 1400065 661619 -137390 -441662 -284235 105567 466479 535118 314972 142179
32363 142179 216895 273416 -50937 -715404 -1341025 -1598613 -1400807 -916567 -513472 -486989
32353 -486989 -762683 -1028063 -1107205 -959419 -469785 320354 909863 850838 503254 586088
32343 586088 983016 856645 102536 -321696 56190 376605 -136088 -846437 -773879 -242185
32333 -242185 -283663 -859164 -937177 -190126 594609 858978 932100 1136189 1209979 928623
32323 928623 465092 -153843 -1138203 -2172316 -2415594 -1710522 -988902 -920780 -914462 -173490
$$ packed form
32392f77478L53020P9222k31538j31537L7933l65096r74518p42254L51607J122789
32382a177850R78515O46739O56679L93426n31802j141802m59955P90798J075608
32373A230356J69709p38446p99009l04272J57427L89802L60912O8639k20146j72793
32363A42179P4716N6521l24353o64467o25621k57588J97806M84240M03095K6483
32353d86989k75694k65380p9142J47786M89634P90139N89509n9025l47584Q2834
32343E86088L96928j26371p54109m24232L77886L20415n12693p10349P2558N31694
32333b42185m1478n75501p8013P47051P84735K64369P3122K04089P3790k81356
32323I28623m63531o18935r84360j034113k43278P05072P21620O8122O318P40972
$$ plain form
32313 -173490 888958 1181969 525718 -184848 -315825 -222378 -543004 -1353657 -2229252 -2786875
32303 -2786875 -2977756 -2998087 -2979136 -2729382 -1918103 -605601 648118 1387588 1717658
32294 1717658 1917666 1894474 1395182 586405 28818 109306 725465 1424647 1683347 1276346
32284 1276346 604736 398564 828602 1229740 1026810 532354 353319 433095 379963 439110
32274 439110 1238781 2580977 3367426 2978318 2031344 1460066 1418115 1445259 1232556 826738
32264 826738 397836 119228 63641 85400 76754 321545 1102871 1940676 1920424 1004313
32254 1004313 250668 285387 308756 -671313 -2204630 -2891103 -2226564 -1099510 -511457
32245 -511457 -542066 -639142 -328305 464525 1330462 1585771 988039 204708 115793 726676
$$ packed form
32313a73490J062448K93011o56251p10566j30977R3447l20626q10653q75595n57623
32303b786875j90881k0331J8951K49754Q11279J312502J253719P39470L30070
32294A717658K00008k3192m99292q08777n57587Q0488O16159O99182K58700m07001
32284A276346o71610k06172M30038M01138k02930m94456j79035P9776n3132N9147
32274D39110P99671J342196P86449l89108r46974n71278m1951K7144k12703m05818
32264H26738m28902k78608n5587K1759q646K44791P81326Q37805k0252r16111
32254A004313p53645L4719K3369r80069j533317o86473O64539J127054N88053
32245e11457l0609r7076L10837P92830Q65937K55309n97732p83331q8915O10883
$$ plain form
32235 726676 1274253 1296046 961429 403311 -502205 -1560132 -2228554 -2427654 -2650316 -2939327
32225 -2939327 -2546908 -1163246 236930 544979 3792 -302782 -84062 -8313 -366930
32216 -366930 -596247 -338295 -95886 -394738 -959362 -1262230 -1407973 -1846527 -2473226 -2658411
32206 -2658411 -2158324 -1481089 -1224855 -1411384 -1622841 -1529326 -1122591 -633309 -373559 -486994
32196 -486994 -693245 -460728 334069 1061288 977894 193317 -372021 -131263 404742 315103
32186 315103 -496114 -1190977 -1130811 -680030 -631877 -1118408 -1490009 -1243646 -682111 -453589
32176 -453589 -684240 -901868 -761382 -463047 -312458 -227104 -13706 134662 -67661 -304071
32166 -304071 107908 1121378 1718031 1140710 -141061 -1172355 -1722810 -2097372 -2177488
$$ packed form
32235G26676N47577K1793l34617n58118r05516j057927o68422j99100k22662k89011
32225b939327L92419J383662J400176L08049n41187l06574K18720P5749l58617
32216c66930k29317K57952K42409k98852n64624l02868j45743m38554o26699j85185
32206b658411N00087O77235K56234j86529k11457R3515M06735M89282K59750j13435
32196d86994k06251K32517P94797P27219q3394p84577n65338K40758N36005q9639
32186C15103q11217o94863O0166M50781M8153m86531l71601K46363N61535K28522
32176d53589k30651k17628J40486K98335J50589Q5354K13398J48368k02323k36410
32166c04071M11979J013470N96653n77321j281771j031294n50455l74562q0116
$$ plain form
32157 -2177488 -1605523 -811522 -826945 -1840964 -2819753 -2928228 -2522801 -2251601 -1975454
32148 -1975454 -1308276 -586180 -400964 -564292 -454375 -156180 -296247 -813432 -912956 -425435
32138 -425435 -228053 -863038 -1578826 -1430136 -729522 -566070 -1172948 -1650814 -1356734 -785352
32128 -785352 -723059 -1085516 -1149084 -677354 -175850 32139 344000 1075266 1595006 1020839
32118 1020839 -305701 -893927 17913 1385628 1742899 1073237 478746 371235 74171
32109 74171 -734437 -1261644 -758748 325921 975569 907463 651160 645019 834588 1015360
32099 1015360 1086322 1023810 961814 1206055 1836625 2401280 2352111 1726778 1075131 758307
32089 758307 649418 533468 482329 708270 1206802 1655777 1682383 1295703 1022528 1382799
$$ packed form
32157b177488N71965P94001j5423j014019r78789j08475M05427K71200K76147
32148a975454O67178P22096J85216j63328J09917K98195j40067n17185r9524M87521
32138d25435J97382o34985p15788J48690P00614J63452o06878m77866K94080N71382
32128g85352O2293l62457o3568M71730N01504K07989L11861P31266N19740n74167
32118A020839j326540n88226R11840J367715L57271o69662n94491j07511k97064
32109G4171q08608n27207N02896J084669O49648o8106k56303o141J89569J80772
32099A015360P0962o2512o1996K44241O30570N64655m9169o25333o51647l16824
32089G58307j08889j15950n1139K25941M98532M48975K6606l86680k73175L60271
$$ plain form
32079 1382799 2180018 2642664 2424727 2055678 2076995 2155977 1601141 490775 -358770 -484832
32069 -484832 -238523 -124290 -246704 -524053 -919657 -1266097 -1302067 -1080246 -947242 -970281
32059 -970281 -833193 -486549 -378794 -708529 -931905 -493210 293090 611171 205506 -400548
32049 -400548 -642100 -445705 -82316 128488 -32332 -525041 -1032651 -1302875 -1416591 -1502938
32039 -1502938 -1376113 -795462 52566 711829 987311 923693 405086 -655735 -1732186
32030 -1732186 -1938362 -1108298 -100215 288461 255091 454606 926659 1085667 600370
32021 600370 -198950 -745688 -702029 -58844 842144 1368912 1049445 86766 -815219 -1236668
32011 -1236668 -1444131 -1904563 -2585972 -2920202 -2432069 -1320289 -371030 -233540 -769072
$$ packed form
32079A382799P97219M62646k17937l69049K1317P8982n54836j110366q49545j26062
32069d84832K46309J14233j22414k77349l95604l46440l5970K21821J33004k3039
32059i70281J37088L46644J07755l29735k23376M38695P86300L18081m05665o06054
32049d00548k41552J96395L63389K10804j60820m92709n07610k70224j13716q6347
32039a502938J26825N80651Q48028O59263K75482o3618n18607j060821j076451
32030a732186k06176Q30064J008083L88676l3370J99515M72053J59008m85297
32021F00370p99320n46738M3659O43185R00988N26768l19467r62679r01985m21449
32011a236668k07463m60432o81409l34230M88133J111780R49259J37490n35532
$$ plain form
32002 -769072 -1237306 -1161997 -785746 -533982 -356961 19021 418697 349426 -205434 -669106
31992 -669106 -667807 -429571 -201546 153021 603249 562897 -301533 -1212288 -995571 384748
31982 384748 1689912 1917258 1350778 888676 880198 1017158 992234 798985 543566 338283
31972 338283 326378 546061 805728 875363 738344 521880 304494 143523 138355 283579
31962 283579 416229 493957 712543 1083682 1129070 398245 -823216 -1738999 -1933232 -1646640
31952 -1646640 -1227796 -799416 -496137 -479368 -537287 -178187 626664 1269269 1358078 1231289
31942 1231289 1231032 1019228 216755 -724856 -1043857 -777320 -544684 -415142 71234 757988
31932 757988 794094 -3711 -689376 -605566 -389956 -870552 -1719664 -2089934 -1993824 -2010672
$$ packed form
32002g69072m68234P5309L76251K51764J77021L75982L99676o9271n54860m63672
31992f69106J299K38236K28025L54567M50228m0352q64430r10755K16717J380319
31982C84748J305164K27346n66480m62102q478J36960k4924j93249k55419k05283
31972C38283j1905K19683K59667O9635j37019k16464k17386j60971n168J45224
31962B83579J32650P7728K18586L71139M5388p30825j221461r15783j94233K86592
31952a646640M18844M28380L03279J6769n7919L59100Q04851O42605Q8809j26789
31942A231289k57k11804q02473r41611l19001K66537K32636J29542M86376O86754
31932G57988L6106p97805o85665Q3810K15610m80596q49112l70270R6110j6848
$$ plain form
31922 -2010672 -2008376 -1334398 -202064 292654 -230074 -845690 -735010 -284700 -242323 -540473
31912 -540473 -640506 -476818 -322711 -87776 520985 1313321 1720422 1534417 1074065 674344
31902 674344 405969 222953 33858 -293725 -723695 -1009197 -1112597 -1377151 -1940445 -2346576
31892 -2346576 -2229052 -2001422 -2206359 -2475023 -1962562 -728532 163006 11578 -793325
31883 -793325 -1517420 -1802085 -1497277 -591623 398775 737888 525045 698523 1579372 2213915
31873 2213915 1746232 686043 61307 -49350 -270616 -718588 -981259 -979885 -898547 -474243
31863 -474243 651850 1950557 2379438 1838773 1301371 1277947 1103573 168803 -992021
31854 -992021 -1473867 -1267090 -1073406 -1216997 -1381548 -1283207 -1072557 -1042863 -1261301 -1552286
$$ packed form
31922b010672K296O73978J132334M94718n22728o15616J10680M50310M2377k98150
31912e40473j00033J63688J54107K34935O08761P92336M07101j86005m60352l99721
31902F74344k68375j83016j89095l27583m29970k85502j03400k64554n63294m06131
31892b346576J17524K27630k04937k68664N12461J234030Q91538j51428q04903
31883g93325p24095k84665L04808R05654R90398L39113k12843J73478Q80849O34543
31873B213915m67683j060189o24736j10657k21266m47972k62671J374Q1338M24304
31863d74243J126093J298707M28881n40665n37402k3424j74374r34770j160824
31854i92021m81846K06777J93684j43591j64551R8341K10650K9694k18438k90985
$$ plain form
31844 -1552286 -1720543 -1778122 -1912258 -2118163 -2023538 -1408420 -764547 -808499 -1431383 -1754408
31834 -1754408 -1372040 -840420 -606198 -204463 846096 1938381 2008611 992696 -159191
31825 -159191 -813172 -1204804 -1612600 -1761575 -1369331 -738570 -405917 -499938 -748382 -901226
31815 -901226 -886377 -701345 -390724 -81005 105626 164281 197889 319512 527017 628156
31805 628156 413505 25434 -31617 489219 1092944 1047116 329482 -328371 -387714 -71652
31795 -71652 153125 232427 369094 546729 601381 585271 662225 708941 397750 -289074 -958803
31784 -958803 -1334891 -1601557 -2021205 -2412405 -2308504 -1604505 -766013 -290219 -168635 -75259
31774 -75259 59283 -29973 -422821 -733937 -572120 -109506 92750 -171734 -417399 -11924
$$ packed form
31844a552286j68257n7579j34136k05905R4625O15118O43873m3952o22884l23025
31834a754408L82368N31620K34222M01735J050559J092285P0230j015915j151887
31825a59191o53981l91632m07796j48975L92244O30761L32653r4021k48444j52844
31815i01226J4849J85032L10621L09719J86631N8655L3608J21623K07505J01139
31805F28156k14651l88071n7051N20836O03725m5828p17634o57853n9343L16062
31795g1652K24777P9302J36667J77635N4652j6110P6954M6716l11191o86824o69729
31784i58803l76088k66666m19648l91200J03901P03999Q38492M75794J21584R3376
31774g5259J34542q9256l92848l11116J61817M62614K02256k64484k45665M05475
$$ plain form
31764 -11924 997602 1733080 1291773 -229475 -1643328 -1816847 -850782 174055 579212
31755 579212 705455 983387 1058566 449283 -393657 -560880 -79668 86876 -450327 -925188
31745 -925188 -704182 -269098 -298976 -536982 -413118 -201650 -503921 -920868 -473748 619798
31735 619798 860348 -381676 -1729165 -1616141 -434921 148841 -443783 -1156558 -1024210
31726 -1024210 -360993 56447 106289 93570 10393 -357199 -906978 -1341131 -1605239 -1757474
31716 -1757474 -1629546 -1146065 -794216 -1098088 -1630418 -1309215 61964 1273880 1247128
31707 1247128 497631 330393 963927 1407135 1132958 811730 1012572 1134713 411830
31698 411830 -653095 -858494 -64338 652864 677807 658695 1201829 1665583 1056193 -399769
$$ packed form
31764a1924J009526P35478m41307j521248j413853j73519R66065J024837M05157
31755E79212J26243K77932P5179o09283q42940j67223M81212J66544n37203m74861
31745i25188K21006M35084k9878k38006J23864K11468l02271m16947M47120J093546
31735F19798K40550j242024j347489J13024J181220N83762n92624p12775J32348
31726a024210O63217M17440M9842j2719q3177l67592n49779m34153k64108j52235
31716a757474J27928M83481L51849l03872n32330L21203J371179J211916k6752
31707A247128p49497j67238O33534M43208k74177l21228K00842J22141p22883
31698D11830j064925k05399P94156P17202K4943j9112N43134M63754o09390j455962
$$ plain form
31688 -399769 -1469277 -1492692 -924683 -351208 181700 687156 891515 778640 865027 1442498
31678 1442498 2013013 1966589 1401418 748522 19213 -893792 -1524831 -1314366 -657530 -568001
31668 -568001 -1208473 -1644092 -1323158 -932451 -1282652 -2072810 -2424271 -2128507 -1675193 -1392849
31658 -1392849 -1231596 -1170455 -1226983 -1212324 -985430 -758253 -686761 -492934 -79986 -91829
31648 -91829 -978632 -1807763 -1147021 837324 2332965 2230219 1400733 1119382 1301352
31639 1301352 1129763 539578 28608 -407932 -1044450 -1489328 -1112021 -280575 -81782
31630 -81782 -717872 -1184261 -801358 -166372 -160190 -740861 -1235638 -1279264 -936307 -305508
31620 -305508 458557 966997 892845 344457 -306349 -793451 -980116 -812826 -500938 -443761
$$ packed form
31688c99769j069508k3415N68009N73475N32908N05456K04359j12875Q6387N77471
31678A442498N70515m6424n65171o52896p29309r13005o31039K10465O56836Q9529
31668e68001o40472m35619L20934L90707l50201p90158l51461K95764M53314K82344
31658a392849J61253O1141n6528J4659K26894K27177P1492J93827M12948j1843
31648i1829q86803q29131O60742J984345J495641j02746q29486k81351J81970
31639A301352j71589n90185n10970m36540o36518m44878L77307Q31446J98793
31630h1782o36090m66389L82903O34986O182n80671m94777m3626L42957O30799
31620c05508P64065N08440p4152n48388o50806m87102j86665J67290L11888N7177
$$ plain form
31610 -443761 -699741 -832835 -581507 -307866 -363987 -393170 115617 796561 677500 -451634
31600 -451634 -1592222 -1701259 -820692 222366 817320 907836 627473 47535 -736716
31591 -736716 -1525647 -2045623 -2008672 -1317496 -363422 93169 -354052 -1221463 -1615136 -1249098
31581 -1249098 -690834 -514497 -539212 -187600 591112 1165646 1047791 518713 194818 199934
31571 199934 112531 -345087 -948906 -1373434 -1590680 -1675306 -1511172 -999995 -399846 -139821
31561 -139821 -338285 -721372 -959537 -903787 -605966 -327707 -397501 -797310 -1037357 -753171
31551 -753171 -255591 -78076 -146016 45403 500280 648330 288159 -125285 -383656 -949921
31541 -949921 -2016570 -2854310 -2782749 -2231676 -2027431 -2035436 -1447642 -229365 692751 737807
$$ packed form
31610d43761k55980j33094K51328K73641n6121k9183N08787O80944j19061j129134
31600d51634j140588j09037Q80567J043058N94954R0516k80363n79938p84251
31591g36716p88931n19976L6951O91176R54074M56591m47221q67411l93673L66038
31581a249098N58264J76337k4715L51612P78712N74534j17855n29078l23895N116
31571A99934q7403m57618o03819m24528k17246q4626J64134N11177O00149K60025
31561a39821j98464l83087k38165N5750K97821K78259o9794l99809k40047K84186
31551g53171M97580J77515o7940J91419M54877J48050l60171m13444k58371n66265
31541i49921j066649q37740P1561N51073K04245q005N87794J218277R22116M5056
$$ plain form
31531 737807 298291 -91833 -389644 -566214 -275425 538805 1265663 1313826 779128 119354
31521 119354 -379245 -504199 -21072 883837 1511083 1451792 1084025 851447 545529 -126590
31511 -126590 -734949 -642470 -44259 288091 161310 90381 297662 343946 -103640 -778982
31501 -778982 -1283541 -1502946 -1378973 -798531 43219 619621 672163 468340 267989 -54368
31491 -54368 -594393 -1009051 -874587 -236201 463672 846194 836812 667271 768450 1385717
31481 1385717 2130789 2205774 1307900 75792 -616178 -625278 -547070 -871734 -1395281 -1515476
31471 -1515476 -1010084 -403597 -404700 -979339 -1329994 -1013449 -625386 -862764 -1342657 -1194466
31461 -1194466 -577789 -507850 -1093243 -1162983 -100144 1105963 1385737 1140312 1268781
$$ packed form
31531G37807m39516l90124k97811j76570K90789Q14230P26858M8163n34698o59774
31521A19354m98599j24954M83127R04909O27246n9291l67767k32578l05918o72119
31511a26590o08359R2479N98211L32350j26781p0929K07281M6284m47586o75342
31501g78982n04559k19405J23973N80442Q41750N76402N2542k03823k00351l22357
31491e4368n40025m14658J34464O38386O99873L82522r382j69541J01179O17267
31481A385717P45072P4985q97874j232108o91970r100P8208l24664n23547j20195
31471a515476N05392O06487j103n74639l50655L16545L88063k37378m79893J48191
31461a194466O16677O9939n85393o9740J062839J206107K79774k45425J28469
$$ plain form
31452 1268781 1503110 976458 -78241 -560024 -243270 -4269 -279410 -508940 -320213
31443 -320213 -121992 -132628 159592 1017189 1768715 1715955 1083662 496964 88578 -288329
31433 -288329 -472008 -267936 45569 90337 -656 121802 375966 436845 353517 421111
31423 421111 584259 528622 297020 262477 472642 556102 403242 451410 1034014 1794307
31413 1794307 2075718 1723001 1179421 810262 410351 -445673 -1664137 -2494175 -2278424
31404 -2278424 -1231572 -255335 22787 -180336 -246311 46335 327734 156811 -393091
31395 -393091 -703733 -224876 831405 1555742 1288019 366106 -344300 -536053 -662925
31386 -662925 -1082845 -1506613 -1480153 -1004309 -415931 57584 400284 701802 1106321 1618424
$$ packed form
31452A268781K34329n26652j054699m81783L16754K39001k75141k29530J88727
31443c20213J98221j0636K92220Q57597P51526n2760o32293n86698m08386l76907
31433b88329j83679K04072L13505M4768r0993J22458K54164O0879q3328O7594
31423D21111J63148n5637k31602l4543K10165Q3460j52860M8168N82604P60293
31413A794307K81411l52717n43580l69159l99911q56024j218464q30038K15751
31404b278424J046852R76237K78122k03123o5975K92646K81399j70923n49902
31395c93091l10642M78857J056281P24337k67723r21913p10406j91753j26872
31386f62925m19920m23768K6460M75844N88378M73515L42700L01518M04519N12103
$$ plain form
31376 1618424 1875311 1468801 614297 69233 188858 510867 514725 286373 98147 -127436
31366 -127436 -465261 -605475 -395730 -314041 -743517 -1183925 -967428 -452570 -604891 -1516456
31356 -1516456 -2282029 -2403456 -2382756 -2656458 -2785815 -2173105 -987630 76604 537597
31347 537597 285409 -536727 -1441299 -1797513 -1512352 -1168273 -1148265 -1044058 -397382 354683
31337 354683 334850 -483378 -1071309 -580317 647147 1539792 1526480 1044072 894274 1337271
31327 1337271 1930833 2128489 1802287 1165622 481956 39422 135702 733749 1268757 1158678
31317 1158678 447604 -352346 -917650 -1240161 -1276327 -994579 -700149 -750694 -960748 -873530
31307 -873530 -610852 -738457 -1191497 -1148997 -270653 719997 1094616 1017083 896416 619706
$$ packed form
31376A618424K56887m06510q54504n45064J19625L22009L858k28352j88226k25583
31366a27436l37825j40214K09745Q1689m29476m40408K16497N14858j52321r11565
31356a516456p65573j21427K0700k73702j29357O12710J185475J064234M60993
31347E37597k52188q22136r04572l56214K85161L44079K0008J04207O46676P52065
31337C54683j9833q18228n87931M90992J227464Q92645j3312m82408j49798M42997
31327A337271N93562J97656l26202o36665o83666m42534R6280N98047N35008j10079
31317A158678p11074p99950n65304l22511l6166K81748K94430n0545k10054Q7218
31307h73530K62678j27605m53040M2500Q78344R90650L74619p7533j20667k76710
$$ plain form
31297 619706 107194 -60182 587380 1506942 1850726 1645867 1404334 987806 -82734
31288 -82734 -1414035 -1961829 -1495027 -845331 -605317 -544355 -467014 -628870 -967618 -886147
31278 -886147 -284340 40915 -419779 -1069331 -1181801 -974517 -975161 -979681 -565730 -199205
31268 -199205 -773749 -2138572 -3033035 -2650824 -1549486 -775848 -665585 -794334 -682170
31259 -682170 -230453 283205 424878 20453 -507429 -443106 425418 1506006 2039150 1834816
31249 1834816 1213919 458874 -353522 -1070704 -1413977 -1340614 -1172374 -1144898 -1046182 -604018
31239 -604018 -55830 118197 -28121 2057 138197 -434477 -1921940 -3058701 -2489432
31230 -2489432 -666052 629345 524695 -246506 -890812 -1480617 -1913124 -1308186 577395
$$ packed form
31297F19706n12512j67376O47562R19562L43784k04859k41533m16528j070540
31288h2734j331301n47794M66802O49696K40014O0962P7341j61856l38748Q1471
31278h86147O01807L25255m60694o49552j12470K07284o44m520M13951L66525
31268a99205n74544j364823q94463L82211J101338P73638J10263j28749J12164
31259f82170M51717N13658J41673m04425n27882O4323Q68524J080588N33144k04334
31249A834816o20897p55045q12396p17182l43273P3363J68240K7476R8716M42164
31239f04018N48188J74027j46318L0178J36140n72674j487463j136761N69269
31230b489432J823380J295397j04650p71201o44306n89805m32507O04938J885581
$$ plain form
31221 577395 2341483 2545411 1672221 1255443 1566264 1552913 834816 252909 297169 392589
31211 392589 152985 79744 431780 546903 32067 -389557 -102073 238311 -183734 -802116
31201 -802116 -484621 554211 963004 248916 -671436 -1008935 -1034898 -1182352 -1252773 -996283
31191 -996283 -634099 -269075 485484 1693755 2573207 2478586 1884364 1633771 1637400 1185805
31181 1185805 308947 -124852 305022 1035980 1451212 1581603 1594121 1309054 704757 323151
31171 323151 566092 961105 743134 -63248 -748903 -980052 -1129691 -1523104 -1928864 -1979621
31161 -1979621 -1676584 -1289673 -1076238 -1208554 -1633565 -1909869 -1587179 -868547 -419990
31152 -419990 -341116 73630 1154730 2054584 1801580 730455 29681 70751 109481 -306262
$$ packed form
31221E77395J764088K03928q73190m16778L10821j3351p18097n81907M4260R5420
31211C92589k39604p3241L52036J15123n14836m21624K87484L40384m22045o18382
31201h02116L17495J038832M08793p14088r20352l37499k5963j47454p0421K56490
31191i96283L62184L65024P54559J208271Q79452r4621n94222k50593L629m51595
31181A185805q76858m33799M29874P30958M15232J30391J2518k85067o04297l81606
31171C23151K42941L95013k17971q06382o85655k31149j49639l93413m05760n0757
31161a979621L03037L86911K13435j32316m25011k76304L22690P18632M48557
31152d19990P8874M14746J081100Q99854k53004j071125p00774M1070L8730m15743
$$ plain form
31142 -306262 -585807 -127985 669019 1022691 904627 938511 1394430 1825164 1668227 897110
31132 897110 123624 178864 1339328 2788416 3212823 2250899 983539 582766 868811
31123 868811 790136 3510 -819939 -1174208 -1347324 -1685571 -1985518 -1985555 -1846864 -1685952
31113 -1685952 -1152515 -62727 912546 886291 -28212 -770615 -646200 -21830 433837
31104 433837 633884 820541 865046 428496 -278166 -518186 -38983 399303 -70604 -1216581
31094 -1216581 -1887616 -1364724 -69750 1139800 1870283 2137147 1913573 1233964 466347
31085 466347 -53163 -511498 -1230213 -1922989 -1987786 -1553484 -1493445 -2121509 -2561677 -1936819
$$ packed form
31142c06262k79545M57822P97004L53672j18064L3884M55919M30734j56937p71117
31132H97110p73486N5240J160464J449088M24407r61924j267360m00773K86045
31123H68811p8675p86626q23449l54269j73116l38247k99947l7J38691J60912
31113a685952N33437J089788R75273k6255r14503p42403J24415O24370M55667
31104D33837K00047J86657M4505m36550p06662k40020M79203M38286m69907j145977
31094a216581o71035N22892J294974J209550P30483K66864k23574o79609p67617
31085D66347n19510m58335p18715o92776o4797M34302O0039o28064m40168O24858
$$ [...]
##END NTUPLES=NMR SPECTRUM
##END=
