##TITLE=31Pdec_LY-TMF-10.24.R.t
 D2O, 24 sc
 6.3.2020
##JCAMPDX= 6.0         $$ Bruker NMR JCAMP-DX V2.0
##DATA TYPE= NMR SPECTRUM
##DATA CLASS= NTUPLES
##ORIGIN= UXNMR, Bruker Analytische Messtechnik GmbH
##OWNER= root
$$ XWIN-NMR		Version 3.5
$$ Fri Mar  6 17:03:41 2020 Russian Standard Time (UT+4h)  she@DPX200
##.OBSERVE FREQUENCY= 81.013821
##.OBSERVE NUCLEUS= ^31P
##.ACQUISITION MODE= SIMULTANEOUS
##.ACQUISITION SCHEME= undefined
##.AVERAGES= 24
##.DIGITISER RES= 17
##SPECTROMETER/DATA SYSTEM= spect
##.PULSE SEQUENCE= zgpg30
##.SOLVENT NAME= CDCl3
##.SHIFT REFERENCE= (INTERNAL, CDCl3, 0, 182.463)
##AUDIT TRAIL= $$ (NUMBER, WHEN, WHO, WHERE, WHAT)
$$ ##TITLE= Audit trail, XWIN-NMR		Version 3.5
$$ ##JCAMPDX= 5.01
$$ ##ORIGIN= Bruker BioSpin GmbH
$$ ##OWNER= she
$$ F:/spectra/data/she/nmr/P31/1/pdata/1/auditp.txt
$$ ##AUDIT TRAIL=  $$ (NUMBER, WHEN, WHO, WHERE, WHAT)
(   1,<2020-03-06 17:01:29.81 +0400>,<she>,<DPX200>,
      <created by zg, POWCHK disabled, PULCHK disabled
       configuration hash MD5:
       00 E9 B6 7A A2 85 ED C7 34 08 36 98 17 FE 4E 26
       data hash MD5: 32K
       C1 AE EF 45 C3 BE 1D 48 D7 9B EB B2 D3 0A DD E8>)
(   2,<2020-03-06 17:01:32.40 +0400>,<she>,<DPX200>,
      <Start of raw data processing
       efp BC_mod = 2 LB = 1 FT_mod = 6 PKNL = 1 PHC0 = -1359.278 PHC1 = 150.6017 SI = 64K 
       data hash MD5: 64K
       63 34 8C F0 4C 04 CA 04 44 20 4A 8A 6D 64 77 5B>)
(   3,<2020-03-06 17:01:50.73 +0400>,<she>,<DPX200>,
      <pk PHC0 = 2.066208 PHC1 = 0 
       data hash MD5: 64K
       9B C3 F6 5B 67 53 2F A5 5C AF A1 D3 74 2B 1B 80>)
$$ ##END=
$$ 
$$ hash MD5
$$ FE 34 F9 11 9F 87 67 5A AA 98 DB 7B 80 48 65 D8
##$RELAX= 
##$RELAX= 
##$RELAX= 
##$RELAX= 
##$RELAX= 
##$RELAX= 
##$RELAX= 
##$RELAX= 
$$ Bruker specific parameters
$$ --------------------------
##$DU= <F:/spectra>
##$EXPNO= 1
##$NAME= <P31>
##$PROCNO= 1
##$TYPE= <nmr>
##$USER= <she>
##$AMP= (0..31)
100 100 100 100 100 100 100 100 100 100 100 100 100 100 100 100 100 100 
100 100 100 100 100 100 100 100 100 100 100 100 100 100 
##$AQSEQ= 0
##$AQ_mod= 1
##$AUNM= <au_zg>
##$AUTOPOS= <>
##$BF1= 81.014009
##$BF2= 200.13
##$BF3= 200.13
##$BF4= 200.13
##$BF5= 200.13
##$BF6= 200.13
##$BF7= 200.13
##$BF8= 200.13
##$BYTORDA= 1
##$CFDGTYP= 0
##$CFRGTYP= 5
##$CHEMSTR= <none>
##$CNST= (0..31)
1 1 145 1 1 1 1 1 1 1 1 1 1 1 1 1 1 1 1 1 1 1 1 1 1 1 1 1 1 1 1 1 
##$CPDPRG= <waltz16>
##$CPDPRG1= <>
##$CPDPRG2= <waltz16>
##$CPDPRG3= <>
##$CPDPRG4= <mlev>
##$CPDPRG5= <mlev>
##$CPDPRG6= <mlev>
##$CPDPRG7= <mlev>
##$CPDPRG8= <mlev>
##$CPDPRGB= <>
##$CPDPRGT= <>
##$D= (0..31)
0 1 0 0 0 0 0 0 0 0 0 0.03 2e-05 3e-06 0 0 0 0 0 0 0 0 0 0 0 0 0 0 0 0 
0 0 
##$DATE= 1583499689
##$DBL= (0..7)
120 120 120 11 120 120 24 19 
##$DBP= (0..7)
150 150 150 150 150 150 150 150 
##$DBP07= 0
##$DBPNAM0= <>
##$DBPNAM1= <>
##$DBPNAM2= <>
##$DBPNAM3= <>
##$DBPNAM4= <>
##$DBPNAM5= <>
##$DBPNAM6= <>
##$DBPNAM7= <>
##$DBPOAL= (0..7)
0.5 0.5 0.5 0.5 0.5 0.5 0.5 0.5 
##$DBPOFFS= (0..7)
$$ [...]
##$SUBNAM2= <"">
##$SUBNAM3= <"">
##$SUBNAM4= <"">
##$SUBNAM5= <"">
##$SUBNAM6= <"">
##$SUBNAM7= <"">
##$SUBNAM8= <"">
##$SUBNAM9= <"">
##$SW= 369.568048894756
##$SWIBOX= (0..15)
0 1 3 0 0 0 0 0 0 0 0 0 0 0 0 0 
##$SW_h= 29940.119760479
##$TD= 32768
##$TD0= 1
##$TE= 0
##$TE2= 300
##$TE3= 300
##$TEG= 300
##$TL= (0..7)
0 120 53 12 22 120 120 120 
##$TP= (0..7)
150 150 150 150 150 150 150 150 
##$TP07= 0
##$TPNAME0= <>
##$TPNAME1= <>
##$TPNAME2= <>
##$TPNAME3= <>
##$TPNAME4= <>
##$TPNAME5= <>
##$TPNAME6= <>
##$TPNAME7= <>
##$TPOAL= (0..7)
0.5 0.5 0.5 0.5 0.5 0.5 0.5 0.5 
##$TPOFFS= (0..7)
0 0 0 0 0 0 0 0 
##$TUNHIN= 0
##$TUNHOUT= 0
##$TUNXOUT= 0
##$USERA1= <user>
##$USERA2= <user>
##$USERA3= <user>
##$USERA4= <user>
##$USERA5= <user>
##$V9= 5
##$VALIST= <valist>
##$VCLIST= <CCCCCCCCCCCCCCC>
##$VD= 0
##$VDLIST= <DDDDDDDDDDDDDDD>
##$VPLIST= <PPPPPPPPPPPPPPP>
##$VTLIST= <TTTTTTTTTTTTTTT>
##$WBST= 1024
##$WBSW= 4
##$XGAIN= (0..3)
0 0 0 0 
##$XL= 0
##$YL= 0
##$YMAX_a= 12949
##$YMIN_a= -12809
##$ZGOPTNS= <>
##$ZL1= 120
##$ZL2= 120
##$ZL3= 120
##$ZL4= 120
##$ABSF1= 0
##$ABSF2= 0
##$ABSG= 0
##$ABSL= 0
##$ALPHA= 0
##$AQORDER= 0
##$ASSFAC= 0
##$ASSFACI= 0
##$ASSFACX= 0
##$ASSWID= 0
##$AUNMP= <proc_1d>
##$AZFE= 0.1
##$AZFW= 0.5
##$BCFW= 0
##$BC_mod= 2
##$BYTORDP= 0
##$COROFFS= 0
##$CY= -3
##$DATMOD= 1
##$DC= 0
##$DFILT= <>
##$DTYPP= 0
##$F1P= 0
##$F2P= 0
##$FCOR= 1
##$FTSIZE= 65536
##$FT_mod= 6
##$GAMMA= 0
##$GB= 0
##$INTBC= 1
##$INTSCL= 5.30512e-09
##$ISEN= 30
##$LB= 1
##$LEV0= 0
##$LPBIN= 0
##$MAXI= 10000
##$MC2= 0
##$MEAN= 0
##$ME_mod= 0
##$MI= 50
##$NCOEF= 0
##$NC_proc= -6
##$NLEV= 6
##$NOISF1= 182.463
##$NOISF2= 159.3651
##$NSP= 0
##$NTH_PI= 0
##$NZP= 0
##$OFFSET= 182.463
##$PC= 4
##$PHC0= -1357.212
##$PHC1= 150.6017
##$PH_mod= 1
##$PKNL= yes
##$PPARMOD= 0
##$PSCAL= 0
##$PSIGN= 0
##$REVERSE= no
##$SF= 81.0140089999434
##$SI= 65536
##$SIGF1= 159.3651
##$SIGF2= -187.1042
##$SINO= 113.3802
##$SIOLD= 16384
##$SREGLST= <1H.CDCl3>
##$SSB= 0
##$STSI= 65536
##$STSR= 0
##$SW_p= 29940.119760479
##$SYMM= 0
##$S_DEV= 0
##$TDeff= 32768
##$TDoff= 0
##$TI= <>
##$TILT= no
##$TM1= 0
##$TM2= 0
##$TOPLEV= 0
##$USERP1= <user>
##$USERP2= <user>
##$USERP3= <user>
##$USERP4= <user>
##$USERP5= <user>
##$WDW= 1
##$XDIM= 65536
##$YMAX_p= 409401704
##$YMIN_p= -40989368
$$ End of Bruker specific parameters
$$ ---------------------------------
##NTUPLES= NMR SPECTRUM
##VAR_NAME=  FREQUENCY,     SPECTRUM/REAL,   SPECTRUM/IMAG
##SYMBOL=    X,             R,               I
##VAR_TYPE=  INDEPENDENT,   DEPENDENT,       DEPENDENT
##VAR_FORM=  AFFN,          ASDF,            ASDF
##VAR_DIM=   65536,         65536,           65536
##UNITS=     HZ,            ARBITRARY UNITS, ARBITRARY UNITS
##FACTOR=    0.456856943014862, 1,           1
##FIRST=     14782.0589164792, 0,            0
##LAST=      -15158.0608439998, 0,           0
##MIN=       -15158.0608439998, -40989368,   0
##MAX=       14782.0589164792, 409401704,    0
$$ Real data points
##PAGE= N=1
##DATA TABLE= (X++(R..R)), XYDATA
$$ [...]
36640A581318M93239J03765m67969p76618j014928j393539j292920l851J758014
36631a013489K111320L29291j793331j844070J28470J561926P47815r01382r43238
36622a616688O07251J467161N32860p19462q15209m71674r28246j497629o70798
36613d112434J061824J624594N57300k87159K47661R12626L94134m48945k81122
36604c31521K33198k80139j100640l73529J407414J562698n91980k301281j376042
36595c151822O12828J020800J65755K12126J201552J079906n58298j566834o49347
36586a633334P15875P42524k15779q64665r88183r50674n15764M50910J146908
36577b112182R87471O34893O87322M67092m84101r22817K35544J582630R83474
$$ y = [1581318, 2074557, 2178322, 1710353, 933735, -81193, -1474732, -2767652, -2771503, -1013489, 1097831, 1427122, -366209, -2210279, -2081809, -519883, 227932, -673450, -1616688, -1009437, 457724, 990584, 271122, -544087, -1015761, -1944007, -3441636, -4112434, -3050610, -1426016, -868716, -1155875, -908214, 4412, 398546, -50399, -331521, -98323, -378462, -1479102, -1852631, -445217, 1117481, 525501, -1775780, -3151822, -2538994, -1518194, -1352439, -1140313, 61239, 1141145, 582847, -983987, -1633334, -917459, -174935, -390714, -1255379, -2243562, -3194236, -3710000, -3259090, -2112182, -1124711, -489818, 197504, 664596, 180495, -742322, -506778, 1075852, 2059326]
36568B059326r15713j421804O0423J201490N34083m60768j32358P06693N25193
36559B156565k73688l56850J4470n02297j775111k050934n02735J505798K142583
36550C57801J196215k526k44094L36317N60120l66679j786150k213014j057002
36541c219012O95108J627913J245771O8774r85165j104054j71055Q38108P48043
36532b55569k29653o32057J82906J129334J126857N96581L53564J53835m34965
36523A990833p16826N4071J001555P28244l42367n09876M59941R80006K26466
36514C872047p16745q22647n92444p76871j038498q48746n79038p04790q47877
36505c055609n33826m0412L75472J129637K167821K210095N30909j337472j365929
$$ y = [2059326, 1143613, -278191, -217768, 983722, 1517805, 1057037, 924679, 1631372, 2156565, 1882877, 1526027, 1540497, 1038200, -736911, -2787845, -3290580, -1784782, 357801, 1554016, 1551490, 1307396, 1643713, 2203833, 1837154, 51004, -2162010, -3219012, -2523904, -895991, 349780, 418554, -566611, -1670665, -1841720, -1003612, -255569, -485222, -1117279, -934373, 194961, 1321818, 1918399, 2271963, 2425798, 1990833, 1274007, 1328078, 2329633, 3057877, 2715510, 2205634, 2665575, 3645581, 3872047, 3155302, 2332655, 1740211, 963340, -75158, -923904, -1502942, -2207732, -3055609, -3589435, -3629847, -3254375, -2124738, 43083, 2253178, 2784087, 1446615, 80686]
36496H0686L093N17086l82711p86051M77004J849091J412521l04330j384861j301577
36486A79951r42769n47745M54084J619010J440352k80855j585927q63521R21808
36477C94388J607827O11967q44377j659898j672196q98583N74387J854592J762558
36468A730665M95127l82276j25795J39619o50183j577951r98446Q45804J865647
36459A342211Q70150q55727j228989K9414J146730N52770j161188j928715p27357
36450a960701J213747K080866J664135R84935L03622r57849k311368k120028j87132
36441a289773J342815R40483p2068P1609N12271n02330j964910j267074J261353
36432i67624K279948N52441j050185r2360J770965J822573N49039J27784L99709
$$ y = [80686, 83779, 600865, 218154, -567897, -90893, 1758198, 3170719, 2866389, 1481528, 179951, -762818, -1310563, -856479, 762531, 2202883, 1922028, 336101, -527420, 394388, 2002215, 2614182, 1769805, 109907, -1562289, -2460872, -1886485, -31893, 1730665, 2225792, 1843516, 1717721, 1857340, 1207157, -370794, -1369240, -523436, 1342211, 2212361, 1356634, 127645, 157059, 1303789, 1856559, 695371, -1233344, -1960701, -746954, 1333912, 2998047, 3982982, 4286604, 3328755, 1017387, -1102641, -1289773, 53042, 993525, 921457, 993066, 1505337, 1003007, -961903, -2228977, -967624, 1312324, 1864765, 814580, 722220, 2493185, 4315758, 4864797, 4992581, 5392290]
36423E392290m45095k032595j987124j8939J194699q554j896209k065858n64663
36414b432048R72484J688743J665023R78206n5797o13754m54545m06618q26358
36405E15336o98892N21620J366997L01799j660748k161352q00374O77536J217297
36396g20781J395477J465524O74804q32330j443506m59008O13671L37561n34239
36387D97173n59592N9054J99779j25368j06075J92002J33073n4118K21283M54051
36377I11262j68459q94371k86806J124558J193213n36805j969399j565865l32210
36368b524882K50132L98372Q44992J116441N32616l48248p90274j206066j866998
36359c593915j547650N67899K648113K272488K28308l39730J329434K404029Q82053
$$ y = [5392290, 4947195, 2914600, 927476, 908537, 2103236, 2094682, 198473, -1867385, -2432048, -1459564, 229179, 1894202, 2872408, 2816611, 2202857, 1748312, 1341694, 515336, -183556, 338064, 1705061, 2006860, 346112, -1815240, -2615614, -1938078, -720781, 674696, 2140220, 2815024, 1982694, 539188, 80180, 693851, 1031412, 497173, -62419, -3365, 196414, 71046, -35029, 156973, 290046, 235928, 457211, 911262, 742803, -151568, -438374, 686184, 1879397, 1342592, -626807, -2192672, -2524882, -2274750, -1876378, -1031386, 85055, 617671, 269423, -520851, -1726917, -3593915, -5141565, -4573666, -1925553, 346935, 575243, 235513, 1564947, 3968976, 4851029]
36350D851029j221133q85688J340122K048306k25563k986880l061451m85129J870989
36341A244602J890941K53210j145007j592721j558961j133037L1441J332181J436552
36332G59201L80203j14716P34553J402675N65517n92724l72361M93209J68384
36323C423941r58521r39387J79894L36876q79423j414245k55082R84926J020248
36314A499227Q15753J195991J056983k54100j080469j32039R73242K63192j203177
36305C134603j200657k01503l55697j495103j384731K68274J208450L50572p84975
36296d60767r74761q95416r39518j32693J434099J625187m55805k349097j572136
36287d720907O70939J525826Q26908N96808J067637L90243j612460k524671j125822
$$ y = [4851029, 3629896, 2744208, 4084330, 6132636, 5907073, 2920193, -141258, -626387, 1244602, 3135543, 3388753, 2243746, 651025, -907936, -2040973, -2009532, -677351, 759201, 1139404, 1024688, 1759241, 3161916, 3727433, 3134709, 2762348, 3255557, 3423941, 2465420, 1526033, 1705927, 2042803, 1163380, -250865, -505947, 478979, 1499227, 2314980, 3510971, 4567954, 4313854, 3233385, 3101346, 4074588, 4337780, 3134603, 1933946, 1732443, 1376746, -118357, -1503088, -1234814, -26364, 324208, -460767, -1435528, -2330944, -3270462, -3403155, -1969056, -343869, -799674, -3148771, -4720907, -4049968, -2524142, -1697234, -1100426, -32789, 357454, -1255006, -3779677, -4905499]
36278d905499N77001N99983k7480M89775J398567R32403j12579N68580K538293
36269B059044K713127K95209j602692p59975O55883k06564k090360j790572M09238
36260c17662J234583j09082q77180K79193J154037K22408n37512N57826J359512
36251B966123n67399l083402k125268J778077L728889J415480j889138k430023
36243b06661q65848r3576n73446m20445R92069K041376J423441j05616r83280
36234A208014p02640O5730N02143L01093k99992p12079l82481O00927J295084
36225A875799P37517p59608j595820p15684Q67953J214555j0996j228095j307687
36216i22066r36062j010715j008924q7707J186569J570560J001494M37163K79096
$$ y = [-4905499, -4328498, -3728515, -3755995, -3266220, -1867653, -935250, -1047829, -479249, 2059044, 4772171, 5067380, 3464688, 2704713, 3360596, 3154032, 1063672, -726900, -317662, 916921, 807839, -69341, 209852, 1363889, 1586297, 1048785, 1606611, 2966123, 2398724, -684678, -2809946, -1031869, 2697020, 4112500, 2223362, -206661, -1072509, -1166085, -1739531, -2159976, -1167907, 873469, 2296910, 2191294, 1208014, 505374, 571104, 1073247, 1374340, 1074348, 362269, -20212, 580715, 1875799, 2613316, 1853708, 257888, -457796, 410157, 1624712, 1613716, 385621, -922066, -1858128, -2868843, -3877767, -3965474, -2778905, -1208345, -206851, 230312, 509408]
36207E09408J72995K6696O3948J53866J04315K04297N08996K86482o50474r82568
36197C97961J62204J235588L26995j529132j626015J26739R99976j92221j409960
36188a507865r44645O0000L8404m03190m9098O67878P70014N64648O52547M70552
36178C19245m67757j105933l73221Q35477R01926j26178r04267p31260K21181
36169a430787J604717K448122J291966j533369l093011j412044J324156J593974
36161G93724l83102j283174O2229J272104O47668l48640m2991O50316J21158j138389
36151C50903j523995q99734m20171m68668l07926N00639J492184K020290J821584
36142B565106J000870P220n56259n03536k45507j88959l05912m36375n07819l00439
$$ y = [509408, 682403, 709099, 773047, 926913, 1031228, 1235525, 1744521, 2031003, 1380529, 397961, 560165, 1795753, 2122748, 593616, -1032399, -905660, 94316, -97905, -1507865, -2452510, -2392510, -2354106, -2757296, -2806394, -2138516, -1368502, -803854, -151307, 319245, -148512, -1254445, -1627666, -792189, 109737, -16441, -920708, -1651968, -1430787, 173930, 2622052, 3914018, 2380649, -712362, -2124406, -800250, 793724, 410622, -872552, -810323, 461781, 1109449, 760809, 717818, 1368134, 1489292, 350903, -1173092, -2072826, -2492997, -2961665, -3269591, -2768952, -1276768, 743522, 2565106, 3565976, 3573196, 3016937, 2513401, 2267894, 2078935, 1773023, 1336648, 828829, 528390]
36132E28390L58487R41423N50444o70914j270346l29924J088360J243029M4165
36123B483114r44614p45482j34095k18437p58908o95210J29295P63151O51657
36114E30471L17435J47446m31271j636885k134899p11117J332021J452443l05051
36105a439407j025299O27321K033985N91672j903430j654002J369340L255741
36097A855921J814359o66078j288613n16198n21234j480521j732537p41434J85738
36088c090597P1658m33907k87317M85302J108298J242594J208380J136215N29624
36079A970250q65253k094772j813958k48792P18196P5194q00180k52909J076132
36070b236092J413957P62641N34364P10699j08026j620673j511065Q20379K716872
$$ y = [528390, 886877, 1828300, 2378744, 1707830, 437484, 107560, 1195920, 2438949, 2483114, 1538500, 793018, 658923, 440486, -318422, -1013632, -884337, -121186, 530471, 847906, 995352, 564081, -1072804, -3207703, -3918820, -2586799, -1134356, -1439407, -2464706, -1837385, 196600, 788272, -1115158, -2769160, -1399820, 1855921, 3670280, 3004202, 1715589, 1199391, 678157, -802364, -2534901, -3276335, -3090597, -3018939, -3452846, -3740163, -3254861, -2146563, -903969, 304411, 1440626, 1970250, 1104997, -989775, -2803733, -3052525, -2334329, -2259135, -3059315, -3312224, -2236092, -822135, -59494, 474870, 1185569, 1077543, -543130, -2054195, -1233816, 1483056]
36061A483056J975378o5370r89936r05801j269199j669107n80875J419187J979607
36052A376940M73259j207980j550682r66376j57338Q96104J721846J203767m27783
36043A361757j277051n19553K80787j48326n91247L58753J382986L22001j894056
36034g23949k113685J69326J772087O62237r01529q5707J828631J444485j129769
36025I22127k141513L279K148701J181383j321683j780715j30839N17148r22461
36016a524573j965283p67673J014333J042736j53300l67299Q40449J859118J592892
36007A571400N73426l36341r00569j054017o45955M9773L61651N4477l73146l80007
35997a079308J9272L90253K84842m34159j357243j726171j177757j58503O41642
$$ y = [1483056, 3458434, 3393064, 2403128, 1497327, 228128, -1440979, -2021854, -602667, 1376940, 1850199, 642219, -908463, -1874839, -2032177, -1136073, 585773, 1789540, 1361757, 84706, -434847, -154060, -302386, -893633, -534880, 848106, 1170107, -723949, -2837634, -2668308, -896221, -233984, -1135513, -1221220, 607411, 2051896, 922127, -1219386, -1216107, 932594, 2113977, 792294, -988421, -1119260, -602112, -1524573, -3489856, -4257529, -3243196, -2200460, -2353760, -2721059, -1880610, -21492, 1571400, 2144826, 1808485, 907916, -146101, -792056, -742283, -380632, -326155, -699301, -1079308, -1060036, -669783, -384941, -819100, -2176343, -3902514, -5080271, -5238774, -4597132]
35988d597132J001365J034509P54303K62827M5878M57249J044745R63590N7243
35979A024577r08404j096926l74197O96279J321932J036180J08941o10845m81884
35970G15653K86259Q16460L17674j202663k673745k616055o77372J551103K048735
35961a433951P85802k97967K3199P37166L83442p50616j289180q51793k45818
35952b939716M7622M05305J106437J743762J734978R43530j87665q85059p32518
35943A236676k73003l35669o31481m5794J281132J568624L9960j466400j018310
35934C55735M54993N98396q04354j799364j366279l81591M33702J322716J960892
35925G74846J255070o32849j889005j500601n24971j12975J40584Q78100J497278
$$ y = [-4597132, -3595767, -2561258, -1806955, -1544128, -1498250, -1041001, 3744, 967334, 1024577, 116173, -980753, -1354950, -658671, 663261, 1699441, 1808382, 1197537, 715653, 1001912, 1818372, 2136046, 933383, -1740362, -4356417, -5033789, -3482686, -1433951, -648149, -946116, -922917, -185751, 197691, -552925, -1842105, -2693898, -2939716, -2892094, -2486789, -1380352, 363410, 2098388, 3041918, 2854253, 1969194, 1236676, 963673, 628004, -3477, -49271, 1231861, 2800485, 2840445, 1374045, 355735, 810728, 1409124, 604770, -1194594, -2560873, -2942464, -2508762, -1186046, 774846, 2029916, 1397067, -491938, -1992539, -2517510, -2630485, -2489901, -1611801, -114523]
35916a14523J231626N61560L02724K11769k99299q50150p20895k16323k16443
35907a09954o97424p35999J29208J288562J754282J048322l89854j443411j336184
35898d92452n26546o4541j38624j53954j53256p62168j485406p71123J456198
35889c091872L012006K364726P76565J00228k9879r08500j949628j546632o6603
35880a339589M88058l22169q71138l86315p4954o75099r86438M2966J417112J582483
35870a125083O55445o0489O8374O86984J262657J272495K84415j210856j732069
35861A01873n85490Q94270R79166r1334o26152k7947N75670K60888n13559r97145
35851b9760j160721j040552k28716J114991J726178Q64110k38160O4713J237265
$$ y = [-114523, 1117103, 1678663, 1981387, 2193156, 1893857, 1043707, 322812, 106489, -109954, -807378, -1543377, -1414169, -125607, 1628675, 2676997, 2287143, 843732, -492452, -1018998, -1083539, -1222163, -1376117, -1529373, -2291541, -3776947, -4548070, -3091872, -79866, 2284860, 3061425, 3161653, 3131774, 2223274, 273646, -1272986, -1339589, -851531, -1173700, -2044838, -2431153, -2506107, -3181206, -4167644, -4124678, -2707566, -1125083, -469638, -530127, -461753, 225231, 1487888, 2760383, 3044798, 1833942, 101873, -483617, 410653, 1389819, 1298485, 672333, 644386, 1220056, 1480944, 967385, -29760, -1190481, -2231033, -2459749, -1344758, 381420, 1245530, 1007370, 1072083, 2309348]
35842B309348J184631m81145j632304q17305M48738O755j584189j906131l21724
35833b793326J269772J346451N14603j28329n95303j066692q66791L53850J492186
35824d73579J369247M67707M1923J63032p748n17681o62049m50018n20895o28468
35814a218529K31531J867923K549515J306390o00985j376630r35410m62971m17906
35805I42928k07344L20937L14605o77335j566002q89794J049056K148060J043704
35796B478815j010841j682018n99784L72327K3550n19347J79818J434186J460237
35787B136943J19757r58170p81342k7188M04228M87167M06849N952o31142r73107
35777A89947q19727m97906r5908N61395J025149M91392o73111r20091L27964J641991
$$ y = [2309348, 3493979, 3012834, 1380530, 563225, 1011963, 1018718, -565471, -2471602, -2793326, -1523554, -177103, 337500, 209171, -386132, -1452824, -2319615, -1965765, -473579, 895668, 1363375, 1405298, 1568330, 1560582, 1042901, 380852, -69166, -590061, -1218529, -986998, 880925, 3430440, 4736830, 4135845, 2759215, 1823805, 1360834, 942928, 735584, 1056521, 1371126, 693791, -872211, -1762005, -712949, 1435111, 2478815, 1467974, -214044, -813828, -441501, -417951, -937298, -757480, 676706, 2136943, 2256700, 1298530, 517188, 490000, 894228, 1381395, 1788244, 1794196, 1163054, 189947, -629780, -1127686, -1223594, -662199, 362950, 854342, 181231, -738860, -410896, 1231095]
35767A231095J473139Q4606j180063j566687r93489M85533K176519K580512J031590
35758E322755j051997j729731q83835P5347K93144L3600l75548q10333q06429
35749F6973k3877Q88608J038548O43687M45834J75515q87021k107134k045671
35740a804538q12912K3936R1610O81897K033952K420554J058381k52177l0446
35731C410257K92634j170669l252294l244619j053291Q25622J143445J057116
35723a991799J313241R66422k62587p39859N46235J972055J438725o31676k031884
35714E78873j711996n20376M75228R83852R75043L96030m20091q18500m46573
35705e08510N13392J502556J683061M76209j392072k030186m95169J659419J990991
$$ y = [1231095, 2704234, 2788840, 1608777, 42090, -951399, -465866, 1710653, 4291165, 5322755, 4270758, 2541027, 1657192, 1732539, 2025683, 2059283, 1683735, 873402, 66973, 43096, 931704, 1970252, 2613939, 3059773, 3235288, 2348267, 241133, -1804538, -2617450, -2593514, -2501904, -1820007, 213945, 2634499, 3692880, 3440703, 3410257, 3702891, 2532222, -720072, -3964691, -5017982, -4192360, -3048915, -1991799, -678558, 287864, 25277, -714582, -168347, 1803708, 3242433, 2610757, 578873, -1133123, -1653499, -1178271, -194419, 780624, 1176654, 756563, -61937, -508510, 4882, 1507438, 3190499, 3666708, 2274636, 244450, -250719, 1408700, 3399691]
35696C399691J22000j932054k308635j118404L79659J330156J540473J009361
35688B422247r6583j271441j922110j770806r70712J2222P03697J045355J384569
35679d63562J803596J769091Q79861l46720j002064q70597m25956k7662K23258
35670A539245J31278k96014m41902J47406P83080M12103p33028j328881q15254
35661f01967K8970M39309M60734K30609l38199q56446o05380K43847O83454M75379
35651A60310M58787Q72012Q17824K3512m08722P4577L36207m53980j139314m75388
35641B65825N09332k4138j642883k062421m95385J236240J237938j46737j033778
35632b156007k36222J503956K229617Q85024j157175j433934M30963K068515J561251
$$ y = [3399691, 3521691, 1589637, -718998, -1837402, -1457743, -127587, 1412886, 2422247, 2325664, 1054223, -867887, -2638693, -3609405, -3597183, -2893486, -1848131, -463562, 1340034, 3109125, 3988986, 3642266, 2640202, 1769605, 1343649, 1315987, 1539245, 1670523, 1374509, 932607, 1080013, 1863093, 2275196, 1542168, 213287, -601967, -572997, -133688, 327046, 557655, 219456, -636990, -1242370, -998523, -315069, 160310, 619097, 1491109, 2308933, 2332445, 1923723, 1998300, 2334507, 1880527, 741213, 265825, 775157, 751019, -891864, -2954285, -3449670, -2213430, -975492, -1122229, -2156007, -2392229, -888273, 1341344, 2226368, 1069193, -364741, 66222, 2134737, 3695988]
35623C695988j62569j282026j803355k499387k556534p46618J827858K725168
35615h01475J617367L78412m0094k95817l25894P72759K093782J153804k089563
35606B463281m159260k629325M65623J654001O22584k75802K25360J187829J444939
35597I99230R24201K16311n5419K90520N62791p5910j070424q78406N22439J140760
35587B576093j4875j158670m70731R60592Q80098o51823j676433j452454r41556
35578a949759n82778J99448J205857J212498N165r24468m00778Q20052J118726
35569G03963L0419j313949j498953l91382O43375L86696n44821n70999L09961
35560b245690M11928o63666q80960J023760K987029K344515j76864j570978q64784
$$ y = [3695988, 3533419, 2251393, 448038, -2051349, -4607883, -5354501, -3526643, -801475, 815892, 1194304, 1154210, 858393, 532499, 1305258, 3399040, 4552844, 2463281, -1695979, -4325304, -3859681, -2205680, -1583096, -1858898, -1633538, -445709, 999230, 1923431, 2139742, 2084323, 2374843, 2937634, 2861724, 1791300, 912894, 1435333, 2576093, 2561218, 1402548, 931817, 1892409, 2772507, 2120684, 444251, -1008203, -1949759, -2532537, -2333089, -1127232, 85266, 90431, -834037, -1234815, -414763, 703963, 734382, -579567, -2078520, -2469902, -1826527, -1439831, -1984652, -2555651, -2245690, -1833762, -2497428, -3378388, -2354628, 632401, 2976916, 2800052, 1229074, 364290]
35551C64290J46998J23750k89860k26773K23927Q04586J279654Q82193o29359
35542B679406j645663n76569J230167R95519j101404j988283n74523O81202J70802
35533a29346k25129J142152K321481Q54438j974537l009387j855573o22515p9584
35524c578000P54034J613695Q46768j301374k137271l57388J795414J635673l28162
35515a056611j455075o60360N96187O91921j91415p54618l41772N42930J129483
35506a499330J208770R54122L67524o02302j500871j546450o18866L79753N15458
35497b342192j14877o46405n40380n9008K49944K29097J79248L31904M39234J72522
35487b100913j47154J40604P80840N98449n59953r51232O73532K686357K464963
$$ y = [364290, 511288, 635038, 345178, 118405, 342332, 1146918, 2426572, 3308765, 2679406, 1033743, 457174, 1687341, 2682860, 1581456, -406827, -981350, -300148, -129346, -354475, 787677, 3109158, 3963596, 1989059, -1020328, -2875901, -3498416, -3578000, -2823966, -1210271, -363503, -1664877, -3802148, -4159536, -2364122, -728449, -1056611, -2511686, -3172046, -2575859, -1883938, -2075353, -2829971, -3171743, -2628813, -1499330, -290560, 663562, 1031086, 428784, -1072087, -2618537, -3237403, -2857650, -2342192, -2457069, -3103474, -3643854, -3702862, -3452918, -3223821, -3044573, -2712669, -2273435, -2100913, -2248067, -2107463, -1326623, -728174, -1288127, -2239359, -1565827, 1120530, 3585493]
35478C585493K16526j252003n84860O49252R36282P29509M49380q09016k965100
35469I55463l749727j957221J22345q032j078893k47383K083961K949031J659649
35460G29193N31574P37723P77300k56373r72399m46958l4494q84474j828393j405019
35450c052320k20562L64018L95477N50956N38122o5352n38984k57959j16201r17118
35440c319923j365577J70886K507003K650556L7265k475129k432374o85519M87317
35431d425495N50652O01763J090282J248809O10998j74310l40737n1693m7722
35422i37453o22552j289428j344877n89214M60414J032713Q88032O31308R91510
35413g79547J736967J757991N81207o96400p54789M37M0772o81391l65317J577167
$$ y = [3585493, 3802019, 2550016, 1965156, 2614408, 3550690, 4280199, 4729579, 3920563, 955463, -2794264, -4751485, -4629140, -4637172, -5716065, -5963448, -3879487, -930456, 729193, 1260767, 1998490, 2775790, 2519417, 1547018, 1100060, 1065566, 181092, -1647301, -3052320, -3272882, -2908864, -2513387, -1962431, -1424309, -1489661, -2028645, -2286604, -2402805, -3319923, -4685500, -4514614, -2007611, 642945, 680210, -1794919, -4227293, -4912812, -4425495, -3874843, -3273080, -2182798, -933989, -322991, -497301, -838038, -889731, -937453, -1560005, -2849433, -4194310, -4783524, -4323110, -3290397, -2402365, -1771057, -779547, 957420, 2715411, 3296618, 2600218, 1845429, 1845866, 1886638, 1205247, 839930, 2417097]
35403B417097K803439J161962j715853k436039q92776k59452j577555j814767
35395b313944R07489L356841J717165k031675k465881J132812L468758J098487
35387D870052k554452k580626K39488J304147n82629k057639j048552K85607l21851
35378b446455j534923j046368M68770Q05879K24973R28109K916068L393081R93376
35369D702510j893016k368588p89156L58162Q2994m43517k33838L26123O46883
35360C88557Q20330R72474P99780K22962k33913j77462L2555k08529r18226j508627
35350A89901j462842q43420j16231M92170J245903K194919K493166J262689p98462
35341D657793j807715j192995n45535j063225j509862l19216J390727J170208
$$ y = [2417097, 5220536, 6382498, 4666645, 2230606, 1337830, 1078378, -499177, -2313944, -1406455, 1950386, 3667551, 1635876, -830005, 302807, 3771565, 4870052, 2315600, -265026, -25538, 1278609, 695980, -1361659, -2410211, -2124604, -2446455, -3981378, -5027746, -4558976, -3753097, -3528124, -2600015, 316053, 3709134, 4702510, 2809494, 440906, -348250, 9912, 92906, -350611, -584449, -258326, 388557, 1208887, 2181361, 2981141, 3204103, 2970190, 2792728, 2825283, 2616754, 1698528, 189901, -1272941, -2116361, -2232592, -1740422, -494519, 1700400, 4193566, 5456255, 4657793, 2850078, 1657083, 1111548, 48323, -1461539, -1780755, -390028, 780180]
35333G80180q35962j834873n64492R17789N72801o63887p58559K49363P60401
35324a377239K82301j74012J17660Q39667J393017J343812M34361r19627j544981
35315C94959q12415M12525R30264P26005M38257N0909p12640j319497j084664
35306i76297m44371k39714j84643M56074J066572L77344j089254j241346M62263
35297a813372J926069J276334o97640j937321j683483n77762P02825J652624J561565
35288D09839K67386j082238j138058k9730R48024J072624O91476J93409m36439
35279H96293r37275o97855J79209N37212l98680j684282j583963J89312J941468
35270a558561K042347Q43994j27471l94815p85337j486381j333284J87067J530222
$$ y = [780180, -55782, -1890655, -2455147, -1537358, -964557, -1628444, -2387003, -2137640, -1377239, -1094938, -1268950, -1151290, -311623, 1081394, 2425206, 2859567, 1939940, 394959, -417456, -4931, 925333, 1651338, 2089595, 2140504, 1427864, 108367, -976297, -1420668, -1660382, -1845025, -1388951, -322379, 54965, -1034289, -2275635, -1813372, 112697, 1389031, 691391, -1245930, -2929413, -3507175, -2804350, -1151726, 409839, 677225, -405013, -1543071, -1572801, -624777, 447847, 1139323, 1332732, 896293, -40982, -738837, -559628, -22416, -421096, -2105378, -3689341, -3500029, -1558561, 483786, 1327780, 1200309, 805494, 20157, -1466224, -2799508, -2612441, -1082219]
35261a082219J083838l07517n34034N18071Q99990j41446r96434m92537J80099
35252h72189l43609j183562p52938M53036O06635m95987j180655m95617O55036
35243c609850J151928R71603N80293K90521N01473J372988J985440J095443q82466
35234C457373j970493j264042j18496Q3923o7775N20320J223743O64122p91430
35225A737245j358045n24507L30875K46780m6119K36413M93358n1556p94714o36883
35215c67153K29032O43176K67553j12721M278K20550J68411Q5415J56417J18659
35205A413617q3956j2723M02692M09857m95952j575877j673835p14568L40499
35196a990246Q00943P81685N66636K00112k36103n52416p12262o72769j22989
$$ y = [-1082219, 1619, -305898, -839932, -321861, 578129, 436683, -559751, -1052288, -872189, -1215798, -2399360, -3152298, -2699262, -2092627, -2588614, -3769269, -4264886, -3609850, -2457922, -1486319, -906026, -615505, -114032, 1258956, 3244396, 4339839, 3457373, 1486880, 222838, 104342, 188265, 120490, 640810, 1864553, 2528675, 1737245, 379200, -145307, 185568, 432348, 386229, 622642, 1116000, 1064444, 269730, -367153, -138121, 505055, 772608, 659887, 664165, 884715, 1053126, 1138541, 1294958, 1413617, 1329661, 1316938, 1719630, 2129487, 1633535, 57658, -1616177, -2330745, -1990246, -1189303, -407618, 159018, 359130, 123027, -429389, -1141651, -1814420, -1937409]
35187a937409R21084J453219M55127j369906k058058j047126j23910p90328j805523
35178f302830q33120K016803L975958L093253N18690j208276j076002p6657M72562
35169E80381J84463n40458j141847j258912q06135J10349J231894K001567J700655
35160B061957K87409j045786r77148J39087N07676o22650j708124j017264Q49785
35151a525058J817056J227685L69007J41905j30517r94384j488601o44748O64574
35142e63081Q14326j45765o41749r0128K13201q08836k199209k121183k36967
35133e779391J883389K548489J599317L35877J16542J010541J756537J184633
35125D655934m21362j748957k087414j824572j306601k43891J251151K046299
$$ y = [-1937409, -1016325, 436894, 892021, -477885, -2535943, -3583069, -3706979, -4497307, -6302830, -7135950, -5119147, -1143189, 1950064, 2468754, 1260478, 184476, 107819, 580381, 764844, 224386, -917461, -2176373, -2982508, -2872159, -1640265, 361302, 2061957, 2349366, 1303580, 326432, 465519, 973195, 350545, -1357579, -2374843, -1525058, 291998, 1519683, 1888690, 2030595, 1900078, 905694, -582907, -1227655, -563081, 251245, 105480, -536269, -626397, -413196, -1222032, -3421241, -5542424, -5779391, -3896002, -1347513, 251804, 587681, 704223, 1714764, 3471301, 4655934, 4234572, 2485615, 398201, -1426371, -2732972, -2976863, -1725712, 320587]
35117C20587J347736M934n54513j88930K03221K76514K78505j28525j431803k612497
35107b484771j765395R90589K909585K029334j89038j011941j18948N54804l2425
35098H81794r66116j363350j540640j728704j223218K88971J698758J805000R49873
35089a197632L64887M32584N89151N68107O22270N92046r2204j190637j476847
35080g88275m00812Q80947R86480K37724L5316O03216O86090k91125j121050o51700
35070A76811L58640L93272n04546r20648k90633M42932M35479p6742o14666j042685
35060a642786r78204J05196J630519K042731R56045n6914J84984N83657l57682
35051B467546j794203j561558M53689J885265J072771q87601j838387j145730
$$ y = [320587, 1668323, 1673257, 1118744, 929814, 1133035, 1409549, 1688054, 1559529, 127726, -2484771, -4250166, -3259577, -349992, 1679342, 1490304, 478363, 359415, 914219, 881794, -84322, -1447672, -2988312, -4717016, -5940234, -5651263, -3952505, -2147505, -1197632, -832745, -400161, 188990, 757097, 1379367, 1971413, 1879209, 688572, -788275, -1189087, -308140, 678340, 916064, 951380, 1554596, 2240686, 1949561, 828511, 176811, 535451, 928723, 424177, -496471, -787104, -344172, 91307, 14565, -600101, -1642786, -2620990, -2515794, -885275, 1157456, 2113501, 2056587, 2241571, 2825228, 2467546, 673343, -888215, -434526, 1450739, 2523510, 1635909, -202478, -1348208]
35043a348208Q7454O16920J99706n00539p33546m47634k03933k27775n1983M97015
35033b112523O93515J06993l31925L45939J337346J076758k49343q87741k42332
35024b63313L46462p4367o50766l20920O13511J328763J639492J498361N27056
35015D644279j026318j903193j382747l75305j13190n50160q58747p24423l65240
35006b655044j82M6469m91869j016456m11102J218784K283857J833766O94521
34997A502744j70861q88975j379963o71936J105677J856901M50038j156079q25401
34988a77855L13169r5537j495973j398721K59747J033738J63390l81826M41529
34979a338339J049535J95279r08868p21678L45596R90055Q16067J68971m45821
$$ y = [-1348208, -1260754, -643834, -444128, -944667, -1678213, -2125847, -2329780, -2557555, -2609538, -2112523, -1419008, -1312015, -1643940, -1298001, 39345, 1116103, 866760, -20981, -263313, 83149, 8782, -641984, -962904, -349393, 979370, 2618862, 4117223, 4644279, 3617961, 1714768, 332021, -43284, -156474, -706634, -1565381, -2289804, -2655044, -2655226, -2608757, -3100626, -4117082, -4528184, -3309400, -1025543, 808223, 1502744, 1331883, 442908, -937055, -1608991, -503314, 1353587, 1803625, 647546, -177855, 135314, 39777, -1456196, -2854917, -2595170, -1561432, -1398042, -1779868, -1338339, -288804, -93525, -1002393, -1724071, -1378475, -388420, 427647, 596618, 150797]
34970A50797k37228J068706K009840Q00111j770495k996019k167077j295170j317188
34961e753723n60773J693311L145817K033840J38158j76276L46543j85015j108959
34952d27077n13360J110135J556801M35922p03317j074476r72078j81604J333150
34943E64096J957331M33950j374539p77584J265053J362628q47592k243548j549605
34934a209810j056816j874760j604873J042023L023472J525496j114588q15046
34926b084902J773571K315087l61209k546157j383759J193515J841609N06781
34918A254536m31240j37249L635p80339j399552r56802k82924l36304l11194J072070
34908b305363K983131L100724J020018q36686n81330N46853L51926r48239j423786
$$ y = [150797, -86431, 982275, 2992115, 3792226, 2021731, -974288, -3141365, -4436535, -5753723, -6314496, -4621185, -1475368, 558472, 696630, 520354, 866897, 681882, -427077, -940437, 169698, 1726499, 2162421, 1459104, 384628, -587450, -769054, 564096, 2521427, 2955377, 1580838, 803254, 2068307, 3430935, 2583343, 339795, -1209810, -2266626, -4141386, -5746259, -4704236, -1680764, -155268, -1269856, -2084902, -311331, 2003756, 1642547, -903610, -2287369, -1093854, 747755, 1254536, 823296, 686047, 689682, -90657, -1490209, -2447011, -2729935, -3066239, -3377433, -2305363, 677768, 3778492, 4798510, 3961824, 3380494, 3927347, 4279273, 3331034, 1907248]
34899A907248o16586J29816J74052K44050N15218J04716j034321j550923p35834
34890h62564L86930O73541K09630n01224j282210j633438p98203Q19850J678823
34881a308865J200112M50965J58820k70939r76716p88255O06386J421430K86629
34872G79567j480977j799259p19522L32426R83634J624984J692786L94238j394845
34863D13032j972205j265703o54406n84278j56081R44602J775271J596812P27031
34854H24075j65134n89056k17133O33670Q36940j42102j152318q73416J46492
34845f97982M03317j44823k15068N81813J335914J456434J089215J43591j409736
34836B542675k471306j868444m14257n0040r10186j187877r0920J079556J175541
$$ y = [1907248, 1290662, 1420478, 1594530, 1838580, 2353798, 2458514, 1424193, -126730, -862564, -475634, 197907, 407537, -93687, -1375897, -3009335, -3807538, -2987688, -1308865, -108753, 342212, 501032, 230093, -746623, -1534878, -928492, 492938, 779567, -701410, -2500669, -3220191, -2887765, -1904131, -279147, 1413639, 1807877, 413032, -1559173, -2824876, -3479282, -4063560, -4219641, -3275039, -1499768, 97044, 824075, 658941, 69885, -147248, 486422, 1323362, 1181260, 28942, -844474, -697982, -294665, -439488, -654556, -72743, 1263171, 2719605, 3808820, 3952411, 2542675, 71369, -1797075, -2211332, -2261372, -3171558, -4359435, -4450355, -3370799, -2195258]
34827b195258N94186l3910o59437q36020J17749J395969J173999m62821j157737
34818b063280J79281J585308J073016n35913j325035j047349m91554L30212J515912
34809g79402K077204J251988j809m61735n07963q95526r25791J29624R06459k93449
34799D99600k272408k128747L57930K140888J275210m84506o07631N78897Q63266
34790B22499l10685j140527k43453J348376J663820M74039n49585k79317M13164
34781A598331K44257m71356n96020k08645k16566l29463N31828J753498J318940
34772C624804p59079j735995j48816J742936J294606p55878j965321j877619j609629
34763b189991j163266J43231J469576J364460L59503J83863Q34305Q49639R4747
$$ y = [-2195258, -1601072, -1634982, -2294419, -3130439, -3012690, -1616721, -442722, -905543, -2063280, -1883999, -298691, 774325, 238412, -1086623, -2133972, -2625526, -2295314, -779402, 1297802, 2549790, 2547981, 2086246, 1578283, 682757, -243034, -113410, 793049, 499600, -1772808, -3901555, -3543625, -1402737, -127527, -612033, -1219664, -640767, 222499, -88186, -1228713, -1472166, -123790, 1540030, 2014069, 1464484, 1185167, 1598331, 1842588, 1371232, 775212, 566567, 350001, 20538, 552366, 2305864, 3624804, 2865725, 1129730, 980914, 2723850, 4018456, 3262578, 1297257, -580362, -2189991, -3353257, -3210026, -1740450, -375990, -16487, 167376, 1001681, 1851320, 1946067]
34754A946067k22382m914k13759o30478k87931J56533o20383j479934j9230K861805
34744A485394L281335J90848k784523k794769j482389j232744j186451K08947
34736d314352J621728J163365R2479O80052J983919J391132o40448j120705M62752
34727A319922J256534l39142k272586k144288n10862M60561K3919p33162o04377
34718c543481M70372J415746J075802l39126j200637n24704N98187O92257J63959
34709a191625L16545Q45717L74986q54809j146360l32593k15197j367581j806921
34700e377838q7656K192008K578234J087038l48901q19812j037715j368077r84737
34691d167456O19242K358064K522610P82346j276055j855329r90471k81469m86242
$$ y = [1946067, 1723685, 1718771, 1505012, 874534, 586603, 743136, 122753, -1357181, -1376411, 1485394, 4766729, 4957577, 2173054, -621715, -2104104, -3336848, -4523299, -4314352, -2692624, -1529259, -1436780, -756728, 1227191, 2618323, 1977875, 857170, 1319922, 2576456, 2237314, -35272, -2179560, -2690422, -2229861, -2205942, -2939104, -3543481, -3073109, -1657363, -581561, -920687, -2121324, -2646028, -2047841, -1355584, -1191625, -875080, -29363, 345623, -509186, -1655546, -1988139, -2203336, -3570917, -5377838, -5465494, -3273486, -695252, 391786, 42885, -776927, -1814642, -3182719, -4167456, -3548214, -1190150, 1332460, 2114806, 838751, -1016578, -2007049, -2288518, -2774760]
34682b774760m56582P13286J693664Q14719q25094n80264J409438J880101o06026
34673A268482l056016k269596N32680J854464J144817P95739J596025J570068
34665C436663j37398j300003o1800J930172J880923j19054j612256j540748j181950
34656A294549j365359j036009N55397K014971J631598J3308p39856o8650N16000
34647B815949L3489n00498O8054J053095R84490j76549j140832j183375p33948
34638A219875k79678J67125N03696M68780K14407M1410l89153j526539k633135
34629b213212k306658n51668R75625J228421R49376R92554R13221K37219j76773
34620D8105N73287J711512J813853R16867J57264k06193q95610j967960k530457
$$ y = [-2774760, -3231342, -2518056, -824392, -9673, -834767, -1415031, -5593, 1874508, 1268482, -1787534, -4057130, -3524450, -1669986, -525169, 270570, 1866595, 3436663, 3299265, 1999262, 1937462, 3867634, 5748557, 5629503, 4017247, 2476499, 1294549, -70810, -1106819, -551422, 1463549, 3095147, 3108455, 2368599, 2299949, 2815949, 2849438, 2348940, 2416994, 3470089, 4454579, 4278030, 3137198, 1953823, 1219875, 940197, 1107322, 1611018, 2079798, 2294205, 2335615, 1946462, 419923, -2213212, -4519870, -5071538, -4095913, -2867492, -1918116, -925562, -12341, 224878, 48105, 621392, 2332904, 4146757, 5063624, 5220888, 5014695, 4119085, 2151125, -379332]
34611c79332k111382j079812K36784J586080K064143R01246q54414j063560N72661
34602a27586J841603J064347o27179j149322l49270L84929M84233N13223N50704
34593B585682l3887j064335j322814l71043N36173J11225j168253j737734r55865
34584c420851L59406J170387J223024Q14074K62884j40451j59614R2460K03593
34575D04912N4952j443J39067q4597r94890j709876j001291Q33787J907026R97233
34565E44880q40956j563377n60910Q86467J299994M47097q25123j554157j317044
34556c483129l68040O08421R99043O75962M9963j80410M42330J477651J688974
34547A910765M64859j028388j100351M3213M58393n83024j386047n21878Q57664
$$ y = [-379332, -2490714, -3570526, -3333742, -1747662, 316481, 1217727, 363313, -700247, -127586, 1714017, 2778364, 2151185, 1001863, 652593, 1037522, 1521755, 2034978, 2585682, 2551795, 1487460, 164646, -206397, 329776, 441001, -727252, -2464986, -3420851, -3061445, -1891058, -668034, 146040, 408924, 268473, 108859, 201319, 404912, 459864, 458421, 597488, 512891, -481999, -2191875, -3193166, -2359379, -452353, 544880, -296076, -1859453, -2420363, -1533896, -233902, 213195, -611928, -2166085, -3483129, -3851169, -3242748, -2243705, -1567743, -1517780, -1698190, -1255860, 221791, 1910765, 2375624, 1347236, 246885, 290098, 748491, 165467, -1220580, -1742458, -884794]
34538h84794R06231m6661m17352j23549j96543l61343M56256J486170P41016j431784
34528A27647k187847l76012J701762J871809R69032O27211M89052m25914j418961
34519A377779j278536l57888L81371J011502J509839O20066j929869l603772k103112
34510d372620R20110J988637P11274m07323l33506l26355o18714J64972J811488
34501d62037K120514O30409l69353K87525P67495l03429j419937j091831m77078
34492c17722r49228j446133o84627J40021m01349q98980O35331K818697K563156
34483A459166j3081j661901q85803L96493M55648J09087N31231J126888Q95301
34474B413029J89454j33817j02266j69483l16792l69155m19533m41701k35483
$$ y = [-884794, 21437, -25224, -442576, -566125, -762668, -1124011, -667755, 818415, 1559431, 127647, -2060200, -2436212, -734450, 1137359, 2106391, 2733602, 3222654, 2796740, 1377779, 99243, -258645, 122726, 1134228, 2644067, 3264133, 1334264, -2269508, -4372620, -3452510, -1463873, -752599, -1159922, -1493428, -1819783, -2438497, -2273525, -462037, 1658477, 2288886, 1919533, 2207058, 2974553, 2671124, 1251187, 159356, -317722, -1266950, -2713083, -3397710, -3257689, -3659038, -4558018, -3922687, -1103990, 1459166, 1446085, -215816, -1101619, -705126, -249478, -140391, 390840, 1517728, 2413029, 2602483, 2468666, 2366400, 2196917, 1880125, 1510970, 1091437, 649736, 414253]
34465D14253j2523j74801m00591l56P22463P12686k7430k52345M90876J054249
34455B526481N63764k24751k88651R2260P7223l64739p57840r90846j005114l76671
34445g48884Q59186J619986R91451m04584j113467o10337L11651O11864o2415
34436A454451j170099j635254q63307L87698Q54423O17739R40176J873967J650508
34427D110302m55990k267358j539836M85181O92059j235123k304549o96897J669979
34418a542232K114614P68651l64744n40613o14036r49646q57942j15152M95987
34409a605113N30184N33474P81240M31168j111131k644512k219967K56798K512436
34400b535423K451609N38250r89456q70353J7813K51923j95932k06787N93782
$$ y = [414253, 401730, 226929, -173662, -174018, 548445, 1261131, 1233701, 981356, 1472232, 2526481, 3090245, 2865494, 2576843, 2669103, 2746326, 2381587, 1623747, 632901, -372213, -748884, 110302, 1730288, 2721739, 2317155, 1203688, 593351, 905002, 1516866, 1454451, 284352, -1350902, -2214209, -1826511, -972088, -354349, 585827, 2459794, 4110302, 3654312, 1386954, -152882, 332299, 1024358, -210765, -2515314, -3212211, -1542232, 572382, 1341033, 976289, 435676, -178360, -1128006, -1985948, -2101100, -1605113, -1074929, -541455, 239785, 670953, -440178, -3084690, -5304657, -5047859, -2535423, -83814, 454436, -535020, -1405373, -1387560, -1135637, -1331569, -1538356, -944574]
34391i44574J020711j00130j947042k248147j70686K230628K442633P87027k06147
34382H64273M00442P42376n26502j743425p93931J323503J798936J38729j438579
34373G65822j531259j003707o37589J64519J472892J869998O61308p62335j066571
34364f6922q26553r07558o83562M76684J437858R17725k65466m87890O5700J0925
34354c29059p67586j175403q44269k02504P54608J919922K034577L04162j574389
34345A20059j340967L38962Q73464o2139k57118R44975J456168K03950r54535
34336A322819n23218J45933m64344j202362l49539J230275J447100K87004n20488
34327A373180l29665J1432K6216p305j62610o79049j002500n34158N6530j96390
$$ y = [-944574, 76137, -23993, -1971035, -4219182, -4389868, -2159240, 283393, 1070420, 864273, 1264715, 2007091, 1480589, -262836, -1056767, 266736, 2065672, 2204401, 765822, -765437, -1769144, -2406733, -2242214, -769322, 1100676, 1761984, 999649, -66922, -893475, -1801033, -2484595, -2007911, -570053, 347672, 82206, -405684, -339984, -329059, -1096645, -2272048, -3116317, -3318821, -2564213, -644291, 1390286, 1694448, 120059, -1220908, -881946, -8482, -70621, -327739, 617236, 2073404, 2277354, 1322819, 799601, 945534, 481190, -721172, -1070711, 159564, 1606664, 1893668, 1373180, 1043515, 1054947, 1081163, 1073858, 911248, 232199, -770301, -1304459, -1247929, -1444319]
34317a444319p01633j53548J023929R87156n79134j639793o10814J404175K090498
34308C76517Q08647q32812r51335N93637K133974K051053O33689l16194J49730
34299D646906R14737M74441r87593k075848k079806j364397l58352P48986J584081
34290A503155J798677J437631M67970j306359l036045k756328n6087K315184J625994
34281A993792q47983j546307Q1949J024210k34557j339892j10897J875125J859972
34272B755412N1596j114036n43889Q19695J924745K238625J207431r61877k488185
34263C889517j826060L4557P46286k39304j361062j515682j160983r02417o97413
34254c032561o04895p70643n54681P52609K230498K067660K96737r88372o24249
$$ y = [-1444319, -2145952, -2299500, -1275571, -288415, -867549, -2507342, -3118156, -1713981, 376517, 1185164, 352352, -598983, -5346, 2128628, 4179681, 4813370, 4497176, 4646906, 5561643, 6036084, 5048491, 2972643, 892837, -471560, -829912, -80926, 1503155, 3301832, 4739463, 5207433, 3901074, 865029, -1891299, -1947386, 367798, 1993792, 1145809, -400498, -318549, 705661, 471104, -868788, -979685, 895440, 2755412, 2807008, 1692972, 1149083, 1968778, 3893523, 6132148, 7339579, 6377702, 3889517, 2063457, 2098014, 2844300, 2604996, 1243934, -271748, -1432731, -2335148, -3032561, -3637456, -4408099, -4962780, -4210171, -1979673, 87987, 384724, -603648, -1227897]
34245a227897K50580M91336O26271J112506Q52274q42166k307281j579562N56418
34236b067521J590999P97124k37236k64528M07393J313546K399589K788180R75173
34227G702719k702631n291196m305489q35783J647978J242118o55854j467799
34219d665937l90577J131997J475986P82768M96822J196297J695684P46765j085946
34210A383859k095830j532610j12992J165175J663609R70580n35994j273070j71119
34201e38392J334682Q88329j161896j987228o27488N02732k95312j098056K86960
34192b695669K344701K137575M1141j007208j72524O15069M01362L71118R69327
34183C004892R17631j58343q73224p31823r79286j796956j412460O12352J972992
$$ y = [-1227897, -977317, -485981, 140290, 1252796, 2105070, 1262904, -1044377, -2623939, -2067521, -476522, 320602, 83366, -181162, 226231, 1539777, 3939366, 6727546, 7702719, 5000088, -291108, -4596597, -5432380, -3784402, -2542284, -3198138, -4665937, -5056514, -3924517, -2448531, -1665763, -1168941, 27356, 1723040, 2469805, 1383859, -711971, -2244581, -2357573, -1192398, 471211, 1441791, 905797, -367273, -538392, 796290, 1684619, 522723, -1464505, -2091993, -1589261, -1884573, -2982629, -2695669, -350968, 1786607, 1827748, 820540, 648016, 1263085, 1664447, 2035565, 3004892, 3922523, 3764180, 2890956, 2159133, 1179847, -617109, -2029569, -1417217, 555775]
34174E55775J316335O40774J671392K405186L58531k735478l138612q99808M03679
34165E77774n47567j135753L97907J991846J219838r67911k012233j451018p39862
34156b666979m56733K04448J411029J913726P60271j155208j918782p97309Q53649
34147a851888J195678J98712m17138L00558J151413P06997m27255o47777N4551
34138B63851K29905n71942j220394r51460k61401L57151R85753J315882P59328
34129I06673j13390r312P12717J21491j925533k672818l43554K718096K974458
34120B368828N62099j182867n22119Q19660P91226j71221m07874L37259Q10026
34111C405017K24130o80946o92745K48367R18805L97133p12773j243510j231936
$$ y = [555775, 1872110, 2512884, 4184276, 6589462, 6947993, 4212515, 1073903, 174095, 577774, 30207, -1105546, -707639, 1284207, 2504045, 1536134, -476099, -1927117, -2666979, -3123712, -2919264, -1508235, 405491, 1165762, 10554, -1908228, -2705537, -1851888, -656210, -457498, -874636, -574078, 577335, 1284332, 857077, 209300, 263851, 493756, -78186, -1298580, -2250040, -2511441, -2154290, -1168537, 147345, 906673, 793283, 783971, 1496688, 1618179, -307354, -2980172, -3323726, -605630, 2368828, 2930927, 1748060, 1225941, 2045601, 2836827, 2665606, 2257732, 2594991, 3405017, 3629147, 2948201, 2255456, 2503823, 3422628, 3819761, 3106988, 1863478, 631542]
34102F31542j588884k112804j440287N26347J866959J374489L93141M32156N55144
34093F37803p14593k179860j449706R31598J899172O20580k56504R33499K140128
34084B562117J117263q41685j169932k20171k90455j480345j651865l83139J67230
34075b190982q84270j273455P65401L198016K891011L13836j126487j03821R76945
34066B566194m838j615971j223134R66400K314067J555878J04536n20539o17242
34057C525351r67885j219876q01290l30165o62217j148358l62275J564070K757566
34048B354921K038160L69125o17909n83631k97268k48584l12906m20204p00391
34039A581313r97207q88492l01606L41878P04852Q72445R64810P83498J57972
$$ y = [631542, -957342, -3070146, -4510433, -3984086, -2117127, -742638, -349497, 82659, 637803, -76790, -2256650, -3706356, -2774758, -875586, -255006, -511510, 421989, 2562117, 3679380, 2837695, 1667763, 1447592, 1157137, -323208, -1975073, -2358212, -2190982, -3075252, -4348707, -3583306, -385290, 2505721, 2819557, 1693070, 1589249, 2566194, 2561356, 945385, -277749, 688651, 3002718, 4558596, 4663132, 4142593, 3525351, 2557466, 1337590, 536300, 206135, -456082, -1604440, -1966715, -402645, 2354921, 4393081, 4762206, 4144297, 3560666, 3263398, 3014814, 2701908, 2281704, 1581313, 584106, -304386, -605992, -264114, 440738, 1313183, 2277993, 3061491, 3219463]
34030C219463n39628o06854J77138J187279J604624J352833J117252J320192J346686
34021A0178985K06793j983781l641194l251270j110071R42356J537886J011004
34013C890708M53366K16782k0727j75194K59531J127861J479097Q89910J34073
34004H255407K5149L03246L34651K66920N97945J042953Q52044Q1464m29120l34476
33994A0996183j34258j79484j99438J9063K73237M55126O95424Q42756N40555
33985A3309164j1838j18039M27626J125543J615784J936771J947221J480193J082837
33976B2795262J410963J830706J106736k70462k46959J634949L166762K718649
33968C4146606J655919J865206K638068K273093J454901K300944M625785N973760
$$ y = [3219463, 2679835, 2072981, 2250119, 3437398, 5042022, 6394855, 7512107, 8832299, 10178985, 10385778, 8401997, 4760803, 1509533, 399462, 1341818, 2879704, 3890708, 4344074, 4560856, 4540129, 4364935, 4624466, 5752327, 7231424, 8121334, 8255407, 8280556, 8583802, 8918453, 9185373, 9783318, 10826271, 11678315, 11759779, 11330659, 10996183, 10861925, 10682441, 10483003, 10502066, 10775303, 11230429, 11925853, 12768609, 13309164, 13297326, 13179287, 13606913, 14732456, 16348240, 18285011, 20232232, 21712425, 22795262, 24206225, 26036931, 27143667, 26873205, 26626246, 28261195, 31427957, 34146606, 35802525, 37667731, 40305799, 42578892, 44033793, 46334737, 50960522, 56934282]
33960E6934282N492935N143750O377347P961745Q316442Q178146R402095J2223263
33952A20030005J5183612J7264516J8929077K1173248K4261067K7419271K9505265
33945B73766061L0004271K9256267K7444058K3741638J7159982Q029427k086449
33938D07315255j1693781j9766976k5291427k7716285k7838433k7028742k5572839
33931B42406772k3017811k0051057j8303249j7873925j6795900j3875578j0634801
33924A21854451r246465r589904r658938q310418o416922n419741n535865n558815
33916F2117383m314783k337012j608523k985823m543086l871971j625815q12488
33908D0017882k409443l917367l109621j092924k62098r92156k001220k544251
$$ y = [56934282, 62427217, 67570967, 73948314, 81910059, 90226501, 98404647, 107806742, 120030005, 135213617, 152478133, 171407210, 192580458, 216841525, 244260796, 273766061, 303770332, 333026599, 360470657, 384212295, 401372277, 409401704, 407315255, 395621474, 375854498, 350563071, 322846786, 295008353, 267979611, 242406772, 219388961, 199337904, 181034655, 163160730, 146364830, 132489252, 121854451, 112607986, 103018082, 93359144, 85048726, 78631804, 73212063, 67676198, 62117383, 57802600, 55465588, 53857065, 50871242, 46328156, 42456185, 40830370, 40017882, 37608439, 33691072, 30581451, 29488527, 29226429, 28234273, 26233053, 23688802]
33900B3688802k508770j566950m4694M25358j013027k626048k279641n89956J94432
33891A3679506k92084n13155j05083l52226j433968j728999n51268O00313M63520
33882I766556j68585j11735L18541K56598j58833l64249m94123q36464j020168
33873G187538p39937n09253p36285q06970j05659P18881O21009j81303n51825
33864D896196j87251J08427q5658j19960N07521J009476J48853j895001l206518
33855A176085k212667J70770J352871L28211r10615j76475J647035J868529J30943
33846C374687r40405K59174J877494J498786l40352j375945j043145n27732k25925
33837B556637M76309J180711O84547n53198n61449Q31128J213179o44617k507044
$$ y = [23688802, 21180032, 19613082, 19568388, 19993746, 18980719, 16354671, 14075030, 13485074, 13679506, 13387422, 12874267, 12769184, 12416958, 10982990, 9253991, 8702723, 9303036, 9766556, 9597971, 9486236, 9804777, 10061375, 9902542, 9538293, 9044170, 8207706, 7187538, 6447601, 5938348, 5202063, 4395093, 4289434, 5008315, 5629324, 5448021, 4896196, 4708945, 4817372, 4731714, 4611754, 5119275, 6128751, 6277604, 4382603, 1176085, -1036582, -865812, 487059, 815270, -95345, -271820, 1375215, 3243744, 3374687, 2434282, 2693456, 4570950, 6069736, 5729384, 4353439, 3310294, 2782562, 2556637, 3032946, 4213657, 4898204, 4345006, 3783557, 4614685, 5827864, 5183247, 2676203]
33828B676203k024632m05282k23488j009163j87491K135777K839153P77793j255737
33819C323133j028448k63324j194042k297829p65306K315564L027251N43313j677310
33810A983002j187811L31634N32624r7199j61142k11835j143120j637998j11003
33801a702848J995850J863120k90760j404580k36556J018467M23210r52882j155150
33792d42129j70389P68055J141224J016237K36235q64328j023955K15128J263875
33783B139953N41659r55156r27277P10667J507578j4894k196972k431057m19676
33774b045175J750608K211378J067176k59098o74246k56380J50203n5400n96005
33765A293061o87058k4497P76684Q65919J34697p04472r42485n01297K75362J072380
$$ y = [2676203, 651571, 246289, 22801, -986362, -1173853, 961924, 3801077, 4578870, 3323133, 2294685, 2031361, 837319, -1460510, -2225816, 89748, 3116999, 3660312, 1983002, 795191, 1126825, 1659449, 1562250, 1401108, 1189273, 46153, -1591845, -1702848, 293002, 2156122, 1865362, 460782, 224226, 1242693, 1665903, 713021, -442129, -612518, 155537, 1296761, 2312998, 2549233, 1684905, 660950, 876078, 2139953, 2681612, 1726456, 799179, 1509846, 3017424, 3002530, 805558, -1625499, -2045175, -294567, 1916811, 2983987, 2724889, 2050643, 1794263, 1944466, 1889066, 1293061, 606003, 581506, 1358190, 2224109, 2358806, 1654334, 711849, 210552, 485914, 1558294]
33755A558294J573262J317263J73149j052625j130432J38088J461451J518799
33747E557249N14369k93236l31819k30584o14324j182532j306274r43648m98713
33738F70488j60768J04283J27606l25517r55289r67835k7550J079412J160255
33729G05085N3770r99764p05785P50843J876244J528134M3185j323382j681287
33720B47043j075282j43293M97951O62446N53122L16490j42882o54112n18597
33711b57114N14120J301313M52306j511335k403776j207086O17788J340857J156095
33702C168J097999J032721K77797o47603o50921j054Q5010m10141l05913N56266
33692A037329Q32719j19701j070826p15633M42115Q40102j26045j459580j674763
$$ y = [1558294, 3131556, 4448819, 4621968, 3569343, 2438911, 2576999, 4038450, 5557249, 6071618, 5778382, 5446563, 5215979, 4601655, 3419123, 2112849, 1169201, 670488, 509720, 614003, 741609, 416092, -539197, -1507032, -1534582, -455170, 705085, 758855, -240909, -946694, -195851, 1680393, 3208527, 3251712, 1928330, 247043, -828239, -971532, -473581, 188865, 741987, 1058477, 915595, 261483, -257114, 257006, 1558319, 2010625, 499290, -1904486, -3111572, -2493784, -1152927, 3168, 1101167, 2133888, 2411685, 1764082, 1113161, 1112107, 1197117, 786976, 481063, 1037329, 1870048, 1750347, 679521, -36112, 406003, 1246105, 1120060, -339520, -2014283]
33683b014283l76258J094893R34817p88920j809895n62162J463093J727604L16004
33674a5107l78304N89069J479786P79351o96131j375689r55538j6955R75612J549819
33664A935913J341231Q68081R27177R65530l00113k355127l042970j867637q68204
33655b396119j195582j225594L94552K142106K091123J008440O69077P30218j79566
33646B038655j509829j570411m57112K97773M13511Q10672J331831R10567j95271
33637B070386o06109j75176j7239k76870l4641N54117K72427p73064r88568K1973
33627D7236P14531K16892l07558J56234O83192L0234j209558j376166m9315J388980
33617B94702J363889j03050j273705o74331P76514O96927j174734k014646Q854
$$ y = [-2014283, -2390541, -1295648, -360831, -1149751, -2959646, -3521808, -2058715, -331111, -15107, -393411, 195658, 1675444, 2454795, 1758664, 382975, -572563, -589518, 386094, 1935913, 3277144, 4145225, 5072402, 6037932, 5737819, 3382692, 339722, -1527915, -2396119, -3591701, -4817295, -4422743, -2280637, -189514, 818926, 1488003, 2218221, 2038655, 528826, -1041585, -1498697, -1200924, -787413, 23259, 1355090, 2265657, 2070386, 1464277, 1289101, 1271862, 994992, 960351, 1514468, 1786895, 1013831, 25263, 47236, 761767, 978659, 671101, 827335, 1510527, 1540761, 331203, -1044963, -1094278, 294702, 1658591, 1555541, 281836, -392495, 384019, 1080946, -93788, -2108434, -2099580]
33608b099580K491878K100814k68308q95722Q47792J723790P1354j707376j320817
33599I43825N7845L73016j34577l18519m03843q47061q58209J2163O01164K62579
33589c11617L49657J577190J945275j73593k635489k216586M46067J753919M50043
33580A184866j092832r62993j71505k98216j040930j225791o53261J00628O77828
33571c482206R97784J067849J133264J388441J459124Q75527l2340n36767o52550
33562B218126r36525j290363j011213l8500Q37334J076242Q26078K67885n65782
33553A383282j271730j252164n42945K21779O75015Q95829Q56947M49336l1577
33544A383772j53748j4176N150p7352q1698k45924p53291j052905o01516O3874
$$ y = [-2099580, 392298, 2493112, 2224804, 1329082, 2176874, 3900664, 3972018, 2264642, 943825, 1001670, 1374686, 1240109, 921590, 517747, -329314, -1187523, -1175360, -574196, -311617, 38040, 1615230, 3560505, 3386912, 751423, -1465163, -1019096, 734823, 1184866, 92034, -870959, -1042464, -1340680, -2381610, -3607401, -4260662, -4160034, -3482206, -2484422, -1416573, -283309, 1105132, 2564256, 3439783, 3407443, 2870676, 2218126, 1281601, -8762, -1019975, -1058475, -221141, 855101, 1681179, 1949064, 1383282, 111552, -1140612, -1683557, -1461778, -786763, 109066, 966013, 1415349, 1383772, 1230024, 1215848, 1220998, 1143646, 1061948, 816024, 62733, -990172, -1591688, -1527814]
33534a527814P0195k70539P4749R91768J153999J4210j338634j678053j013736
33525c523855p7774P20163J364901J833300J986231J596015N15937q54448j587289
33516A973181j236242m45535K9572L10007O05583K57536j131696k253743j457565
33507c348902O67559J800260J065223K1988J40114Q80720R20368o5j131834j674551
33497f59120j218708p1259O55686J71077p88269r09352k44316J41312J59355N79463
33487b184131J104620P11362k8935N29329J847493J309467j420217l139283j855127
33478c125422J60044L30847p5694J130242K444375R54069k192443k902080l69576
33469c645638J886910J578629M01175K93935N22819P4331j21195O37818R24065
$$ y = [-1527814, -1457619, -1728158, -1653409, -661641, 492358, 506568, -832066, -2510119, -3523855, -3601629, -2881466, -1516565, 316735, 2302966, 3898981, 4414918, 3560470, 1973181, 736939, 291404, 320976, 630983, 1236566, 1494102, 362406, -1891337, -3348902, -2681343, -881083, 184140, 206128, 346242, 1226962, 2147330, 2147265, 1015431, -659120, -1877828, -1949087, -1293401, -1122324, -1910593, -2819945, -3064261, -2922949, -2763594, -2184131, -1079511, -368149, -397084, 132245, 1979738, 3289205, 1868988, -1270295, -3125422, -2965378, -2634531, -2710225, -1579983, 864392, 1818461, -373982, -3276062, -3645638, -1758728, -180099, 221076, 515011, 1037830, 1112161, 990966, 1628784, 2552849]
33460B552849l80215j742863j278211K28416P58888J72235k79894l64738n55071
33451h88604l09127R33459J788632N61447j545668j630202M18482J510123J28678
33442I67220j368164p01750O52296M9646j869059k140460j42862J529740J068708
33433a954685j31643l002J123653J425232M75171l55668p6969O51097O36043k98514
33423A490715j263189j379685o01745L46531O74205K72804j58930J45019J084585
33414F10310J628003Q45920r63328k318373j916069q153J735421J877342O10011
33405B101084o46147q45218k06839L43298J55075p36275j684956j784296o36795
33396c941069R89300J741041J204036L58909J85382M29324L44351M6549J89012
$$ y = [2552849, 2172634, 429771, -848440, -620024, 138864, 311099, 31205, -333533, -888604, -1197731, -264272, 1524360, 2085807, 540139, -1090063, -671581, 838542, 967220, -400944, -1102694, -450398, -400752, -2269811, -4410271, -4553133, -3023393, -1954685, -2086328, -2089330, -965677, 459555, 934726, 579058, 502089, 1153186, 1789229, 1490715, 227526, -1152159, -1753904, -1407373, -733168, -460364, -619294, -474275, 610310, 2238313, 3084233, 2120905, -197468, -2113537, -2121690, -386269, 1491073, 2101084, 1454937, 609719, 402880, 746178, 901253, 164978, -1519978, -3304274, -3941069, -2951769, -1210728, -6692, 352217, 537599, 966923, 1311274, 1357823, 1546835]
33387A546835O05050L79035o45430j409541j026460J12869R73748J009793L60049
33378A905948m72335q15426l26831L44215N8604j213625k031104j329447J05380
33369c774621Q35926P58294P87626J065460Q70588K13844N3444O01864P76090
33360B188515l3091q46620o35224M8221P9581m03341m87459k44948n04014j081325
33350a919705q72142J03985L87183n63953j211269j95690J457770J763435N97033
33341d53353l84862k08740M95264Q75201P58720J35858r11478j557837q06625
33332b057852R25691J995074J692353R79933O02216q9125j543306k617671k074800
33323b187487m82148P42164J356989J874172J793161J30963k346971l231785j390061
$$ y = [1546835, 2151885, 2530920, 1885490, 475949, -550511, -437642, 536106, 1545899, 1905948, 1433613, 618187, 291356, 635571, 694175, -519450, -2550554, -3880001, -3774621, -2938695, -2180401, -1392775, -327315, 543273, 757117, 810561, 1412425, 2188515, 2155424, 1308804, 673580, 721801, 801382, 398041, -89418, -334366, -838380, -1919705, -2791847, -2687862, -2300679, -2864632, -4075901, -4271591, -2813821, -1050386, -453353, -838215, -1046955, -551691, 323510, 1082230, 1218088, 306610, -1251227, -2057852, -1132161, 862913, 2555266, 3535199, 4137415, 4048290, 2504984, -112687, -2187487, -2669635, -1927471, -570482, 1303690, 3096851, 3227814, 880843, -2350942, -3741003]
33314c741003J435859K618883J485428l57057j000747j12545R36308O61791p58356
33305A168561j614537p95203Q25481J652238J279952L24484q42390j977450k251387
33296b230251j155906K51094N50869J16052L69071J141382Q41003n91340j135956
33287a843982J88081J695036J545745J38953j090644j621028j455497m41998P29105
33278b156229M95729j124740j717579J22998K213787J830510r4431n53373O82998
33269c00330R35589p36423j901001o35390J520345J912724L18268j330922j640865
33260a858005q86376r1591P5129j90559l8176R00166J642460J013557l99571p59334
33250e92300L15610J055860K17840r94929p71448O92635J734119J603033R38453
$$ y = [-3741003, -2305144, 313739, 1799167, 1442110, 441363, 328818, 1265126, 1926917, 1168561, -445976, -1241179, -415698, 1236540, 2516492, 2840976, 1998586, 21136, -2230251, -3386157, -3135063, -2584194, -2468142, -2099071, -957689, -116686, -708026, -1843982, -1655901, 39135, 1584880, 1723833, 633189, -987839, -2443336, -2885334, -2156229, -1660500, -2785240, -4502819, -4379821, -2166034, -335524, -429955, -983328, -300330, 635259, -101164, -2002165, -2637555, -1117210, 795514, 1113782, -217140, -1858005, -2744381, -2835972, -2760843, -2951402, -2989578, -2089412, -446952, 566605, 167034, -592300, -276690, 779170, 997010, 2081, -769367, -76732, 1657387, 3260420, 4198873]
33241D198873L07178l73216j020865j176103p95773l82662j12866L75970J023496
33232B044032R57930k81469j599670j333244N03646J784488P43157j580875k411027
33223a173032q12840J015393P61716p76678r06765J023256K640675J793371p25934
33214B839162k471796k268863r12912K70774N64876J5002o29144l67322R24626
33205b035597K071633J967252J004666L25392K3518p28881j836095j976490o58353
33196a842955P04072P57370K55667P64027J926213J782757j28787j799883j576357
33187H42124l52164K17521K65766P94905J295425M79018j065474j342159k14076
33178I20886K10304r18883j728960q21957M16884M23881J99621J133941J901736
$$ y = [4198873, 4506051, 4132835, 3111970, 1935867, 1140094, 757432, 644566, 1020536, 2044032, 3001962, 2720493, 1120823, -212421, 291225, 2075713, 2818870, 1237995, -1173032, -1985872, -970479, -208763, -985441, -1892206, -868950, 1771725, 3565096, 2839162, 367366, -1901497, -2814409, -2543635, -1978759, -1963757, -2592901, -2960223, -2035597, 36036, 2003288, 3007954, 3333346, 3356864, 2627983, 791888, -1184602, -1842955, -1138883, -381513, -125846, 638181, 2564394, 4347151, 4218364, 2418481, 842124, 489960, 707481, 973247, 1768152, 3063577, 3542595, 2477121, 1134962, 920886, 1131190, 212307, -1516653, -2338610, -1921726, -1497845, -1298224, -164283, 1737453]
33169A737453M58043j990819k264034j27192J317911N22124l92749M97721J752775
33160A511233J094062r35565j941852j114684K16684Q13925O85286K74674k02403
33151D01360n58655n79814k80045J13142L35967J98105j49122j42738M41678Q58295
33141F38173L13736o73909q78733k04813K98492K20841K07069M94154N25768K68745
33131A209523L79123P31754L80608o31759j110360p79234o92614j091582r02106
33122b506647k6960J44442n67152m16863J004565J457773k13063j684124p94151
33113c602180Q94627R25745P7631M58726J386455P78937p39462r23049j30370
33104h72940n32770j675165r79752J311082J915205q0396j590489n50914J065744
$$ y = [1737453, 2195496, 204677, -2059357, -2186549, -868638, -346514, -739263, -241542, 1511233, 2605295, 1669730, -272122, -1386806, -1170122, -356197, 329089, 603763, 401360, -157295, -737109, -1017154, -904012, -568045, -369940, -519062, -661800, -220122, 638173, 951909, 278000, -600733, -805546, -507054, -286213, -79144, 415010, 940778, 1209523, 1588646, 2320400, 2701008, 2069249, 958889, 179655, -512959, -1604541, -2506647, -2533607, -2389165, -2956317, -3373180, -2368615, -910842, -1123905, -2808029, -3602180, -2707553, -1781808, -1704177, -1245451, 141004, 919941, 180479, -742570, -872940, -1405710, -3080875, -4060627, -2749545, -834340, -914736, -2505225, -3056139, -1990395]
33095a990395Q96523l21382p66658l74414J46599Q17039J309916O17187p63079
33086d28664o82175J142768K035814M99632j240595r29535J49092j35258r53276
33077e42197m35586O06536J81522j142712j322446n46959n35840r78713j38371
33068d854766J444709J408279k04806o48106J027833K424825J743341L23601j13044
33059B551866j35810q06253j368255p12899L62080L00608p34171j197304m23111
33050b163249P76906J425817J283799O75485R8403j83717m17378q30251q98353
33041b32538l9439R79158O72307p77166j313407l995J280124M99825j454991k002158
33031b392280n10228J094062J205350L40862k41982k84616j73219J09898O88450
$$ y = [-1990395, -1093872, -1415254, -2181912, -2556326, -2409727, -1592688, -282772, 334415, -428664, -1110839, 31929, 2067743, 2567375, 1326780, 397245, 546337, 411079, -542197, -977783, -371247, -189725, -1332437, -2654883, -3201842, -3737682, -4716395, -4854766, -3410057, -2001778, -2206584, -2854690, -1826857, 597968, 2341309, 2664910, 2551866, 2416056, 1609803, 241548, -471351, -109271, 191337, -542834, -1740138, -2163249, -1386343, 39474, 1323273, 1998758, 2097161, 1913444, 1496066, 665815, -232538, -271977, 707181, 1379488, 602322, -711085, -715080, 565044, 1064869, -390122, -2392280, -2902508, -1808446, -603096, -262234, -504216, -788832, -962051, -852153, -163703]
33022a63703R53169Q1550j524915k187819r02050J112370J631252K06708j164890
33013a958328n94491J314786K480700K086080J087230K88389n83549j618878j985663
33004E16276j235322l10840l06346q83967q19760K94711J652837K232299J617509
32995B757397J74132j075612j151489k05867N13558K66930k14308j0308M31754
32986A486187J4650j176742j866585j275205J43949J552681K369989K157682R25015
32977D331621l60196n92012l7320K237p55818j099654m13706R9252o78577j760669
32967a264842j411188J12333Q68898K25876j84666R07394K267435J805266m08623
32958B917883k068920j468749N89130J929250J401705j74056j127037p16301J86818
$$ y = [-163703, 789466, 871016, -653899, -2841718, -3743768, -2631398, -1000146, -793438, -1958328, -2552819, -1238033, 1242667, 3328747, 4415977, 4704366, 4120817, 2501939, 516276, -719046, -1029886, -1336232, -2220199, -3039959, -2745248, -1092411, 1139888, 2757397, 2931529, 1855917, 704428, 498561, 1012119, 1279049, 1064741, 1054433, 1486187, 1500837, 324095, -1542490, -2817695, -2673746, -1121065, 1248924, 3406606, 4331621, 3971425, 3379413, 3342093, 3344330, 2588512, 1488858, 1075152, 1174404, 495827, -1264842, -2676030, -2563697, -1694799, -1468923, -1653589, -746195, 1521240, 3326506, 2917883, 848963, -619786, -30656, 1898594, 3300299, 3126243, 1999206, 1282905, 1469723]
32949A469723K26535o83196j191927l82012Q18989Q61946k26418r69660o36966
32940g12986j1790K52394N91944J171123J029650j88366r21530J67107J614482
32931B992028Q74709j671708k802674r98819J387795J628335K80314l53369P9755
32922A416366J2396j041100j754935j290454m32943k4219J90347N57587O58740
32913a708215J89308l28030m30782m13692m34561J15112J411492K244009J482925
32904B127566p9077o95988j47484K12718j81420l41713K75880O42996m1816q16080
32894I55582n27271J41599j66749j042686r06973K77313R31783N90762N00240
32885G53600R09990J53717k188916l436881j357587J994235K715672N27448j103263
$$ y = [1469723, 1696258, 1013062, -178865, -560877, 258112, 1120058, 893640, -76020, -712986, -724776, -472382, 119562, 1290685, 2320335, 2131969, 1210439, 1377546, 2992028, 3866737, 2195029, -607645, -1606464, -218669, 1409666, 1689980, 1336611, 1416366, 1428762, 387662, -1367273, -2657727, -3090670, -3114889, -2924542, -2366955, -1708215, -1518907, -1846937, -2277719, -2691411, -3125972, -3010860, -1599368, 644641, 2127566, 2048489, 1352501, 1205017, 1417735, 1236315, 894602, 1170482, 1813478, 1771662, 955582, 428311, 569910, 403161, -639525, -1546498, -1269185, -337402, 253360, 753600, 1663590, 1817307, -371609, -3808490, -5166077, -3171842, -456170, 71278, -1031985]
32876a031985k04510J309457J170663m0632n84837k92225M4512L66583P70852
32867A507878N58119n02102j099907k11857J054933J123781M03544K02050J75285
32858C211724q87882k374884k407177r11748K68307M01974N66822J011583M57492
32849f63789j105059j477868M29329K473266K225321L60222p48393m43168J37397
32840A187258L19970K58163k12757j162526j521716k88956J542265J982155P40370
32831B844226o87854j350258j522875j266470k25486R83366J029342r7028r30314
32822a223351p46546k91225k218N97488J212859N73306j167223j921485q23993
32813c792388K09977k55587n32491J174826K982664J778854j557844k965520j142244
$$ y = [-1031985, -1236495, 72962, 1243625, 1202993, 618156, 325931, 370443, 737026, 1507878, 2065997, 1563895, 463988, 252131, 1307064, 2430845, 2834389, 3036439, 3211724, 2323842, -51042, -2458219, -3369967, -3101660, -2699686, -2132864, -1121281, -663789, -1768848, -3246716, -2817387, -344121, 1881200, 2241422, 1493029, 1049861, 1187258, 1507228, 1765391, 1552634, 390108, -1131608, -1420564, 121701, 2103856, 2844226, 2156372, 806114, -716761, -1983231, -2208717, -1225351, -196009, -293037, -1223351, -1969897, -2261122, -2263340, -1665852, -452993, 120313, -1046910, -2968395, -3792388, -3582411, -3837998, -4370489, -3195663, -212999, 1565855, 8011, -2957509, -4099753]
32804d099753Q83718Q10617J62749P46954J240628j10398j802384j228895R11884
32795b484880J623885L65622m60911K03036N35564n93557j479083n83030P29529
32786b143825N18438m69163k32438R66215J076737k19286r75235j50130R24918
32777g03769R20905M74916P50058J435902J358329J74924j525606l062986l729867
32768c907194k797461m95659J553637J891836Q64193j06375l99320m07168l44445
32759d147956k4065L80744N01675O13119J140060J388733K00465j821868k291381
32750d060474j41343K489164K758943P24390j020503r31754j18227j08625n64245
32741i72674k16478Q74396J363059P01379j09755j51886J20324r8443n29824m33148
$$ y = [-4099753, -3216035, -2405418, -2242669, -1495715, -255087, -365485, -2167869, -3396764, -2484880, -860995, -495373, -956284, -753248, -217684, -811241, -2290324, -2873354, -2143825, -1625387, -2094550, -2326988, -1360773, -284036, -503322, -1478557, -1628687, -703769, 217136, 692052, 1442110, 2878012, 4236341, 4411265, 2885659, -177327, -3907194, -6704655, -7200314, -5646677, -3754841, -2890648, -2997023, -3396343, -3803511, -4147956, -4172021, -3791277, -3289602, -2676483, -1536423, -147690, 52775, -1769093, -4060474, -4201817, -1712653, 1046290, 1770680, 750177, -181577, -299804, -408429, -972674, -1189152, -314756, 1048303, 1749682, 1639927, 1488041, 1608365, 1509922, 980098, 546950]
32731E46950q9493l61733r70081o82710N63868J286982Q04720L72861R29605J280045
32721C681014J55573j240496r10748N49442P47882n84010j140162J33579J391088
32712B783162R68561l08914j155280j846755k596777k146080j29122J115955k30640
32703c545890j969646p32168K586387L730897J371912j033617n28302J390180
32695A269753J751458M86174l89621k68668k65748q21117j070992n27841R4680
32686B58078k1772o79681q50344J91984J758509K028229K53397j628578j110917
32677A98905J125893J688303n84400k579240j466614R97684J312940l51541q94948
32668e53018L89071R16823m84446j552629n13787J056378J185762P51015J346472
$$ y = [546950, 457457, 95724, -874357, -1557067, -993199, 293783, 1098503, 1471364, 2400969, 3681014, 3836587, 2596091, 1685343, 2234785, 2982667, 2398657, 1258495, 1392074, 2783162, 3751723, 3442809, 2287529, 440774, -2156003, -4302083, -4431205, -3315250, -3545890, -5515536, -6247704, -3661317, 69580, 1441492, 407875, -120427, 1269753, 3021211, 3507385, 3117764, 2849096, 2583348, 1762231, 691239, 163398, 258078, 236306, -443375, -1293719, -1101735, 656774, 2685003, 2938400, 1309822, 198905, 1324798, 3013101, 2428701, -150539, -1617153, -619469, 693471, 341930, -553018, -163947, 752876, 268430, -1284199, -1797986, -741608, 444154, 1195169, 2541641]
32659B541641J902544L90721k185815k635159l00247J886111J612034j5193r04163
32650B292474j038030j476551j892832j167574K93819Q53034J65572l46368J46380
32641b170076O52425K17818l67439R8667J127091J233827L48278l4567O98090
32632A804114J116007j90097k354861l104422j501673J064802K551391K227850
32624A613111R40769j7728r2844K21570J19980m90002r46967q90323q06648j085044
32614a434126j088850j2563J588679K136267J048057m59674r71711n49301k46264
32605A0514m74142n86917P446R20714J202607M97692m38681n39402K49410P52293
32595A601534j9819j496940k118801j182053M72213J611408J747390R78950m37840
$$ y = [2541641, 4444185, 4834906, 2649091, 13932, -286315, 1599796, 3211830, 3196637, 2292474, 1254444, -222107, -2114939, -3282513, -2988694, -2135660, -1970088, -2316456, -2170076, -1517651, -1299833, -1667272, -1568605, -441514, 792313, 1140591, 1106024, 1804114, 2920121, 2730024, 375163, -2729259, -4230932, -3166130, -614739, 1613111, 2553880, 2536152, 2443308, 2664878, 2784858, 2294856, 1347889, 457566, -349082, -1434126, -2522976, -2535539, -946860, 1189407, 2237464, 1777790, 806079, 256778, 10514, -463628, -1050545, -1043099, -122385, 1080222, 1577914, 1139233, 599831, 849241, 1601534, 1581715, 84775, -2034026, -3216079, -2743866, -1132458, 614932, 1593882, 1156042]
32586A156042j805824j952376l74593J738412K402559R65453j078098j648881
32578e97306l05997J315069J351229j76328j466705j204531p3350N03086M12769
32569b42064N39360Q30793K98173q93099j118546J23394J019133J57913j062392
32560c47335o10005P52674O08709j049857j586982J17466J863300J556154J95956
32551A500080k03043R9816m76073j640016j405501O30129K286087J696356k59226
32542B228609j308731p01444J79683j40350j317054j630356k08702J657254J976401
32533G35310O44162m52718k07816J42325p72755j930561j376480M55816J094990
32524a667727j87721j191686k15111J342656J284795P94l83124N90304J217432
$$ y = [1156042, -649782, -2602158, -2976751, -1238339, 1164220, 2129673, 1051575, -597306, -903303, 411766, 1762995, 1586667, 119962, -1084569, -1157919, -654833, -242064, 297296, 1128089, 1426262, 533163, -585383, -461989, 557144, 715057, -347335, -957340, -204666, 404043, -645814, -2232796, -2115330, -252030, 1304124, 1500080, 1297037, 1396853, 920780, -719236, -2124737, -1494608, 791479, 2487835, 2228609, 919878, 218434, 398117, 257767, -1059287, -2689643, -2898345, -1241091, 735310, 1379472, 926754, 718938, 861263, 88508, -1842053, -3218533, -2762717, -1667727, -1855448, -3047134, -3262245, -1919589, -634794, -634000, -1017124, -426820, 790612]
32515G90612M51030o54098q01143l18999l21970r03652j135651n39049K38602
32506c194318L27306j96608l57828M62890J585013J766827Q64332Q3220K67960
32497A608794P18402M14973l12669m78803l17467r29462k028212j772986M01114
32488b696316K314315J773942k32859q26027O54567J768761O56751j220359j362261
32479H30514l4555K24013j323526k268635p31104J494830J390808p40108j659375
32470b817138o1506J579897R70558o23129p71076K38003L78471m18838l74687
32461a899445P07662R67430k20164j111960o01023Q562n55800j373641j090959
32452e169338j22348M97631R84153J823654K183502J120764n35790j218333p89420
$$ y = [790612, 1241642, 587544, -213599, -532598, -854568, -1758220, -2893871, -3432920, -3194318, -2867012, -3063620, -3421448, -2958558, -1373545, 393282, 1257614, 1340834, 1608794, 2327196, 2742169, 2429500, 1950697, 1633230, 703768, -1324444, -3097430, -2696316, -382001, 1391941, 1159082, 333055, 987622, 2756383, 3413134, 2192775, 830514, 795959, 1019972, -303554, -2572189, -3303293, -1808463, -417655, -1157763, -2817138, -2878644, -1298747, -328189, -951318, -1722394, -1484391, -1105920, -1524758, -1899445, -1191783, -224353, -444517, -1556477, -2157500, -2148938, -2704738, -4078379, -5169338, -5291686, -4794055, -3809902, -1986248, 197254, 1318018, 782228, -436105, -1225525]
32443a225525j72611L21854P48724N65169l48792o61703N16198J701977J179646
32434B624937M3476M11036J416219L32307k439975l231271p86898J495587P02353
32425E67771j364470j432046K69330J056222J39630q95062j027291o88919j72406
32416c547241O81602J407498J308593P60206O24731O83244J34243p05302p85620
32407E61954j96271p3770o70205r75024l67929O02946J187715J121299M26615
32398A617330m20510l85505Q56519J839658R18184j213195k179697j137214K82574
32389A78144M41980m98351j599145k321040k108944m30659J897353K857332J719599
32380A36269J43779k20225P8062k10454o18544J27282J527755J717949M22364
$$ y = [-1225525, -1398136, -1076282, -327558, 237611, -111181, -772884, -256686, 1445291, 2624937, 2668413, 3079449, 4495668, 4827975, 2388000, -843271, -1630169, -134582, 567771, -796699, -2228745, -1959415, -903193, -763563, -1658625, -2685916, -3374835, -3547241, -2865639, -1458141, -149548, 610658, 1235389, 1918633, 2052876, 1347574, 561954, 365683, 291913, -378292, -1353316, -1721245, -1118299, 69416, 1190715, 1617330, 1196820, 811315, 1667834, 3507492, 4425676, 3212481, 1032784, -104430, 178144, 620124, 121773, -1477372, -3798412, -5907356, -6338015, -4440662, -1583330, 136269, 280048, 59823, 137885, -72569, -691113, -563831, 963924, 2681873, 3104237]
32371C104237m24933M25657J599404J065133r93301k495617k199895r39773j15972
32362i75060K273J0139J44421J22575l9972J36518P60823J152518O37923n32992
32352A419166j391567j232602k34233P29159Q39641J73646k28766M33808J488209
32343A996461J434809n5466j632560k050583j504258p02887K59604J235627J327518
32334C08265J61812r32489m85320Q98297J385321N90492k23687m42613q30526
32325D29552j758731k336556j800157m63897J109905K621716L350050K339068
32317C490950r1350k141693k455459j383684o0302P38477O41554j44893m94205
32308a900605M47193J586937J074930o56933j159251K09822J193247M41289k45483
$$ y = [3104237, 2679304, 3104961, 4704365, 5769498, 4776197, 2280580, 80685, -859088, -975060, -972787, -962648, -818227, -695652, -735624, -599106, 161717, 1314235, 1952158, 1419166, 27599, -1205003, -1439236, -710077, 129564, 303210, 74444, 508252, 1996461, 3431270, 3375804, 1743244, -307339, -1811597, -2514484, -2254880, -1019253, 308265, 470077, -462412, -947732, -49435, 1335886, 1926378, 1702691, 1260078, 429552, -1329179, -3665735, -5465892, -5929789, -4819884, -2198168, 1151882, 3490950, 3399600, 1257907, -1197552, -2581236, -2641538, -1903061, -1261507, -1406400, -1900605, -1453412, 133525, 1208455, 551522, -607729, -397907, 795340, 1236629, 991146]
32299I91146P20546J653339M64614j463948j386445K17053N04962r89543j860397
32290a148673r41268L22019R11931J524545K130156J318542p23738j437858K22828
32281B178484J644627L97158j855665j811056N25855K067712J181426n63969j199047
32272B565525o94312j3796M28874N90922K60139n22268j208014j435326j396771
32263a425027j160973k98729J284423K642744K577893J011450q72044j829940
32255A929797j601223p63624P6096O91547R85174P50748k5917q07006q91696k89492
32245E4404J68733j20713o58979m56839N86975J447147J253654L30784m09928
32236B195238p42425j181709j863585k097564j329950M09J014644J400574J393797
$$ y = [991146, 1711692, 3365031, 3829645, 2365697, 979252, 1196305, 1701267, 711724, -1148673, -2089941, -1767922, -855991, 668554, 2798710, 4117252, 3393514, 1955656, 2178484, 3823111, 4220269, 2364604, 553548, 1079403, 3147115, 4328541, 3764572, 2565525, 1871213, 1857417, 2286291, 2877213, 3137352, 2615084, 1407070, -28256, -1425027, -2586000, -2884729, -1600306, 1042438, 3620331, 4631781, 3759737, 1929797, 328574, -435050, -358954, 332593, 1317767, 2068515, 2042598, 1235592, 343896, 54404, 223137, 102424, -556555, -1013394, -426419, 1020728, 2274382, 2605166, 2195238, 1452813, 271104, -1592481, -3690045, -5019995, -5019586, -4004942, -2604368, -1210571]
32227a210571J137192O53492J77587p8422k14707j59044N40786J601231J472964
32218C920508n74640k436407j393760J659502K768631M30339k148540j855024
32210C70609q6193J14327r09057o44956O94135M47092j550245k250937m27788
32201d243013J208244N02478p05887J08151J955140K183438P94532N93M39779
32192B243455O65470R6523j49846L67266M56109o07697j766615j802026r72782
32183a470143k31411J60797M43688O05955N96015O53007P35897K30816r90516
32174G34105j773922r88422O08493J017294k63489j338532n12596J204455J492091
32165A79477J08778q13946o9000Q38287K10352j047637q40977P72747J624459
$$ y = [-1210571, -73379, 580113, 757700, 679278, 464571, 305527, 846313, 2447544, 3920508, 3345868, 909461, -484299, 1175203, 3943834, 4374173, 2225633, 370609, 284416, 398743, -510314, -1155270, -461135, -14043, -1564288, -3815225, -4243013, -3034769, -2532291, -3238178, -3130027, -1174887, 1008551, 1803083, 1803676, 2243455, 2908925, 3005448, 2855602, 3222868, 3678977, 3071280, 1304665, -497361, -1470143, -1701554, -1540757, -1097069, -491114, 104901, 757908, 1493805, 1724621, 734105, -1039817, -2028239, -1419746, -402452, -665941, -2004473, -2517069, -1312614, 179477, 288255, -525691, -594691, 243596, 453948, -593689, -1434666, -661919, 962540]
32156I62540O65360o78112p25652L79361J351828J347192L65614r11005j314868
32147A442258k43288J217471J356810K40140l58711K35889N75910l62274j367223
32138B736982r94976R8655L54490k86308p20858n39380p5752N77782J172884P85989
32128C109508p39926j689861o10080J160185J114400p03205j807022j051330l9463
32119a256794k83075j019512q29522J12075N49446j1983q95982j166714m41621
32110e243682P75258J409151R52118J77066Q6660M96152N78953L90340N93153
32101B15169R85808P73290J40144k1592J51323k16706p53333k12980R37161O85132
32091B683416j051324j621612L35948K408246J872648k87049j166667l24974K16891
$$ y = [962540, 1627900, 949788, 224136, 603497, 1955325, 3302517, 3668131, 2757126, 1442258, 1198970, 2416441, 3773251, 4013391, 3654680, 3890569, 4466479, 4104205, 2736982, 1742006, 1840661, 2195151, 1908843, 1187985, 648605, 572853, 1150635, 2323519, 3109508, 2369582, 679721, 69641, 1229826, 2344226, 1641021, -166001, -1217331, -1256794, -1539869, -2559381, -3388903, -3276828, -2727382, -2739365, -3635347, -4802061, -5243682, -4468424, -3059273, -2107155, -1930089, -1843429, -1347277, -768324, -377984, 215169, 1200977, 1974267, 2114411, 2092819, 2244142, 2027436, 1274103, 1061123, 1998284, 2683416, 1632092, 10480, 346428, 2754674, 4627322, 4340273, 3173606, 2848632, 3065523]
32082C065523m15111r45792m59148L41081O64059O28493L70662l38204j212361
32073A699202j459394r76947m45085r3329M53871R94103P22194l05551r23926
32064c34862m98398L03915P75896J036174J144660N91761n57893j102930k72510
32055A085813R54552J115563K44601m31281l37517l6431n1229k00747k05025k00749
32045A937550m20162p94081j020855p97105m5384Q44221J186941P39883O2992
32036A694000j92396q1784l5080n4407J55825M80481M94445J69708j66384m49862
32026B014546p25486n58675L80912J175677M21740j477333k198765n69733J533902
32017c215J653459O3311j023801q02643l96202l00152L89712J725488K064996
$$ y = [3065523, 2650412, 1704620, 1245472, 1586553, 2250612, 2879105, 3249767, 2911563, 1699202, 239808, -737139, -1182224, -1275553, -821682, 172421, 894615, 589064, -334862, -833260, -529345, 246551, 1282725, 2427385, 3019146, 2461253, 1358323, 1085813, 2040365, 3155928, 3400529, 2969248, 2631731, 2595300, 2544071, 2343324, 2138299, 1937550, 1517388, 723307, -297548, -1094653, -1140037, -295816, 891125, 1631008, 1694000, 1501604, 1419820, 1384740, 1330333, 1486158, 1966639, 2461084, 2630792, 2464408, 2014546, 1289060, 730385, 1111297, 2286974, 2708714, 1231381, -967384, -1537117, -3215, 1650244, 1713555, 689754, -112889, -509091, -809243, -419531, 1305957, 3370953]
32008C370953O07768r55414p56720N85033J127838M06435n28781j071606j337939
31999A447567r94754L79363J864144J799073L7285j721298k050569j117580J62123
31990a94646J060672J033038L3596r65360r23649k86311l32499r56909o65125
31981b197193R35646K297987K162521J077707J9280r43528j752855j686152o64740
31972g51327J17804k3022j67477M21433Q74332M24003N6017P72069J528503Q56527
31962D108862n43233r45060m81562o01841j236282r52757K42520P19759M7305
31953C57711l28439K69856N92445k56671j283419j312991o53372j01870L13969
31944b402781O75009N16448k37863p78764o51370m49965o14238o72114l15772
$$ y = [3370953, 3978721, 3023307, 2266587, 2851620, 3979458, 4385893, 3857112, 2785506, 1447567, 452813, 832176, 2696320, 4495393, 4532678, 2811380, 760811, -356769, -194646, 866026, 1899064, 1932660, 967300, 43651, -242660, -575159, -1532068, -2197193, -1261547, 1036440, 3198961, 4276668, 4295948, 3352420, 1599565, -86587, -751327, -633523, -656545, -824022, -402589, 471743, 895746, 951763, 1723832, 3252335, 4108862, 3565629, 2620569, 2139007, 1537166, 300884, -651873, -409353, 310406, 357711, 29272, 299128, 891573, 634902, -648517, -1961508, -2614880, -2716750, -2402781, -1727772, -1211324, -1449187, -2227951, -2879321, -3329286, -3943524, -4615638, -4931410]
31935d931410L1558L71886J372912K623035K352939J70162j606954j064002L52023
31926c27851J40709j155482q25567J469257K870823J563095o14776r99905K41590
31917B361893Q55247j44684j464792j607739o79893J45345K30316K3965J56376
31908a23966M54250K63152l68037n20389K18388Q75988L32150j003389j663174
31899a535027j078311j02573M15166N87793P72598P98927M00299j79757m60120
31890c81005k20298M66879J208739J200451r3534j868510k417579j184984L85480
31881b904361P54470K48837J11081L15139j43423j032898q29100O37129J316048
31872a527078k7464j431489l45196K243133K744282J26107k369462j702644R13948
$$ y = [-4931410, -4899852, -4527966, -3155054, -532019, 1820920, 1991082, 384128, -679874, -327851, -187142, -1342624, -2168191, -698934, 2171889, 3734984, 3120208, 2120303, 2361893, 3217140, 3072456, 1607664, -75, -679968, -534623, -304307, -280342, -123966, 330284, 593436, 225399, -294990, -76602, 799386, 1131536, 128147, -1535027, -2613338, -2715911, -2300745, -1712952, -940354, -141427, 258872, 79115, -381005, -601303, -134424, 1074315, 2274766, 2181232, 312722, -2104857, -3289841, -2904361, -2149891, -1901054, -1789973, -1474834, -1618257, -2651155, -3480255, -2843126, -1527078, -1554542, -2986031, -3331227, -1088094, 1656188, 1782295, -587167, -2289811, -1375863]
31863a375863K183382J338817L25209K57902K28447l86243p44405k45729M11072
31854A992589N73789N07992L15021m56029j446347j407180l25494J34759o24279
31845g35179q97277L36692J262081K28490r89632J39639K299449J893467j208773
31836B328957l175784j922228K21272P17989L74024P61832J018326j38443j347969
31827a162024n68221J242729J451427O3805l26753J101443J982762M59011k044787
31818B199392k919333j618635L34800J393082J015860l73843j539627j306577
31810b814881k6442O24065m4425o47686J29567J391365J419862L99160k2842M23004
31800H30747K42388r96586j460621J40414K082989J750026n52648j859075n97036
$$ y = [-1375863, 807519, 2146336, 2471545, 2729447, 2957894, 2571651, 1827246, 1581517, 1992589, 2566378, 3074370, 3389391, 2933362, 1487015, 79835, -245659, -110900, -735179, -1632456, -1295764, -33683, 194807, -794825, -655186, 1644263, 3537730, 2328957, -846827, -2769055, -2547783, -1829794, -1455770, -693938, 324388, 185945, -1162024, -1730245, -487516, 963911, 1027716, 700963, 1802406, 3785168, 4244179, 2199392, -719941, -2338576, -2003776, -610694, 405166, 31323, -1508304, -2814881, -2841323, -2217258, -2261683, -2909369, -2779802, -1388437, 31425, 430585, 407743, 830747, 1073135, 76549, -1384072, -1243658, 839331, 2589357, 2036709, 177634, -419402]
31791d19402J440145J739825J93492j372882j682413q74141L70290J346523J368646
31782B110083M05705n31073n64550j88230l17874n64471J45333J456583J770983
31773C722489O98003m10849q05469j349168k351768k341746m89310J372086J092262
31764h63470n44517j028522R6387Q66784J01955j145737j534299r80024O2396
31755d969047J194896J602549O32767p37969o88599P01579J286488J30231r88573
31746a835678m61446O58484O33342j17446j05040N06646M13110l46096n61983
31737a216107j21558k0506k66056J56086J100752J120930l6481p59890j75232
31728b18062L94006l08720j281029p76143J019555K293785K018914P89312l82015
$$ y = [-419402, 1020743, 2760568, 2954060, 1581178, -101235, -975376, -605086, 741437, 2110083, 2515788, 1984715, 1420165, 1231935, 914061, 349590, 494923, 1951506, 3722489, 4420492, 4009643, 3204174, 1855006, -496762, -2838508, -3327818, -1955732, -863470, -1407987, -2436509, -2340122, -1473338, -1371383, -2517120, -4051419, -5031443, -4969047, -3774151, -2171602, -1538835, -2276804, -2965403, -2263824, -977336, -847105, -1835678, -2297124, -1638640, -1005298, -1122744, -1227784, -721138, -308028, -654124, -1216107, -1337665, -1358171, -1624227, -1468141, -367389, 753541, 717060, -42830, -218062, 175944, -132776, -1413805, -2189948, -1170393, 1123392, 3142306, 3931618, 3549603]
31719C549603r70712q41110k33523J81840p565k81722J37633J026172J241678
31710C802294J36152j579432k450378j563107N79887K257453J994637J61636j334163
31701B004979j284599m48332q7286j65393j2171P5445n61450j177024l13017J616936
31691c51912K330559R25546o38503m28290O44168M80750q80071j560287q86735
31682c64775p4139R7130K61448O98255N12578n09847r39572Q1231J070101L37890
31672A170300j145652j048485O65366J597044N69596p58538o80237J21354J99074
31663F89822j67321K03248J096366J256280N30328q3983l32617r29400j793866
31654D68857j748960m35931R30279J328710J129470Q34999K7650j351451j912542
$$ y = [3549603, 2578891, 1737781, 1504258, 1686098, 1678533, 1396811, 1534444, 2560616, 3802294, 3938446, 2359014, -91364, -1654471, -1074584, 1182869, 3177506, 3339142, 2004979, 720380, 272048, 184762, 19369, 7198, 82643, -478807, -1655831, -1968848, -351912, 1978647, 2904193, 2265690, 1837400, 2481568, 2962318, 2082247, 521960, -364775, -438914, -341784, -80336, 617919, 1130497, 620650, -318922, -237691, 832410, 1170300, 24648, -1023837, -358471, 1238573, 1808169, 1049631, 369394, 490748, 689822, 522501, 725749, 1822115, 3078395, 3608723, 3524740, 3192123, 2262723, 468857, -1280103, -1716034, -785755, 542955, 1672425, 2507424, 2535074, 1183623, -728919]
31645g28919n10929J694688K439457J296147n4320m23315m48551r56107j409255
31636H98896r21723P2759L29973k95551n46768L53043J353067Q73807q83906j950504
31626g16907j188828J28075K10732n93615n08555O43791J019448k31317j460730
31617b697906j138237k38278l43469p65804K14530K038164K329650O32542p64760
31608g33568k95936P85022P61707n23k58652j49240n62056j167639p75286O53995
31598a742176J748828J499071L07116p65583j052398n61529J81078M93344J39614
31589B47365l96879m37518K01087J110701J628788J278169K86333l89532j43956
31580C384558K81499k57623j434591j714204o74917L38999L94003K61594O38277
$$ y = [-728919, -1239848, 454840, 2894297, 4190444, 4136124, 3712809, 3264258, 2308151, 898896, -22827, 49932, 379905, 84354, -462414, -109371, 1243696, 2117503, 1233597, -716907, -1905735, -1777660, -1566928, -2160543, -2669098, -2025307, -1005859, -1237176, -2697906, -3836143, -4074421, -4417890, -5183694, -4969164, -2931000, -601350, 31192, -733568, -1029504, -244482, 517225, 516702, 258050, 108810, -453246, -1620885, -2396171, -1742176, 6652, 1505723, 1812839, 1047256, -5142, -566671, -385593, 107751, 247365, -149514, -587032, -385945, 724756, 2353544, 3631713, 3918046, 3528514, 3384558, 3666057, 3408434, 1973843, 259639, -415278, -76279, 317724, 579318, 1217595]
31571A217595O28528n88274j843898j468251J17080J003891M66701n56859j178942
31562b202429j171655l11403J216604K117281J420695L00987O02915J846915J868337
31553E688247L72498o29699l13184l13214j527823k217517r29134Q20945P91976
31544A743095o55615j535227j266540o62684L5986R08984R85556m67885j800689
31535b715019p17094J874034K476469Q4776k012057q85204J810866K336236J41718
31526B394725j765959j252873M56736J102722L50312n35000p74298o26737m14494
31517a064866j55814p0116m60419r36200o26689M81773J240501R35017L97479
31508b59334O43573J078871L73438j173856j745645p40766K31976q9850n66981
$$ y = [1217595, 1846123, 1257849, -586049, -2054300, -1937220, -933329, -466628, -1023487, -2202429, -3374084, -3685487, -2468883, -351602, 1069093, 1370080, 1972995, 3819910, 5688247, 6060745, 5431046, 5117862, 4804648, 3276825, 1059308, 130174, 951119, 1743095, 1087480, -447747, -1714287, -2376971, -2340985, -1432001, -446445, -914330, -2715019, -3432113, -1558079, 918390, 1003166, -1008891, -1894095, -83229, 2253007, 2394725, 628766, -624107, -167371, 935351, 1285663, 750663, -23635, -650372, -1064866, -1220680, -1290796, -1751215, -2687415, -3314104, -2832331, -1591830, -656813, -259334, 384239, 1463110, 1836548, 662692, -1082953, -1823719, -1591743, -1681593, -2248574]
31499b248574M32416K131488K219980L13638j350828j055781J67512L38910o07892
31490C40869j037394j73704Q95644R55459L35423J58437N12056L57166p33776
31481A610180j728552j555317o13478m93K29434Q34135J617442J380807j114q95111
31471H77933j41638J179784J288646J23144r39794j092408o14205O5112N73232
31462A319806L16419p23988j323595n26607N57566R2037j563312k148292q81095
31453d881061M58536M29688l6278M30161J366856J550630J018809N10868m1192
31444H07017q58538j038321K49651J817686J633705j59024j254965m89262O21535
31435A329484L10248r60358j468097o52983N43226J167581J086189O17755J48620
$$ y = [-2248574, -1816158, 315330, 2535310, 2848948, 1498120, 442339, 609851, 948761, 340869, -696525, -870229, 25415, 980874, 1316297, 1474734, 1986790, 2343956, 1610180, -118372, -1673689, -2287167, -2287660, -2058226, -1224091, 393351, 1774158, 1773044, 877933, 736295, 1916079, 3204725, 3327869, 2388075, 1295667, 681462, 746574, 1319806, 1636225, 912237, -411358, -937965, -380399, -288362, -1851674, -3999966, -4881061, -4422525, -3992837, -4029115, -3598954, -2232098, -681468, 337341, 848209, 807017, -51521, -1089842, -840191, 977495, 2611200, 2452176, 1197211, 707949, 1329484, 1639732, 679374, -788723, -1441706, -898480, 269101, 1355290, 1973045, 2121665]
31426B121665o612P0065j39177q59246j522683j499333r97734n81576r5381R86425
31416b523587K172366K056989L13017j363673j189051L79359J244650L56928j239786
31407B07212k054034j749214p80071M85846J553442J560979K94317r93713q20576
31398b295812O10988J664536J396809M96293k0745j08675l00871p36388j048945
31389c42810q08938J55991J434241J967203J006735p09608j564350j117070n99537
31380e78143q86425j094824j39448J276570J546600M98675n41401q03646p94095
31371a516137r04856o92624M3445O44800O60047N74261Q12528Q67831K10258o41602
31361E7951q54155n38243k97724N2510J116981K360349K247821L99185j487855
$$ y = [2121665, 2115053, 2185118, 2045941, 1186695, -335988, -1835321, -2833055, -3414631, -3510012, -2523587, -351221, 1705768, 2018785, 655112, -533939, -154580, 1090070, 1446998, 207212, -1846822, -3596036, -4376107, -3890261, -2336819, -775840, -481523, -1475236, -2295812, -1684824, -20288, 1376521, 1872814, 1852069, 1743394, 1442523, 706135, -342810, -1151748, -995757, 438484, 2405687, 3412422, 2702814, 1138464, 21394, -578143, -1464568, -2559392, -2698840, -1422270, 124330, 623005, 81604, -722042, -1516137, -2420993, -3113617, -3070172, -2425372, -1765325, -1191064, -378536, 489295, 699553, 57951, -796204, -1334447, -1632171, -1579661, -462680, 1897669, 4145490, 4544675, 3056820]
31352C056820j683748o51733k06250q58752j252071m05491O72854M23059r04061
31343a809373j410027m4480J967648K575662J250757n80517j210067l50067P88917
31334A178453Q45741l20611j535577j596228n81919L51643M74738L34584P89599
31325e9577J548736J328208l84948k233273k217573p0751K091572J988424j16044
31316A874774j647010r19392P40851R17792m96553j261830j45115J324673J221677
31307A609867n6706p57301n01017l62258o12238k20253J099202J953991J190660
31298C343947l88853j158999p46228n3063K29428J83979O0848j6504J05466L23458
31288A883479K3974j070643j958011j288474O13764J750572R82677m25224o36537
$$ y = [3056820, 1373072, 721339, 515089, -343663, -1595734, -2001225, -1328371, -905312, -1809373, -3219400, -3263880, -1296232, 1279430, 2530187, 1949670, 739603, 389536, 1178453, 2024194, 1703583, 168006, -1428222, -2010141, -1658498, -1183760, -849176, -59577, 1489159, 2817367, 2432419, 199146, -2018427, -2089178, 2394, 1990818, 1874774, 227764, -691628, 49223, 967015, 470462, -791368, -936483, 388190, 1609867, 1553161, 795860, 294843, -67415, -679653, -899906, 199296, 2153287, 3343947, 2955094, 1796095, 1049867, 996804, 1226232, 1410211, 1471059, 1454555, 1560021, 1883479, 1907453, 836810, -1121201, -2409675, -1795911, -45339, 937338, 512114, -124423]
31279a24423K12306N58467M5463m3410P52103Q72773q54667k815296k349131M49675
31269c296140K476638J580260p17136j398248K00258J960565J914244L42214j075187
31260A987468j202829k36378Q01307R97067L33044k98441j60679K87004m4832
31251B462731j189429j747063p01987R55094J284459m9075j239356p31542O84720
31242b71448J048331J9449p61715k20812O37049N29863k9868J65435P15184K21224
31232B052692j126306j588956p00591Q490k71217k98059P17761J362595M66904
31223F23313n32922J20992J307674O88005j394486k454592j802840j038709o99741
$$ y = [-124423, 87883, 646350, 691813, 648403, 1400506, 2273279, 1418612, -1396684, -3745815, -3296140, -819502, 760758, 43622, -1354626, -1154368, 806197, 2720441, 3062655, 1987468, 784639, 548261, 1349568, 2346635, 2679679, 2381238, 2220559, 2507563, 2462731, 1273302, -473761, -1175748, -220654, 1063805, 1014730, -224626, -956168, -271448, 776883, 796332, 34617, -186195, 450854, 980717, 950849, 1116284, 1831468, 2052692, 926386, -662570, -1363161, -1354671, -1625888, -1923947, -1206186, 156409, 623313, 90391, 211383, 1519057, 2207062, 812576, -1642016, -3444856, -4483565, -5183306]
$$ [...]
##END NTUPLES=NMR SPECTRUM
##END=
