##TITLE=31Pdec_LY-TMF-10.100.2
 D2O, 24 sc
 6.3.2020
##JCAMPDX= 6.0         $$ Bruker NMR JCAMP-DX V2.0
##DATA TYPE= NMR SPECTRUM
##DATA CLASS= NTUPLES
##ORIGIN= UXNMR, Bruker Analytische Messtechnik GmbH
##OWNER= root
$$ XWIN-NMR		Version 3.5
$$ Fri Mar  6 18:33:57 2020 Russian Standard Time (UT+4h)  she@DPX200
##.OBSERVE FREQUENCY= 81.013821
##.OBSERVE NUCLEUS= ^31P
##.ACQUISITION MODE= SIMULTANEOUS
##.ACQUISITION SCHEME= undefined
##.AVERAGES= 24
##.DIGITISER RES= 17
##SPECTROMETER/DATA SYSTEM= spect
##.PULSE SEQUENCE= zgpg30
##.SOLVENT NAME= Acetone
##.SHIFT REFERENCE= (INTERNAL, Acetone, 0, 182.463)
##AUDIT TRAIL= $$ (NUMBER, WHEN, WHO, WHERE, WHAT)
$$ ##TITLE= Audit trail, XWIN-NMR		Version 3.5
$$ ##JCAMPDX= 5.01
$$ ##ORIGIN= Bruker BioSpin GmbH
$$ ##OWNER= she
$$ F:/spectra/data/she/nmr/P31/1/pdata/1/auditp.txt
$$ ##AUDIT TRAIL=  $$ (NUMBER, WHEN, WHO, WHERE, WHAT)
(   1,<2020-03-06 18:32:40.84 +0400>,<she>,<DPX200>,
      <created by zg, POWCHK disabled, PULCHK disabled
       configuration hash MD5:
       00 E9 B6 7A A2 85 ED C7 34 08 36 98 17 FE 4E 26
       data hash MD5: 32K
       F4 B6 37 8E BE A5 01 5F DB 0E 9E 66 F0 00 D5 4C>)
(   2,<2020-03-06 18:32:44.76 +0400>,<she>,<DPX200>,
      <Start of raw data processing
       efp BC_mod = 2 LB = 1 FT_mod = 6 PKNL = 1 PHC0 = -1361.802 PHC1 = 150.6017 SI = 64K 
       data hash MD5: 64K
       61 65 F0 CB 45 6D E0 24 AD F7 D2 A3 BA 9D 95 1E>)
(   3,<2020-03-06 18:33:07.75 +0400>,<she>,<DPX200>,
      <pk PHC0 = 4.350506 PHC1 = 0 
       data hash MD5: 64K
       C3 20 10 C7 9C EE 06 2B 63 C9 26 8E 02 6B 70 FF>)
(   4,<2020-03-06 18:33:11.82 +0400>,<she>,<DPX200>,
      <abs ABSG = 5 
       data hash MD5: 64K
       84 5C A2 C8 12 A6 13 FE 8F F0 D1 7B 76 06 B2 CE>)
$$ ##END=
$$ 
$$ hash MD5
$$ DE 5C 32 57 5B 86 A0 2B 50 09 70 A2 DA DC EE E6
##$RELAX= 
##$RELAX= 
##$RELAX= 
##$RELAX= 
##$RELAX= 
##$RELAX= 
##$RELAX= 
##$RELAX= 
$$ Bruker specific parameters
$$ --------------------------
##$DU= <F:/spectra>
##$EXPNO= 1
##$NAME= <P31>
##$PROCNO= 1
##$TYPE= <nmr>
##$USER= <she>
##$AMP= (0..31)
100 100 100 100 100 100 100 100 100 100 100 100 100 100 100 100 100 100 
100 100 100 100 100 100 100 100 100 100 100 100 100 100 
##$AQSEQ= 0
##$AQ_mod= 1
##$AUNM= <au_zg>
##$AUTOPOS= <>
##$BF1= 81.014009
##$BF2= 200.13
##$BF3= 200.13
##$BF4= 200.13
##$BF5= 200.13
##$BF6= 200.13
##$BF7= 200.13
##$BF8= 200.13
##$BYTORDA= 1
##$CFDGTYP= 0
##$CFRGTYP= 5
##$CHEMSTR= <none>
##$CNST= (0..31)
1 1 145 1 1 1 1 1 1 1 1 1 1 1 1 1 1 1 1 1 1 1 1 1 1 1 1 1 1 1 1 1 
##$CPDPRG= <waltz16>
##$CPDPRG1= <>
##$CPDPRG2= <waltz16>
##$CPDPRG3= <>
##$CPDPRG4= <mlev>
##$CPDPRG5= <mlev>
##$CPDPRG6= <mlev>
##$CPDPRG7= <mlev>
##$CPDPRG8= <mlev>
##$CPDPRGB= <>
##$CPDPRGT= <>
##$D= (0..31)
0 1 0 0 0 0 0 0 0 0 0 0.03 2e-05 3e-06 0 0 0 0 0 0 0 0 0 0 0 0 0 0 0 0 
0 0 
##$DATE= 1583505160
##$DBL= (0..7)
120 120 120 11 120 120 24 19 
##$DBP= (0..7)
150 150 150 150 150 150 150 150 
##$DBP07= 0
##$DBPNAM0= <>
##$DBPNAM1= <>
##$DBPNAM2= <>
$$ [...]
##$SUBNAM3= <"">
##$SUBNAM4= <"">
##$SUBNAM5= <"">
##$SUBNAM6= <"">
##$SUBNAM7= <"">
##$SUBNAM8= <"">
##$SUBNAM9= <"">
##$SW= 369.568048894756
##$SWIBOX= (0..15)
0 1 3 0 0 0 0 0 0 0 0 0 0 0 0 0 
##$SW_h= 29940.119760479
##$TD= 32768
##$TD0= 1
##$TE= 0
##$TE2= 300
##$TE3= 300
##$TEG= 300
##$TL= (0..7)
0 120 53 12 22 120 120 120 
##$TP= (0..7)
150 150 150 150 150 150 150 150 
##$TP07= 0
##$TPNAME0= <>
##$TPNAME1= <>
##$TPNAME2= <>
##$TPNAME3= <>
##$TPNAME4= <>
##$TPNAME5= <>
##$TPNAME6= <>
##$TPNAME7= <>
##$TPOAL= (0..7)
0.5 0.5 0.5 0.5 0.5 0.5 0.5 0.5 
##$TPOFFS= (0..7)
0 0 0 0 0 0 0 0 
##$TUNHIN= 0
##$TUNHOUT= 0
##$TUNXOUT= 0
##$USERA1= <user>
##$USERA2= <user>
##$USERA3= <user>
##$USERA4= <user>
##$USERA5= <user>
##$V9= 5
##$VALIST= <valist>
##$VCLIST= <CCCCCCCCCCCCCCC>
##$VD= 0
##$VDLIST= <DDDDDDDDDDDDDDD>
##$VPLIST= <PPPPPPPPPPPPPPP>
##$VTLIST= <TTTTTTTTTTTTTTT>
##$WBST= 1024
##$WBSW= 4
##$XGAIN= (0..3)
0 0 0 0 
##$XL= 0
##$YL= 0
##$YMAX_a= 11332
##$YMIN_a= -14961
##$ZGOPTNS= <>
##$ZL1= 120
##$ZL2= 120
##$ZL3= 120
##$ZL4= 120
##$ABSF1= 182.463
##$ABSF2= -187.1042
##$ABSG= 5
##$ABSL= 3
##$ALPHA= 0
##$AQORDER= 0
##$ASSFAC= 0
##$ASSFACI= 0
##$ASSFACX= 0
##$ASSWID= 0
##$AUNMP= <proc_1d>
##$AZFE= 0.1
##$AZFW= 0.5
##$BCFW= 0
##$BC_mod= 2
##$BYTORDP= 0
##$COROFFS= 0
##$CY= -3
##$DATMOD= 1
##$DC= 0
##$DFILT= <>
##$DTYPP= 0
##$F1P= 0
##$F2P= 0
##$FCOR= 1
##$FTSIZE= 65536
##$FT_mod= 6
##$GAMMA= 0
##$GB= 0
##$INTBC= 1
##$INTSCL= 5.30512e-09
##$ISEN= 30
##$LB= 1
##$LEV0= 0
##$LPBIN= 0
##$MAXI= 10000
##$MC2= 0
##$MEAN= 0
##$ME_mod= 0
##$MI= 50
##$NCOEF= 0
##$NC_proc= -5
##$NLEV= 6
##$NOISF1= 182.463
##$NOISF2= 159.3651
##$NSP= 0
##$NTH_PI= 0
##$NZP= 0
##$OFFSET= 182.463
##$PC= 4
##$PHC0= -1357.452
##$PHC1= 150.6017
##$PH_mod= 1
##$PKNL= yes
##$PPARMOD= 0
##$PSCAL= 0
##$PSIGN= 0
##$REVERSE= no
##$SF= 81.0140089999434
##$SI= 65536
##$SIGF1= 159.3651
##$SIGF2= -187.1042
##$SINO= 113.3802
##$SIOLD= 16384
##$SREGLST= <1H.CDCl3>
##$SSB= 0
##$STSI= 65536
##$STSR= 0
##$SW_p= 29940.119760479
##$SYMM= 0
##$S_DEV= 0
##$TDeff= 32768
##$TDoff= 0
##$TI= <>
##$TILT= no
##$TM1= 0
##$TM2= 0
##$TOPLEV= 0
##$USERP1= <user>
##$USERP2= <user>
##$USERP3= <user>
##$USERP4= <user>
##$USERP5= <user>
##$WDW= 1
##$XDIM= 65536
##$YMAX_p= 445512325
##$YMIN_p= -7063075
$$ End of Bruker specific parameters
$$ ---------------------------------
##NTUPLES= NMR SPECTRUM
##VAR_NAME=  FREQUENCY,     SPECTRUM/REAL,   SPECTRUM/IMAG
##SYMBOL=    X,             R,               I
##VAR_TYPE=  INDEPENDENT,   DEPENDENT,       DEPENDENT
##VAR_FORM=  AFFN,          ASDF,            ASDF
##VAR_DIM=   65536,         65536,           65536
##UNITS=     HZ,            ARBITRARY UNITS, ARBITRARY UNITS
##FACTOR=    0.456856943014862, 1,           1
##FIRST=     14782.0589164792, 0,            0
##LAST=      -15158.0608439998, 0,           0
##MIN=       -15158.0608439998, -7063075,    0
##MAX=       14782.0589164792, 445512325,    0
$$ Real data points
##PAGE= N=1
##DATA TABLE= (X++(R..R)), XYDATA
$$ [...]
##PAGE= N=2
##DATA TABLE= (X++(I..I)), XYDATA
36714a657021N53577J197394P60301j41673l78581K0316R5197l32061m33954J9841
36704b96664J27381n96032j252259q84095R4511O45139O38095O99106R43058Q62052
36694I80292L44394j11385k52428l41937m51939k72439J27167J27779m20043p21398
36684i91937j91030N29251N00992k5542m6632M99507O32169N6973k10256M81544
36674A235039J162818O11366p12335j228054m43886N11722N86503J8131m15749
36665A325555n03582m89097m52299l15821j39886l3159J5579J5850n5870o0568
36655f93298J72881M31102K95769j15800j50988L64742P05928K73525m77496o82822
36645A23543k34513K78817M74920M17109J95734j15730k51037p8898J0758l57834
$$ y = [-1657021, -1103444, 93950, 854251, 712578, 333997, 354313, 449510, 117449, -316505, -296664, -169283, -765315, -2017574, -2901669, -2807158, -2162019, -1523924, -824818, 118240, 980292, 1324686, 1213301, 960873, 618936, 166997, -105442, 21725, 149504, -270539, -991937, -1182967, -653716, -152724, -178266, -224898, 274609, 906778, 963751, 753495, 1235039, 2397857, 3009223, 2296888, 1068834, 624948, 1136670, 1723173, 1741304, 1325555, 821973, 332876, -119423, -435244, -575130, -608289, -592710, -576860, -632730, -693298, -520417, -89315, 206454, 90654, -60334, 304408, 1010336, 1283861, 806365, 123543, -110970, 167847, 642767, 1059876, 1255610, 1139880, 888843, 809945, 820703, 462869]
36635D62869p77600n15009L20487Q12589N35430P3871K1654J75343J15478l6336
36625A188776J5128P3814k12770o07565n16136Q1227N04652L02224j58668k64104
36615D06578J8034K11437N1996k41600m04221m56468m55857k60042J50912L79553
36605e99678J05507k52170L7045Q54104J163713M33616n02869n69653M5180K55449
36595I70244l00904q44018o85996j09267K41862K44641K05562K81812L58972K96652
36585F59560N8567k55917m06121k25147J12229K68028J98002J47945K08993K38855
36575A004994K27382L00469L12196m7997n98657o83268j24949L72647J77424l81130
36565E59111n50075k00756K00925L95514N16420N99679M57996P2869k85648l83118
$$ y = [462869, -314731, -829740, -509253, 303336, 838766, 912637, 934291, 1109634, 1225112, 1188776, 1203904, 1277718, 1064948, 457383, -58753, 22474, 527126, 829350, 670682, 406578, 424612, 636049, 688045, 446445, 42224, -414244, -870101, -1130143, -979231, -599678, -494171, -746341, -709296, 144808, 1308521, 1742137, 1239268, 669615, 714795, 970244, 669340, -174678, -860674, -969941, -728079, -483438, -277876, 3936, 362908, 659560, 718127, 462210, 56089, -169058, -56829, 211199, 409201, 557146, 766139, 1004994, 1232376, 1532845, 1845041, 1797044, 1198387, 515119, 390170, 762817, 940241, 559111, 9036, -191720, 9205, 404719, 921139, 1520818, 1978814, 2051683, 1766035, 1382917]
36555A382917k19161M4857J42366j55869o86166q83626m72331N6324Q9173j90868
36545h92384r3916M72490Q42168O10054J68164j5703o7578k62389l83296o5979
36535C11631M66212N68538M7844n77243p57399m84815n2008M08245Q40352R40086
36525A711443L66072o38925j218368p93900J98025P89693O01838J05039j94231
36516I26686l24389m49919m23336j28126J04433p9282m22766l56484J75870O71989
36506c05324Q06061P21968N78610L07831n9730k88239l22983l64847l89551o3245
36496F20551N81697Q66385L33389m40389m88486K12495O69722K37001n06874n94024
36486A491467j8631K82675k27551q91506p13280K89297J069232Q59379J7265o04348
$$ y = [1382917, 1163756, 1208613, 1350979, 1195110, 508944, -374682, -847013, -790689, -701516, -892384, -986300, -513810, 328358, 938412, 1106576, 1090873, 1023295, 760906, 377610, 311631, 777843, 1346381, 1394225, 816982, 59583, -425232, -477240, -68995, 771357, 1711443, 2077515, 1438590, 220222, -573678, -375653, 414040, 1015878, 1120917, 926686, 602297, 152378, -270958, -399084, -294651, -373933, -796699, -1153183, -977313, -305324, 500737, 1222705, 1801315, 2109146, 2049416, 1761177, 1438194, 1073347, 683796, 620551, 1202248, 2068633, 2402022, 1961633, 1473147, 1685642, 2355364, 2592365, 2085491, 1491467, 1472836, 1755511, 1527960, 636454, -76826, 212471, 1281703, 2141082, 2158347, 1553999]
36476A553999o79335m52874j41527J76087K51205j52383p34270q34006k61981
36467a275085M67455Q49339Q94117P61957L78618k64001q03056q96000o95572
36458e82228n90841o25744m80424M5355P50001J194854J079013N68748K39602
36449A598336M34504P05743L14464o58664j255483r18694k39802l2711k26303
36440b78610k48246k8918J03871K13302O24808J114999J014382K09728n94897
36431B130419p73712m41024j00521o4360l02899m91933k08076N30058J012002
36422A289954O38675j31148l00285K15981M43384j69750r20844r00209k15977
36413e0219L33480L47890J00448L9216L80965R32285J087407L66437q41603j515566
$$ y = [1553999, 874664, 421790, 280263, 456350, 707555, 555172, -179098, -1013104, -1275085, -807630, 41709, 935826, 1697783, 2076401, 1812400, 1009344, 113344, -582228, -1173069, -1798813, -2279237, -2233882, -1483881, -289027, 789986, 1358734, 1598336, 2032840, 2738583, 3053047, 2394383, 1138900, 220206, -19596, -52307, -278610, -526856, -555774, -451903, -238601, 386207, 1501206, 2515588, 2725316, 2130419, 1356707, 915683, 815162, 750802, 447903, -44030, -252106, 277952, 1289954, 1928629, 1797481, 1497196, 1713177, 2156561, 1986811, 1065967, 165758, -50219, 283261, 631151, 731599, 770815, 1151780, 2084065, 3171472, 3537909, 2696306, 1180740]
36403A180740j203185m93365p7585L3367M2271j49943m67265l48061M18426J109393
36393D4793J020015M80400K12994K25441J48583J10418L14402K67995m56459j132960
36383A235622q16792k1129p686n99515m03453O59727R28801k75995j314479o89819
36373a304718O93333J115121O33221M75173P53738N77385m0033j58463K99870
36364C044627L64214k49447o88503n25956l94723o36760o14397K9337N73990M00668
36354A303050k9370j26488j68192n09123o88942l09455N145l35172n79276K41561
36344a196262J375419J149525l82098j270983m94933O43780O55297l2961j90315
36335B56469J45027R6158k67502q4405O21289Q38708K19134m23914n18999n09516
$$ y = [1180740, -22445, -515810, -593395, -560028, -517757, -667700, -1134965, -1483026, -1064600, 44793, 1064808, 1545208, 1758202, 1983643, 2132226, 2242644, 2557046, 2825041, 2368582, 1235622, 418830, 397701, 390015, -209500, -612953, 46774, 975575, 699580, -614899, -1304718, -611385, 503736, 1136957, 1612130, 2365868, 2943253, 2903220, 2744757, 3044627, 3408841, 3159394, 2470891, 1944935, 1550212, 913452, 299055, 328392, 902382, 1303050, 1273680, 1147192, 979000, 469877, -219065, -528520, -523375, -858547, -1437823, -1196262, 179157, 1328682, 946584, -324399, -819332, -175552, 479745, 446784, 256469, 401496, 497654, 230152, 145747, 767036, 1605744, 1824878, 1400964, 881965, 372449]
36325C72449q00808r53999n32555P8430L82573O17559J138575J498735R84474
36316B785433k26033j195661j369544r72199m23662M3687K83156K82710K62509
36307e29604L37927K77069j4530j06991L08646P32400M96043j78092m95438k40183
36297E87247J55645M44768O06947L27140n33362j146794o10444M58666O01940
36288H91753j54455k69226O71992J100605Q3067r81993n94018M55942N66497m0297
36278A729867o5210L99089K37495l72051j93447O42925O22295m99440j111375
36269A390148m05312L38889K9673m52736K4304Q25079P09020q2212m36115k94525
36259A646213m21737p46227m93829K10073L72219j29602k27290N36816J121523
$$ y = [372449, -428359, -1382358, -1914913, -1836483, -1453910, -836351, 302224, 1800959, 2785433, 2559400, 1363739, -5805, -978004, -1401666, -1357979, -1074823, -792113, -529604, -191677, 85392, 70862, -36129, 272517, 1004917, 1500960, 1322868, 827430, 587247, 742892, 1187660, 1794607, 2121747, 1588385, 441591, -168853, 289813, 891753, 737298, 468072, 1140064, 2240669, 2323736, 1341743, 747725, 1203667, 1770164, 1729867, 1664657, 2063746, 2301241, 1929190, 1735743, 2378668, 3000963, 2501523, 1390148, 984836, 1323725, 1353398, 900662, 924966, 1750045, 2459065, 2376853, 1940738, 1646213, 1224476, 478249, -15580, 194493, 566712, 437110, 209820, 746636, 1868159]
36250A868159N66060n06135q37847l55329l6718k42844k46032L91726R04616M01022
36240A906678p17987j228351p50261q8683J24180K00709M81545N81418K22071
36231G31319J0164M42681P77231P7586j029247j035404R7563P57613J23330o62813
36221B90023l73417N33408Q81754M88470m1747m12243n73586k65329M17002O05518
36211A549853j97917j090023r06225N1180N10213J23442k76777j55252J29749
36202b61757K25298K31190J13887l74017r66420r29549j34374O29774P14320L73674
36192c77974J90634K95030M55772N02408L74370Q2069j85838j76111J18225M69598
36182A748183O71148N40334r4421r98799j390222p62614L24037Q74106P00479
$$ y = [1868159, 2434219, 1928084, 1090237, 734908, 698190, 455346, 209314, 601040, 1505656, 1906678, 1188691, -39660, -789921, -878604, -754424, -553715, -72170, 509248, 731319, 741483, 1184164, 1961395, 2038981, 1009734, -25670, 71893, 829506, 952836, 290023, -83394, 450014, 1331768, 1820238, 1778491, 1366248, 792662, 527333, 944335, 1549853, 1351936, 261913, -644312, -593132, -82919, 40523, -236254, -391506, -261757, -36459, 194731, 308618, -65399, -1031819, -1961368, -2095742, -1465968, -751648, -377974, -187340, 107690, 563462, 1065870, 1440240, 1522309, 1336471, 1160360, 1278585, 1748183, 2419331, 2959665, 2865244, 1866445, 476223, -286391, 37646, 911752, 1612231]
36173A612231L89081K19788o7228m89077o53867m64264k39480o7870K26069M59079
36163I24462K71509l4898K02451P44026N53294n31807j327878j005168k20812
36154d24821Q4568L7673J77729L30580J08832j24122J89425P21479O89676O7391
36144A858410m84141o23619m77876p2544N43446Q37709L53030l85731m01697L11814
36134A458801P54232L80791k35522m12374k51730j75479k09604j84733k00097
36125I24285m09769n96562l84343J92066O21596M73627r2289m58268k48805J68969
36115A90507J28920l63425n30334M1658O44966M09478l09298l20172O28818J333126
36105A854244P55105n22839j084913n28453J94971K15382j79196j82988L07717
$$ y = [1612231, 2001312, 2221100, 2153872, 1664795, 1010928, 546664, 307184, 239314, 465383, 924462, 1195971, 1161073, 1363524, 2107550, 2660844, 2129037, 801159, -204009, -424821, -340253, -302580, -124851, 205729, 314561, 190439, 379864, 1101343, 1791019, 1858410, 1374269, 750650, 272774, 200230, 743676, 1581385, 1934415, 1548684, 1146987, 1458801, 2213033, 2593824, 2358302, 1945928, 1694198, 1518719, 1309115, 1124382, 924285, 514516, -82046, -466389, -274323, 347273, 820900, 728611, 270343, 21538, 190507, 319427, -43998, -574332, -532674, 112292, 521770, 212472, -107700, 521118, 1854244, 2609349, 2086510, 1001597, 473144, 668115, 883497, 704301, 521313, 829030]
36096H29030O48101M60250J06892p311q1631m31238p17879l30958N36534R11197
36086A922987L44090m46358o25296l80274m23027p36491n86648K45503R55069
36077B69555P35157j14320n14724N2383Q84918R11742M7805o54975l55451M50487
36067A712577O17237m3309n40123j87602M36595M47724l3802j92186J79049M13407
36057B809567K8487n35584n01699J73954O26228R8954r65297j239205j82200J038406
36047A351611R56304j72583p57419k31557K60739q7178m19446J35286P42403J82405
36037A960565r61623j073661m7164O23133K52374j81818P3099L25316j91447r19402
36027a40628q48229k0136O63630O64972J99704k28916k09193L24010Q52912O71795
$$ y = [829030, 1477131, 1937381, 2044273, 2036962, 1955331, 1524093, 806214, 475256, 1011790, 1922987, 2267077, 1820719, 1195423, 815149, 392122, -344369, -931017, -685514, 269555, 1004712, 890392, 375668, 428051, 1312969, 2224711, 2272516, 1617541, 1262090, 1712577, 2329814, 2286505, 1746382, 1558780, 1995375, 2443099, 2409297, 2217111, 2396160, 2809567, 2838054, 2302470, 1800771, 1974725, 2600953, 2699907, 1734610, 495405, 313205, 1351611, 2307915, 2135332, 1377913, 1146356, 1407095, 1319917, 900471, 1035757, 1778160, 1960565, 998942, -74719, -121883, 501250, 753624, 571806, 644905, 970221, 778774, -140628, -988857, -1008993, -345363, 319609, 519313, 290397, 81204, 405214, 1258126, 1929921]
36017A929921j82488q28750o65214j05308J57241R9110J15844K57403K64077R9958
36007A141794m1985j13662k09337l11107l18083k02199M3199M00030O24674L70876
35997A384200k58999o21869l06090K87359M84421K19932k5174k1646n8342l44634
35987G39158n42743k04041M54252O08174j14938r29959p50574L14294R96630N92108
35977A162361j33519k43152j2274j71429m71316j79515M18611L65942k48525l15560
35967A71624M20098Q89484M48200k12090l81092k92701j83921L14659J061021
35958B235282R41056m29502j634137j287939n1511M51933j9516m31853l53647
35949e79834k63458k64345P8422O20449O13307m3144n43453l52098J96069N77748
$$ y = [1929921, 1747433, 918683, 253469, 148161, 305402, 404512, 520356, 777759, 1041836, 1141794, 1099809, 986147, 776810, 465703, 147620, -54579, -11380, 388650, 1013324, 1384200, 1125201, 503332, 197242, 484601, 969022, 1188954, 1163780, 1142134, 1083792, 739158, 196415, -7626, 446626, 1054800, 939862, 9903, -740671, -426377, 570253, 1162361, 1028842, 785690, 773416, 601987, 130671, -48844, 369767, 735709, 487184, 171624, 591722, 1481206, 1929406, 1717316, 1336224, 1043523, 859602, 1174261, 2235282, 3176338, 2746836, 1112699, -175240, -226751, 225182, 205666, -226187, -579834, -843292, -1107637, -1029215, -408766, 204541, 161397, -382056, -734154, -538085, 39663]
35939C9663O16109K99080k13181m05115N7358O48308N63017q8204m25799r0491
35929A000745L93856N38942M08249J85797o5344j94146j30519j63953m41519m67105
35919A065003J33299P22581N14058n6101m0928K54522k42541j210080j060488
35910G9325L93918J227099J86497j401160j625694n69540L75807O75574P37366
35901G9192O35209J77256k44547j50010O0463k13135n26548n9455P89058Q07971
35891A355454j11792p76495n14987P577O9539j13907q7724P6484J74649K81091
35881C59889L53989J17940k86983k45477L30987O69884L18866o7754J86279N53596
35871B291216O9170j073348j683574j221817l44691K69373P12185J150776J196468
$$ y = [39663, 655772, 954852, 741671, 336556, 393914, 1042222, 1605239, 1517035, 1091236, 1000745, 1394601, 1933543, 2341792, 2527589, 2462245, 2268099, 2137580, 1973627, 1532108, 1065003, 1198302, 1920883, 2434941, 2378840, 2337912, 2592434, 2349893, 1139813, 79325, 473243, 1700342, 1886839, 485679, -1140015, -1709555, -1333748, -658174, 79192, 714401, 891657, 647110, 497100, 557563, 344428, -182120, -241575, 547483, 1355454, 1243662, 467167, -47820, -40243, 29296, -84611, -172335, -95851, 78798, 359889, 713878, 831818, 544835, 299358, 630345, 1300229, 1619095, 1551341, 1737620, 2291216, 2360386, 1287038, -396536, -1618353, -1963044, -1693671, -981486, 169290, 1365758]
35862A365758N74767j65619l32151j24121k50192p09279p62967j47691M93924
35853e7571O25760N09147M87390L12686j82197l71101L05354J124435P74500p31789
35843B796614j827751j364600o79Q03946N22020k18741o33318m35932J69696O50477
35833D61732N18001n9333k66410L46116J130368J080605J01839r35624j275756
35824A101538r37864l72333N6870J91332P9078j3195J60475M90006N97567K96844
35814A650318j91258m90618m13391p3978K37452L27602K79198K57840J81897j37608
35804A627454n08956m40141J02107M68618K07495k53499k72724K1462J3034l67343
35794E97507n64597l05925N1318J60382J25297J48149J92331J84064J93005K37098
$$ y = [1365758, 1940525, 1774906, 1442755, 1318634, 1068442, 359163, -403804, -551495, -57571, 568189, 1077336, 1564726, 1877412, 1695215, 1324114, 1629468, 2753903, 3528403, 2796614, 968863, -395737, -396416, 407530, 929550, 710809, 77491, -358441, -188745, 461732, 979733, 920400, 653990, 1000106, 2130474, 3211079, 3312918, 2377294, 1101538, 163674, -208659, -151789, 39543, 118621, 105426, 265901, 755907, 1353474, 1650318, 1459060, 968442, 555051, 481073, 718525, 1046127, 1325325, 1583165, 1765062, 1627454, 1118498, 678357, 780464, 1249082, 1456577, 1203078, 930354, 951816, 964850, 597507, 32910, -273015, -221697, -61315, 63982, 212131, 404462, 588526, 781531, 1018629]
35784A018629J77972o2618l84301o36621o82061m27167m5021K4839l13969m36133
35774a766451K07220J091826J170228L90840j98336l7066J83454k22736p89218
35765B9761p01769q5791L21206L32999L29522M07995L26664J26025O0272L7005
35755A183889j53743k03443K91925Q52029N31337n37718j026969k40996Q43261
35746A539572R54794J72847n33841p66016q04592o93899k08255L83304M25105
35737D69019j49592o56889n98010j45423L88691R02484J151953P46472j50154
35728A958551o93446l72318K92864N01534K32324O2484K20467L57550J64163k18284
35718B505889m12414j99653K48137M32890L9784n26660m94651J95932O53243K24969
$$ y = [1018629, 1196601, 1133983, 749682, 113061, -569000, -996167, -1041188, -1016349, -1330318, -1766451, -1559231, -467405, 702823, 1093663, 895327, 858261, 1041715, 818979, 29761, -672008, -757799, -436593, -103594, 225928, 633923, 960587, 1086612, 1146884, 1183889, 1030146, 826703, 1118628, 1970657, 2501994, 1964276, 937307, 696311, 1539572, 2494366, 2667213, 2133372, 1367356, 562764, -131135, -339390, 43914, 469019, 319427, -337462, -935472, -1080895, -692204, 210280, 1362233, 2108705, 1958551, 1265105, 892787, 1185651, 1687185, 1919509, 1981993, 2202460, 2560010, 2724173, 2505889, 2093475, 1893822, 2141959, 2574849, 2614633, 2087973, 1593322, 1789254, 2442497, 2667466]
35708B667466n74715q35361m73916n3043J94279L81042L48879n8727l21983J45516
35698A419437P87044M28278q41901j498656p20193M11994N34964j31127m27837
35689c7997m1883L65129L81559K32553J35381P9153J39121L34274L04125k22006
35679A669409p74601o48565K0948L80983O7747l68468l33993R9694M93752N60467
35669A167373K68138j60212l09754l0353K30439K6895k83409n749O72504P70094
35659B345966k212p17110o05193j47972j79424n70111o02691j93207J49934L33348
35649a88672P12260J146019R69214J61034l08225J82341Q65952N99498m70234
35640C669187j079820o40464l4276k94658j106032j227547j90657J045321J266517
$$ y = [2667466, 2092751, 1257390, 783474, 730431, 924710, 1305752, 1654631, 1595904, 1273921, 1419437, 2206481, 2634759, 1792858, 294202, -425991, -13997, 520967, 389840, -37997, -79880, 285249, 666808, 899361, 1034742, 1113895, 1253016, 1587290, 1891415, 1669409, 894808, 246243, 267191, 648174, 715921, 347453, 13460, 113154, 606906, 1167373, 1435511, 1275299, 965545, 935192, 1165631, 1192526, 909117, 903368, 1575872, 2345966, 2343754, 1626644, 1021451, 873479, 694055, 123944, -478747, -671954, -522020, -188672, 523588, 1669607, 2638821, 2799855, 2491630, 2673971, 3539923, 4139421, 3669187, 2589367, 1948903, 1914627, 1619969, 513937, -713610, -904267, 141054, 1407571]
35631A407571M26373m03420l53334K92971N83170J43873l86496k94125J82799
35622A599382K24762l03327o36229l45109l6857k62386m04881L93204J564917
35613A793476J576083J42501j157088r52545J68225O59414O7241p24880q88857
35604F83570m91492n5134J25027J74229M11806Q77264J067933N13432l63047n85829
35594B357759j4092L88640M0658l91987k37096o554m17617j008487q87355k97400
35584d73531j69185m76627l57488L00579P08866N80829L97707K27081l73876j083670
35574g19315q60808K89740R32309K44718p30944o66781K39665Q92860Q73256M82278
35564I76978o7190n80583n59282J57232Q27222O65513o7170m99166l26495N4058
$$ y = [1407571, 1833944, 1430524, 1077190, 1370161, 1953331, 2097204, 1710708, 1416583, 1599382, 1824144, 1520817, 884588, 539479, 502622, 240236, -164645, 228559, 1793476, 3369559, 3512060, 2354972, 1402427, 1570652, 2230066, 2297307, 1572427, 683570, 192078, 136944, 261971, 436200, 848006, 1725270, 2793203, 3306635, 2943588, 2357759, 2343667, 2732307, 2772965, 2380978, 2143882, 2137328, 1719711, 711224, -176131, -473531, -642716, -1119343, -1476831, -1176252, -467386, 113443, 511150, 738231, 364355, -719315, -1580123, -1290383, -358074, -113356, -844300, -1511081, -1271416, -378556, 494700, 976978, 909788, 329205, -230077, -72845, 754377, 1419890, 1352720, 853554, 527059, 581117]
35554E81117K33462M2438n12959j047801r55768k51487K83960K95715M54573J155659
35544B78909J465506M68811r78479j195124p4788Q38627O45534R5333N0463K31534
35534A826326N8135k77043l02481j41708j82158l31375k45215R61M6931j00339
35524C52034n2293L20246O04425L44105l38751p92822n57565P7093M30473L11666
35514F98611J94519M21324O87358O01226K88880k217m31683j069262j283420m91872
35504c86536O61384Q43777j57199j059330p95885J94874P96591O51021K51273
35495I99970J06360L38500P53952Q68941K15693r27817j472438p26458O00782
35486G57485J203466Q06692L09712L40656M54163M9691o04525q35740o18991m65457
$$ y = [581117, 814579, 857017, 344058, -703743, -1659511, -1910998, -1627038, -1331323, -876750, 278909, 1744415, 2213226, 1234747, 39623, -35165, 803462, 1448996, 1544329, 1594792, 1826326, 1884461, 1607418, 1304937, 1163229, 981071, 649696, 404481, 405442, 452373, 352034, 299741, 619987, 1224412, 1568517, 1229766, 436944, -120621, -43528, 386945, 698611, 893130, 1314454, 2001812, 2603038, 2891918, 2889701, 2458018, 1388756, 105336, -386536, 274848, 1118625, 961426, -97904, -893789, -698915, 97676, 748697, 999970, 1106330, 1444830, 2198782, 3067723, 3283416, 2355599, 883161, 156703, 757485, 1960951, 2767643, 3077355, 3418011, 3872174, 3921865, 3317340, 2481600, 1862609, 1397152]
35476A397152m48466j21987N03051O98078J26488m66452k94744K74195L71633
35467B038948P1790J47795N42900L25133o02132j021981k74061N46330K34571
35458B009293o13603n98361K10960M69987j96467o70240k69953K09091k3083m03566
35448A24058m6213O93739P45381L7779l45010K30469J010231Q79631j44782r34013
35438B251270o76179J16544K69248n37896j291019q57107N76823J625253J251311
35429B728248q9179r82364o11537M07372Q39043L37639k44760j93539J2936l90321
35419A813538r85194p10822K48405M94654l24607p69061O2715Q97303L16754p81934
35409B61751n47285P65642J139527j5951j060576p60258J41255N48573N45479
$$ y = [1397152, 948686, 826699, 1329750, 2027828, 2154316, 1687864, 1393120, 1667315, 2038948, 2110738, 2258533, 2801433, 3126566, 2524434, 1502453, 1228392, 1774722, 2009293, 1395690, 797329, 1008289, 1478276, 1281809, 611569, 341616, 550707, 527624, 124058, 77845, 771584, 1516965, 1554744, 1209734, 1440203, 2450434, 3330065, 3185283, 2251270, 1575091, 1691635, 1960883, 1422987, 131968, -725139, -148316, 1476937, 2728248, 2639069, 1656705, 1045168, 1452540, 2291583, 2629222, 2384462, 2190923, 2203859, 1813538, 828344, 117522, 365927, 860581, 535974, -233087, -170372, 726931, 1043685, 261751, -285534, 480108, 1619635, 1603684, 543108, -217150, -75895, 472678, 1018157]
35400A018157N16569J91673m83551p21397j30032M23332J61909k93942M846P42247
35390A429811R04859L69695j30049k31598j89562j79391j65135k37651m37745
35381A133234n10236l48190k69292l58713j27912N56689Q93788L12662m39856
35372H42174l76260J27192k3401p49551q49742R6094J065569J045850J90779p16042
35362F52662j138505q79589l3002Q43624J070779O21984J23717k8314o8047k70829
35352H94480m77346m02547n0503L34740M92014L11787R723N481L60303N66853
35342B044985K43785k66553m31166k99432k03583q9513J66984J82144l31460p20516
35332B95675j95703P08252O65699m05003j075636m72996N61591Q66474M40730
$$ y = [1018157, 1534726, 1726399, 1242848, 521451, 391419, 814751, 976660, 682718, 687564, 1429811, 2334670, 2704365, 2574316, 2342718, 2153156, 1973765, 1808630, 1570979, 1133234, 622998, 274808, 5516, -353197, -481109, 75580, 969368, 1282030, 842174, 465914, 593106, 569705, -179846, -1029588, -933494, 132075, 1177925, 1368704, 652662, -485843, -1365432, -1398434, -554810, 515969, 1137953, 1261670, 1233356, 1165309, 894480, 417134, 14587, -35916, 298824, 790838, 1102625, 1112348, 1117829, 1478132, 2044985, 2288770, 2022217, 1591051, 1291619, 1088036, 998523, 1165507, 1347651, 1016191, 295675, 99972, 808224, 1473923, 1068920, -6716, -479712, 81879, 948353, 1389083]
35323A389083j05305n92928r47300o54468M55568J424818J191332J20023m41720
35314A839103l2791M24578J27961m52480l89141K58817M72452k98153j287094
35305F63252j347925m64811K52340J42111j46975J69505O52755L56202m87580
35296b11126o56914J72169R16001P75700K95236J59874L4108n19024q69678k31661
35286a35315Q10548R11727r8106r99923r06759k03221L61285O01665O36734M61715
35276A440350J59233j0199l4422j98265m84060m43253N6691M73463L45113l1487
35266A273164q3710K26522M86836M47496J59082k54589n81956n22019q7604K25954
35256A289176Q5687j31287O7979M24848L18119j52820k77892O9964K43887K8084
$$ y = [1389083, 1283778, 690850, -256450, -910918, -455350, 969468, 2160800, 2280823, 1839103, 1806312, 2230890, 2358851, 1906371, 1517230, 1776047, 2248499, 1950346, 663252, -684673, -1149484, -897144, -755033, -902008, -732503, -79748, 276454, -211126, -868040, -695871, 220130, 995830, 1291066, 1450940, 1485048, 966024, 96346, -135315, 675233, 1586960, 1488854, 488931, -417828, -621049, -259764, 341901, 978635, 1440350, 1599583, 1589384, 1554962, 1356697, 872637, 429384, 486075, 959538, 1304651, 1273164, 1189454, 1415976, 1902812, 2350308, 2509390, 2254801, 1672845, 1150826, 1063222, 1289176, 1374863, 1243576, 1311555, 1736403, 2054522, 1901702, 1623810, 1693774, 1937661, 1965745]
35246A965745P0957O31468Q36173K483j052315j075279k49659J75819j39572l23443
35236H42377K4246K04044j46932k64735M01988J111833R49265J95297l25414n48853
35226B443116q25860q87724l05895M11759L79611k09613l69518J6079O1865m56393
35216B57427n93517J68727R63381Q57741K23331M020L12545N85758O24093O15638
35206D019144M47578j45842q55200r93056m94500r5079l34626q64409r80957n05909
35196h02856J36063N15416N92525N44300M15539Q2121m65196r38784r70665m85125
35186a376662K28172P82849R61781P90808M91682L31529L82978M46147L05128
35177C344412J542k66026m36139o15281q40097r41880o86472o8429N02213M79642
$$ y = [1965745, 2036702, 2668170, 3504343, 3506826, 2454511, 1379232, 1129573, 1305392, 1165820, 842377, 866623, 1070667, 923735, 659000, 1060988, 2172821, 3122086, 3317383, 2991969, 2443116, 1617256, 729532, 423637, 835396, 1215007, 1005394, 635876, 651955, 713820, 257427, -336090, -167363, 796018, 1653759, 1877090, 1881110, 2193655, 2779413, 3403506, 4019144, 4466722, 4320880, 3465680, 2472624, 1978124, 1883045, 1548419, 684010, -296947, -802856, -666793, -151377, 441148, 985448, 1400987, 1483108, 1017912, 79128, -891537, -1376662, -1148490, -365641, 596140, 1386948, 1878630, 2210159, 2593137, 3039284, 3344412, 3345954, 3079928, 2643789, 2028508, 1188411, 246531, -439941, -508370, -6157, 473485]
35167D73485j05397m23674J61028J017196R20618j48073q46798m37407J82012
35158G92990O6200k80007l1341L42066k9910o75458n32500P7380l3095p24057
35148a027732p31833j026K05993k51631k743J182256J556860L03670p93746j07461
35138C32607J182634J041901k21755p77894l02201k7581l12336k62413L44100
35129I97062O38459L05668M8554J79268J41775k82178n14276k25299J97903M45358
35119A932294N91067M90594j48954r63957j139824n52836J43538N65430Q13775
35110A731127P44406J21345n26483l89673K28009K46049l75238n52365m5632N0299
35100A231844o78971j028187j38159R71872R59123J44712k54676q821K36626K69027
$$ y = [473485, 368088, -55586, 105442, 1122638, 2043256, 1895183, 1048385, 610978, 792990, 859190, 579183, 547842, 889908, 859998, 184540, -347960, -270580, -303675, -1027732, -1759565, -1760591, -1554598, -1806229, -1808972, -626716, 930144, 1233814, 440068, 332607, 1515241, 2557142, 2335387, 1557493, 1255292, 1227711, 915375, 652962, 997062, 1635521, 1941189, 1989743, 2169011, 2310786, 2028608, 1514332, 1289033, 1486936, 1932294, 2523361, 3013955, 2865001, 1901044, 761220, 208384, 351922, 917352, 1731127, 2475533, 2596878, 2070395, 1680722, 1908731, 2154780, 1779542, 1227177, 1181545, 1231844, 552873, -475314, -613473, 358399, 1317522, 1462234, 1207558, 1198737, 1435363, 1704390]
35090A704390K85538P6074n73912j035532n61366L71322N66398j44048p26782
35081c7918n32249k5748K18026K94112M16293L88414P8145j65284m6877J19993
35071G06907j24351n92084n91610J22539R09207R69148L45917j50289p4003N6207
35061A577588l26105p50559l26227O94587R81468L2978r72465q40782o688L57109
35051D20904J75800K90134Q20725R57143L82634k28200l76924l99884n62079m18695
35041A061558K96088Q81004N74102j99754l39916L40313Q47916M16243n24515
35032C353039j064534r53790n92783k59232Q9301L55989K30954k71059o36746
35023B51139m79434k7151K84201M02635M94429M68846J52790k21953k42264L1936
$$ y = [1704390, 1989928, 2066002, 1492090, 456558, -104808, 266514, 832912, 688864, -37918, -570167, -595915, -377889, -83777, 332516, 720930, 799075, 633791, 586914, 706907, 582556, -9528, -601138, -478599, 430608, 1399756, 1745673, 1595384, 1521381, 1577588, 1251483, 500924, 174697, 869284, 1850752, 1883730, 911265, 70483, 63795, 420904, 596704, 886838, 1707563, 2664706, 3047340, 2819140, 2442216, 2042332, 1480253, 1061558, 1357646, 2238650, 2812752, 2612998, 2273082, 2613395, 3461311, 3877554, 3353039, 2288505, 1334715, 741932, 482700, 572001, 927990, 1158944, 887885, 251139, -228295, -255446, 28755, 431390, 925819, 1394665, 1547455, 1325502, 1083238, 1115174]
35013A115174J78841J61978L44556O75858N67917j41573p70903p47122l65843
35004A018883j02633K07196P89892J063320L12773r66325j407312n72112M60556
34995H04238O04265J01407j24946J50522L90693L03577K10287L73961N07905K12555
34985C534464l75286o73570l64836J77264K57844l78819j208286j381087n76822
34976i89134N65490R76636K85754o32340n43309O19442J518844J054087j41834
34967B713636n03411L07835R15759J87227j128741j403802k98065R10998J057776
34958B759212L55886k42165k99339q9391O3084J04945J1544k96158o55536o42191
34948A069891j29712L62526K76421j44236j46092L47561N10590p9241o05773j95050
$$ y = [1115174, 1294015, 1455993, 1800549, 2476407, 3044324, 2902751, 2131848, 1384726, 1018883, 916250, 1123446, 1913338, 2976658, 3289431, 2323106, 915794, 343682, 804238, 1408503, 1509910, 1384964, 1535486, 1926179, 2229756, 2440043, 2814004, 3321909, 3534464, 3159178, 2485608, 2120772, 2298036, 2555880, 2177061, 968775, -412312, -989134, -423644, 552992, 838746, 206406, -336903, 282539, 1801383, 2855470, 2713636, 2210225, 2518060, 3433819, 3621046, 2492305, 1088503, 790438, 1701436, 2759212, 3115098, 2872933, 2573594, 2484203, 2547287, 2652232, 2663776, 2367618, 1712082, 1069891, 940179, 1302705, 1579126, 1434890, 1288798, 1636359, 2146949, 2067708, 1461935, 1266885]
34938A266885O17999O13883j91088n50302J0036M59196j1615p06670o47934j13679
34928G46711K8372k06292k19674j03262m21917r60851q61674k3301O92524Q00458
34918e28906P45593Q49036O65606q8331p40622n07579K98394O00495k4716q00833
34908D68137p20183K39348J068021Q78533o0682o75466m34463P2042R4649k35732
34898F94204l07448n7181P8755K0577J08332L58043L78944J06228m8612Q9491
34888A421333K08556J19638K7531L2224n1900k02419j11941J94529K75331K8375
34878A941257j11979O157m9492m07281m59146J24975O39123L25119m11996n77017
34868A019720j6174N44890O84021O71677O99170M90082j24489p93743j064167
$$ y = [1266885, 1884884, 2498767, 2307679, 1757377, 1767413, 2226609, 2214994, 1508324, 860390, 746711, 775083, 568791, 349117, 245855, -176062, -1136913, -1998587, -2021888, -1329364, -528906, 216687, 1065723, 1731329, 1642998, 902376, 394797, 693191, 1293686, 1268970, 468137, -252046, -12698, 1055323, 1933856, 1873174, 1197708, 763245, 835287, 929936, 694204, 386756, 329575, 408330, 428907, 537239, 895282, 1274226, 1380454, 1331842, 1421333, 1629889, 1749527, 1777058, 1809282, 1757382, 1554963, 1443022, 1637551, 1912882, 1941257, 1829278, 1835435, 1785943, 1378662, 919516, 1044491, 1683614, 2008733, 1596737, 1019720, 1003546, 1548436, 2232457, 2904134, 3603304, 4093386, 3968897, 3175154, 2110987]
34859B110987q95637n97593m33677l56906p1632N38439J027953P90914r15l77681
34849A734252J21516O69412L08901n91667r07381m76588k08773n02038o55727
34840e08093j55811M50534M94794J93520O8626J1355l25740o60823m11992L23228
34830e20402Q28656P21389K58756k06371m88580l56057L05682J049886J175105
34821B768064O15527K718k91108n70804j019406j125616m48607M84252P16306
34812A131326J38326l89226k06067L77971O13632K08281m84734q71123n54064
34803c5678L47290J131089J028395L4829r60500j123681n77025n6876J48769M35514
34793C72126J015977J367776R30622K0557m98105l76876k34104m95692o93842
$$ y = [2110987, 1215350, 617757, 184080, -172826, -244458, 293981, 1321934, 2112848, 2111933, 1734252, 1855768, 2525180, 2834081, 2242414, 1335033, 858445, 649672, 147634, -508093, -663904, -213370, 281424, 474944, 543570, 554925, 229185, -431638, -843630, -520402, 308254, 1029643, 1288399, 1082028, 593448, 237391, 543073, 1592959, 2768064, 3383591, 3386309, 3095201, 2524397, 1504991, 379375, -69232, 415020, 1131326, 1269652, 880426, 674359, 1052330, 1665962, 1874243, 1389509, 518386, -35678, 311612, 1442701, 2471096, 2505925, 1545425, 421744, -155281, -212157, -63388, 372126, 1388103, 2755879, 3686501, 3707058, 3208953, 2832077, 2597973, 2102281, 1408439]
34784A408439k77957L54826L71460j56806k92724K82689P21778L65142j89184
34775B587663r4383L36547K16280l31605l45840K76026M83727k12151q66372n63708
34765A486184J74892K90973j96312m45798k37791j31884l28985l62321k1480K78512
34755E05990L05752M42033R08623J169837O50543l29317r08836q04388n33775
34746A406462n31298n68583k76719J80779L98363M72097Q48892J365513J130591
34737D426097j65927j381727j161463J89062R82453L47574p86270j172914p70037
34728E06848k38000K12612O61181Q04761L85351r6687j2163L07298K4783p95772
34718A760212j186523p27770j13302l0225k04503P6959R52549J789386J783025
$$ y = [1408439, 1130482, 1485308, 1856768, 1699962, 1407238, 1689927, 2411705, 2776847, 2587663, 2493280, 2829827, 3046107, 2714502, 2368662, 2644688, 3128415, 2916264, 2049892, 1486184, 1661076, 1952049, 1755737, 1309939, 1072148, 940264, 611279, 248958, 227478, 505990, 811742, 1253775, 2162398, 3332235, 3982778, 3653461, 2744625, 1940237, 1406462, 875164, 306581, 29862, 210641, 609004, 1081101, 1929993, 3295506, 4426097, 4260170, 2878443, 1716980, 1906042, 2888495, 3236069, 2449799, 1276885, 506848, 268848, 481460, 1142641, 1947402, 2332753, 2236066, 2223903, 2531201, 2555984, 1760212, 573689, -154081, -267383, -297608, -502111, -425152, 527397, 2316783, 4099808]
34709D099808P26947o19019j146243o85502k57820n43618p33887J42741J298558
34700B281965J029591o07386j557846o45708P76443Q76306j62060p87801l91732
34691H11772K46151M03494K13377J03081K43394N64335P78647M78688l31386r57910
34681B553643p35472J09727P28954O53202J51360k80204m20148l75922l82550
34672B002590m94379m25545N9306N81415M37728l85288j007613p55180K4874N80615
34662F18523O88220N64682L27482K8908j43618j49429k37411m39686l54659J55457
34652A058469N45586L82350Q0619K34694O23410N68293J988m97267n76776m27530
34642A993836l31734l55967l94175k05600L63601R57926R25881K53755k54719
$$ y = [4099808, 4826755, 4207736, 3061493, 2375991, 2118171, 1574553, 840666, 983407, 2281965, 3311556, 2704170, 1146324, 500616, 1277059, 2153365, 1991305, 1203504, 811772, 1057923, 1461417, 1674794, 1777875, 2021269, 2585604, 3364251, 3842939, 3511553, 2553643, 1818171, 1927898, 2656852, 3310054, 3461414, 3181210, 2761062, 2385140, 2002590, 1508211, 1082666, 1141972, 1723387, 2161115, 1775827, 768214, 13034, 37908, 618523, 1306743, 1871425, 2198907, 2227815, 2084197, 1934768, 1697357, 1257671, 903012, 1058469, 1604055, 1986405, 2067024, 2301718, 2925128, 3493421, 3495409, 2998142, 2421366, 1993836, 1662102, 1306135, 911960, 706360, 1069961, 2027887, 2953768, 3207523, 2952804]
34633B952804j19898J41293K316j56659J41187M59187J95727k38777n8833N08769
34623C827116N77480M6101l92759m61202m34702k66340L10225R16749Q73647L28441
34613E324756l3878k47175q09676j327462q81768J77858M00624m54640q86292
34604A262347o1010Q17881N28145j83432N9188R54435J042440J1410r06978p63597
34594B760829l1193K45938k40071q16526o35447K97254R35459L91063p47280r98508
34584A161518p644R26137P14985q9911l86933j53062r7317l52505m78143l37120
34574I00005r6293K95059Q27494R94466M56055j83995j13885M38072N60369P3489
34564D150836l00674j17727K75554M40225L38442P1886k62876m36746l26767k08521
$$ y = [2952804, 2832906, 2974199, 2976515, 2819856, 2961043, 3420230, 3615957, 3377180, 3318347, 3827116, 4404596, 4450697, 4057938, 3596736, 3162034, 2895694, 3205919, 4122668, 4996315, 5324756, 5290878, 5043703, 4234027, 2906565, 2024797, 2202655, 2603279, 2148639, 1262347, 1201337, 2019218, 2547363, 2363931, 2423119, 3377554, 4419994, 4431404, 3524426, 2760829, 2729636, 2975574, 2735503, 1918977, 1283530, 1580784, 2516243, 2907306, 2160026, 1161518, 1153874, 2080011, 2794996, 2705085, 2318152, 2165090, 2067773, 1715268, 1237125, 900005, 803712, 1098771, 1926265, 2920731, 3376786, 3192791, 3078906, 3516978, 4077347, 4150836, 3850162, 3732435, 4007989, 4448214, 4786656, 4858542, 4595666, 4158920, 3832153, 3623632]
34554C623632l06335k88602J48679M94649P9969o73003o77325J26861N76691K0426
34544C125642p72470q59767l64838J08922M98249R66087J141693N18255o15150
34535C746623j314147j015105l4866Q46979J002759L68939m20342n24009J53332
34526B810163P37251M61645l17955o61137l45789j5850j04277k91230j92206L1711
34516B112326R9854J69847M88369P81441N45246j40732o11687m95413j39567n277
34506B804407n4716j0529J35029K36141L42219N02224M31296j14452p38467p54842
34496B778310j58715L44321L87136L64300N40307M46052k73230r76487p88810
34487B663184L3121L46537k72412r67303q66382k19663J53915O1572J6079L31119
$$ y = [3623632, 3317297, 3028695, 3177374, 3672023, 3751992, 3078989, 2401664, 2528525, 3105216, 3125642, 2353172, 1493405, 1128567, 1237489, 1735738, 2701825, 3843518, 4361773, 3746623, 2432476, 1417371, 1382505, 2229484, 3232243, 3601182, 3180840, 2656831, 2810163, 3547414, 4009059, 3691104, 3029967, 2684178, 2668328, 2564051, 2272821, 2080615, 2112326, 2212180, 2382027, 2870396, 3651837, 4197083, 4056351, 3444664, 2949251, 2809684, 2804407, 2749691, 2739162, 2874191, 3110332, 3452551, 3954775, 4386071, 4271619, 3533152, 2778310, 2619595, 2963916, 3351052, 3715352, 4255659, 4701711, 4428481, 3451994, 2663184, 2696305, 3042842, 2770430, 1803127, 936745, 717082, 870997, 932569, 948648, 1279767]
34477A279767O73539N61516l5768o91035r02500m49077M06545J001174Q18603
34468B662764J18137k31321J92511P16194M18421n07181q75634j43264P56985
34459C107612O67775k33153p70184l47379N04264R97346Q32045J46089o24628
34450D279787q69719m15542O4620p9739l89864O28P40271O02353m16821q18220
34440B697754M3499Q36266M28453k54364P4478P40224K64854r66030j205560j87692
34430B471882N54479K74022o0100J75098J66726n74614j055238m76182L28549
34421A804622L43940O5375L80498P78258K52392p04646p14445K00702O30263P0572
34411C107531m30165k12329o162l51336m52450L68045J194919P86203l90055p75432
$$ y = [1279767, 1953306, 2514822, 2479054, 1788019, 885519, 436442, 842987, 1844161, 2662764, 2780901, 2549580, 2742091, 3458285, 3876706, 3369525, 2493891, 2350627, 3107612, 3775387, 3542234, 2772050, 2424671, 2928935, 3926281, 4758326, 4904415, 4279787, 3410068, 2994526, 3059146, 2979407, 2589543, 2590171, 3330442, 3932795, 3515974, 2697754, 2741253, 3577519, 4005972, 3751608, 3826086, 4566310, 4831164, 3865134, 2659574, 2471882, 3026361, 3300383, 3240283, 3415381, 3582107, 3007493, 1952255, 1476073, 1804622, 2148562, 2213937, 2594435, 3372693, 3625085, 2920439, 2205994, 2406696, 3036959, 3107531, 2677366, 2465037, 2458875, 2107539, 1655089, 2023134, 3218053, 4004256, 3614201, 2838769]
34401B838769p1448M35240j2483n41161j76342O18182P67005K27562j58636q1020
34391C845668l2145k31033k25758J85650M24955n636o63903p16468o0136O07289
34381C128483P06029L38320l2393j19592J4991J12799J973j83642j52447R6278
34371C910799J78893j17651m07493j72506M46800P14737K12221o20617r97070
34362C148113o50485k4447L18130K93463K22357K64031J93324j13018k59352J72827
34352C564943Q35056R01368K48433k78718r2317K58000k2448o82146p66515l5085
34342C930571P21147P90055L07651k15602n61114p34559o61834k94057J82629
34333C464887M87163N14271L59261J56995l6128k39090m32533m70141k34009J03822
$$ y = [2838769, 2767321, 3202561, 3190078, 2648917, 2472575, 3090757, 3857762, 4085324, 3926688, 3845668, 3813523, 3582490, 3356732, 3542382, 3967337, 3961701, 3297798, 2581330, 2521194, 3128483, 3834512, 4172832, 4140439, 4020847, 4035838, 4148637, 4150610, 3966968, 3814521, 3910799, 4089692, 3972041, 3564548, 3392042, 3838842, 4553579, 4765800, 4145183, 3148113, 2497628, 2473181, 2791311, 3084774, 3307131, 3571162, 3764486, 3651468, 3392116, 3564943, 4399999, 5301367, 5549800, 5271082, 5178765, 5436765, 5414317, 4732171, 3965656, 3930571, 4651718, 5441773, 5749424, 5533822, 4972708, 4238149, 3576315, 3282258, 3464887, 3952050, 4466321, 4825582, 4982577, 4946449, 4707359, 4274826, 3804685, 3570676, 3674498]
34323C674498J89286o7640l91603n50019n37573k84970L31692R99527J075648
34314D438846N46171K50346O18197Q49241J29880r17253j036769k35195K92735
34305D936199L2623k56251J7830L89551L10658N2981P2810K06815Q2648k19047
34295E626817m30103n71499p10492o30344j54187N00869R81829J118048Q33229
34286F564167J61295m94886o14127k63911o2651k67599m62226l26634o7884J39657
34276D305201M05806N25903j4851r77805j218309k87146O55202L99939n62727
34267C231213q79292l12522K86944N55020Q38840J022263N30206l41798m59966
34258D470908L38837P17052j57465j157606p85450N48339J091411K84274n64696
$$ y = [3674498, 3863784, 3796144, 3404541, 2854522, 2316949, 2031979, 2363671, 3363198, 4438846, 4985017, 5235363, 5853560, 6702801, 6832681, 5915428, 4878659, 4643464, 4936199, 4968822, 4712571, 4730401, 5119952, 5430610, 5483591, 5556401, 5763216, 5845864, 5626817, 5196714, 4625215, 3914723, 3284379, 3130192, 3631061, 4612890, 5730938, 6564167, 6725462, 6230576, 5616449, 5352538, 5289887, 5022288, 4560062, 4233428, 4165544, 4305201, 4711007, 5236910, 5222059, 4244254, 3025945, 2738799, 3394001, 3793940, 3231213, 2351921, 2039399, 2326343, 2881363, 3720203, 4742466, 5272672, 4930874, 4470908, 4809745, 5526797, 5369332, 4211726, 3426276, 3974615, 5066026, 5350300, 4785604]
34249D785604l02919M97142N70959j98627p55433l54332O27446J281546J027794
34240G179180p1047j315817j683058p25757O87418J112017K46853o84996o08277
34231D136516N0763K80392P2115J40753M69528L03996m09441p22024j53801M90210
34221D659007L13526l88314o66650k45464L20560N23250L81382J63493L7625j6217
34211E082198j32102l39981m02980q3018M29739O55476M22099J4410k56262k72581
34201E116998K2626N08931P07344K85108l03648l31390Q7709J79992j70479k36307
34191E866884K26917N00989J64281j77812p580K06458m3794l19293m4597M32306
34181F804759N05833L96080N87645P35678K07525o54411q98446m06879K4730m0850
$$ y = [4785604, 4482685, 4979827, 5550786, 5352159, 4596726, 4242394, 4869840, 6151386, 7179180, 7108133, 5792316, 4109258, 3383501, 4070919, 5182936, 5429789, 4744793, 4136516, 4187279, 4467671, 4539786, 4680539, 5150067, 5454063, 5044622, 4322598, 4168797, 4659007, 4972533, 4584219, 3917569, 3672105, 3992665, 4515915, 4897297, 5060790, 5098415, 5082198, 4950096, 4610115, 4207135, 4124117, 4553856, 5209332, 5631431, 5645841, 5389579, 5116998, 5139624, 5648555, 6355899, 6641007, 6337359, 6005969, 6093678, 6273670, 6103191, 5866884, 6093801, 6594790, 6759071, 6581259, 6573679, 6780137, 6736343, 6417050, 6372453, 6804759, 7310592, 7706672, 8294317, 9029995, 9237520, 8583109, 7684663, 7277784, 7302514, 7261664]
34171G261664k60341l32654l61356l32900l2957L83344M22755Q794l63680l48350
34161F044319j22002M5764J37508K21550L24277N04030P30031P36658L33045k11702
34151H743478m10391j10279M30161Q40911P99509J83015o51268j043290p74734
34142H007112l01426k2776J80786M01838L44690n5927l25970k71447l68002p36303
34132F852575o06193L58468J097067O25861l05406l36767L57153N18830m2647
34123H518941l59189j59821j68851n02024l88923K30922L81713k11429m85085
34114F856254K26216J061973R75886J66526n43019q41153p65576k65531L66000
34105G237576L86723l44781q54710k83654Q94227J501190J070215J28830n17360
$$ y = [7261664, 7001323, 6668669, 6307313, 5974413, 5941456, 6324800, 6747555, 6756349, 6392669, 6044319, 5922317, 5968081, 6105589, 6327139, 6651416, 7155446, 7885477, 8622135, 8955180, 8743478, 8333087, 8222808, 8652969, 9493880, 10293389, 10476404, 9825136, 8781846, 8007112, 7705686, 7682910, 7863696, 8265534, 8610224, 8554297, 8228327, 7956880, 7588878, 6852575, 6246382, 6604850, 7701917, 8327778, 8022372, 7685605, 8042758, 8561588, 8518941, 8159752, 7999931, 7831080, 7329056, 6940133, 7171055, 7552768, 7341339, 6856254, 7082470, 8144443, 9120329, 9286855, 8743836, 7902683, 7137107, 6871576, 7237576, 7624299, 7279518, 6424808, 6141154, 7035381, 8536571, 9606786, 9735616, 9218256]
34096I218256l90367L45563Q86337N74576j68874l48161Q0678J31194m92030p57635
34086I079537m0448O59317K66531n11739j99087J091910J708091P88784o76763
34077A2166133j330758r78962k73873L08239O16770M87348r8632o73530o15139
34068I607596J03540P91479P92780J83164m22109n88095l53160P4070N29033P66588
34058A1484886N53017Q8459l3808M32792R99767J062576N92658l6955n36507p34460
34048A3872425n60660k88603l08905m19086l3160O09540M57390n43511q68268
34039A1917162L18626J530597J099289j07850o7792J016236J055307l63975j253579
34030A5144021n31819L14071j03618q04414l01206Q53693J082559L13118j89311
$$ y = [9218256, 8827889, 9173452, 10059789, 10634365, 10465491, 10117330, 10198008, 10329202, 9837172, 9079537, 9039089, 9698406, 9964937, 9453198, 9254111, 10346021, 12054112, 12842896, 12166133, 10835375, 9856413, 9582540, 9890779, 10507549, 10994897, 10896265, 10222735, 9607596, 9711136, 10502615, 11295395, 11478559, 11056450, 10468355, 10115195, 10189265, 10718298, 11484886, 12037903, 12126362, 12092554, 12525346, 13525113, 14587689, 15180347, 15143392, 14606885, 13872425, 13311765, 13023162, 12714257, 12295171, 12262011, 12871551, 13328941, 12785430, 11917162, 12235788, 13766385, 14865674, 14757824, 14690032, 15706268, 16761575, 16397600, 15144021, 14612202, 14926273, 14822655, 14018241, 13717035, 14570728, 15653287, 15966405, 15777094]
34021A5777094M3963K71820R5518Q6089O59019J274901J165751L65551l49094
34012A9390612l83704P3564M38410N06680N15281N25279L41437J45632M10611
34003B1963802Q80917O38314k73165m94095M87392J159227L02476q42390m99238
33994B3323240P28844J018014M57263N57497J240328R89991j97646o76268j0967
33985B7430296N71496O88856J156991J695640J045599l02009l41989J001359J570129
33976C4516368O93871J80763Q38295J164589N08016L40377J184854J462270P10454
33967D1599857P12684K000086K575156J670253J304315K397014K967732K089440
33959E7316537J819908L082362L619040K408819J942265L496335M567767L859379
$$ y = [15777094, 15821057, 16092877, 16188395, 16274484, 16933503, 18208404, 19374155, 19739706, 19390612, 19006908, 19080472, 19518882, 20025562, 20540843, 21066122, 21407559, 21553191, 21963802, 22844719, 23483033, 23209868, 22715773, 23203165, 24362392, 24664868, 23822478, 23323240, 24052084, 25070098, 25527361, 26084858, 27325186, 28315177, 28117531, 27441263, 27430296, 28001792, 28690648, 29847639, 31543279, 32588878, 32286869, 31944880, 32946239, 34516368, 35210239, 35391002, 36229297, 37393886, 37901902, 38242279, 39427133, 40889403, 41599857, 42312541, 44312627, 46887783, 48558036, 49862351, 52259365, 55227097, 57316537, 59136445, 62218807, 65837847, 68246666, 70188931, 73685266, 78253033, 82112412]
33951H2112412M022566O222110P231874N683829N468064Q548778J0731877R683162
33943A39704672R903866J3524305J4840603J2181946J4020961J9588986M907692
33936B28673031m8787211j15659846j40453351j00932192l4674832P141717J4067223
33929a90625461J0252788J1875020J3666898J0352066P787815R950670J1466217
33922a15273987Q389352N042584N370656O402188M790939K697201K927051L937014
33914g5717002L490130K664554K934851L151566K256873J640433K354583K966817
33906e4257195K273648J435213J605683J967935J695393J471313J675737J383589
33898d0748684M22736J58891J036399J543259Q01884P2998M81678J207249J139509
$$ y = [82112412, 86134978, 92357088, 99588962, 105272791, 110740855, 119289633, 130021510, 139704672, 149608538, 163132843, 177973446, 190155392, 204176353, 223765339, 228673031, 179885820, 64225974, -76227377, -177159569, -211834401, -204692684, -190625461, -180372673, -168497653, -154830755, -144478689, -136690874, -126740204, -115273987, -106884635, -101842051, -96471395, -90069207, -85278268, -82581067, -79654016, -75717002, -72226872, -69562318, -66627467, -63475901, -61219028, -59578595, -57224012, -54257195, -51983547, -50548334, -48942651, -46974716, -45279323, -43808010, -42132273, -40748684, -40325948, -40167057, -39130658, -37587399, -36785515, -36712517, -36230839, -35023590, -33884081]
33889c3884081O15271M21714N74487R18201J500560J774022R60004l55898o45605
33880b8121325J88966O70028L17342L30370J126783J327923J55804j043736q30417
33871b5878262K85236R29619P80156M25610K90646M46472P17535O06159r2447
33862b1489276n90917n8421Q92224R60126K10760j25972K43590M49486K59943
33853a9248457L24891N83914K65468m11030l85309K58626L63354j08807J3741
33844a8343609P90488R18579J88591k0013P34304J119523M40620k26681j24983
33835a4523181j372l49452m60694j14297k13662q01938m92748J024493J911942
33826a4020909Q76827q61590j532056j048259j56666Q94129J653995J204439j68735
$$ y = [-33884081, -33268810, -32847096, -32272609, -31354408, -29853848, -28079826, -27119822, -27475720, -28121325, -27932359, -27262331, -26944989, -26614619, -25487836, -24159913, -24004109, -25047845, -25878262, -25593026, -24663407, -23883251, -23457641, -23166995, -22720523, -22002988, -21396829, -21489276, -22080193, -22138614, -21246390, -20286264, -20075504, -20201476, -19957886, -19508400, -19248457, -18923566, -18339652, -18074184, -18485214, -18870523, -18611897, -18248543, -18357350, -18343609, -17553121, -16634542, -16445951, -16465964, -15731660, -14612137, -14171517, -14398198, -14523181, -14524553, -14874005, -15334699, -15448996, -15662658, -16464596, -16957344, -15932851, -14020909, -13144082, -14005672, -15537728, -16585987, -16742653, -15848524, -14194529, -12990090, -13158825]
33817a3158825p34835P8958O50668o2593p02886N1703J175800J150612L80075
33808a1171323l1177k81582q30609r07749N5595R38816P12789K66849O25247R01564
33798i721580O7094p98354l04227O25003L69539m27686j51655O52098K78030q32895
33788a0244633p70944L32924N08162m51770o06451N99319J291422L74016p61696
33779i729651p00759m401L05040L96294O80053P68729M12836J65931K55007M1486
33769g409435o10290p23645J41248Q50876L57394o20437p18619J0440L41367j97851
33759h578952p27018l57781O15244J108999N22682n98626j177838p94364m4628
33750a0032282L23930K51252J06347L7281l995N0900K30473L48845L20493K71198
$$ y = [-13158825, -13893660, -13814702, -13164034, -13226627, -13929513, -13877810, -12702010, -11551398, -11171323, -11202500, -11484082, -12314691, -13222440, -13166845, -12228029, -11515240, -11248391, -10623144, -9721580, -9654486, -10452840, -10757067, -10132064, -9762525, -10190211, -10341866, -9689768, -9411738, -10244633, -11015577, -10682653, -10174491, -10626261, -11232712, -10633393, -9341971, -8967955, -9729651, -10430410, -10434811, -10129771, -9733477, -9053424, -8284695, -7871859, -7705928, -7450921, -7409435, -8019725, -8743370, -8602122, -7751246, -7393852, -8014289, -8732908, -8722468, -8381101, -8578952, -9305970, -9663751, -9048507, -7939508, -7416826, -8015452, -9193290, -9987654, -10032282, -9708352, -9457100, -9350753, -9313472, -9317467, -9266567, -9036094, -8687249, -8366756, -8095558]
33740h095558J09056l94996q30008l46412Q65709J342970L78552p70145p22964
33731h463796K5303K35172O5251M66551J143189R35149o8817n57070j15708K56681
33721f078095j11295o97728q51483n34780J10333Q48714J014850K05172p48088
33712f842400o45753L13882Q27083M36678q2495k24827k89174l70488j55877J49747
33702f883624l5015m90739m04942J86248M58096L20262M60426P90634M14625n84181
33692e768210r04797o0605Q01677O85401K7047l82721n10455n00818j44932M39197
33682f319216O08223K26991j7081K53187N59497M42797j4415o34526j123766p48014
33672f766323O79365J709213Q21090j044659j499523k92079M47658j06882k38748
$$ y = [-8095558, -7986502, -8381498, -9211506, -9557918, -8692209, -7349239, -6970687, -7740832, -8463796, -8438493, -8203321, -8138070, -7671519, -6528330, -5593181, -5661998, -6219068, -6334776, -6078095, -6189390, -6887118, -7738601, -8273381, -8163048, -7314334, -6299484, -6094312, -6842400, -7488153, -7174271, -6347188, -5910510, -5993005, -6217832, -6507006, -6877494, -7033371, -6883624, -6918639, -7409378, -7814320, -7628072, -7169976, -6849714, -6389288, -5598654, -5184029, -5768210, -6673007, -6733612, -5931935, -5246534, -5219487, -5602208, -6112663, -6613481, -6758413, -6319216, -5710993, -5484002, -5501083, -5247896, -4688399, -4245602, -4260017, -4894543, -6018309, -6766323, -6086958, -4377745, -3556655, -4601314, -6100837, -6392916, -5945258, -6052140, -6290888]
33663f290888R24880J552389K68644j285402j129880j15290r7663o86646l72175
33654g232031M40348K30960o70015o06837L82973O65925j6188j64871O83347J104725
33644e181664K87502o07356l73273N30551J009769Q37687L84309j55332n93566
33635c861373n88742j83367R8568P325j59389j99530k82080m40220m17362j44271
33625f170441J81401N06823Q59077R56496N19837j22481l96918l33643l75553
33616d375402n11819l74003n1677K5076p3638P5550L11191L0107o63493q91127
33606f499235l02875L93781N21801L36352M54147R03212J123880O65501k77889
33597b681325r01396n20486N00971R31697K06152p11788o50466R4899L26841j93750
$$ y = [-6290888, -5366008, -3813619, -3544975, -4830377, -5960257, -6075547, -6173210, -6859856, -7232031, -6791683, -6560723, -7230738, -7837575, -7454602, -6788677, -6804865, -6969736, -6286389, -5181664, -4894162, -5501518, -5874791, -5344240, -4334471, -3496784, -3112475, -3267807, -3861373, -4450115, -4633482, -4534914, -4527589, -4686978, -4886508, -5168588, -5608808, -6026170, -6170441, -5989040, -5482217, -4623140, -3666644, -3146807, -3269288, -3666206, -3999849, -4375402, -4887221, -5261224, -5312901, -5287825, -5361463, -5285913, -4974722, -4944615, -5608108, -6499235, -6802110, -6408329, -5886528, -5550176, -5096029, -4192817, -3068937, -2403436, -2681325, -3582721, -4103207, -3602236, -2670539, -2464387, -3176175, -3826641, -3731742, -3404901, -3598651]
33587c598651n62320k76301J67175L10713L34462L90258K40655j63771m96989
33578c654769o50803q28322r42701o53403p8058K96849M62424Q11152J173902
33569d063729Q91419J4337n37835k93200J96832L72073L44217K68154k1940l81452
33559c211124k92786J62778K08680l17899n46806R126O16217N29373O9993k05640
33549b978088m36366p41797n58990L16229R07862M01634m46207m44508J50107
33540c830124K19345k50179k49772M23220Q58815N80921J00827k06900n67637
33531b921484r26228p52094n2041M34549L65305J62830J9351l75023p86118l53933
33521e184886Q57889J446917O37897m40342m46690K29584M36317K45122M40883
$$ y = [-3598651, -4160971, -4437272, -4270097, -3959384, -3624922, -3234664, -2994009, -3157780, -3654769, -4305572, -5133894, -6076595, -6729998, -6808056, -6511207, -6048783, -5237631, -4063729, -3172310, -3157973, -3695808, -3989008, -3792176, -3420103, -3075886, -2807732, -2829672, -3211124, -3503910, -3341132, -3132452, -3450351, -3997157, -3988031, -3371814, -2842441, -2772448, -2978088, -3414454, -4156251, -4715241, -4399012, -3491150, -3089516, -3535723, -3980231, -3830124, -3610779, -3860958, -4110730, -3687510, -2828695, -2247774, -2146947, -2353847, -2921484, -3847712, -4599806, -4651847, -4217298, -3851993, -3689163, -3669812, -4044835, -4830953, -5184886, -4326997, -2880080, -2242183, -2682525, -3129215, -2899631, -2463314, -2218192, -1777309]
33512a777309O70198j00659j451499j672570l56740Q50240O88855m5794j29013
33503c324291J79665J7627l78155k36411K06908J64602j48396J34543Q20380P60019
33493a803509k27843r15221n18644K23799L81116J75683K77812N82265N05822
33484a318720j5037n15225o22689k10571O15190J245982Q77259l58628j179162
33475a481601p63905K0001j20539r37972j060752j37347O71431M83291j54637
33466c482030l34057o2020J67666L63767P85742J094422O27415m82877j196368
33457b518340q41588j2264K19556k97265o90548l15617M38427Q08505O51402L63814
33447b193918J49567j01080l95261o46232r46805j260950j045613N1804J244238
$$ y = [-1777309, -1107111, -1207770, -2659269, -4331839, -4688579, -3838339, -3149484, -3195278, -3324291, -3144626, -3126999, -3505154, -3741565, -3534657, -3370055, -3518451, -3383908, -2563528, -1803509, -2031352, -2946573, -3465217, -3241418, -2860302, -2684619, -2406807, -1824542, -1318720, -1333757, -1848982, -2471671, -2682242, -2067052, -821070, 56189, -302439, -1481601, -2245506, -2225505, -2346044, -3284016, -4344768, -4482115, -3810684, -3327393, -3482030, -3816087, -3878107, -3710441, -3346674, -2560932, -1466510, -839095, -1321972, -2518340, -3359928, -3372192, -3152636, -3449901, -4140449, -4456066, -4017639, -3209134, -2557732, -2193918, -2044351, -2145431, -2540692, -3186924, -4133729, -5394679, -6440292, -6388488, -5144250]
33438e144250J322104L92983j57123L09030Q49351O08824Q5350m0601j46435o63808
33428b584575q87553j20062Q10718O54025k30674m91475k0413Q4115l96651m93619
33418c676164N9302L29879m0762j78094L23909N41343j23431p43081l24286N91265
33408c240120Q54081M25817J10059J62012J79356j5571k67450n74540r38443r85155
33398d289954m08381M08978P82406N59445J34441j26613r8163J71411L94942K49588
33388b221900q8967q3300K39919J78442m13817o03008J89057R85578N26407p55452
33378b047041j213924k92481Q04179Q76875J57731l90026l87728j27632J35274
33369b484773L96424N90463N12486J08914l44928m80328k68857j19020l60949
$$ y = [-5144250, -3822146, -3429163, -3586286, -3277256, -2427905, -1819081, -1733731, -1774332, -1920767, -2584575, -3472128, -3592190, -2781472, -2127447, -2358121, -2849596, -2870009, -2785894, -3182545, -3676164, -3616862, -3286983, -3327745, -3505839, -3181930, -2640587, -2764018, -3507099, -3831385, -3240120, -2386039, -1960222, -1850163, -1688151, -1508795, -1524366, -1791816, -2366356, -3304799, -4289954, -4698335, -4289357, -3506951, -2947506, -2813065, -2939678, -3037841, -2866430, -2471488, -2221900, -2310867, -2394167, -2154248, -1975806, -2389623, -2992631, -2803574, -1817996, -1291589, -2047041, -3260965, -3553446, -2749267, -1872392, -1714661, -2104687, -2492415, -2620047, -2484773, -2088349, -1497886, -985400, -876486, -1221414, -1701742, -1970599, -2089619, -2450568]
33360b450568o93951m89594K81248Q44582N78554k13959p89850q44016n36483
33351d314037l9585M34770M71507p3703o05797m14679K87027N65146O6608m75323
33341d098066k69602M75641Q87184N49530r0918l89328k50677p5120j21439k03846
33331c586641j02665m72j94402n05430m05010K10293P70120P26441J87047l25076
33321c225795m73441k91822n907J57526J51482J62101K99620L16423k6355m11280
33311c347448k86346K82255O47330N08826J94729k9601k24350k69063P8469M68298
33301a976901K50332k98714j75042N42717M54850q33575j610500n28210J119619
33292c055424J245347J00274l84504K25158M95537k11304q61684q27120p94353
$$ y = [-2450568, -3144519, -3634113, -3352865, -2508283, -1929729, -2143688, -2933538, -3777554, -4314037, -4353622, -3918852, -3447345, -3521048, -4126845, -4541524, -4254497, -3689351, -3622743, -4098066, -4367668, -3892027, -3004843, -2455313, -2546231, -2935559, -3186236, -3261356, -3382795, -3586641, -3689306, -3689778, -3884180, -4389610, -4794620, -4584327, -3814207, -3087766, -2900719, -3225795, -3699236, -3991058, -3996965, -3839439, -3687957, -3525856, -3226236, -2909813, -2936168, -3347448, -3633794, -3351539, -2704209, -2195383, -2000654, -2030255, -2254605, -2523668, -2445199, -1976901, -1726569, -2025283, -2200325, -1657608, -1202758, -2036333, -3646833, -4175043, -3055424, -1810077, -1709803, -2094307, -1869149, -1373612, -1584916, -2446600, -3273720, -4068073]
33283d068073r88415m26726J088497J983024J206078N4590J80883R45654N43276
33274E18788r60196j657981p39525M06295L98883l01106m90153r0892J4673n09987
33264c411201r88688o96157K59316J104817J200993O05281p1029l28512k30609
33255b555789j11251j9431K05202L71436r003q52097j181618k52931J223653J692223
33245a489606O81226n63351p24918n2903K88818O327j56462J13110J77663k93488
33235b013584n70925m0476O41112M54505l87598p15312r9851O27579O21837L2645
33225a450068m40260m27445o7772L04961M23066K40421p6870m02842p47843r58567
33215c603219o79139L4673M64674J39254l59459j66760N84388J026900Q60808
$$ y = [-4068073, -5056488, -5483214, -4394717, -2411693, -1205615, -1151025, -970142, -24488, 518788, -441408, -2099389, -2838914, -2432619, -2033736, -2334842, -2824995, -2915887, -2901214, -3411201, -4399889, -5096046, -4836730, -3731913, -2530920, -1925639, -1996668, -2325180, -2555789, -2667040, -2686471, -2481269, -2109833, -2118836, -2970933, -4152551, -4405482, -3181829, -1489606, -808380, -1371731, -2096649, -2149552, -1860734, -1854407, -2010869, -1897759, -1720096, -2013584, -2584509, -2624985, -1983873, -1529368, -1916966, -2632278, -2732129, -2104550, -1482713, -1450068, -1890328, -2317773, -2385545, -2080584, -1657518, -1417097, -1493967, -1896809, -2644652, -3603219, -4282358, -4247685, -3783011, -3643757, -4003216, -4169976, -3585588, -2558688, -1697880]
33206a697880N11946J67816l30320o75908k96090M92828O52532J5458m32024k22351
33196a813993j07199n02092n64581K31321Q25426J55787r37511q66226K83783
33187c295285J017698P43315K65158J17352l1464k17975L7428M89120J84191p94154
33177a484616j066143j45919N60064l2599q32245l43450P96861Q24719k41241
33168a964569o52731J97999R05660M66919k13822r4322K33825k32157j021423
33159b374621r68141k05904J03556k54148l03132L27210P27505K40907m50709
33150c157477m05134K35413O65779N93917L05255l3533m34534o58132l61525L13361
33140b936610P44190N12653j44011o05578m82819K4591L59563K52886L0840R3682
$$ y = [-1697880, -1185934, -1018118, -1348438, -2024346, -2320436, -1827608, -1175076, -1159618, -1591642, -1813993, -1921192, -2423284, -2987865, -2756544, -1931118, -1775331, -2712842, -3579068, -3295285, -2277587, -1534272, -1269114, -1151762, -1183226, -1401201, -1363773, -874653, -690462, -1484616, -2550759, -2696678, -2136614, -2169213, -3001458, -3344908, -2548047, -1723328, -1964569, -2617300, -2419301, -1513641, -1046722, -1260544, -1354866, -1121041, -1353198, -2374621, -3342762, -3548666, -3445110, -3699258, -4002390, -3675180, -2947675, -2706768, -3157477, -3562611, -3327198, -2661419, -2067502, -1762247, -1795780, -2230314, -2888446, -3249971, -2936610, -2192420, -1679767, -1823778, -2429356, -2912175, -2887584, -2528021, -2275135, -2244295, -2150613]
33130b150613K84259J77873j43020j70790J81044M35071L45146J95194J47595
33121f98241m0545m18054o06609m24341j21414J79157N43852O18210p0312r83126
33111b021423r33410K9334M77582m1284j43155Q67418J392462J29962j336999
33102a579513p91586R38068J173630l67003j322679o10250K41897J34989M1480
33093b140967O49533Q43905r7588q79537l25835N78997M10134l77890n04125l7335
33083a880708J19952n0790l3777j562k42067j97760M99667R03003J62919p93596
33073a514719o29841J78106K90013p4329K73686R93468O21530o33516q94314K52319
33063a137597R52357J64626o34870j0109J048250Q43051l20984q60430m41238
$$ y = [-2150613, -1866354, -1688481, -1831501, -2002291, -1821247, -1386176, -1041030, -845836, -698241, -738786, -1156840, -1763449, -2187790, -2309204, -2130047, -1586195, -967985, -1038297, -2021423, -2954833, -2925499, -2447917, -2489201, -2632356, -1764938, -372476, -242514, -1579513, -2371099, -1433031, -259401, -626404, -1949083, -2559333, -2317436, -2182447, -2140967, -1491434, -647529, -745117, -1624654, -1950489, -1371492, -961358, -1339248, -1843373, -1880708, -1760756, -1811546, -1845323, -1846885, -2088952, -2286712, -1787045, -884042, -721123, -1514719, -2144560, -1966454, -1676441, -1750770, -1477084, -483616, 137914, -495602, -1389916, -1137597, -185240, -20614, -655484, -665593, 382657, 1225708, 904724, 44294, -396944]
33054c96944q8073k42410k99223N376J13060k42743n03033k15016K72466M32204
33044a164336L24771L31142M63885L63514j06338n61531m94180J26118P71747
33035E4792R13024N38934K6894l39148m92695l89674p1631J31817p8783m00237
33025a06707j85632N37149Q53337J62809q67012j122298n30114m1731j95334m34106
33015a929639r8590N27894O68295J88455k97199l51442j95822j80855k43936j36235
33005b049074J20968K84975K33239N4152q5341m7896J47856K55115P8391j62898
32995a170513j04136J16031J0484l45681k81304K83079M63294j80236p34884l21833
32985b265699M15313L56547k52221m02430k22053n84319j096345m22742J217965
$$ y = [-396944, -485017, -727427, -1026650, -1021274, -908214, -1150957, -1653990, -1869006, -1596540, -1164336, -839565, -508423, -44538, 318976, 212638, -348893, -843073, -716955, 54792, 967816, 1506750, 1533644, 1194496, 701801, 312127, 240496, 372313, 293530, -106707, -292339, 244810, 1098147, 1260956, 393944, -728354, -1258468, -1300199, -1495533, -1929639, -2028229, -1500335, -832040, -643585, -940784, -1292226, -1488048, -1668903, -1912839, -2049074, -1928106, -1643131, -1409892, -1355740, -1441081, -1488977, -1341121, -1086006, -1007615, -1170513, -1274649, -1158618, -1148134, -1493815, -1775119, -1492040, -1028746, -1208982, -1943866, -2265699, -1850386, -1493839, -1746060, -2148490, -2370543, -2954862, -4051207, -4473949, -3255984]
32976c255984J865690P17759o21540o45277N661Q1163k39917j64906J35411J39619
32966a982321J28568M33031M94487q0964n13689j49226K79849K6227j81381M28791
32956a116628R16585J67223q59633n51791N18463N41631l29642l26717O09765
32947d30744O25867o41250j220309j71590P72023J78105p23647k73000Q29813
32938a054732Q23391k54467q57240l99634J80168O3738m70239o76870k07317N89729
32928b263473Q99304L02523m74317l33055N62953Q87055J57653m90810r9476O73524
32918a78119O99277K0133n44706o91167o68089o01246n03409m59080k98796K74850
32908b950352Q52053N15326o08684j071739j50595R01354O59234l85521p61175
$$ y = [-3255984, -1390294, -672535, -1294075, -1939352, -1933691, -1852528, -2092445, -2257351, -2121940, -1982321, -1853753, -1420722, -926235, -1007199, -1520888, -1670114, -1390265, -1364038, -1545419, -1116628, -200043, -32820, -892453, -1444244, -925781, -384150, -713792, -1040509, -430744, 195123, -446127, -1666436, -1838026, -1066003, -887898, -1611545, -1884545, -1054732, -231341, -485808, -1343048, -1742682, -1562514, -1498776, -1969015, -2645885, -2853202, -2263473, -1364169, -1061646, -1535963, -1869018, -1306065, -419010, -261357, -752167, -851643, -178119, 521158, 541291, -3415, -694582, -1362671, -1963917, -2467326, -2926406, -3225202, -2950352, -2098299, -1582973, -2191657, -3263396, -3413991, -2512637, -1853403, -2238924, -3000099]
32899c000099k69734O6063j46622k35871K35186Q57212J099879Q30066J60317
32890d03603n30020n84551K28737J166224J290447O07904j55785o20990r18127
32881H0236j043265p97499k94843P0103J33663L5674p6343q5020R6847K60083
32871a620364M758n69307p58546k30112M35455O24269N24853N49085N29611J58970
32861c51328k95429m11244l06774k78972k01267Q3393K39759k9627l72070l29128
32851b252687m2338J66708L94836P29915P97864L78409j00807k76799l74838m49162
32841a028899j6034Q05784Q59258l00596j279340p66044L99337O04452J7058l5948
32831g40972M48211L33362l30932l30664L29308K14993r51351j533162n74117
$$ y = [-3000099, -3269833, -3203770, -3350392, -3586263, -3351077, -2493865, -1393986, -563920, -403603, -933623, -1518174, -1289437, -123213, 1167234, 1775138, 1619353, 998363, 80236, -963029, -1760528, -2055371, -1985268, -1851605, -1815931, -1892274, -1977294, -1880447, -1620364, -1615606, -2184913, -2943459, -3173571, -2738116, -2113847, -1588994, -1039909, -510298, -351328, -646757, -1058001, -1364775, -1643747, -1845014, -1761621, -1521862, -1551489, -1923559, -2252687, -2295025, -2128317, -1733481, -1003566, -205702, 172707, 71900, -204899, -579737, -1028899, -1044933, -239149, 620109, 319513, -959827, -1725871, -1326534, -722082, -705024, -740972, -292761, 40601, -290331, -620995, -291687, -76694, -1028045, -2561207, -3135324]
32822c135324O48111O93019P8892J07733P08531P89638P5618o16921o60284k72275
32812a583262J9783l775j38135N893N11679Q66112M88965m45136j156179j223379
32802b657434q86875m13750J95712P79090R24575N26436k6521l45861l67138k02347
32792b474113m2058q5928k13366K028N59658P95956M17252J06999L23756K86544
32782c23272o86686j574975r42638O28515J159054J93398p19100o04211k70611
32773c140526m76051o37918j32964N79448R37158J123910J226138P75337j51986
32764A02546n95890k07847J22604j44393k94343J17702K34207n04352j033183
32755b202949l01470Q30695Q29515j60550p01885k71869L38683N08058L61372
$$ y = [-3135324, -2487213, -1794194, -1715302, -1607569, -899038, -109400, -33782, -650703, -1310987, -1583262, -1563479, -1567254, -1705389, -1699496, -1187817, -321705, 167260, -277876, -1434055, -2657434, -3544309, -3958059, -3762347, -2983257, -2058682, -1532246, -1558767, -1904628, -2271766, -2474113, -2516171, -2602099, -2815465, -2813437, -2253779, -1457823, -1040571, -933572, -609816, -323272, -1009958, -2584933, -3527571, -2899056, -1740002, -1546604, -2265704, -2869915, -3140526, -3616577, -4254495, -4387459, -3808011, -2870853, -1746943, -520805, 254532, 102546, -493344, -701191, -578587, -722980, -1017323, -899621, -665414, -1169766, -2202949, -2504419, -1673724, -844209, -1004759, -1706644, -1978513, -1639830, -1131772, -770400]
32746g70400M5301m18403o39502k18136M50192N76361J13362k57374j60070J63921
32736a114748M58354O83435P15792M11222o3595l88687m71846l72310j10597J50864
32726a02116J13512j49016j36249K75922M91573O7134n87339q09758m90949Q6055
32716a241231O26319O97279n4006j131060j428604p33663j08643k13397k90488
32707c877494L58359R72266N77434k44425k10917O05794R82584N08627Q631N5321
32697b63820K25602k7896o38081j172971j209833n32591N01007J017597O11391
32688a489595m8859j53921J52586K65642J84853K82133M42630K91648n7001k54778
32678c84662l67325n51629n19805o2971L73499L82659L01900M62105M30790j04007
$$ y = [-770400, -725099, -1143502, -1783004, -2001140, -1550948, -974587, -861225, -1118599, -1278669, -1114748, -656394, 27041, 742833, 1154055, 1090460, 701773, 229927, -142383, -252980, -102116, 11396, -137620, -273869, 2053, 493626, 560760, -26579, -836337, -1327286, -1241231, -614912, 82367, 28361, -1102699, -2531303, -3264966, -3373609, -3587006, -3877494, -3519135, -2546869, -1969435, -2213860, -2424777, -1818983, -836399, -327772, -319141, -263820, -38218, -66114, -704195, -1877166, -3086999, -3619590, -3118583, -2100986, -1489595, -1538454, -1692375, -1539789, -1274147, -1089294, -807161, -364531, -72883, -129884, -384662, -751987, -1303616, -1823421, -1886392, -1512893, -1130234, -828334, -366229, 64561, -39446]
32668c9446m90248k32506j18671q95901j598998q27954Q17901J352673K84375
32659a748775q13424o92539J46837O71480O27964L08689L2396P9095L72119L22647
32649f93511k69877o12777j42021L48679L0132l45797K26988Q90933J94780j124921
32639a497392j036000L80502J008044K41810k88532M7242j73624j340340j567393
32630d225683k926J274249N49976o49933j70202J236549J420794L91083j84717
32621c60810m371j43579o46264m82483L10231N62959N1059k19405R8778J88507
32611f45378l27639p40407n26810p3892J68474K84098M13100M65737M28900L50583
32601b03234J25540j58303l7472N12588O55477n7308o78863k14139O63767N98558
$$ y = [-39446, -529694, -762200, -880871, -1776772, -3375770, -4203724, -3385823, -2033150, -1748775, -2562199, -3254738, -3107901, -2436421, -1808457, -1499768, -1467372, -1388277, -1016158, -693511, -963388, -1576165, -1718186, -1369507, -1339375, -1685172, -1458184, -567251, -372471, -1497392, -2533392, -2152890, -1144846, -903036, -1191568, -1144326, -1317950, -2658290, -4225683, -4228609, -2954360, -2404384, -3054317, -3224519, -1987970, -567176, -176093, -360810, -365181, -508760, -1155024, -1637507, -1327276, -764317, -713258, -932663, -833885, -645378, -973017, -1713424, -2240234, -2314126, -2145652, -1861554, -1448454, -982717, -553817, -203234, -77694, -235997, -273469, 239119, 894596, 837288, 158425, -55714, 608053, 1206611]
32591A206611k55642n90873k09861k13652q80330j080030k10184Q04355J021199
32582d08407O80881K83747k96029j023099j137184k92238N82527M80156k60125
32573a389771n96440l39187j63275l66031m85974j51149L53223N30199L15878
32564b292527R1788J59919L32917J85147k49377l41008K75354J028447J110501
32555C01161N81460J07046j82484o85906j236897j074692j59965N07552L50248
32546a492477L8007K56540N91642M40535J55707K54133K50233m45749j041501
32537i92930l45043R75068Q92794q74069k021002q20843J347231J961885P64585
32528H87676m10719n54590m11379n95646n78350o161M51630K95069O2972K46464
$$ y = [1206611, 950969, 360096, 150235, -63417, -943747, -2023777, -2233961, -1429606, -408407, 272474, 556221, 260192, -762907, -1900091, -2192329, -1609802, -1129646, -1389771, -1986211, -2325398, -2488673, -2854704, -3340678, -3491827, -3138604, -2608405, -2292527, -2200739, -2040820, -1707903, -1522756, -1772133, -2113141, -1837787, -809340, 301161, 882621, 989667, 807183, 121277, -1115620, -2190312, -2350277, -1842725, -1492477, -1454470, -1197930, -606288, -165753, -10046, 244087, 494320, 48571, -992930, -1337973, -362905, 529889, -344180, -2365182, -3186025, -1838794, 123091, 887676, 476957, -77633, -489012, -1084658, -1663008, -1669169, -1217539, -922470, -859498, -613034]
32518f13034L78257N2451j34729L21065O69586L3032r72098j035690j28274O17710
32508h11724O75662M54574R8320o15998j218609q51185J82887N62623m3368m61868
32498b028686O2764P59719P46207L26312J47698J32763K4270O2695L61047M31966
32488A026755K0924l84151m52460n30909p07077l87177N02383R70520M41199k71610
32478B28397l53236k68721o46146r74343o00680k8941N5579J16521P55188J274943
32468d41439P78943q2467r7917M13744K17145o21879r18805m79498k42039m22297
32458a896509k59401L36156N32062J39460r0273Q1800Q3546j36082O7391O37191
32448e04659O76148J8204m16855j72054J40602J00176N8932J39137q1053n39306
$$ y = [-613034, -234777, -182326, -317055, 4010, 673596, 706628, -265470, -1301160, -1429434, -811724, -136062, 318512, 416832, -199166, -1417775, -2268960, -2086073, -1523450, -1566818, -2028686, -1965922, -1206203, -459996, -133684, 14014, 146777, 171047, 233742, 594789, 1026755, 1047679, 663528, 211068, -319841, -1026918, -1414095, -911712, 58808, 500007, 228397, -124839, -393560, -1039706, -2014049, -2614729, -2643670, -2588091, -2471570, -1716382, -441439, 337504, 255037, 157120, 570864, 788009, 166130, -752675, -1232173, -1474212, -1896509, -2155910, -1819754, -1287692, -1148232, -1238505, -1156705, -1073159, -1209241, -1141850, -504659, 171489, 189693, -227162, -399216, -258614, -158438, -99506, 39631, -41422, -580728]
32438e80728n85956k21625j95247n92962o32877j43036J31127m046J29572N79767
32428b116011M89223k14407m45937J44657N11549J00549k47237k9600r733n02815
32418b319762m87800M53829J023819L29461n17468l60720N0995k79119n32115
32409b638880L85319J513040J184772k13349r40174o71083m98280o67394m01836
32400b947865K54840L99661L3924P6208N79147N99072n6019m93107k86957L2189
32390a808907J41115K64196L24039K3764k76626m3549K46325j94860q28383m78535
32380b631421N02693N97401l18566p41431j27285L29716L4720K3991P94097J104227
32370d31858J59973p85096m60755L04480J10108o29982n84103J41196L57912n2005
$$ y = [-580728, -1166684, -1388309, -1583556, -2176518, -2809395, -2952431, -2821304, -2825350, -2695778, -2116011, -1626788, -1841195, -2287132, -2142475, -1630926, -1530377, -1777614, -1807214, -1816947, -2319762, -2807562, -2353733, -1329914, -1000453, -1517921, -1878641, -1827646, -2106765, -2638880, -2253561, -740521, 444251, 230902, -709272, -1380355, -1878635, -2546029, -2947865, -2693025, -2293364, -2259440, -2183232, -1604085, -1005013, -1061032, -1554139, -1841096, -1808907, -1667792, -1403596, -1079557, -1055793, -1332419, -1375968, -1129643, -1324503, -2152886, -2631421, -2128728, -1531327, -1849893, -2591324, -2718609, -2388893, -2354173, -2330182, -1536085, -431858, -271885, -1056981, -1517736, -1213256, -1103148, -1733130, -2317233, -2176037, -1818125, -1870130]
32360a870130q8046N05625Q97549O62749K57851n4597n09861r21152o40949K31497
32350a529464O38307M3281o89807m76217N01109J095913P00729j11951m26900
32341b55000o6965L45083K47167k18278n22302m50612j75959J76674N46384N97636
32331B23828J1261p76359q32116k5911O22802L55541k44077k29149K37848K59678
32321c96654k83084n50412p2505N64437N92040M3255m34676m19148j12484j7144
32311a086375l05235n42428k11265M86335P56488L27163q9565J36850N58727L75044
32301D05739k64492n29243k75141k00140n85139p94907l19441M53290Q96268R40540
32291b72666P76687L23801m53411j090538j066254n07763O881K05532K69704L41654
$$ y = [-1870130, -1958176, -1452551, -555002, 107747, 365598, 311001, -198860, -1120012, -1760961, -1529464, -891157, -847876, -1537683, -2013900, -1512791, -416878, 283851, 171900, -255000, -321965, 23118, 270285, 52007, -470295, -920907, -1096866, -920192, -373808, 223828, 235089, -541270, -1373386, -1399297, -776495, -420954, -665031, -894180, -656332, -396654, -679738, -1230150, -1302655, -738218, -146178, -102923, -537599, -956747, -1069231, -1086375, -1391610, -1934038, -2145303, -1658968, -902480, -575317, -664882, -528032, 30695, 405739, 141247, -387996, -663137, -863277, -1448416, -2243323, -2562764, -2109474, -1213206, -272666, 504021, 827822, 374411, -716127, -1782381, -2290144, -2283263, -2077731, -1808027, -1466373]
32281a466373L07478Q9235j55898k02405K5516M03552O92326P29926N65657K83427
32271A272441k25670r80227j446201r49530K45336R37926N26056j26218l9930
32262g86017L26393o6858q96404q11532K87768Q50734O3726p97892l52194P40746
32252a441530Q96114M5042n18264l05252j17491l80732m27581K16508R83947J172257
32242A23018Q13613K33563m36026r05440p01595L6296M57677J49384l13480l74931
32232i17921k59627k23221Q8610Q18641J227987P22065q6204k66429q877j93274
32222I01750q88985j274656q74356l3445O88299R01011M33083l07833m07817L44097
32212e18852Q16871O7346j038230r83981M3012M86213n5038l41557K50503P23850
$$ y = [-1466373, -1158895, -1069660, -1225558, -1427963, -1402447, -998895, -306569, 423357, 989014, 1272441, 1046771, 66544, -1379657, -2329187, -2083851, -1145925, -619869, -746087, -786017, -459624, -526482, -1422886, -2234418, -1946650, -1095916, -1032190, -1830082, -2182276, -1441530, -545416, -500374, -1018638, -1323890, -1441381, -1822113, -2249694, -2033186, -1049239, 123018, 936631, 1170194, 734168, -171272, -872867, -836571, -378894, -229510, -542990, -917921, -1177548, -1400769, -1312159, -493518, 734469, 1456534, 1370330, 1103901, 1095024, 901750, 12765, -1261891, -2136247, -2169692, -1481393, -580382, -147299, -455132, -862949, -518852, 298019, 365365, -672865, -1656846, -1613834, -1127621, -1182659, -1524216, -1273713, -549863]
32202e49863L23638j71034N9602M17561L4721o57726o94233j50915J88697J70512
32192a029040J89562K32633N2950n6049L03045O74048K53265p58170j273224p95524
32182b206504Q6602P19860J045611J097999O77031j26265p00627o25582k23430
32173b55305p2161k57312m00456k43475N3857J53245n2109k90747k15682J36332
32163a443813L41308J33393k46411m10507l18386j69380K776K95626N78960N14575
32153g21859J9640m92327m87688P3624O06230N45607J10158O0438N21400N91402
32143H26625l14931j279086j032175J2256K26961o36341q90209M07463J740462
32134i38975J309148k61157r27233k03483N17799K79011m20246q79452r85797
$$ y = [-549863, -226225, -397259, -337657, 79904, 114625, -543101, -1237334, -1388249, -1199552, -1029040, -839478, -606845, -553895, -609944, -306899, 367149, 620414, -137756, -1410980, -2206504, -2119902, -1400042, -354431, 743568, 1420599, 1294334, 593707, -31875, -255305, -327466, -584778, -985234, -1228709, -1174852, -1021607, -1073716, -1364463, -1580145, -1443813, -1102505, -969112, -1215523, -1626030, -1944416, -2113796, -2111020, -1815394, -1236434, -721859, -702219, -1194546, -1682234, -1608610, -1002380, -456773, -346615, -286177, 235223, 826625, 511694, -767392, -1799567, -1787311, -1560350, -2196691, -3086900, -2679437, -938975, 370173, 109016, -818217, -1021700, -503901, -224890, -645136, -1524588, -2510385]
32125b510385n94114M83224J562335J484648L71293k59459L15320R24620L46215
32116B123697q67542j378148r80901m39242n4056M28339Q41995O66949j4116n39868
32106b12893o25890n20554k91288K02361O26846L80890l21281m50655L59997J113125
32096B60658P90622k09365o91084l13462J81075K27150P3618L0266j20600n14267
32086b85389o11169R2655J037619J050991r9225j250150j234993k41162O14583
32077i26240O85192K48317k02255m74841m60270k2240N98338P30505O6984p45101
32067e01611p86482m4352N78963M75503L1500j10825J7561M545r2395J06330M21696
32056A00433K07123n06628q04199k88047J18002m39517j185824o66088J001632
$$ y = [-2510385, -3104499, -2621275, -1058940, 425708, 797001, 537542, 852862, 1777482, 2123697, 1256155, -121993, -1102894, -1542136, -1596192, -1167853, -325858, 341091, 326975, -212893, -838783, -1359337, -1650625, -1448264, -821418, -440528, -761809, -1212464, -852467, 260658, 1051280, 841915, 150831, -162631, 18444, 245594, 319212, 349478, 228878, -285389, -896558, -803903, 233716, 1284707, 1185482, -64668, -1299661, -1540823, -926240, -241048, 7269, -194986, -669827, -1130097, -1152337, -553999, 176506, 243490, -501611, -1288093, -1332445, -753482, -277979, -246479, -357304, -339743, -335198, -427593, -321263, 100433, 307556, -199072, -1003271, -1291318, -1173316, -1612833, -2798657, -3464745, -2463113]
32047b463113K029464J275820l78437j318491r88493J3257Q30477Q38987o5298
32038b25827j125803j244941l09692N89046O64932M09582N14801O76949L05207
32029B54254l02497m80608l38077l38200j98930O12778J538362J317740j96843
32020A867979j644245j785149p63979L85588Q22708M13462k47133l23322K87881
32011i86210P12279L44360j77437m9389K53433k02393j020820r92005j88400R3290
32001b213292m32112n69170J99964P73548L54583k12256L1960N91555N21274n4923
31991a008869m49151n27198l89541J66365R41079J013879J19784n71444j32095
31982h37191N80441K90133o26263q48806k53639J66193J10770J86749M86665L97255
$$ y = [-2463113, -433649, 842171, 463734, -854757, -1843250, -1829993, -999516, -160529, -225827, -1351630, -2596571, -2906263, -2317217, -1652285, -1242703, -727902, -50953, 254254, -48243, -528851, -866928, -1205128, -1404058, -791280, 747082, 2064822, 1867979, 223734, -1561415, -2325394, -1939806, -1117098, -703636, -950769, -1274091, -986210, -273931, 70429, -107008, -156397, 97036, -105357, -1126177, -2118182, -2306582, -2213292, -2645404, -3214574, -3014610, -2241062, -1886479, -2098735, -2066775, -1475220, -953946, -1008869, -1458020, -1985218, -2374759, -2208394, -1267315, -253436, -133652, -705096, -837191, -256750, 33383, -592880, -1441686, -1695325, -1529132, -1418362, -1231613, -744948, -347693]
31972c47693j41370m47293k69245n0948L3426K52260M80795K58921k15834j94820
31962f41801L60314O08164J25400n31583p63272n79514j60427L81466O53683K71550
31952b76020l39825l05621L63373O95617K23577m04480n44667l62724j86353M7549
31942a089574L07057K62897l5967p0393K35844L38949R9372L4561K16744J2492
31932C11982n95855o27727K38995Q32422K86173m37293n2512R36371J047877J09217
31922B049650p44009r50941r26716p88489j84079N65160N83299n9470k87283J90775
31912e52103L35352m24110j079405n56061O52390J305668J114484O32015N6695
31903A484925p39969j318491r64418Q6166O81062K40188n36241p10486k18147
$$ y = [-347693, -489063, -936356, -1205601, -1256549, -1223123, -970863, -490068, -231147, -446981, -641801, -281487, 326677, 452077, -79506, -842778, -1422292, -1582719, -1201253, -547570, -276020, -615845, -921466, -558093, 137524, 361101, -43379, -588046, -950770, -1137123, -1089574, -782517, -519620, -555587, -625980, -390136, -51187, 48185, 82746, 299490, 311982, -283873, -911600, -672605, 159817, 445990, 8697, -43815, 892556, 1940433, 2049650, 1305641, 354700, -572016, -1360505, -1544584, -979424, -396125, -455595, -742878, -552103, -216751, -640861, -1720266, -2276327, -1623937, -318269, 796215, 1428230, 1484925, 744956, -573535, -1537953, -1451787, -770725, -530537, -1066778, -1777264, -1995411]
31894a995411L81056P07336P10171M19997k5394l46063m16282l70485k20962K42148
31884i13889Q69399R54510J60796p36211p38244l7818K51269k76064q08413n88432
31874a863097J34767P28115R77818Q54930K17511o98966j136818p81010l00349
31865a867099l03087l80576L9211N20560L12510k55364k22354M01766O66345K57636
31855h30452j11663M28J65332J2225j98794j78231L8700M37012Q66483O28517
31845H29557o57612j857678j436680J24075P30676j12275m53588Q65036K155290
31836A86801J557875r166n24670r2218k39076r39908q00250J90422N12175k17299
31826c75314o48745j21684L51870P5248k17012N3151K78050M1842L559N08136
$$ y = [-1995411, -1614355, -907019, -196848, 223149, 197755, -148308, -564590, -935075, -1156037, -913889, -44490, 910020, 1070816, 334605, -403639, -441457, -190188, -466252, -1274665, -1863097, -1728330, -1000215, -22397, 832533, 1050044, 351078, -785740, -1566750, -1867099, -2170186, -2550762, -2511551, -1990991, -1678481, -1933845, -2156199, -1754433, -1088088, -830452, -942115, -941687, -776355, -764130, -962924, -1141155, -1102455, -665443, 201040, 829557, 171945, -1685733, -3122413, -2998338, -2267662, -2379937, -2833525, -1968489, 186801, 1744676, 1735510, 1210840, 1118622, 879546, -60362, -860612, -670190, -158015, -375314, -1024059, -1145743, -793873, -718625, -935637, -882486, -604436, -562594, -559035, -50899]
31816e0899P21564J24268m36749k31356N3285l40481p30211j60876Q36807J052753
31806H38105M62788p5248l92202q61058j142927n87999L12969L58038m45725p62680
31796b295939N2450J068840J285487Q98977N41438K14667l28265q27887q74747
31787b64979o23849n29300n88488l86565J65366N73820L86671j35116k21403M40475
31777a183368J153438R81926J7632o69242m93018j02383k52479o11776m17023
31768a576293K06395M89296K76657P8636J4052k87312p01725n57017J93880O64475
31758a198956K93543l39952l91861J71935P78267R86655O58053j15851q90539
31749d8706j103452p17030k28590R8253M54049P94259O65638M5385l79670k14962
$$ y = [-50899, 670665, 794933, 358184, 126828, 180113, -160368, -890579, -1051455, -214648, 838105, 1300893, 1225645, 833443, -27615, -1170542, -1758541, -1445572, -1087534, -1533259, -2295939, -2243489, -1174649, 110838, 1009815, 1551253, 1765920, 1437655, 609768, -264979, -888828, -1418128, -2006616, -2393181, -2227815, -1653995, -1267324, -1402440, -1623843, -1183368, -29930, 951996, 969628, 300386, -192632, -295015, -547494, -1159270, -1576293, -1369898, -880602, -603945, -525309, -511257, -798569, -1500294, -2057311, -1863431, -1198956, -905413, -1245365, -1637226, -1465291, -687024, 299631, 957684, 841833, -48706, -1152158, -1869188, -2097778, -1999525, -1545476, -751217, -85579, -40194, -419864, -634826]
31739f34826N0855n3698k07726l0436J13023k00218n50484l17411K37365L98905
31729a194651J33816p8463j92796m17031l87286L58946J200618R37207l58899
31720A461j164167o02239L23077K45672o54696j113529o30144O5537K53574J18782
31710c156672K02257M90082M68873l1320m45523j61231N95290R91480P25689L72794
31700E1719L56470K55767k95220o78345j92002N76527M58123l98640o61020M0163
31690d86458N19903O4806l78405Q4953O71962K60365o12320n97721J84329L48962
31680F0376m09365q00682q1557P22729M30811n38721r03428l24718L94665N51569
31670h98321K17294j75044l09940q4003L42664N87181M27779R3537o4744n8402
$$ y = [-634826, -583971, -637669, -845395, -875831, -762808, -963026, -1513510, -1830921, -1593556, -1194651, -1060835, -1139298, -1332094, -1749125, -2136411, -1777465, -576847, 360360, 1461, -1162706, -1764945, -1441868, -1196196, -1850892, -2964421, -3594565, -3529028, -3275454, -3156672, -2954415, -2464333, -1995460, -2026780, -2472303, -2633534, -2038244, -1046764, -321075, 51719, 408189, 663956, 368736, -309609, -501611, 74916, 533039, 134399, -526621, -486458, 33445, 98251, -280154, -195201, 476761, 737126, 124806, -472915, -288586, 60376, -348989, -1149671, -1231228, -508499, -77688, -616409, -1519837, -1844555, -1449890, -898321, -681027, -856071, -1166011, -1250014, -907350, -320169, 107610, 201147, 136403, 78001]
31660G8001j19934k06942l7500L76091O17751M43510J68754K18728M57537L15775
31650B311771l55877q85831n40295M36924R57580L91087o46328j120106q81944
31641c33019o29444p09091o53208r8102M90502N05325J79034K27809O83882P76266
31631D39954Q4065p89411j010980n70548j32184p1212j04739J53331O35336R21844
31621d44544P08149R6317m69906n61428j65840K95556M47464L42235K02802j7663
31611D33142m68892r12689q83565l93293J6599Q0940J52898M68676O22454K56230
31601f27500j83057k4271N53418P15794J62837n08068o53696k60932K75009N70063
31591A9597M18201k4745k52156l0116J50034j95628o05480l01402L92606L50798
$$ y = [78001, -41933, -248875, -286375, 89716, 707467, 1150977, 1319731, 1538459, 1995996, 2311771, 1955894, 1070063, 529768, 966692, 1924272, 2315359, 1669031, 548925, -333019, -962463, -1671554, -2324762, -2422864, -1932362, -1427037, -1248003, -1020194, -336312, 439954, 524019, -265392, -1276372, -1846920, -1979104, -2050316, -2155055, -2001724, -1366388, -444544, 263605, 359922, -109984, -671412, -837252, -541696, -94232, 248003, 450805, 433142, -35750, -948439, -1832004, -2225297, -2208698, -2127758, -1974860, -1506184, -883730, -627500, -810557, -834828, -281410, 434384, 597221, 89153, -564543, -825475, -550466, 19597, 437798, 413053, 160897, 130781, 280815, 85187, -520293, -821695, -429089, -78291]
31581g8291n17078r35088k04859O93492O57944P0586p9462J99511K46271K5341
31571G8367n3373q7688l56147m68551K8342N69225L00041l92852l80447L29832
31561d33251N94738N5122l67499j56473J6086l15131n17772n4761N28435N71885
31551g8621L23444K34040R5882l15438n40832k45003o497l82709q23997n14737
31541b254468K29926M72078J72518R4334L91483M20467j1333k44301J51950P20221
31531A42875Q39072M68901r6012o73849j097658j088940n27217L55451J130447
31522e46930J333392O29477p22267j652449j171446L37262J280932O77728o02750
31513d37051q93113K01753J347292J178026l2109q23968m85185J18768p5406p21478
$$ y = [-78291, -595369, -1530457, -1735316, -1041824, -383880, -313294, -392756, -193245, 53026, 78367, 24994, -62694, -418841, -887392, -859050, -289825, 10216, -382636, -763083, -433251, 161487, 216609, -150890, -307363, -291277, -606408, -1124180, -1178941, -650506, -78621, 244823, 478863, 574745, 259307, -281525, -526528, -533025, -915734, -1739731, -2254468, -2024542, -1552464, -1379946, -1285612, -894129, -473662, -484995, -729296, -577346, 142875, 981947, 1450848, 1354836, 680987, -416671, -1505611, -2032828, -1677377, -546930, 786462, 1415939, 693672, -958777, -2130223, -1792961, -512029, 165699, -437051, -1330164, -1128411, 218881, 1396907, 1364798, 540830, 55645, 174413, 99007, -622471]
31503f22471o11990L95344J026684M46173m93876n21986K58628P41281N24183
31494A141970K14473J63258m8279o39341j025380o53763J25189N24528L27653
31485A30308j6598j24265q6974j42620k31525o3506M19834Q33020P53368K57137
31475A728179j96007l84728m85155n75497m64726k02353j97965m52334k56081
31466a486667P13057J487503R00266o29271j388295n78329O68313Q74700J01130
31457F62407l89347M3948O50952M05807o19534j357518j091532k85724J39932
31448a840609K5986l0251K61257N20816N00628M74844M96418P2225q28407j199133
31438a546226k93621J054716J398988O26268p3372o308K85186J14857m23936p90847
$$ y = [-622471, -1234461, -839117, 187567, 633740, 139864, -382122, -123494, 617787, 1141970, 1356443, 1519701, 1471422, 832081, -193299, -847062, -721873, -197345, 130308, 113710, -10555, -97529, -240149, -471674, -535180, -115346, 717674, 1471042, 1728179, 1532172, 1147444, 662289, 86792, -377934, -580287, -778252, -1230586, -1486667, -773610, 713893, 1614159, 984888, -403407, -981736, -313423, 561277, 662407, 273060, 317008, 967960, 1373767, 754233, -603285, -1694817, -1980541, -1840609, -1814623, -1844874, -1583617, -1062801, -562173, -87329, 409089, 481314, -347093, -1546226, -1839847, -785131, 613857, 1240125, 1166753, 1160445, 1445631, 1560488, 1136552, 345705]
31428C45705n92454J98641J049378J052919j0025j046757r12877j6748L22924
31419C90706j46525m80671k45669O350L3215K45833N10466P0026r11768j187134
31409a715171l86241L08427J55938O364N12119P37907j19925r81917m81154P03761
31399a259892Q65646o0211o16140k33948K10862J70910J36876M02236N08441K43044
31389C67824O6240K26451L81301L26528K48846J08027l58935q65194p00506J25174
31379g4244O77170L32750m55456q87727p15545k17459J89005J93073p6178n593
31369a040204O74842J212305P21920m24969j030007p92337n15421n25657j40933
31360a860461Q66321J470901Q19491m20580r63490n40714J28679N02348N70546
$$ y = [345705, -246749, -48108, 1001270, 2054189, 2044164, 997407, 84530, 67782, 390706, 244181, -236490, -482159, -475809, -442594, -196761, 313705, 383731, -528037, -1715171, -2101412, -1792985, -1637047, -1630683, -1118564, -380657, -500582, -1482499, -1963653, -1259892, -394246, -454457, -1070597, -1304545, -1093683, -922773, -785897, -383661, 124780, 367824, 434064, 660515, 1041816, 1368344, 1617190, 1725217, 1366282, 501088, -199418, -74244, 602926, 935676, 480220, -407507, -1123052, -1340511, -1151506, -958433, -1034611, -1040204, -365362, 846943, 1568863, 1143894, 113887, -678450, -1193871, -1719528, -1860461, -994140, 476761, 1296252, 875672, -87818, -628532, -499853, 2495, 573041]
31351E73041L76718o6719m87881n39941k55663K3660P4761j07886m49704p44528
31341a604142o39204J3047Q44448J243423R44832K82563j33111l6648J61925j36958
31331I40175q18983j051286m86865O6026j92166p17890m02623O01538R84191K20034
31321h57849p51210j013998p12655k32456M88556J236354J220205L21074k98432
31312f00411K18844J016587P54819l87513j096882q90582m88212l92894k99804
31303b166048l3338n740l65134m87247J60723J104182J309464M33095o77028q33280
31293a560351J44136J095171Q23824l70680j028603m73808L48058L62649j29334
31284g88938j85351K26934M23790L34391M97984Q49619O40794k57712r63657q38493
$$ y = [573041, 949759, 883040, 395159, -144782, -400445, -376785, -302024, -409910, -859614, -1604142, -2243346, -2230299, -1385851, -142428, 802404, 1084967, 951856, 915208, 1077133, 940175, 121192, -930094, -1416959, -1350933, -1543099, -2260989, -2663612, -2062074, -1077883, -857849, -1609059, -2623057, -3335712, -3568168, -3079612, -1843258, -623053, -301979, -600411, -381567, 635020, 1389839, 1002326, -94556, -985138, -1473350, -1866244, -2166048, -2199386, -2205126, -2570260, -3057507, -2896784, -1792602, -483138, -50043, -727071, -1560351, -1416215, -321044, 502780, 132100, -896503, -1370311, -1022253, -659604, -788938, -974289, -747355, -323565, 10826, 508810, 1358429, 1999223, 1741511, 777854, -60639]
31274f0639l29676j53779l16922m12790l50652k81563j80255L2463K08674K02646
31264a642493J71346L01382M13475J86399l20137o83191o49872m04000k44305
31255b871396j82000j739L38110N61941M53359K29419K69859N08930M68112J1015
31245b14390l39677j24263L59595M79592J33350k61504m71850o33169p57161n53504
31235b382981J02526Q36015J080114O08106k53985q53443p38913q8394M95742
31226a195213O71855N92304L98548m9514o78874r60691o35993k31524k66400l65419
31216b720921J02749Q40953R68148L98673o1077j5801O5955j08567r8300L75704
31206b52484P59132M54219k51331n85138k78373K61837N04231K31913l10408n42435
$$ y = [-60639, -390315, -544094, -861016, -1273806, -1624458, -1906021, -2086276, -2053813, -1845139, -1642493, -1471147, -1169765, -756290, -569891, -890028, -1573219, -2223091, -2627091, -2871396, -3053396, -3055135, -2717025, -2155084, -1701725, -1472306, -1202447, -693517, -225405, -214390, -554067, -678330, -318735, 160857, 294207, 32703, -439147, -1072316, -1829477, -2382981, -2280455, -1444440, -364326, 243780, -10205, -863648, -1602561, -1690955, -1195213, -523358, 68946, 467494, 417980, -260894, -1221585, -1857578, -2089102, -2355502, -2720921, -2618172, -1777219, -809071, -410398, -471475, -487276, -421321, -529888, -628188, -252484, 506648, 960867, 709536, 124398, -153975, 107862, 612093, 844006, 533598, -8837]
31196h837j50846L57866J96742n04893p13772p13O83345K96814q03505j367222
31186b015021q77765M4384O58194Q04384O21190K16591k04767l40545j45783N0637
31176a188501o2748m07826o14828m13823R5798N35966O32474M79332L27561K00025
31166d16570m9303l51464m42989k94618j33252L3013M43202R59773R46543J56120
31156H50455o78926o48235J68880Q05282N61565l20792j049775j011264j99430
$$ y = [-8837, -159683, 198183, 394925, -109968, -823740, -824453, -141108, 155706, -647799, -2015021, -2892786, -2848402, -2190208, -1385824, -764634, -548043, -752810, -1093355, -1239138, -1188501, -1251249, -1659075, -2273903, -2687726, -2591928, -2055962, -1423488, -944156, -616595, -416570, -465873, -817337, -1260326, -1554944, -1688196, -1655183, -1211981, -252208, 694335, 850455, 171529, -476706, -307826, 497456, 1059021, 738229, -311546, -1322810, -1522240]
$$ [...]
##END NTUPLES=NMR SPECTRUM
##END=
