##TITLE=31Pdec_LY-THF
 CDcl3, 24 sc
 20.10.2020
##JCAMPDX= 6.0         $$ Bruker NMR JCAMP-DX V2.0
##DATA TYPE= NMR SPECTRUM
##DATA CLASS= NTUPLES
##ORIGIN= UXNMR, Bruker Analytische Messtechnik GmbH
##OWNER= root
$$ XWIN-NMR		Version 3.5
$$ Tue Oct 20 13:52:21 2020 Russian Standard Time (UT+4h)  she@DPX200
##.OBSERVE FREQUENCY= 81.013821
##.OBSERVE NUCLEUS= ^31P
##.ACQUISITION MODE= SIMULTANEOUS
##.ACQUISITION SCHEME= undefined
##.AVERAGES= 24
##.DIGITISER RES= 17
##SPECTROMETER/DATA SYSTEM= spect
##.PULSE SEQUENCE= zgpg30
##.SOLVENT NAME= CDCl3
##.SHIFT REFERENCE= (INTERNAL, CDCl3, 0, 182.463)
##AUDIT TRAIL= $$ (NUMBER, WHEN, WHO, WHERE, WHAT)
$$ ##TITLE= Audit trail, XWIN-NMR		Version 3.5
$$ ##JCAMPDX= 5.01
$$ ##ORIGIN= Bruker BioSpin GmbH
$$ ##OWNER= she
$$ F:/spectra/data/she/nmr/P31/1/pdata/1/auditp.txt
$$ ##AUDIT TRAIL=  $$ (NUMBER, WHEN, WHO, WHERE, WHAT)
(   1,<2020-10-20 13:51:02.78 +0400>,<she>,<DPX200>,
      <created by zg, POWCHK disabled, PULCHK disabled
       configuration hash MD5:
       00 E9 B6 7A A2 85 ED C7 34 08 36 98 17 FE 4E 26
       data hash MD5: 32K
       3C F5 C0 12 E2 C1 D2 D7 CF F9 79 E3 38 E7 6E A6>)
(   2,<2020-10-20 13:51:07.01 +0400>,<she>,<DPX200>,
      <Start of raw data processing
       efp BC_mod = 2 LB = 1 FT_mod = 6 PKNL = 1 PHC0 = -2378.213 PHC1 = 65.80057 SI = 64K 
       data hash MD5: 64K
       9C B4 1F 4F 2F 1C F0 48 E0 6E 66 D9 3F 82 CD 33>)
(   3,<2020-10-20 13:51:51.17 +0400>,<she>,<DPX200>,
      <pk PHC0 = 2.047391 PHC1 = 5.599999 
       data hash MD5: 64K
       E9 17 DC 89 80 FE 64 4D 4C 71 65 A5 04 8D 68 FB>)
(   4,<2020-10-20 13:51:55.25 +0400>,<she>,<DPX200>,
      <abs ABSG = 5 
       data hash MD5: 64K
       E8 B5 69 95 54 18 5B 38 B0 08 7D C7 9C B5 8B 85>)
$$ ##END=
$$ 
$$ hash MD5
$$ 67 DA 33 B5 1F CF A8 8A A1 89 A1 83 50 E6 06 E4
##$RELAX= 
##$RELAX= 
##$RELAX= 
##$RELAX= 
##$RELAX= 
##$RELAX= 
##$RELAX= 
##$RELAX= 
$$ Bruker specific parameters
$$ --------------------------
##$DU= <F:/spectra>
##$EXPNO= 1
##$NAME= <P31>
##$PROCNO= 1
##$TYPE= <nmr>
##$USER= <she>
##$AMP= (0..31)
100 100 100 100 100 100 100 100 100 100 100 100 100 100 100 100 100 100 
100 100 100 100 100 100 100 100 100 100 100 100 100 100 
##$AQSEQ= 0
##$AQ_mod= 1
##$AUNM= <au_zg>
##$AUTOPOS= <>
##$BF1= 81.014009
##$BF2= 200.13
##$BF3= 200.13
##$BF4= 200.13
##$BF5= 200.13
##$BF6= 200.13
##$BF7= 200.13
##$BF8= 200.13
##$BYTORDA= 1
##$CFDGTYP= 0
##$CFRGTYP= 5
##$CHEMSTR= <none>
##$CNST= (0..31)
1 1 145 1 1 1 1 1 1 1 1 1 1 1 1 1 1 1 1 1 1 1 1 1 1 1 1 1 1 1 1 1 
##$CPDPRG= <waltz16>
##$CPDPRG1= <>
##$CPDPRG2= <waltz16>
##$CPDPRG3= <>
##$CPDPRG4= <mlev>
##$CPDPRG5= <mlev>
##$CPDPRG6= <mlev>
##$CPDPRG7= <mlev>
##$CPDPRG8= <mlev>
##$CPDPRGB= <>
##$CPDPRGT= <>
##$D= (0..31)
0 1 0 0 0 0 0 0 0 0 0 0.03 2e-05 3e-06 0 0 0 0 0 0 0 0 0 0 0 0 0 0 0 0 
0 0 
##$DATE= 1603187462
##$DBL= (0..7)
120 120 120 11 120 120 24 19 
##$DBP= (0..7)
150 150 150 150 150 150 150 150 
##$DBP07= 0
##$DBPNAM0= <>
##$DBPNAM1= <>
##$DBPNAM2= <>
$$ [...]
##$SUBNAM3= <"">
##$SUBNAM4= <"">
##$SUBNAM5= <"">
##$SUBNAM6= <"">
##$SUBNAM7= <"">
##$SUBNAM8= <"">
##$SUBNAM9= <"">
##$SW= 369.568048894756
##$SWIBOX= (0..15)
0 1 3 0 0 0 0 0 0 0 0 0 0 0 0 0 
##$SW_h= 29940.119760479
##$TD= 32768
##$TD0= 1
##$TE= 0
##$TE2= 300
##$TE3= 300
##$TEG= 300
##$TL= (0..7)
0 120 53 12 22 120 120 120 
##$TP= (0..7)
150 150 150 150 150 150 150 150 
##$TP07= 0
##$TPNAME0= <>
##$TPNAME1= <>
##$TPNAME2= <>
##$TPNAME3= <>
##$TPNAME4= <>
##$TPNAME5= <>
##$TPNAME6= <>
##$TPNAME7= <>
##$TPOAL= (0..7)
0.5 0.5 0.5 0.5 0.5 0.5 0.5 0.5 
##$TPOFFS= (0..7)
0 0 0 0 0 0 0 0 
##$TUNHIN= 0
##$TUNHOUT= 0
##$TUNXOUT= 0
##$USERA1= <user>
##$USERA2= <user>
##$USERA3= <user>
##$USERA4= <user>
##$USERA5= <user>
##$V9= 5
##$VALIST= <valist>
##$VCLIST= <CCCCCCCCCCCCCCC>
##$VD= 0
##$VDLIST= <DDDDDDDDDDDDDDD>
##$VPLIST= <PPPPPPPPPPPPPPP>
##$VTLIST= <TTTTTTTTTTTTTTT>
##$WBST= 1024
##$WBSW= 4
##$XGAIN= (0..3)
0 0 0 0 
##$XL= 0
##$YL= 0
##$YMAX_a= 41007
##$YMIN_a= -42459
##$ZGOPTNS= <>
##$ZL1= 120
##$ZL2= 120
##$ZL3= 120
##$ZL4= 120
##$ABSF1= 182.463
##$ABSF2= -187.1042
##$ABSG= 5
##$ABSL= 3
##$ALPHA= 0
##$AQORDER= 0
##$ASSFAC= 0
##$ASSFACI= 0
##$ASSFACX= 0
##$ASSWID= 0
##$AUNMP= <proc_1d>
##$AZFE= 0.1
##$AZFW= 0.5
##$BCFW= 0
##$BC_mod= 2
##$BYTORDP= 0
##$COROFFS= 0
##$CY= -3
##$DATMOD= 1
##$DC= 0
##$DFILT= <>
##$DTYPP= 0
##$F1P= 0
##$F2P= 0
##$FCOR= 1
##$FTSIZE= 65536
##$FT_mod= 6
##$GAMMA= 0
##$GB= 0
##$INTBC= 1
##$INTSCL= 5.30512e-09
##$ISEN= 30
##$LB= 1
##$LEV0= 0
##$LPBIN= 0
##$MAXI= 10000
##$MC2= 0
##$MEAN= 0
##$ME_mod= 0
##$MI= 50
##$NCOEF= 0
##$NC_proc= -3
##$NLEV= 6
##$NOISF1= 182.463
##$NOISF2= 159.3651
##$NSP= 0
##$NTH_PI= 0
##$NZP= 0
##$OFFSET= 182.463
##$PC= 4
##$PHC0= -2376.166
##$PHC1= 71.40057
##$PH_mod= 1
##$PKNL= yes
##$PPARMOD= 0
##$PSCAL= 0
##$PSIGN= 0
##$REVERSE= no
##$SF= 81.014009
##$SI= 65536
##$SIGF1= 159.3651
##$SIGF2= -187.1042
##$SINO= 113.3802
##$SIOLD= 16384
##$SREGLST= <1H.CDCl3>
##$SSB= 0
##$STSI= 65536
##$STSR= 0
##$SW_p= 29940.119760479
##$SYMM= 0
##$S_DEV= 0
##$TDeff= 32768
##$TDoff= 0
##$TI= <>
##$TILT= no
##$TM1= 0
##$TM2= 0
##$TOPLEV= 0
##$USERP1= <user>
##$USERP2= <user>
##$USERP3= <user>
##$USERP4= <user>
##$USERP5= <user>
##$WDW= 1
##$XDIM= 65536
##$YMAX_p= 469962226
##$YMIN_p= -1871192
$$ End of Bruker specific parameters
$$ ---------------------------------
##NTUPLES= NMR SPECTRUM
##VAR_NAME=  FREQUENCY,     SPECTRUM/REAL,   SPECTRUM/IMAG
##SYMBOL=    X,             R,               I
##VAR_TYPE=  INDEPENDENT,   DEPENDENT,       DEPENDENT
##VAR_FORM=  AFFN,          ASDF,            ASDF
##VAR_DIM=   65536,         65536,           65536
##UNITS=     HZ,            ARBITRARY UNITS, ARBITRARY UNITS
##FACTOR=    0.456856943014862, 1,           1
##FIRST=     14782.0589164895, 0,            0
##LAST=      -15158.0608439895, 0,           0
##MIN=       -15158.0608439895, -1871192,    0
##MAX=       14782.0589164895, 469962226,    0
$$ Real data points
##PAGE= N=1
##DATA TABLE= (X++(R..R)), XYDATA
$$ [...]
61559c31774Q9563J32846J37238K37866K98306Q7665k45665k95573k0363J70884
61549B60993M9021j30743j24267q7666j96705k42214J3012L36339L24707N3787
61539B56264l0913J70897K71019L9304k36656k26677m2856J1408p9047j08942
61529B3801l6223J369l1905m7534n0892j19339j73732m0981K17176L02193R9008
61518A42941j38852j53986j8878O0154P3811J26865J74817R7090m8167q9162k3068
61507B03565l680o2937p1913J0946P1694M9424O116m3138j53977k60353j86990
61496d41243O3724K51670K23077R1627J651o4668j23111p3104Q0124J17776o4663
61485F2860k24602j13487J21710J51759n0938k28028k43554j85006j05757M1924
$$ y = [-331774, -242211, -109365, 27873, 265739, 564045, 651710, 406045, 110472, 90109, 260993, 310014, 179271, 55004, -32662, -229367, -471581, -458569, -122230, 202477, 256264, 225351, 396248, 667267, 706571, 469915, 243238, 200382, 211790, 132743, 23801, -12422, -11053, -42958, -90492, -141384, -260723, -434455, -475436, -258260, 43933, 142941, 4089, -149897, -168775, -108621, -34810, 92055, 266872, 363962, 315795, 226633, 203565, 199885, 136948, 65035, 75981, 147675, 197099, 203215, 160077, 6100, -254253, -441243, -377519, -125849, 97228, 188855, 190506, 125838, 2727, -70377, 9747, 127523, 62860, -161742, -275229, -153519, -1760, -52698, -280726, -524280, -709286, -815043, -773119]
61475g73119K09503K42525J12778k6502m3268N6284J88906K35805R4047j55094
61465A41865k36532l7358J61921O6769j66832j83258k0963k7733k21956k23999
61455g48076R0662L41083K28731l5882j28554p0741k7412K9022J49326J75801
61445C960L130j48982m4517J71259J98966M8210m7996m1910n6966o9101M9014
61434F5067K15560K01883k740j79124k19685k03509j50007J350J58456J35231
61424B2482j4657l0591J17380J39302j01954l31292k63725j4331J19953R2009
61414b65424O7416R1785O2752k0109k4342P9474J46118P6970k8568k2242P9076
61403B42906J16822K555j63845k10168r2183O8015J41000J21013O3542k6248j48704
$$ y = [-773119, -563616, -321091, -208313, -234815, -278083, -221799, -32893, 202912, 296959, 141865, -94667, -132025, 29896, 96665, -70167, -253425, -274388, -302121, -524077, -748076, -657414, -316331, -87600, -123482, -252036, -322777, -350189, -321167, -171841, 3960, 7090, -141892, -186409, -15150, 183816, 232026, 184030, 142120, 85154, 16053, 65067, 280627, 482510, 479770, 300646, 80961, -122548, -272555, -271205, -112749, 22482, 7825, -22766, 94614, 233916, 131962, -199330, -463055, -477386, -357433, -265424, -198008, -106223, -43471, -63580, -87922, -8448, 137670, 214640, 186072, 163830, 242906, 359728, 362283, 198438, -11730, -103913, -35898, 105102, 226115, 289657, 263409, 114705]
61392A14705k12046j19520N2145J06617o601j16077p4163N1380J13307R1153N1001
61381E1901O60p7358j14242k4330J38829K27885J94100J13934L3592p5348j89992
61370B79631k12127j23839l8104k1419J1370J28105K21604J57214n781r6298q0019
61359B20337n7667n2372P06N0917m9205k52048k77616j2605K60896K38827K5935
61348I6105o2079L762j1182j32817j02915J40785K65168L5602k62078j92133J87820
61337c3962L79319J17858k94977m11445j70058J27871K32188J63538O6399R155
61327A85886j9715k1984O791J9546l9148j27962j40903p1258l9534j01632j43623
61316d93536o3279N9651J10356J38888K23358K39430L0514k42038k36886M4977
$$ y = [114705, -97341, -216861, -164716, -58099, -64700, -180777, -254940, -203560, -90253, 900, 51901, 52561, -24797, -139039, -163369, -24540, 203345, 397445, 511379, 544971, 469623, 279631, 67504, -56335, -94439, -115858, -104488, 23617, 245221, 402435, 396654, 300356, 220337, 162670, 110298, 111004, 161921, 112716, -139332, -416948, -429553, -168657, 70170, 96105, 34026, 37788, 26606, -106211, -209126, -68341, 196827, 232429, -29649, -221782, -33962, 345357, 463215, 168238, -243207, -413265, -285394, -53206, 110332, 176731, 185886, 166171, 144187, 150978, 170524, 131376, 3414, -137489, -208747, -248281, -349913, -493536, -556815, -497164, -386808, -247920, -24562, 214868, 245382, 3344, -233542, -188565]
61306a88565K07840M4040j59314q9037J24692J83009J10083J25053J92457Q7934
61296F38192j51079k20940k9677J50766R7351p4536j50148j14225p3157n7428
61286A5119m4843n3488q8910r7714o7657p3099j34357j41600k1747J19413J41801
61275d47082P6115M9642O4224L150j47695k36847j53455J8146J23954J36520J32859
61264c80469J35888R8332K7421n038L326k4080p4108k4091J18295J37881n6413
61253d3056k01264m0785K18285J62244j73888l17032p6755J75873J19197m5722
61243b22903j3192R9697K0342j54027j23317Q8157J89785J15240N7242O7130J0673
61232A34827r1582o3732O0588M2014j36981k03512m5928J04907P5691J7764J03998
$$ y = [-188565, 19275, 63315, -95999, -185036, -60344, 122665, 232748, 357801, 550258, 638192, 487113, 266173, 236496, 387262, 484613, 410077, 259929, 145704, 72547, 15119, -29724, -83212, -172122, -269836, -337493, -410592, -544949, -686549, -708296, -588883, -447082, -370967, -321325, -257101, -253951, -401646, -638493, -791948, -773802, -649848, -513328, -380469, -244581, -146249, -118828, -123866, -120540, -144620, -218728, -242819, -124524, 13357, -43056, -244320, -285105, -66820, 95424, -78464, -395496, -472251, -296378, -177181, -222903, -236095, -136398, -116056, -270083, -393400, -305243, -115458, -218, 57024, 124154, 134827, 43245, -20487, 40101, 82115, -54866, -258378, -304306, -199399, -123708, -105944, -1946]
61221a946K25924J90548K1537j17051j51658j14715n5417l5325r0528j36746n3621
61210c18998R9501J27374k054j01196n9578J1592R93m3336n3576m2744K172J23384
61198b56466K31339J65857k1342q8356K7413J24379Q9393L7128R502j23622l24530
61187a29305l09112j0650K24560J49040j4695N458P8510j5690j29063j5020J83204
61176A7237J54507l9842r0272J3114m75j72577k49566j26055K4074P9977R9908
61165b89970J00659L2967j2766J01645K52248J69491j02594k10117k6733J51230
61155A66060O9801j28088j77116p0811J3256n045o0852o6171K1771J65760K43579
61144A72144J74739M1820l3371p8463j68824k18887j08006N0960M8684n3686r215
$$ y = [-1946, 223978, 414526, 436063, 319012, 167354, 52639, -2778, -38103, -128631, -265377, -318998, -219497, -92123, -94177, -195373, -254951, -243359, -242366, -285702, -339278, -382022, -379850, -256466, -25127, 140730, 119388, 31032, 58445, 182824, 272217, 309345, 318847, 195225, -129305, -438417, -449067, -224507, -75467, -90162, -84704, -6194, -21884, -150947, -165967, 17237, 171744, 131902, 41630, 54744, 54269, -118308, -367874, -493929, -469855, -389878, -289970, -189311, -156344, -169110, -67465, 184783, 354274, 251680, 41563, 14830, 166060, 235861, 107773, -69343, -140154, -126898, -131943, -192795, -258966, -237195, -71435, 172144, 346883, 388703, 355332, 276869, 108045, -110842, -218848, -167888, -119204, -172890, -182105]
61133a82105J72563K18955O7423k7779M3318N9916r6725j93669n4608J12287O8221
61122A87797n4007q796J24865R6814p5511j52105p4318k2540r1402j59597j04471
61111c33271L7084J48206J52112N0710p4902j23811q1577j4042N3508J34952J59921
61100A08890M0766j03926l7524J96901K48836j6623k64438j83747N2881J18825
61090A60841N1388O9855J04599m2955k20074j05401J79235J67527j83950l54674
61080a73609o2390K83214K21338p4468j39415M4546J00906r0202k32828j14781
61070b37689R7415J62174R2964M2500L9152L409o3535o1740M4046J46159J17583
61059C82438k9760j55749j57835q2525m3132o3192o2412J2267J14116J72375J75868
$$ y = [-182105, -9542, 209413, 276836, 249057, 292375, 352291, 255566, 61897, 7289, 119576, 187797, 133790, 124994, 249859, 346673, 271162, 119057, 44739, 22199, -69203, -228800, -333271, -296187, -147981, 4131, 54841, -20061, -143872, -225449, -239491, -185983, -51031, 108890, 149656, 45730, 8206, 205107, 453943, 437320, 172882, -10865, 42016, 160841, 212229, 282084, 386683, 343728, 123654, 18253, 197488, 365015, 181065, -173609, -235999, 47215, 268553, 194085, 54670, 99216, 200122, 109920, -122908, -237689, -140274, 21900, 114864, 157364, 196516, 199925, 136390, 74650, 118696, 264855, 382438, 352678, 196929, 39094, -43431, -86563, -149755, -212167, -199900, -85784, 86591, 262459]
61048B62459J48358R4170J1758p2156j20489j21236q7830m4962j9266j5170l456
61037C2180K7240K3099o3318j59237j22586O4416K40512K53650J27108j6359j12387
61026B94318j55537j17060J9245J63679J74955K4111j65719k51730j91389m2475
61016b47602R0724J20060N2590J050M4890J00901L4758j08403j30731J7752J23557
61005I9546O741j95840k09994j1250J58944J46550N6932L4806O1425O7710Q9743
60994C05313J64377J77406p721l05678m52703l07739L222K53812L23372K23370
60984C77031L3356j35311j88341j19321o12J04688J69033J50906K0711j38330
60974B73810j66263l0678R5124M4829j20059k01284j24468L489P0885P3839M4835
$$ y = [262459, 410817, 504987, 516745, 444589, 324100, 202864, 115034, 70072, 50806, 35636, 32180, 59420, 82519, 19201, -140036, -262622, -198206, 42306, 295956, 423064, 406705, 294318, 138781, 21721, 40966, 204645, 379600, 403711, 237992, -13738, -205127, -247602, -156878, -36818, 15772, 16822, 61712, 162613, 197371, 88968, -41763, -24011, 99546, 106287, -89553, -299547, -310797, -151853, -5303, 51629, 86435, 147860, 215570, 305313, 469690, 647096, 639375, 333697, -119006, -426745, -423523, -169711, 153661, 377031, 410387, 275076, 86735, -32586, -33198, 71490, 240523, 391429, 412140, 273810, 107547, 76869, 171993, 216822, 96763, -104521, -228989, -225500, -154615, -80776, -35941]
60963c5941j4994q9837j27399j18064j19816j42444q6079J06574K92910K62600
60953g2490L0387j41461p0206J17539J81321R4764L0712O4596P1924m2881j72701
60942I1504j59387k1464P6885L6425q2579j49073q6764N9119J46119P8127m9590
60931f0678m0837J20315K08538P7343r9876q0344O5708N8521j41338k50449r0767
60920b33864J33786J30244p0828j70970r286K40850K96492R9763j24941j44321
60910A46925Q83O4483n3877j68618j06409J5630n764j05319n8112J23136K00401
60899E3359J16426O5912J06661M2788j75184k74903r4253J16095Q1699p1175p8370
60888a10945J2128j335n7729L4716J78291J10417j11790j67641j1630O0324n9453
$$ y = [-35941, -50935, -140772, -268171, -386235, -506051, -648495, -734574, -628000, -335090, -72490, -42103, -183564, -253770, -136231, 45090, 139854, 170566, 235162, 307086, 264205, 91504, -67883, -89347, -12462, 23963, -58616, -207689, -294453, -235334, -89215, -11088, -60678, -101515, 18800, 227338, 304681, 204805, 124461, 190169, 248690, 107352, -143097, -233864, -100078, 30166, -40662, -211632, -220918, 19932, 316424, 416187, 291246, 146925, 147808, 212291, 158414, -10204, -116613, -100983, -106747, -212066, -270178, -147042, 53359, 169785, 235697, 342358, 385146, 209962, -64941, -159194, -43099, 38600, -32575, -110945, -98817, -100152, -157881, -123165, 55126, 165543, 53753, -113888, -125518, -65194, -124647]
60877a24647j07918O8662K31623J44694o3682j55966j40053j35038j07860R140
60867c81045J15315R5829L4360N1123O8861l0629j45157r5988O1779J22450N6420
60856d6682O972O650m7795j43127j20814N5035K05159J76533K8851o8022j3219
60845C9541J55474K72137J66450j01955k23250l0974J97762J02464j94221k45664
60835A37764R186J36858p6209k59218o7836K45752K50648J3405r2004l5765r1269
60824A71312k43105j67025J60298L30697J36508r6820l6163J61386J61517j3563
60814E65042q9389k442O0717M894o9092p8220o0593o4053q5953j15142j23183
60803e7414n6916O0623R8486P87r2325m0344Q0898J12878O1591K8332q926j24562
$$ y = [-124647, -232565, -163903, 67720, 212414, 148732, -7234, -147287, -282325, -390185, -381045, -265730, -169901, -135541, -84418, -15557, -46186, -191343, -287331, -225552, -103102, -46682, -39710, -33060, -80855, -223982, -344796, -289761, -84602, 91931, 120782, 52760, 39541, 195015, 467152, 633602, 531647, 308397, 277423, 475185, 577649, 383428, 137764, 146950, 283808, 207599, -51619, -119455, 126297, 376945, 390350, 298346, 262581, 171312, -71793, -238818, -78520, 252177, 388685, 291865, 255702, 417088, 578605, 565042, 475653, 473211, 533928, 538822, 469730, 391510, 330917, 266864, 180911, 65769, -57414, -114330, -53707, 44779, 45566, -46759, -87103, -6205, 106673, 168264, 196596, 187670, 63108]
60791F3108k23931j39976O8303J56589N1003o3659m7657K0591L5396K4347L4634
60780b1252L3598J0367K4117O9076L7522r5903j88422j22364K8055J11150Q5631
60769b8425K1348n580L5646J07015J02139m0867k15898k46182j13294K8123O2681
60758b93294Q832q4205j71363j54065K1932K07230J92901K3718n8050Q837N0288
60747b47239J1583M7854J71217J50180p5208k05979l2972K20625K54716J19441
60737D14218J4913p4012k27365l06389j72472n564m2078j49434m1867K03101K50876
60726a36073O4208n9944J633M8714m2354j30226r8215j9657M7448J48290K37408
60715F1232J67652m1871j71745j13641R620Q5002J27415J11067m7085k57694k80017
$$ y = [63108, -160823, -300799, -232496, -75907, -24904, -88563, -136220, -115629, -80233, -55886, -21252, 12346, 22713, 46830, 115906, 153428, 57525, -130897, -253261, -225206, -114056, -28425, -7077, -12657, 22989, 130004, 232143, 191276, -24622, -270804, -384098, -355975, -293294, -284462, -368667, -540030, -694095, -672163, -464933, -272032, -248314, -306364, -297527, -247239, -235656, -187802, -16585, 133595, 58387, -147592, -180564, 40061, 294777, 414218, 429131, 355119, 127754, -178635, -351107, -356671, -398749, -548183, -590050, -386949, -136073, -71865, -131809, -130176, -81462, -123816, -254042, -352257, -371914, -324466, -176176, 61232, 228884, 187013, 15268, -98373, -88753, -3751, 123664, 234731, 187646, -70048, -350065]
60704c50065p5886J03910R2293J9258L6528P8678M9572K2072P8753J36074R2789
60693B83976J239n2379r2747j51201j63233r7057m4617o4237o9784R551R8123
60682c42366J14446J02528J11182Q5505k448n3644J544P1846N0558k2692n4633
60671F1826l9807j3470J7951J5700q3811k13682j87611K3756J88066J16579p0970
60660a85473j32858l0663Q3880J08272P1230M1631O2159J18655J23511J4142j17511
60649A56975j29087o0492o5226j04458J4324K34722K24986r0557l18328j64136
60639c01277J00634P3977j37499j24651J41663K80077J12602j03289j13501M080
60629f7184O1187M3042L0405J9159m4850j46350k06342j63737k6303J23159J86878
$$ y = [-350065, -425951, -322041, -229748, -210490, -173962, -95284, -45712, -23640, 55113, 191187, 283976, 285215, 232836, 140089, -11112, -174345, -271402, -316019, -380256, -450040, -440489, -342366, -227920, -125392, -14210, 71295, 68847, 15203, 16747, 88593, 139151, 116459, 61826, 22019, 8549, 26500, 42200, -41611, -255293, -442904, -419148, -231082, -114503, -185473, -318331, -348994, -265114, -156842, -85612, -43981, 18178, 136833, 260344, 274486, 156975, 27888, -32604, -97830, -202288, -187964, 46758, 271744, 181187, -137141, -301277, -200643, -126666, -264165, -388816, -247153, 32924, 145526, 42237, -71264, -67184, -5997, 37045, 67450, 86609, 41759, -104591, -310933, -474670, -500973, -377814, -190936]
60618a90936J54019J00886O8676K8438q166K1459Q3348N5447m9243o7234J7784
60607B14478N132j56960k13515k1766J53735N0628j43478j00494J06400J62536
60597E6696M7102j0143J4663l6251j03797N054J74999R6558j69152k25741j280
60586a51292J23372l2507j63422l8869J20282Q8074K6759J16473J69868j5856
60576B42882k30403j70482M4407P8940n8935o6773J28608K65884J58394q3925
60566C08597k50687k29196k8395K01346K25406l086k04975j23541Q3420O8440
60556D7329j59894k44019l9422J72732J41964J0805K8694J37268R6912r4783j77774
60545h0188j9079J87553J88342j81j38683q0802P6166J56852J14878J8794q1643
$$ y = [-190936, -36917, 63969, 132645, 161083, 152917, 174376, 257724, 313171, 263928, 196694, 214478, 219610, 62650, -150865, -172631, -18896, 31732, -111746, -212240, -105840, 56696, 103798, 93655, 108318, 72067, -31730, -26676, 148323, 244881, 75729, -150012, -151292, -27920, -60427, -223849, -262718, -142436, -54362, -27603, 88870, 258738, 242882, 12479, -158003, -113596, -34656, -93591, -160364, -31756, 234128, 392522, 308597, 57910, -171286, -199681, 1665, 227071, 223985, 19010, -104531, -21111, 47329, -112565, -356584, -396006, -223274, -81310, -70505, -41811, 95457, 192369, 97586, -80188, -99267, 88286, 276628, 276447, 137764, 56962, 133128, 289980, 404858, 423652, 342009]
60534C42009j69707j87008p8733P7916J23267L8626n584R8825K17436J61665l0494
60523E88218j47572r8237m876k29o1889q9956n2039N899L3545J1918m6124r3285
60511D5373p5209Q999R5862J26947J01533M2641m4182j34368j49666m1722R5841
60500G2049R5878o2352j90614j26771L8677Q2845m2178j56828j11092M0494J55615
60489b04277J72583J08643L105p0699l5739P7844J41017R7497K3375k8009r7202
60478A88138j67301j16247O3387J71969Q3753m8814n4322k9921j32027k38425
60468b79810j21729J34308K16799N1980j20249j43750j11018r6934l5575O0436
60458d45542M9609n7830l7016J94349L93464L26632Q5621r2230j46840j70414
$$ y = [342009, 172302, -14706, -93439, -15523, 107744, 146370, 140786, 239611, 457047, 618712, 588218, 440646, 342409, 337533, 337304, 275415, 185459, 133420, 139319, 172864, 184782, 138658, 45373, -29836, -20837, 75025, 201972, 303505, 346146, 301964, 167596, 17930, -23792, 72049, 167927, 105575, -85039, -211810, -173133, -90288, -132466, -289294, -400386, -359892, -204277, -31694, 76949, 80054, 9355, -26384, 51460, 192477, 289974, 313349, 285340, 188138, 20837, -95410, -32023, 139946, 223699, 174885, 120563, 90642, -41385, -279810, -401539, -267231, -50432, 1548, -118701, -262451, -373469, -470403, -505978, -445542, -395933, -453763, -490779, -296430, 97034, 423666, 509287, 417057, 270217, 99803]
60448I9803j98069j87986j21579n843J42241K39278J73997k4420j72409j56250
60438b11237n8388r359l7445j03647j46672o7739J62376L56850K72808l8782k56973
60427a38208k18867r1012m4929k5606M2060P9505M2985M9774J51070J97612R3609
60416A37993l1756o1752p0355j07496o7745M6517K1376j82569k44665K9786L33631
60405a97035L08786R5448L2381O1934q8276l11727k49380N8685J83606k325j48205
60394b56108l1258J30284J29980J06337J96376K25481K7065k05508j90279K713
60384A35083P0347o8748j95732j32256M8572J69164J62083R0626K9731j4770o5522
60373B28578r0393k8057Q7800J23614K6546q6862j09184j00059j46349j79612
$$ y = [99803, -98266, -286252, -407831, -413674, -271433, -32155, 141842, 117422, -54987, -211237, -269625, -278984, -316429, -420076, -566748, -634487, -472111, -115261, 157547, 118765, -138208, -357075, -448087, -493016, -518622, -476562, -397057, -354072, -304298, -153228, 44384, 137993, 106237, 44485, -25870, -133366, -201111, -154594, -133218, -315787, -560452, -530666, -197035, 111751, 207199, 239580, 301514, 213238, -98489, -347869, -289184, -105578, -107903, -256108, -287366, -157082, -27102, 79235, 275611, 501092, 528157, 322649, 132370, 135083, 205430, 136682, -59050, -191306, -142734, 26430, 188513, 279139, 308870, 294100, 228578, 138185, 110128, 197928, 321542, 348088, 261226, 152042, 51983, -94366, -273978]
60363b73978r5827L5362O3862o130n2580m2397k5213O818O8114P2656k2773p0063
60351c42149M5114J46540K0760j81240j44758P3422J13695q0404j57223N1617
60341d54626K55079J88572L279m8600J036O498n606L3425M4130l0057o9168r013
60329h5051q706j56521k34971n1668J99000K13855N6539K0040J28396J31659m5054
60318A67518j91984j77259j14284j01683n7754Q6894K34904K61879J60182k3028
60308B45385k38904l65988k53813N9545L08307K94968J23301K1097K9736K3323
60298B46957k5948j582J10273J23296p1342k68005j88798Q9913J96080o011j94826
60287A0007o0955K19506K41356k9584k27949j36325N3785R2005q65p4769r0419
$$ y = [-273978, -369805, -334443, -270581, -276711, -329291, -371688, -396901, -390083, -321969, -249313, -272086, -342149, -297035, -150495, -129735, -310975, -455733, -382311, -268616, -349020, -506243, -454626, -199547, -10975, -7696, -56296, -55260, -48762, -54368, -20943, 23187, -6870, -76038, -85051, -93757, -250278, -485249, -536917, -337917, -124062, -67523, -47483, 80913, 212572, 167518, -24466, -201725, -316009, -417692, -475446, -388552, -153648, 108231, 268413, 245385, 6481, -359507, -613320, -553775, -245468, 49500, 172801, 193898, 223634, 246957, 221009, 219427, 329700, 452996, 381654, 113649, -75149, 14764, 210844, 204833, 10007, -50948, 168558, 409914, 380330, 152381, 16056, 69841, 161846, 160981, 86212, -4207]
60276d207o9939O589J09243J22810L4170r191M3339K2199j59545k79936j16721
60265c01189J77178K73536J34027j596j5349l849o211M9664J07677K006k06556
60254B09338k14162O5039K94690J74041j25405k26729p8918O1624O8628M7365
60244B75511L2801p7027k26718j70113J14667K66386L4968k96040k88161Q902
60234c24824J56115j337j61302j05311m630l2398m1703J20228K80073K22859O8231
60223A76001L6001M2664r7477k35313q4215K30278K81271R258j80520p5968M0965
60212A42945p2296k07288r8681J10976J29361l550l0864P3847R5544n3287k17668
60201a30961k35485r7855J02396K40496K20900Q5218k168L0631O0884j5760j01801
$$ y = [-4207, -74146, -67557, 41686, 164496, 198666, 189475, 232814, 255013, 95468, -184468, -301189, -124011, 149525, 283552, 281956, 266607, 262758, 256547, 306211, 413888, 415894, 209338, -4824, 60215, 354905, 528946, 403541, 176812, 97894, 159518, 228146, 275511, 308312, 231285, 4567, -165546, -50879, 215507, 250475, -45565, -333726, -324824, -168709, -170046, -331348, -436659, -441289, -473687, -515390, -395162, -115089, 107770, 176001, 212002, 254666, 157189, -78124, -162339, 67939, 349210, 358468, 177948, 101980, 142945, 70649, -136639, -235320, -124344, 5017, 1467, -29397, 44450, 139994, 86707, -130961, -366446, -464301, -361905, -121409, 99491, 184709, 182541, 213172, 274056, 258296, 156495]
60190A56495o7404J9921O072r5041j26423j9409J32528J90611P4084j78217l71769
60179b78552k92538K2134K63918K10177j7578j52532j01751M6170J80037J98906
60169G8391L8675j88994k35753m0834J47806J26322J2199j3995k0283j26997k05659
60158d29122q3505J05385J03677m1449o4525P8582J83519J59382R7282J4584j42428
60147a8618k56942j35072J44491K91081K32483J64946J49224J3088k58610l86276
60137f0205k00137J00313K44527K07866R9643k4551j00130l2244J17572J31825
60127D84479m3085j87457j47332n7189p3131j12746m8312M4909M2922O547M8165
60116d2230J02964M1266r7254j68068j30471l8231P2397J41850O5984j19652j70769
$$ y = [156495, 89091, 109012, 115084, 20043, -106380, -125789, 6739, 197350, 271434, 93217, -278552, -571090, -548956, -285038, -74861, -92439, -244971, -346722, -300552, -120515, 78391, 117066, -71928, -307681, -348515, -200709, -74387, -62188, -76183, -96466, -223463, -429122, -512627, -407242, -303565, -345014, -409539, -330957, -147438, 11944, 109226, 123810, -18618, -275560, -410632, -266141, 24940, 257423, 422369, 571593, 584681, 326071, -60205, -260342, -160029, 84498, 292364, 392007, 367456, 267326, 235082, 352654, 484479, 441394, 253937, 106605, 49416, -23715, -136461, -184773, -139864, -96942, -90395, -42230, 60734, 102000, 4746, -163322, -293793, -332024, -259627, -117777, -51793, -171445, -342214]
60105c42214N7755L54069M03734J96129l4166j64880k38676k40772j07358O2700
60095e3679Q0135k6618l5342R0813J18792n6264j91987o0422J78938K05258O799
60084B56423j36395r2738l3398j01478j70338p0910J09154J43975O731j04737
60074a93711o5081L5617P7634P4689P9317O8283K1150p546n478p3754k42156l23605
60062e54641j36936J92648L55903K55918Q6677K0592K2315N533k2054l7563o1923
60051A26469p3921j6209N9570K1239j09125j38249q821Q0881l727j03317m4207
60040b09417M2273n9251k37738j79208J29619L34106K14227j7555o0343M6596
60030C309M1396j34972k56968j48054Q9294K37285K30195J63533J10594N2042
$$ y = [-342214, -284459, 69610, 473344, 669473, 635307, 470427, 231751, -9021, -116379, -53679, 26456, -162, -35504, 55309, 174101, 117837, -74150, -134572, 44366, 249624, 256423, 120028, 27290, -6108, -107586, -277924, -348834, -239680, -95705, -88974, -193711, -258792, -223175, -145541, -70852, 8465, 76748, 97898, 90352, 84874, 11120, -231036, -554641, -691577, -498929, -143026, 112892, 199569, 220161, 242476, 248009, 225955, 188392, 126469, 52548, 36339, 95909, 117148, 8023, -130226, -139047, -58166, -61893, -165210, -209417, -167144, -226395, -464133, -643341, -513722, -179616, 34611, 17056, -43287, 3309, 44705, -90267, -347235, -495289, -405995, -168710, 61485, 225018, 335612, 387654]
60020C87654j8223l5649K7219P2084j5884j97359l03442k32889n2732J07178J86495
60009g5548J95688J58287J06124Q5558J05308R6638j5652j96910l03681k29135
59999g3323k7522J37467J63814R4495K3738k1918o0271o4782N297R8198R7734
59988C72927j9758j45905j82499j35227m7247N3550J14060Q5519K8025M4483P4874
59977B42802n2663k90912l31789n4568K19230J62235o4501o6851J62568K44479
59967A70030Q243k67789k83408r6618L9203Q837j06606j60094n3282J67300L06332
59956b67852K24467K6932q0356o0403l893Q7079K36329K95739J08891j61310j91581
59945B14042J1850J20265R385q8451l8580k3946j59687k53991j59989l9872m4519
$$ y = [387654, 369431, 333782, 361001, 433085, 417201, 219842, -83600, -316489, -369221, -262043, -75548, 120140, 278427, 384551, 470109, 575417, 672055, 656403, 459493, 155812, -73323, -100845, 36622, 200436, 294931, 318669, 296751, 236480, 171698, 176995, 275193, 372927, 353169, 207264, 24765, -110462, -157709, -104159, 9901, 95420, 123445, 167928, 242802, 190139, -100773, -432562, -487130, -267900, -105665, -170166, -237017, -74449, 170030, 178273, -89516, -372924, -469542, -430339, -421502, -528108, -688202, -741484, -574184, -267852, -43385, -16453, -96809, -157212, -161105, -74026, 162303, 458042, 566933, 405623, 214042, 225892, 346157, 355542, 267091, 228511, 204565, 44878, -209113, -369102, -408974, -453493]
59934d53493k8971J48442L07224K18294r402j03784l2152L4152K0663k6889r7628
59923b3544j71720j37180M6007K12506K05062R7862M0524K6493j1104l3278o947
59912B44681j9798j02936j15299R640R6162N989j20554j18023o8958q7849p1013
59901c47958O9497J69164J06316O9945J90972J98643j20317l98376j73392K95189
59891E9683L25731j37536m28526j73603K25989L01592J38279K3101m1728j45890
59881A47092j71985l3029P3680l3365j90167j46723L0751R3446K176p1077l7830
59870c37031L0504O1580N1089J8169J664M2509J03506R4789K2710q127K1171J0234
59858A12767o2477q0092O719Q5550O9399J2027l1981q6720j28068o9707M8931
$$ y = [-453493, -482464, -334022, -26798, 191496, 182094, 78310, 46158, 80310, 100973, 74084, -23544, -195264, -332444, -286437, -73931, 131131, 228993, 269517, 296010, 284906, 251628, 244681, 224883, 121947, 6648, 16288, 112450, 118439, -2115, -120138, -189096, -276945, -347958, -278461, -109297, -2981, 66964, 257936, 456579, 336262, -62114, -235506, 59683, 385414, 247878, -180648, -354251, -128262, 173330, 311609, 334710, 292982, 147092, -24893, -57922, 15758, -17607, -207774, -354497, -323746, -230300, -228124, -299201, -337031, -306527, -244947, -193858, -175689, -174025, -131516, -28010, 66779, 89489, 81362, 102533, 112767, 50290, -29802, -23083, 62467, 131866, 143893, 111912, 25192, -102876, -172583, -123652]
59847a23652O4626l6343o7167L9698J03551J6397o0393N956P2664p549r2865O248
59835g8829J71556J52854k4473j18868o4939k6504q7910j46628j17810l4784N9946
59824c16389J40712J28984j2497j27560j5587K50830L62989J79569r5942k11162
59814B83947j60349q3487k7784M5134J11775J01104K4062l2504l4602k6199k3882
59803A77215J4771Q5555Q9281l8816k01184k25490o9422J35515K42372K14378
59793D24175R2905n5728j30078m5818J28896J90473M5690j47839j90674r9160
59783B12842k4755o362K4692N0966j8280j44380j62150k4538J14534J12812O005
59772A41386q1258p5299K8114J71748K33702J23667r1898k52011k83980k23903
$$ y = [-123652, -59026, -95369, -162536, -122838, -19287, -2890, -63283, -57327, 15337, 7788, -85077, -78829, 92727, 245581, 221108, 102240, 37301, 10797, -77113, -223741, -341551, -376335, -316389, -175677, -46693, -59190, -186750, -202337, 48493, 411482, 591051, 495109, 283947, 123598, 40111, 12327, 57461, 169236, 270340, 294402, 261898, 227296, 201097, 177215, 191986, 277541, 366822, 328006, 126822, -98668, -168090, -32575, 209797, 424175, 517080, 461352, 331274, 285456, 414352, 604825, 650515, 502676, 312002, 212842, 188087, 181725, 206417, 257383, 239103, 94723, -67427, -91965, 22569, 135381, 141386, 60128, -15171, 12943, 184691, 418393, 542060, 450162, 198151, -85829, -309732]
59762c09732r6136P4490J62536N3457j32379j32988R0849K80789K36257N3626
59752B80769p4031j09435j10672q1367j3828L7556M1813N2763R5861R5671J87
59741B15287j18551j61984j15966j6886R1547J34259N8610n6238p5720j5650j1893
59730g3185o5929k3812J36681K18462J03192o8997j35442j30870j39427j17776
59720b97103k0601O5167O9549P0378J24438J26665L694j05937n3297O7508O3434
59709A13895n6629j12599k0110J30700K11268J51296l3371k13472k32286r9705
59699a61013N868q884m5403k6381k0117n1698j0524J13511J31053l2586j55306
59688b61480o2039P7866M5918n4427j5196Q7075N5410l6979J0962J12005J4184
$$ y = [-309732, -405868, -331378, -168842, -115385, -247764, -380752, -289903, -9114, 227143, 280769, 206738, 97303, -13369, -94736, -108564, -71008, -29195, 23568, 119429, 215100, 215287, 96736, -65248, -181214, -198100, -106553, 27706, 86316, 30078, -45642, -61292, -73185, -139114, -162926, -26245, 192217, 295409, 226412, 90970, -39900, -179327, -297103, -317704, -252537, -182988, -112610, 11828, 138493, 142187, 36250, -17047, 50461, 113895, 57266, -55333, -75443, 55257, 266525, 417821, 384450, 170978, -61308, -161013, -155145, -164029, -209432, -235813, -255930, -307628, -318152, -204641, -73588, -106174, -261480, -323519, -245653, -199735, -254162, -269358, -182283, -126873, -163852, -152890, -40885, -26701]
59677b6701k13536k26364M2851K56350J81554o700n8609j1O997n8593r9544o6034
59665b68340K0404J18993J78922J66918J02134K716j50315l00170k70108m029
59655d02875K45726K02419k1801n9355J77292L68272K43902p4554k77787k21249
59645A79990K566J87400J55633p8506k63630j77439O8482J71609O7967j8125L0393
59634C26340N6088n3238j43775n7304R3423J01919k4574j25805j56260j95682
59624a78868k32421j27796J52969L97376L43641J1808k61527j97367P2479J63018
59614A43312o0202l18854l18729r9464J29310K77247L15361J56211j47245k79811
59604b02864n6875K22651J71547q1342j05212J12085J60455o8796j92361j334
$$ y = [-26701, -240237, -466601, -423750, -167400, 14154, 7454, -51155, -51166, -44169, -102762, -202306, -268340, -247936, -128943, 49979, 216897, 319031, 321747, 171432, -128738, -398846, -402875, -157149, 45270, 23469, -35886, 141406, 509678, 753580, 679026, 401239, 179990, 182556, 369956, 525589, 447083, 183453, 6014, 74496, 246105, 314072, 295947, 326340, 382428, 329190, 185415, 128111, 221534, 323453, 298879, 173074, 16814, -178868, -411289, -539085, -386116, 11260, 354901, 366709, 105182, -92185, -19706, 143312, 83110, -235744, -554473, -653937, -524627, -247380, 67981, 224192, 76947, -202864, -259739, -37088, 134459, 53117, -52095, 59990, 220445, 151649, -40712, -42046]
59594d2046J90965J03630n7602q180J27627Q8659n6641p8418L826L0378L9278
59583C41476J46437K31006R1836j74044k81944j89269j00495q3962o061J44605
59573A19585J80628L6395r2996m0290R8396J23338r022j71876k19124j03300P6290
59562a976J32195j3251j97952j97910j7110J33892J34524O4698Q672n9093j28437
59551a41748q4855R1220K13081J34179j4451j8782P6073M7746j12614j62120j9522
59540H207N9368j09981k92457j63876J61350K69794P0519q7142J9824J63980Q2807
59529A82393r6034j05409K1975P0338L5962Q2909J95116J91950N8148l7573n1348
59518E48427j10421k27433k40224r6298M2263N0642p742m1828m8337j7505P6742
$$ y = [-42046, 148919, 252549, 194947, 186767, 314394, 403053, 346412, 267994, 271820, 302198, 341476, 487913, 718919, 810755, 636711, 354767, 165498, 65003, -18959, -25020, 119585, 300213, 336608, 243612, 203322, 301718, 425056, 416034, 244158, 25034, -78266, -1976, 130219, 116968, -80984, -278894, -296004, -162112, -27588, 37110, 45782, -13311, -141748, -226603, -135383, 77698, 211877, 197426, 178644, 254717, 302463, 189849, 27729, 8207, 67575, -42406, -334863, -498739, -337389, -67595, 2924, -84218, -64394, 99586, 182393, 86359, -19050, 2925, 73263, 109225, 192134, 387250, 579200, 637348, 599775, 548427, 438006, 210573, -29651, -125949, -83686, -33044, -40786, -82614, -130951, -148456, -71714]
59507g1714J46033N6033j22603j51100K2369J67370J14979k4516q9044r2520j01271
59496a45984q2622j6765R217n0125j06394j00339r6665j15773n0498J27156K47376
59485c81416J66727l1115j70477j77382n5910J51103K89514J88652o1082j46563
59475b27949K5047J67756O4565r4981n6970P0593L7458r6745p5992R8977J77827
59464H9586Q4599J7756J03810K16081J97649O4487p3543j47002j41312q9193o7261
59453B55657j16405j78468j80088j29119n7963M2780J43147J32328k1075j66743
59443b75949j59430n0559L1931P6020J12760Q6668j6940m2871J16048K77180J92134
59432C46992n8680j62002l4833Q0545R456j24055j38737n8441j8059m6613n4052
$$ y = [-71714, 74319, 130352, 7749, -143351, -120982, 46388, 161367, 136851, 47807, -44713, -145984, -228606, -245371, -236154, -286279, -392673, -493012, -589677, -705450, -755948, -628792, -381416, -214689, -245804, -416281, -593663, -649573, -498470, -208956, -20304, -81386, -227949, -202902, -35146, 29419, -65562, -122532, -51939, -14481, -111226, -187218, -88241, 89586, 174185, 191941, 295751, 511832, 709481, 773968, 700425, 553423, 412111, 322918, 255657, 139252, -39216, -219304, -348423, -406386, -363606, -220459, -88131, -109206, -275949, -435379, -485938, -454007, -377987, -265227, -178559, -195499, -238370, -122322, 154858, 346992, 288312, 126310, 91477, 172022, 181478, 57423, -81314, -139755, -157814, -204427, -258479]
59421b58479L3851J83770K58984J30179j48774l23071k07953O4229K05304J43518
59411H1558O2391P4652O6116o0972j72968q5177J37283K26278N7352j81926k33277
59400b8690r5398J880o5396j50264q0472O8148J02243K5450J0114Q3671Q3427
59389d5287l9444j11267k5058P5555K9229j02958j60382r5517M5200J98162K48781
59378A7014J04900j02070j10376O4702Q6506j70081l46839j35027K01395K06490
59368a83386o4050j50503Q9668L07458K34022L0961m8307l1285q1880j89475j93739
59357b80516l4353J59542K20176J24957Q642j7165j1263q1308j63043j02120M7495
59346a28956N6619q5052r7660J27493K98133J69161o3846r6813O788n814j24147
$$ y = [-258479, -224628, -40858, 218126, 348305, 199531, -123540, -331493, -267264, -61960, 81558, 143949, 218601, 284717, 223745, 50777, -34400, 102883, 329161, 386513, 204587, -28690, -124088, -122208, -187604, -337868, -418340, -350192, -247949, -222499, -212385, -128714, -45287, -84731, -195998, -221056, -145501, -116272, -219230, -379612, -475129, -429929, -231767, 17014, 121914, 19844, -90532, -25830, 60676, -109405, -456244, -591271, -389876, -183386, -247436, -397939, -308271, -813, 233209, 264170, 215863, 184578, 102698, -86777, -280516, -314869, -155327, 64849, 189806, 198448, 181283, 170020, 88712, -74331, -176451, -128956, -72337, -157389, -255049, -127556, 170577, 339738, 275892, 179079, 185867, 180053, 55906]
59335E5906j43113l8449M7173P0892O0062l4020j77101j42128J33466L11627J41109
59324B85424p2046O4058L24086J95089k48845m29682j77816P3838N5346k920P1176
59313A37708Q7045m6753q7391O3069J13016j09802l19482k27762J9932J39686
59303b30734J23255R9311O9368K0443L7566J01399M1043j36615j68068L4779J88963
59292A80710Q0842j08510j34469m1518L5652J18510K01880J29910j02383k21432
59282A39192r2550M0663j7316q1603L0619J28500P704j31196j8655J92745J82715
59271C80818r562j20406j32448j98273k57280j46952L0335N6013k292O5863J83771
59260a50413J23849k2376L1519K20136J84066j03193k44614n8575J33805L2349
$$ y = [55906, -87207, -125656, -78483, -7591, 52471, 18451, -158650, -300778, -167312, 144315, 285424, 213378, 277436, 601522, 796611, 547766, 118084, -59732, 14106, 69452, 66532, 137708, 224753, 178000, 90609, 153678, 266694, 156892, -162590, -390352, -370420, -230734, -107479, -8168, 61200, 81643, 119209, 220608, 261651, 125036, -43032, -8253, 180710, 261552, 153042, 18573, -22945, 12707, 131217, 333097, 463007, 360624, 139192, 46642, 87305, 69989, -11614, 19005, 147505, 155209, 24013, 5358, 198103, 380818, 371256, 250850, 118402, -79871, -337151, -484103, -453768, -397755, -400047, -334184, -150413, -26564, -48940, -17421, 202715, 386781, 283588, 38974, -19601, 114204, 146553]
59250A46553k08365k81593j62543j6148R2956J78830J97690J29000O5638O8948
59240B10966M9851p2064k03767k08092j07234k7829o994K6776J09025J70383J18316
59229E9337m6391j92565j55168Q0948L11259L04974O7731j72802k45605j97003
59219a85285j47500j04287J689J60998K64073K21935M8699j67852l25608l42919
59209e76057k00699J6016J63885J79172J43710J60624J98567J46918P451q9191
59199A50396p2986q982M8626J18861J54163L3716j91805k60185p3566R7362J1679
59188G279j52770j10485K5663n5489k75166k32723J39309M28630L34991K6071
59178A35310k00465k56202j56026P6001K64640J77647j05376k31652q7325P2405
$$ y = [146553, -61812, -343405, -505948, -522096, -429140, -250310, -52620, 76380, 142018, 210966, 260817, 188753, -15014, -223106, -330340, -358169, -365163, -338387, -229362, -58979, 59337, 12946, -179619, -334787, -253839, 57420, 362394, 430125, 257323, 11718, -185285, -332785, -437072, -435383, -274385, -10312, 211623, 260322, 92470, -233138, -576057, -776756, -760740, -596855, -417683, -273973, -113349, 85218, 232136, 239587, 150396, 77410, 68428, 117054, 235915, 390078, 423794, 231989, -28196, -101762, -4400, 7279, -145491, -255976, -230313, -285802, -560968, -793691, -654382, -225752, 109239, 135310, -65155, -321357, -477383, -401382, -136742, 40905, -64471, -296123, -383448, -311043]
59168c11043J00369J54499K74064K14354o6274k04461j3003J66967M3364j18963
59158B39873Q601K04655Q6891j88388j78117R2114J94055K2206r4300K384Q4696
59147D74670P94q4860l3936L1163k4332j26871j49842r9445m9726k6730j2276
59136a01391K4814R9229J51896R3949l4335q5165n4202j01770k11128j06137K76139
59125d8101N20137K60375k48005m51465k32292N0133J34750Q9489K0435p8619
59115A6837j67344j44816k7130O8392R4065N5176p8887k50075k40582K9963K83373
59104c61028K35502K8082M924J85379K87892J82075k069j36241j71169n1162J59864
59093C62049J96985n3238k76174j52620J15220J11968j17237j81901k9534J5773
$$ y = [-311043, -210674, -56175, 217889, 432243, 365969, 161508, 148505, 315472, 358836, 239873, 248474, 453129, 540020, 351632, 173515, 265629, 459684, 481890, 387590, 389974, 474670, 475464, 390604, 356668, 387831, 363499, 236628, 86786, -12659, -62385, -89115, -101391, -76577, 22652, 174548, 268497, 234162, 148997, 94795, -6975, -218103, -324240, -48101, 472036, 732411, 484406, 32941, -199351, -149218, -14468, 75021, 95456, 16837, -150507, -295323, -322453, -254061, -159996, -104820, -183707, -433782, -674364, -644401, -361028, -125526, -97444, -92520, 92859, 380751, 562826, 560757, 424516, 253347, 202185, 362049, 559034, 505796, 229622, 77002, 192222, 304190, 186953, 5052, -24482, -8709]
59083h709j21605j40768O9024K26493J50582K2119P489O173o8951r9653j1389
59072C0805P0007M4338k4018p6379j28612j26894O981J63132J52335L5393M2786
59061A89874J62815J48710l5601j36794m8454K4006o2167j68309j50084o9614
59051a45618j5136M3992J20663J41880Q7711J5242o7278j62576j68000k1846J10166
59040f0800N2033p8242o9674Q178k4127o0033J01431K96048K02756p5117j45487
59029A46966J0463N1335p3683o5796J03064J11347q1175j21821P6677J54481l9112
59018B72746j83671r7732m6974j86063k34081o128K25116K09183J08325J14143
59008A74864J09639p5m8498K3837o040j81324j84222R4230K75736J10396r9772
$$ y = [-8709, -130314, -271082, -202058, 24435, 175017, 197136, 204625, 210798, 141847, 42194, 30805, 100812, 145150, 121132, 44753, -83859, -210753, -203772, -40640, 111695, 147088, 189874, 352689, 501399, 465798, 329004, 280550, 304556, 242389, 74080, -76004, -145618, -160754, -116762, 3901, 145781, 233492, 248734, 181456, 18880, -149120, -170966, -60800, -8767, -87009, -156683, -148505, -172632, -232665, -131234, 164814, 367570, 292453, 146966, 157429, 208764, 135081, 69285, 172349, 283696, 202521, 80700, 157377, 311858, 272746, 89075, -8657, -55631, -241694, -475775, -481903, -256787, -47604, 60721, 174864, 284503, 284428, 235930, 259767, 253727, 72403, -111819, -17589, 258147, 368543, 268771]
58997B68771m8980O7445o875r5370K0809J26678l4641k42875j55326J12342K21532
58986B33510J64724J38665J05516p1359k49987j96383j334O2915k7880q3645l1920
58975D2822N3580J16638J04065l1580j61911p3299J37502J09038j79839k84190
58965a67174q125K34165J01139j13414j8411K13302K01675O455p6570n2903q4586
58954B35553r1041M6874J50037L7810j12865j06303j03890k46035k71694Q000
58944d53554K42987R4884j23543K6179K92892J45725k67533l25808M5695K98150
58934b3926J57784p4549j35477j00034l1728J18511K21833P9796j50500j11811
58924e0101J61144K67287P1317j34474j25970L45Q8764Q4218m4555k23375k11850
$$ y = [268771, 219791, 287236, 280361, 184991, 205800, 332478, 297837, 54962, -100364, 11978, 233510, 398234, 536899, 642415, 571056, 321069, 124686, 123352, 186267, 158387, 74742, 42822, 96402, 213040, 317105, 285525, 123614, 50315, 187817, 296855, 117016, -167174, -175299, 58866, 160005, 46591, 28180, 241482, 443157, 449612, 373042, 320139, 235553, 144512, 191386, 341423, 379233, 266368, 160065, 56175, -189860, -461554, -453554, -210567, -115683, -239226, -213047, 79845, 225570, -41963, -367771, -322076, -23926, 133858, 59309, -76168, -176202, -207930, -89419, 132414, 212210, 61710, -50101, 111043, 378330, 449647, 315173, 189203, 189548, 278312, 362530, 317975, 94600, -117250]
58913a17250N3909K35235P6130j29570j4817J91189N2181k51936j85307J90754
58903A00518K75101o3749k79192o9106J79257Q6242j59277k01532l0294J45392
58893a6640J92167P2143j32697j69039R7432L72294K84063l4849j63050q3158
58883D18666j19024k54894j53952J27715J27294k02383l31560k9895K41067J12674
58873f4292j06670j6987K03644J55525j24069k85523k01462k1220J22502J78809
58863a59743J07964l3180p4391M2619J65566J59648O8179k1093p9628o1900O3072
58852A77113J69660R0236j04161j74901q0199j3296o0579q7673k416J08931J39546
58841A62261O0830j11893k68284k15924L9172J80401J9269j51405J0796L21725
$$ y = [-117250, -63341, 171894, 248024, 118454, 103637, 294826, 347007, 95071, -90236, 100518, 375619, 311870, 32678, -36428, 142829, 229071, 69794, -131738, -162032, -16640, 175527, 247670, 114973, -54066, 43366, 415660, 699723, 664874, 501824, 418666, 299642, 44748, -109204, 18511, 145805, -56578, -388138, -418033, -176966, -64292, -170962, -187949, 15695, 171220, 47151, -238372, -439834, -461054, -338552, -159743, -51779, -84959, -159350, -116731, 48835, 208483, 276662, 255569, 175941, 114041, 177113, 346773, 437009, 332848, 157947, 77748, 64452, 3873, -83800, -86216, 22715, 162261, 223091, 111198, -157086, -373010, -333838, -153437, -134168, -285573, -274777, 46948]
58831D6948L54050J14606m7117n9810j26131k01038m7010K25424K44187J5894
58821E20003p4068O3539J01386p9390j88373o6720O7516M2566l9112r2260j56027
58810I9060j62952j8307R0551q0806l28689k35627J10753K04028n4814k18091
58800e94894n4493J46554J56553J20723J37131O1288j02409j04333J02863K60482
58790A29465K42350J71815P9775r5017j95005m1870J24876k2151k36457l6902
58780A20879L88289L93603l9954k74516j10015k6858k13990k57208j0530R6997
58770F6697j04446k12410m9525L5707o8199J78K73626K74719o5278j87576O7786
58759C1279J35889j96067l37678K2003L27489J76909L193J59260K32591q5936
$$ y = [46948, 400998, 515604, 468487, 408677, 282546, 81508, 34498, 259922, 504109, 520003, 445935, 509474, 610860, 531470, 343097, 276377, 343893, 386459, 347347, 255087, 99060, -63892, -82199, 8352, -72454, -401143, -636770, -526017, -321989, -376803, -594894, -649387, -502833, -346280, -225557, -88426, -27138, -129547, -233880, -131017, 129465, 371815, 543630, 623405, 528388, 333383, 291513, 416389, 394238, 157781, 120879, 509168, 902771, 862817, 588301, 478286, 451428, 237438, -19770, -30300, 66697, -37749, -250159, -299684, -263977, -332176, -331998, -58372, 216347, 151069, -36507, 31279, 167168, -28899, -366577, -344574, -17085, 159824, 163017, 322277, 554868, 468932]
58749D68932l15618n4286K68708J86721k8786m2852j14022m05880m57704n3868
58739e48655K01418p6115k85464P6155M35808J69893k32399n6980L43465K46862
58729B73988j11095n3191K51267J75171j40348r3817K01649J58160j59316j98255
58719C04213L0133N9593r5628o2385N9608r0016l14153j58798J90079J98805n0253
58708G1198o6166J12456O9940j22604p6101J04598M2972j13044J6853K24973Q5704
58697C50779j40647O8738M43989L10112j92971l35936p9936m3794k89071k47878
58687a56615J31864K52959k4338j55412O3687J83935r988j60462o3081L9491K8844
58676A30884O6295J04611o4655k64059j30342J74670J78700m7025j9879K44303
$$ y = [468932, 153314, 99028, 367736, 554457, 525671, 482819, 368797, -37083, -494787, -548655, -347237, -423352, -708816, -632661, -196853, -26960, -259359, -316339, 27126, 273988, 162893, 109702, 360969, 536140, 395792, 301975, 503624, 661784, 502468, 304213, 334346, 393939, 298311, 235926, 295534, 205518, -108635, -267433, -77354, 121451, 71198, 5032, 117488, 187428, 64824, -11277, 93321, 136293, 23249, 40102, 265075, 350779, 210132, 278870, 722859, 1032971, 840000, 504064, 424128, 380334, 91263, -156615, -24751, 228208, 203870, 48458, 112145, 296080, 286092, 125630, 62549, 102040, 130884, 197179, 301790, 237135, -26924, -157266, 17404, 196104, 149079, 129200, 373503]
58666C73503K68308J0851r8660Q301o876j37922o1591J20104O379k71790k08231
58655B376J24804J65853j10525j69634O8219J15554j20632j80889M7831J58037
58645A00994M7979O4651K27731J59121j24352j87946j9243m4424k50968j73855
58635b00312J71600K43161l9645j52385O7081J87099N1009J2273J55829J23999
58625F19709j30467k14587l9277O5146L2069R7725J74828j5358k57228j37278
58615A95282R8585q1618m19474k13953L73308M99932P7113j59547p205n73k15545
58604A46305j28863K17236J78449k13810k16141K10979K66342j89425l44124N5098
58594a7954K58264m7434j97313J11494K52631o3572k23530O3988J97290j20328
$$ y = [373503, 641811, 652662, 554002, 562303, 555427, 417505, 355914, 476018, 482397, 210607, 2376, 127180, 293033, 182508, 12874, 81093, 196647, 76015, -104874, -57043, 100994, 148973, 213624, 441355, 600476, 476124, 288178, 268935, 224511, -26457, -200312, -28712, 214449, 174804, 22419, 89500, 276599, 327608, 339881, 495710, 619709, 489242, 274655, 235378, 300524, 332593, 430318, 605146, 589788, 332560, 195282, 293867, 212249, -207225, -421178, -47870, 452062, 529175, 369628, 362423, 361850, 146305, 17442, 234678, 413127, 199317, -16824, 194155, 460497, 271072, -73052, -17954, 240310, 192876, -4437, 107057, 359688, 296116, 72586, 136574, 333864, 213536]
58584B13536k90596K2752K76236J11778n3666K2377l2402k69605j79820K16335
58574C6925K25941j88943k12415K94104M19502j53114n24345j79888J66252k3680
58564a39661k10404K8519K05870K7452K6013M09299N19366R6497j67164N0009
58554H45796J15777k30888l30535L1891J36989j96653j56882M13382N13073j58608
58544I83342n05064j598L39572j18997m80681p9338K92101P853j93449K28130
58534D71871M80704K4114l24692j3418J62968k54447l48911L22231O32428n6468
58524A096380n69008m2793M77303O6019l47074J08851M80214j05234o06412j7283
58514E40963O22560J27247o16526l49209K60086O8822l31062N8723N79887K46057
$$ y = [213536, -77060, -54308, 221928, 333706, 280040, 302417, 270015, 410, -179410, 36925, 262866, 73923, -138492, 155612, 575114, 422000, -102345, -282233, -115981, -139661, -350065, -321546, -115676, -88224, -62211, 347088, 866454, 962951, 795787, 845796, 961573, 730685, 400150, 432041, 569030, 372377, 215495, 628877, 1141950, 983342, 478278, 476680, 816252, 697255, 216574, 137236, 429337, 437190, 243741, 471871, 952575, 976689, 651997, 638579, 801547, 547100, 198189, 520420, 1152848, 1096380, 527372, 484579, 961882, 1027901, 680827, 789678, 1269892, 1164658, 558246, 540963, 1163523, 1290770, 674244, 325035, 585121, 653943, 322881, 381604, 961491, 1207548]
58504A207548k83114n2474L00182n1816l46474J99630O45307J07752l99544R2864
58494A419861N46266l7444n49889L9789N00508k87131r27252o0774Q72371K16146
58484A732451p48829k24624P02074K51572n81377q4887P20692J46373p05937j10917
58474A096591P34702L5331q74918k3071J167692M57842q03330k23105R15221J40096
58464B623051j211384m52303J134120O66538p18259j11745J353650P26271p52776
58455C257163K6662J702790Q93031r89618k35790J812035J226912o61919K47108
58446G278374K482105J638598n91485P18357L779320L168923R55763L371442Q045269
58437C0846666P329068L096525L940463Q565494Q422639O468067J3701586K6273218
$$ y = [1207548, 924434, 871960, 1172142, 1120326, 773852, 973482, 1618789, 1726541, 1326997, 1419861, 1966127, 1928683, 1378794, 1418583, 1919091, 1631960, 704708, 643934, 1516305, 1732451, 983622, 758998, 1461072, 1712644, 1131267, 1046380, 1767072, 1913445, 1207508, 1096591, 1831293, 1866624, 991706, 968635, 2136327, 2594169, 1790839, 1567734, 2482955, 2623051, 1411667, 959364, 2093484, 2760022, 2041763, 1930018, 3283668, 4009939, 3257163, 3283825, 4986615, 5879646, 4890028, 4654238, 6466273, 7693185, 7031266, 7278374, 9760479, 11399077, 10807592, 11525949, 15305269, 18474192, 19429955, 22801397, 30846666, 38175734, 41272259, 45212722, 53778216, 62200855, 68668922, 82370508, 108643726]
58429A08643726L0428714L4149958O2045823J04028624J03411560K7253821p4997381
58422C94964845j21091811r2571421m4489231k4719469k5207624j9521603q134627
58415E9229059n279976q574042o712831j779659k759329p006493n837292j060841
58407B0218596o25588l638070l314260j90193o0062k403036k061363M16043K77179
58398H619246j933670j693581O07962O95101j259813j315683N13366O58302r19645
58389C971585r84252M81099N06819q58592q41984M21936K94897r61269o99550
58380A330689P72088P04763p27843p69446N91675O88846o53428r10132K41516
58371A268728N01515m93876o64960K91013M33580m43754m45825N57891O19589
$$ y = [108643726, 139072440, 173222398, 235268221, 339296845, 442708405, 469962226, 394964845, 273873034, 181301613, 136812382, 112092913, 86885289, 67363686, 59229059, 53949083, 45375041, 38662210, 36882551, 34123222, 27116729, 21279437, 20218596, 19593008, 15954938, 12640678, 12450485, 12390423, 9987387, 7926024, 8342067, 8619246, 6685576, 4991995, 5599957, 6295058, 5035245, 3719562, 4232928, 4891230, 3971585, 2987333, 3468432, 3975251, 3116659, 2274675, 2696611, 2991508, 2030239, 1330689, 2102777, 2807540, 2079697, 1310251, 1901926, 2590772, 1937344, 1027212, 1268728, 1770243, 1276367, 611407, 902420, 1336000, 892246, 446421, 1004312, 1623901]
58362A623901m45427o83262K19950M41474l63056n04843L13937M76368k64895
58353H14147l45561L82721L07687o44365o73301M30999P56503j95303o40197J10354
58343C03684N13084j34542m71525J41857M35042j84025m94336Q2625L80117j81992
58333C89989n19678p4224J80921j94544k40939L49527M80586j97904n03500P0522
58323b59244M30465M602k49389J83522L90222j01071l84558J4103K45222j08086
58313A65788k11054K58589L55547k73121n74096j5083M27405J02969j99728J13143
58303A50359L52787K0603k20126M7744J52015k38129l63769R6806K84735k04978
58293G8047m80409j9860L43632J7820k66458P8224L90465R6300k19884l6415J31583
$$ y = [1623901, 1178474, 495212, 715162, 1156636, 793580, 288737, 602674, 1079042, 814147, 468586, 851307, 1158994, 514629, -158672, 272327, 1028830, 833527, 193330, 303684, 816768, 682226, 210701, 352558, 787600, 603575, 109239, 191864, 571981, 389989, -129689, -203913, -22992, -217536, -458475, -108948, 371638, 173734, -329766, -259244, 171221, 175823, -73566, 109956, 500178, 399107, 14549, 28652, 273874, 165788, -45266, 213323, 568870, 295749, -278347, -293430, 133975, 236944, 37216, 150359, 503146, 523749, 303623, 351367, 503382, 265253, -98516, -1710, 283025, 78047, -402362, -422222, -78590, -60770, -327228, -249004, 141461, 237761, 17877, -18538, 113045]
58282A13045j09337k03628J46579K64419j57154l40952R2238L24918q7397l02114
58272b59383J82483M65867r0464n83689j74346L89299J61821l30644j82814K42725
58262a79145J53611j61437k9336K51809O7400k61479j19548K04782J21145j31132
58252h3330m1419J46482N452j47713R6364L34391Q2765k56696j27686J59545Q4004
58241B52159r6544M6548K08269o878k31843n6503J15308j36447l41459p725L59487
58230A04372J38023k50161j33459J68670K4882k63534p6323K74430J20222k60053
58220a52931j37424K99608K89397j28622k53390J9114J67665O7726M0214P9343
58210B90700m8714j63048J5557J86790m7281l56742k05461J62725J63989n7453
$$ y = [113045, 3708, -199920, -53341, 211078, 53924, -287028, -194790, 130128, 42731, -259383, -76900, 388967, 298503, -285186, -459532, -70233, 91588, -239056, -421870, -179145, -25534, -186971, -216307, 35502, 102902, -158577, -278125, -73343, 47802, -83330, -124749, 21733, 27185, -120528, -24164, 310227, 392992, 136296, 8610, 168155, 252159, 155615, 202163, 410432, 403554, 171711, 115208, 230516, 94069, -247390, -255115, 104372, 242395, -7766, -141225, 27445, 52327, -211207, -287530, -13100, 107122, -152931, -290355, 9253, 298650, 170028, -83362, -64248, 103417, 171143, 211357, 290700, 241986, 78938, 94495, 281285, 234004, -122738, -328199, -165474, -1485, -58938]
58200e8938M8906L66597L31376k5624j91934j17478j52410k51437j03569J45082
58190i429J18249n9120l0748O8016o8338k10173k3445J72469m8694l14363m9618
58179d55194M03832L08034j55147j95936J92593K97798M466r4063J33913J82149
58169F22445n5294j13396Q3492P2618k16531l08006q5386K6713q5127m2457K13656
58158A12727K56229j6850j74532k1125J32071R3705K5475k9608j94596l04656
58148a21160p9037K58301K29423o2993r9617J09875P2353k12061k11390J29306
58138A3000K43501m2299k27644p3175L6489r0583j03001J36210K30360J3524j10140
58127B6242O4698J50054q9389k73482r6982J35907R2096l0705M5215J57909O4047
$$ y = [-58938, -10032, 356565, 687941, 662317, 470383, 352905, 200495, -50942, -154511, -9429, 108820, 49700, 18952, 86968, 18630, -191543, -214988, -42519, -91213, -405576, -455194, -51362, 256672, 101525, -94411, 98182, 395980, 400446, 306383, 440296, 622445, 567151, 453755, 537247, 609865, 393334, 85328, -58, 26655, -58472, -100929, 112727, 368956, 352106, 177574, 156449, 288520, 382225, 407700, 378092, 183496, -121160, -200197, 58104, 287527, 224534, 124917, 234792, 307145, 95084, -116306, 13000, 256501, 214202, -13442, -86617, -50128, -140711, -243712, -107502, 122858, 136382, 26242, 90940, 240994, 151605, -121877, -218859, -82952, 9144, -21561, 23654, 181563, 245610]
58116B45610r5440q3160K2625L6327j3276l2357n0457o4022K1839J58241J62428
58105C08358M6605K087J8235q9705k49162j79719Q0544J78913M1924l3141M7929
58094A72868M2921q4114m5784J84597K23718p2505l20019k10262N1362J50021
58084I2803R4826K5272m4159r2189l7635M5572j4818j51137j30978J5609N5641
58073a41193K2610J41563L01565J64349j76448k54393j7283Q7655p4524j14860
58063f0959R9797J63452j02650k87129j31991J4442j15700j91228Q5714L86257
58053a39995L08804N6364L2585J54889J00240p9096j01506J4337L2800n5689p5185
58042B48548j0063K3642K5498N3573N1247l8940j24043j06885l5802K6714J04312
$$ y = [245610, 150170, 67010, 89635, 125962, 112686, 80329, 29872, -34150, -12311, 145930, 308358, 354963, 357050, 375285, 285580, 36418, -143301, -62757, 116156, 158080, 124939, 172868, 215789, 131675, 85891, 270488, 494206, 421701, 101682, -108580, -57218, 92803, 187629, 212901, 168742, 76553, 38918, 84490, 69672, -81465, -212443, -196834, -141193, -118583, 22980, 324545, 488894, 312446, 58053, 40770, 128425, 53901, -60959, 38838, 202290, 99640, -187489, -319480, -305038, -420738, -611966, -526252, -139995, 168809, 225173, 257758, 412647, 512887, 433791, 332285, 346622, 379422, 323733, 248548, 238485, 262127, 287625, 341198, 392445, 353505, 229462, 122577, 86775, 113489, 217801]
58031B17801J67827J07485n9604j74578j89666j88871j41057N1976K48636J87315
58021B27264n0888j14003L5619O7692j06611j78899l0073N5628m6519n4931J57359
58010c8362K71910R0514r1579m995J44479Q5112o9698j16179j25131j87799j66586
57999b08314j3681L1644j24861j82597M7525K69572J85650j4249j7755R2291P0869
57988A36094l4048l6591K6473K7840J3111M5678K7644p7668j08240m152N4836
57977G0977M069K7314J41100P1470k17438l40093j26295M9607p5908j77917N3601
57966e19513L22493K40002k792j6385J06655M7945j20900j34224o6539j27657
57956b70915j77702J2758K49974K06695J7627M2505K14799J75123q2464k28498
$$ y = [217801, 385628, 493113, 433509, 258931, 69265, -119606, -260663, -208687, 39949, 227264, 176376, 62373, 97992, 165684, 59073, -119826, -149899, -94271, -140790, -195721, -38362, 233548, 324062, 232483, 227488, 371967, 457079, 387381, 271202, 146071, -41728, -208314, -221995, -190351, -315212, -497809, -450284, -180712, 4938, -9311, -27066, 65225, 136094, 102046, 65455, 91928, 119768, 132879, 178557, 206201, 128533, 20293, 16141, 70977, 75046, 102360, 243460, 314930, 97492, -242601, -368896, -319289, -395197, -573114, -519513, -197020, 42982, 40190, 23805, 130460, 178405, 57505, -76719, -143258, -270915, -448617, -435859, -185885, 20810, 38437, 80942, 295741, 470864, 388400, 159902]
57946A59902j61411o1187K1582J56648K13658K4536k14872j68119Q1712J42817
57936A95266o5413k36889j91978n9138L9325J13781J37153P2796K7763Q5875Q6157
57925B04698j25304l50884k87615J284J98683J94122J01805l0773j79091j67014
57915d40089Q4155K86803J60872q2606n4485J70705J94008l8296j93240j28583
57905d0756m2688n6968p8487q1130j28236j23472P6273L14674K88358L9705p9050
57894H8223O0759K23374K09439O7812q9841j82487j05122J20679K19637N060k63338
57883C54195k26202j023J7549j69080j86757L7950J43904m6229k42682j73361
57873d91736K8949R3633j8872j52986j53373L8903L03875L73594J45479j10639
$$ y = [159902, -1509, -62696, -41114, 115534, 329192, 353728, 138856, -29263, 52449, 195266, 129853, -107036, -299014, -358152, -318827, -205046, -67893, 4903, 32666, 118541, 204698, 79394, -271490, -559105, -557821, -359138, -165016, -63211, -93984, -273075, -440089, -355934, -69131, 91741, 9135, -45350, 125355, 319363, 281067, 87827, -40756, -83444, -140412, -218899, -300029, -428265, -551737, -475464, -160790, 127568, 167273, 88223, 148982, 372356, 581795, 649607, 559766, 377279, 272157, 392836, 612473, 617533, 354195, 127993, 126970, 144519, -24561, -211318, -173368, -29464, -75693, -318375, -491736, -462787, -369154, -388026, -541012, -694385, -655482, -351607, 21987, 167466, 56827]
57863E6827r6897P6266R3936m5775p7457N0470J24068O3163J0900L0798L7147
57852C23446J1925K496m2032j55377j87386n1215K9917j24230k56052o4207K15277
57841b97438J53673j09921o9090K68743L66797N5833k12753j39550J4494o642
57831B4146m2401P0836J54209L8900j18885j29182n6007j3672L3115J10885J51357
57820B23301J60363J97149J59014q0436l23078k44182M9990J23780q7460j87768
57810i327k3165P1679r7841k45254j32792M7347R4388J43889K90584K93586j536
57799D31558l07289k99481p6305Q7391J52455J92642J43764k3001j21152k6661
57789A53921P8508m176j61298j67998k9527R5841J43341J19679j386j87641k89351
$$ y = [56827, -40070, 36196, 130132, 84357, 6900, 57370, 181438, 244601, 255501, 286299, 323446, 335371, 337867, 295835, 140458, -46928, -98143, -68226, -192456, -448508, -512715, -297438, -143765, -253686, -322776, -54033, 312764, 368597, 155844, 16294, 30788, 24146, -18255, 52581, 206790, 245690, 126805, -2377, -58384, -72056, -38941, 71944, 223301, 383664, 580813, 739827, 659391, 336313, 92131, 142121, 265901, 178441, -9327, -32492, 39187, -58654, -303908, -436700, -389353, -294965, -151076, 139508, 433094, 431558, 124269, -175212, -251517, -164126, -11671, 180971, 324735, 301734, 180582, 153921, 232429, 228253, 66955, -101043, -130570, -34729, 108612, 228291, 226905, 39264, -250087]
57778b50087k01345K4968K69403L99056K77484n6372k83221j68583N0533K934
57768F4770k00935j59123R7781J51627l8357o8601J20489R1428k54096m03755
57758e98772j14088J37132j0456j78409K4573K75295J42754j07660N813L13528
57748a10290L11137L8500n6303P7747R8907m2753n9420Q4168J05210o7980j91807
57737A87116j49691p6600l9316K6388P4458K496q3360k370J44937J02055j01194
57726H4919j80600n3810O9391N4866l941j5823m787J7818O4507O6630l5580j36549
57714g2959r5961L3869J01229R2440Q4205O2211j0179n4396j5509j4532j42644
57703c2226k34520q9820J88280L15357J99324j2317j56654j45263L6729K40859
$$ y = [-250087, -451432, -426464, -157061, 241995, 519479, 463107, 179886, 11303, 61836, 64770, -136165, -295288, -197507, -45880, -84237, -152838, -32349, 59079, -195017, -598772, -712860, -575728, -586184, -764593, -740020, -464725, -321971, -429631, -423818, -110290, 200847, 239347, 183044, 260791, 359698, 316945, 257525, 341693, 446903, 378923, 187116, 37425, -39175, -78491, -52103, 22355, 24851, -58509, -60879, 84058, 186113, 84919, -95681, -149491, -80100, -25234, -29175, -44998, -49785, -31967, 32540, 99170, 63590, -72959, -168920, -135051, -33822, 58618, 142823, 205034, 194855, 140459, 124950, 110418, -32226, -266746, -356566, -168286, 147071, 346395, 334078, 177424, 32161, 68890, 309749]
57693C09749K22102k4571j83869o3881J14863J00118Q868N0554J07824m2140k88157
57682C11460l47824k19767j09565m0719R4996K17039J56298q118n5740Q384J3370
57671A9814m0861k6121K7070L446k9708N5385J59734J13183P899M1393J34893
57660D66127O0936j42240k40373k01542j68050j18070O9169K79510K76280R9701
57650C81448r342k7651j17456k36088j83518j3991Q081j32061j79484o6413N448
57639e71027k3427K8020J93126K44205P8896j02228j18989l6431L0640Q7595J44173
57628d5447J40827O2168l5537j18092j53067o6488J09951J70719K4195j10162
57618b0933l7755P8519K5540n2151O0140J81661L2904j96318j20812J40814J43477
$$ y = [309749, 531851, 507280, 323411, 259530, 374393, 474511, 483379, 533933, 641757, 599617, 311460, -36364, -256131, -365696, -406415, -311419, -94380, 61918, 53800, -1940, 6444, 19814, -21047, -47168, -20098, -16652, -46360, 9025, 168759, 281942, 289841, 331234, 466127, 527063, 384823, 144450, -57092, -225142, -343212, -274043, 5467, 281747, 381448, 372106, 344455, 226999, -9089, -192607, -206598, -198517, -330578, -510062, -576475, -571027, -594454, -566434, -373308, -129103, -50207, -152435, -271424, -307855, -277215, -189620, -45447, 95380, 157548, 122011, 3919, -149148, -215636, -105685, 65034, 89229, -20933, -58688, 19831, 45371, -6780, 53360, 235021, 267925, 71607, -49205, 91609, 235086]
57607B35086q9136j00457J65433K51011P761j51331j8518M8981j74959l42810
57597a68939j60855Q0453L8977p3944R1666L59504K99109n4299k48479r3558J27079
57586A96714J26648k8108r7260m733R5821L2486j53987k39109j12224N9298Q2398
57575d2056K1085L1578O2754l681n1703Q3746K38811J29930j30460j71604J5667
57564A84067P9309o2393j09306K4840M1333j65858k74802q8289J43842J78741
57554d8516J19449P9866m6405k40655k24233N6542K30727P7229j08705k8034J45093
57543A2358J34242L0305K8685L6156r0953k13335j65006o8395p1320n4375Q1560
57532c40078J38957k2849j52810P131K66692K82322P0750j16826j99786k17313
$$ y = [235086, 145950, 45493, 210926, 461937, 469698, 318367, 299849, 348830, 173871, -168939, -329794, -249341, -210364, -284308, -192642, 166862, 465971, 411672, 163193, 69635, 196714, 323362, 295254, 197994, 193261, 289082, 321568, 167581, -71528, -183752, -124454, -42056, -20971, 10607, 73361, 69680, 17977, 101723, 340534, 470464, 340004, 168400, 184067, 263376, 200983, 91677, 116517, 157850, -8008, -282810, -371099, -227257, -48516, 70933, 150799, 104394, -136261, -360494, -303952, -73225, 4004, -104701, -132735, 12358, 146600, 176905, 205590, 241746, 150793, -62542, -227548, -295943, -367263, -421638, -340078, -201121, -223970, -376780, -369649, -102957, 179365, 250115, 133289, -66497, -283810]
57522b83810j15460Q5871J57511Q176j00024P162Q2270p7239j85362N7463L70483
57511G041K98489m0928j66842o853R4976J6028m5594m1362j22278k41545j83535
57500d32403J2330Q9649K7026L6353J25857Q4862r0793j62561n8746N1654J00378
57489b16394J69706K06224O2382j65290k07940n2499N1958J7080j0770J2979j885
57478a34449R235J76875L18535J06815l28398m50106j01440K27602J30360j52620
57468a97591j83326K3203J39500O2961l4364m9717m1237l9798l756N6266O9522
57457a98337K0824k4456j0234M2102N2145k4962j04827m0974J54436K61566J41014
57446B68297m2932n5486N7130O5555o5659j43327o6040N4314J02365Q7401M4356
$$ y = [-283810, -399270, -313399, -155888, -147712, -247736, -240574, -158304, -235543, -420905, -363442, 7041, 305530, 264602, 97760, 90907, 185883, 201911, 156317, 114955, -7323, -248868, -432403, -420073, -330424, -303398, -267045, -141188, -56326, -147119, -309680, -368426, -316772, -216394, -46688, 159536, 221918, 56628, -151312, -203811, -151853, -134773, -145543, -132564, -134449, -125214, 51661, 370196, 477011, 148613, -301493, -402933, -175331, -44971, -197591, -380917, -357714, -218214, -155253, -189617, -239334, -280571, -320369, -324125, -267859, -198337, -177513, -201969, -212203, -170101, -117956, -142918, -247745, -288719, -134283, 127283, 268297, 225365, 169879, 227009, 292564, 226905, 83578, 17538, 71852, 174217, 261618, 305974]
57435C05974j7705n8636m8800n1361j24773j94060j65526q9933n0522J324J08267
57424c85751J39718j892j43806q6492M8726K9805n7451L5979K32255K14841j7686
57413H246j21026L1552J74281J22998K7963L2044M2378j5015m5880l3120j11456
57402A12965k59356k42013j7019J29494L3950p6709J6961J60748J13733m9703
57392g6949r7000n945P8250J03315J00413M4009p4981j47596r0588J7545Q1732
57381f7795J33627J93159J52791k9893j80328j40886k3770k6937j12001r1229
57371a93262L7368Q1688k1858r3898J4117J86229J93717J1529j40173r2019M1521
57360B4959L2874j11518j58940k9350O4524k0406r4548M2950K31691K02919M2607
$$ y = [305974, 288269, 229633, 180833, 129472, 4699, -189361, -354887, -444820, -495342, -494018, -385751, -246033, -247925, -391731, -478223, -429497, -399692, -457143, -421164, -188909, 25932, 8246, -112780, -81228, 93053, 216051, 244014, 276058, 318436, 303421, 257541, 224421, 112965, -146391, -388404, -405423, -275929, -241979, -318688, -301727, -140979, -27246, -76949, -173949, -179894, -101644, 1671, 102084, 146093, 71112, -76484, -167072, -149527, -67795, 65832, 258991, 411782, 381889, 201561, 60675, 36905, 9968, -102033, -193262, -155894, -74206, -96064, -189962, -175845, 10384, 204101, 215630, 75457, -16562, 24959, 57833, -53685, -212625, -241975, -177451, -197857, -292405, -249455, -17764, 185155, 227762]
57349B27762L6902J57301J13769j02263j65301K7911J68554M2252j47342j44798
57339B14747j2124O8842Q8193R9562N5472n7779j24137r7143r5690j66268j70244
57328a96569m5359N3662K4778p805N0171P2684l9581j46940r8255K9246R7454
57317b06514J19798J38430R2299k2380o3271K0996P4282R582l3464K3899J7153
57306A70810j50613k78992j90219k8302J7133L5499J57806K38147J02959q5539
57296a1311o6331Q2118R3958k5255n1541L8241N5570l9223r1402m3260J6430O5241
57284B3235J38152J45587k0054k23044k10426M008J46094Q0067m7376p8598k5713
57273f8068M9715J25593J51401P2418n0117r6709p0234p2023j14002j07033k0176
$$ y = [227762, 264664, 421965, 535734, 433471, 268170, 296081, 464635, 506887, 359545, 214747, 202623, 271465, 359658, 459220, 514692, 456913, 332776, 235633, 139943, -26325, -196569, -241928, -188266, -163488, -171293, -121122, -48438, -88019, -234959, -333214, -303968, -206514, -86716, 51714, 144013, 121633, 58362, 79358, 153640, 163222, 129758, 153657, 170810, 20197, -258795, -449014, -477316, -460183, -424684, -266878, -28731, 74228, -11311, -77642, 4476, 98434, 73179, 21638, 59879, 115449, 76226, -15176, -58436, -42006, 23235, 161387, 306974, 286920, 63876, -146550, -142542, 3552, 83619, 36243, -42355, -68068, -18353, 107240, 258641, 331059, 280942, 184233, 113999, 41976, -72026, -179059, -199235]
57262a99235Q9375J78548K22811J69647J9588j10097j29980j00894q8742k9409
57252B1612J02760J49155m17j77691j78232q9701j07239j62745n9536J32580J75159
57241a94295Q9908J11792K32798J90555m0618j42425L9899K30655J39726j32643
57231E25352k94371k49414j13228q135J1403l5336k4906J54115L86049M00038
57221G51567J32515j65157k68430k35131k10128j77539p1312K9827J3884n2846
57211b52750q144J55250K69593K10766K7035j49845k39783k48223k16947j66463
57201f19511q5042K6504J16397J15265J1912j08654j07195Q2254L17650L18718
57191F8298O089k93155k00665J66839L04727M0032k14918j11355J12948Q3740
$$ y = [-199235, -109860, 68688, 291499, 461146, 480734, 370637, 240657, 139763, 51021, 21612, 124372, 273527, 273110, 95419, -82813, -172514, -279753, -442498, -502034, -369454, -194295, -104387, 7405, 240203, 430758, 390140, 247715, 287614, 518269, 657995, 525352, 230981, -18433, -131661, -139796, -128393, -163729, -188635, -34520, 351529, 751567, 884082, 718925, 450495, 215364, 5236, -172303, -243615, -213788, -199904, -252750, -260894, -105644, 163949, 374715, 401750, 251905, 12122, -236101, -453048, -619511, -704553, -678049, -561652, -446387, -434475, -543129, -650324, -568070, -250420, 68298, 74387, -218768, -419433, -252594, 52133, 92165, -122753, -234108, -121160, -37420]
57181c7420p4393o645K03733J69802j03063k08353l2892P8099n1362j49375l0711
57170b42580O4029o3969j67990L7040L58091L80682O5140k41786k92419j60808
57160b64570k8232L3498O3388J22277K00152J84627J554k12918k35287p0209M7722
57149a57998L691p1245p9884r6660j21948O599K82547L95067J64452j33170j58694
57138C2757j8696n0537k45603k61799K0161K99604K81299M0340j36683r8698P4471
57127f3384K06079J75852P977j48463j61077m1683Q6626J14847J8187j32599j93312
57116a30950o4563J58807K48977J19361o3423j14575o0902l3245m5613k3323K7213
57105A7764K8154k3421m4581N595P2333P2750k4922j56575j82602l1258J63298
$$ y = [-37420, -111813, -118458, 85275, 255077, 152014, -56339, -89231, -11132, -62494, -211869, -242580, -178551, -242520, -410510, -373470, -15379, 365303, 430443, 188657, -103762, -264570, -292802, -259304, -195916, -73639, 126513, 311140, 312694, 99776, -135511, -205720, -157998, -154307, -225552, -305436, -402096, -524044, -517445, -234898, 160169, 324621, 191451, 32757, 14061, -36476, -282079, -543878, -523717, -224113, 57186, 97526, -39157, -137855, -63384, 142695, 318547, 326524, 178061, 16984, -24699, 61927, 176774, 194961, 62362, -130950, -195513, -36706, 212271, 331632, 268209, 153634, 92732, 59487, 13874, -9449, 17764, 45918, 22497, -22084, -16489, 55844, 128594, 103672, -52903, -235505, -266763, -103465]
57094a03465J84691K7651q3766k9124M2319j0487p2763J3352J48576J21164m5222
57083A92926j30293o3880l503n7138j32164j08910p852P8524J12319J15785J19832
57072A15646J34491J26556L9114j16193k23918j92067p5260P108L2165O3870J22008
57061C3520J60646J52589J03330M402j35548k33882k02428o7865N1924Q3023M4597
57050e692j3214n0464l6609K3691P6875Q1247N5093K4253k8261j06261j50038
57039a29380j11019l1688J3698J6210J6191L9965R6470J68800J71662K3264j79591
57028I4582j97190K7208K14156R2080k09430l22007j40052P6012J08618N6070
57018a99953J02114K06405J89116K4884j20346j32350q5449r0663j12265l5291
$$ y = [-103465, 81226, 108877, 25111, -4013, 38306, 27819, -44944, -31592, 116984, 238148, 192926, 62633, -1247, -4750, -61888, -194052, -302962, -310814, -232290, -119971, -4186, 115646, 250137, 376693, 415807, 299614, 75696, -116371, -191631, -184523, -152358, -88488, 33520, 194166, 346755, 450085, 454487, 318939, 85057, -117371, -185236, -133312, -50289, -5692, -18906, -69370, -105979, -82288, -5413, 75834, 130927, 155180, 126919, 20658, -129380, -240399, -272087, -258389, -242179, -225988, -186023, -89553, 79247, 250909, 274173, 94582, -102608, -75400, 138756, 230836, 21406, -300601, -440653, -364641, -256023, -199953, -97839, 108566, 297682, 322566, 202220, 69870, -15579, -106242, -218507, -253798]
57008b53798J28724K30138J95099J21069Q8469J6325j53195k53575j02136J55980
56998A73100J85727m7287k13426j17474M0447M4023J107P6332J40664q241k49170
56987B5802k87500j07202L9222M3293L9623R9150J18303O1888N5725J48136J88242
56976D24682M9230j75025k87817k03901J819J68709J57221k1824j83988j70043
56966b40937l9073M3206M6883N6494O9870J7769m6345K377J15054J02793n1086
56955G7005j40022n5892O3650R5309J10648J70305J52801l3310k32666k41103
56945c3275j10238n3559j16828j43386n1574M1685J9683n0228j5857J44871K92161
56934g6545K96441J76218L7340o9089j49717j57369j3918K06800K69510P7161
$$ y = [-253798, -125074, 105064, 300163, 421232, 509701, 526026, 372831, 119256, 17120, 173100, 358827, 311540, 98114, -19360, 21087, 65110, 66217, 142549, 283213, 274972, 25802, -261698, -368900, -329678, -286385, -246762, -147612, -29309, 32579, 88304, 236440, 424682, 473912, 298887, 11070, -192831, -191012, -22303, 134918, 113094, -70894, -240937, -280010, -236804, -189921, -133427, -63557, -45788, -92133, -89756, 25298, 128091, 77005, -63017, -118909, -55259, 40050, 150698, 321003, 473804, 440494, 207828, -33275, -143513, -197072, -313900, -457286, -508860, -467175, -447492, -497720, -513577, -368706, -76545, 219896, 396114, 433454, 364365, 214648, 57279, 43361, 250161, 519671, 596832]
56924E96832j44144j35807J5833K0584j51763k27401p5160R1392P3039r895M4697
56913I8207J73281J61741r581j58470j82003j46255j15083o9942j5954j3025n5603
56902c32687m0818P9332J95450J64731J489j22835p5117Q5714J80195J17109j6985
56891B35578q7685o9895k6936O876L7681M5097P332k4489J3517P0865L6858p1356
56879A73443j09222k2662P3113Q3902O5044Q1602P3873k9725j72029k52008k59554
56868b94223k17013q7508J19879K43490J46750l7831k9449K22596M46053L79142
56858H91886O5783k39017l45672k47381o4070M6343m715j34649j53965n563J33787
56847e7233R0171m7312n6193P1418J11980k5545j34870l3026J40394J37390j8526
$$ y = [596832, 452688, 316881, 332714, 353298, 201535, -25866, -101026, -9634, 63405, 53510, 98207, 271488, 433229, 423648, 265178, 83175, -63080, -178163, -248105, -264059, -277084, -332687, -373505, -294173, -98723, 66008, 67497, -55338, -130455, -44741, 135454, 252563, 235578, 147893, 77998, 51062, 57938, 95619, 140716, 148048, 123559, 137076, 207941, 244799, 173443, 64221, 41559, 114672, 198574, 263618, 345220, 419093, 389368, 217339, -34669, -294223, -511236, -598744, -478865, -235375, -88625, -126456, -155905, 66691, 512744, 891886, 957669, 718652, 372980, 125599, 61529, 107872, 103157, -31492, -185457, -191020, -57233, 32938, -14374, -70567, 851, 112831, 87286, -47584, -80610, 59784, 197174, 178648]
56836A78648j06729q5313j09486j81691r8832J58260K85333R3287j61635j38401
56826a66559P8845J26888p9594k49238j67788K8345J02551L2066l0974J6069J29360
56815a80029J87586J25290K0206L537N3625L513j61978j98898K9014K64564K07047
56804C53477j1356m6047P7342K9695k00691k39829K6568K25164J11910l9799M4015
56793C30449J53864J1666j85838j03631J09066M8273k39221l12007o1173J36485
56783a12067N9196m7749L9362J44829M5725j28359j29054Q067O9589J4160l6883
56772g3184m6371o5743p0899q314M9497j830q3898j8519J77518K76249J52293
56761B86799n6091j53836j10083p811Q8975J31248P0415m7447p7654J6268N5756
$$ y = [178648, 71919, -13394, -122880, -304571, -403403, -245143, 40190, 133477, -28158, -166559, -87714, 39174, -40420, -289658, -457446, -429101, -326550, -294484, -325458, -309389, -180029, 7557, 132847, 153053, 156590, 210215, 213728, 51750, -147148, -118134, 146430, 353477, 342121, 296074, 373416, 403111, 202420, -37409, -10841, 214323, 326233, 286434, 330449, 484313, 495979, 310141, 206510, 315576, 363849, 124628, -187379, -248552, -112067, -52871, -100620, -61258, 83571, 129296, 937, -128117, -120050, -50461, -36301, -73184, -119555, -185298, -256197, -264511, -215014, -216844, -300742, -319261, -141743, 134506, 286799, 230708, 76872, -33211, -41022, 47953, 179201, 249616, 202169, 124515, 140783, 196539]
56750A96539r9426k80643k06027Q0723K13957J1108k58380k49057L552J93916
56740c93738J79537P5789p863p8952j10471j2276J82415K87539K06254N7827j4828
56729C71233k4354l7365l3565J1903J9105p6920j69899j02006Q5585J70013L9095
56718B52825j48568j56807L9010K27545K12101K1237j60136k19147j95894j50718
56708b78552p0523M0019R3412N1164K1857R2869J56627P8991l8855N740J58205
56697C10954J49222p6468k49816j85136l3012J2179M932N5812P0027o8228k08524
56686b18058j12931J54413K79184J20432j38453k65393k13319o0538J07151K09992
56676a37520K02303J34217R9837J11198J02516M9428m997l1865l8108k3108L689
$$ y = [196539, 97113, -183530, -389557, -308834, -94877, -83769, -342149, -591206, -587654, -393738, -214201, -138412, -146275, -225227, -335698, -347974, -165559, 121980, 328234, 386061, 371233, 346879, 309514, 275949, 287852, 306957, 230037, 60138, -41868, 43717, 213730, 252825, 104257, -52550, -13540, 214005, 426106, 447343, 287207, 68060, -127834, -278552, -349075, -309056, -215644, -164480, -142623, -49754, 106873, 185864, 147009, 152749, 310954, 460176, 383708, 133892, -51244, -84256, -72077, -67145, -11333, 58694, -9534, -218058, -330989, -176576, 102608, 223040, 84587, -180806, -394125, -454663, -347512, -137520, 64783, 199000, 298837, 410035, 512551, 561979, 556982, 525117, 487009, 463901, 467590]
56665D67590j0390q7458j45745j00833p866J1256m0762m6882K1109M2854o2998
56654C9875j92271j67427M3013K67121K95512J00881j21306j64955n2045J4427
56644F2825o3726j55211j04358N8215J87845K03166J06095o5231k03613j70708
56634a44701O412R0800o1983k64224k37335r02J87898K17689K03517K00145J00253
56623B97569j10950k32203j19880O8800P1757j12962k17399o3152J92336K45930
56613A9846L9662j53011q5952J16780J27183j15120l05866k05126M5493J64432
56603c51679J11065M6886M9523O7702Q0608J11765J31591J01759O2766M5935j3560
56592D44361j34952j84261q4607K955o8808j41351L855K21048J74070j08640k38204
$$ y = [467590, 457200, 369742, 223997, 123164, 115298, 126554, 85792, 38910, 60019, 102873, 39875, -152396, -319823, -276810, -9689, 285823, 386704, 265398, 100443, 48398, 62825, -901, -156112, -260470, -202255, -14410, 188756, 294851, 229620, 26007, -144701, -138289, -47489, -109472, -373696, -611031, -611933, -424035, -206346, -2829, 197316, 297569, 186619, -45584, -165464, -96664, -24907, -137869, -355268, -418420, -226084, 19846, 59508, -93503, -179455, -62675, 64508, -50612, -356478, -561604, -516111, -351679, -240614, -193728, -144205, -76503, 4105, 115870, 247461, 349220, 411986, 457921, 444361, 309409, 125148, 40541, 43496, -25312, -166663, -162808, 58240, 232310, 123670, -114534]
56581a14534o9167Q3108l6386k24222j56637J25108L10021K45974O0359n9663
56571A63961m3436N2446R9559J0143j45727j99742r2985O3325J48905J43658O5916
56560B66023n9644j48785j18030k9624l0051j16670j26772L478J38409J52531
56550f9135P7593j2251r6249j31994n4244Q5960J42222Q9811N4722P8370M9513
56539B14318n8663r1722L7867J88971J94244O7857q4060j99629k24023j13395
56529f8235L3770L2603j10382j71061n1409P2263O0177K7956R9038J73412J34622
56518B32754P3304R3110Q8698n6000k22913k49749k07888k43561k77767j26073
56508h96085J74346L97577M21343K89553P5509j20415j45884J5005J31505K3823
$$ y = [-114534, -183701, -100593, -136979, -361201, -517838, -392730, -82709, 163265, 223624, 163961, 120525, 172971, 272530, 282673, 136946, -62796, -155781, -92456, 56449, 200107, 266023, 206379, 57594, -60436, -90060, -120111, -236781, -363553, -360075, -221666, -69135, 8458, -3793, -100042, -232036, -286280, -200320, -58098, 31713, 86435, 164805, 214318, 155655, 63933, 101800, 290771, 485015, 552872, 468812, 269183, 45160, -68235, -34465, -1862, -112244, -283305, -334714, -262451, -202274, -174318, -75280, 98132, 232754, 306058, 399168, 487866, 431866, 208953, -40796, -248684, -492245, -770012, -896085, -721739, -324162, 97181, 386734, 462243, 341828, 195944, 210949, 342454, 366277]
56498C66277j40097r0173J07310J40974o8905k69131k48059o5336J07941J68200
56488I001Q7204p2008j42437k0807J66595K13846J01737m0938j54045k25802j52703
56477b30357J25093M02750L94373J23426j19587j91664k03854k20120j49755M220
56467f5475P1498q815p3514o733Q0405N6963k0530k9895K8541P5367P6821M3092
56455B27725j3306o6920r6307j16011j18532l4368J36497K31787J30499k9909
56445B51155m3403L6972J1665r1766o3937Q6109J11267n3729j84304j52191r0571
56434a82733p5838J0469J58256J18887j72142l82147k44253M2887J50730J03825
56424d72059J21607J90730J36063k0342r6354n9234j6262K0039R0064R9864m3565
$$ y = [366277, 226180, 136007, 243317, 384291, 315386, 46255, -201804, -267140, -159199, 9001, 96205, 24197, -118240, -139047, 27548, 241394, 343131, 302193, 148148, -77654, -230357, -105264, 297486, 691859, 815285, 695698, 504034, 300180, 80060, -69695, -65475, 6023, -2792, -76306, -83039, -2634, 54329, 33799, 3904, 32445, 107812, 184633, 227725, 214419, 147499, 51192, -64819, -183351, -217719, -81222, 150565, 281064, 251155, 207752, 244724, 256389, 164623, 100686, 186795, 298062, 244333, 60029, -92162, -182733, -258571, -248102, -89846, 29041, -143101, -525248, -769501, -726614, -575884, -472059, -350452, -159722, -23659, -44001, -140355, -199589, -215851, -195812, -105748, -5884, -49449]
56413d9449j82955q7752J65714K78736J65850J8240n0246j13991j76797j19965
56403a52615K4275M9364p2174r7287Q8787K52521J70853l0209j12285r4564j30399
56392a03733j71394n5079J44043J57773o1626k38458j65693K1057Q4966K7764
56382c60380K3931J24433K03409J61556L1958j08812k03404j85384k7642J48545
56372a91790J53163j4724j17880R720K22339K69169J43251M2372L7643j337j37325
56361D14601k35889j81203m6033N0639J03014J30086Q0494m0510r2267j1502K8318
56350A99748j23443k86739j70095J47348K60993K2902k20801j25430J73071L03050
56340A80604J95610Q6978P4375j505j97657l01359j68382P363k2783j63748j16457
$$ y = [-49449, -232404, -320156, -154442, 124294, 290144, 308384, 258138, 144147, -32650, -152615, -128340, -78976, -151150, -248437, -159650, 92871, 263724, 233515, 121230, 26666, -103733, -275127, -330206, -186163, -28390, -90016, -328474, -494167, -473110, -388144, -360380, -336449, -212016, -8607, 152949, 184907, 76095, -127309, -312693, -340335, -191790, -38627, -53351, -171231, -161511, 60828, 329997, 473248, 515620, 553263, 551926, 414601, 178712, -2491, -48524, 2115, 105129, 235215, 315709, 275199, 182932, 171430, 199748, 76305, -210434, -380529, -233181, 27812, 50714, -170087, -295517, -122446, 180604, 376214, 463192, 537567, 536062, 338405, 37046, -131336, -123973, -146756, -310504, -426961]
56329d26961J51363L42721K62020O0209m1448n4149r4094j25069l9286R8227J09762
56318B43295j0255p3051J4019J11387O5797p8384j73348j66506j08687l6849N0903
56307a61679J33905J63440J19102K8132p0810j60473k41109k98632k83121j51011
56297i22256N2798K00494K10851J29659L9574l8706q8788m3145Q9101J33125l0032
56286b67325k15737j39947J41374K60354N9554j83463j76176J396J16163J58545
56276b45262K42159K94774J56546q8836j85354j01147o8369j81851k33634o2593
56266d73567J66719K08611Q9323J0997P593p3553k60878l46329j67227J39704
56256f98607K87991J84830J0167l6853L4519P0953m947j06592r6852N5649K32685
$$ y = [-426961, -275598, 67123, 329143, 389352, 347904, 293755, 199661, 74592, 35306, 133533, 243295, 233040, 159989, 174008, 285395, 351192, 272808, 99460, -67046, -175733, -212582, -161679, -27774, 135666, 254768, 282900, 212090, 51617, -189492, -488124, -771245, -922256, -869458, -668964, -458113, -328454, -288880, -327586, -416374, -459519, -370418, -237293, -267325, -483062, -623009, -481635, -221281, -161727, -345190, -521366, -519970, -403807, -245262, -3103, 291671, 448217, 359381, 174027, 72880, 4511, -177340, -410974, -473567, -306848, -98237, -8914, 2083, 9676, -63877, -324755, -671084, -838311, -698607, -410616, -225786, -215619, -252472, -217953, -147000, -151947, -258539, -355391, -299742, -67057]
56245f7057K67362J14277p4959j01415L4991J23061K6400j27503j55497j05448
56235f5788j46254k35604j50587J20713K79392J32297j07737j20709P9518K13684
56225a075J44054r716j12177j48392j16624R730J62545J89480N8202p9619j00993
56214d585o7702q0340q9557J2915J77696K27162J07089k7311l2405K5100j0676
56203B37386j32234j71961n4579Q8114J05488J9523n2344p3052q1465q3518o4069
56192b62711n4482o9989l1093J19812K71575K66985J34353K8705k1166j06314
56182B75675k00963j73261n1375k0463r9004r1342M7825J00759j6745o1335J13217
56171a77012K41703O5655j93045j59305P8494J13981j04137k03780j5733J72554
$$ y = [-67057, 200305, 314582, 239623, 138208, 173199, 296260, 322660, 195157, 39660, -65788, -212042, -447646, -598233, -477520, -198128, -65831, -173568, -294277, -214759, -1075, 142979, 133263, 21086, -127306, -243930, -234200, -71655, 117825, 176027, 96408, -4585, -72287, -152627, -242184, -229269, -51573, 175589, 282678, 255367, 222962, 248062, 237386, 105152, -66809, -121388, -33274, 72214, 91737, 39393, -33659, -115124, -198642, -262711, -317193, -387182, -418275, -298463, -26888, 240097, 374450, 403155, 381989, 275675, 74712, -98549, -149924, -170387, -269391, -360733, -312908, -212149, -228894, -290229, -177012, 64691, 130346, -62699, -222004, -143510, -29529, -133666, -337446, -353179, -180625]
56161a80625J15390j9750J7689J54325J59908K6007o0646j3384Q1353J24796R3687
56150D98750R085p8726j10508q8514p7251r3423p1340J7746R8749R9153M1632
56139B45353j8603o5293q3790m6326R484j4211j19982j60368l3927J40976J65648
56128A8961L6293m4618N0164J81784J14116j58143l52237k29785Q1635K30774
56118g1056J00914n0207J3334J58503J13067r7068j93009p3558O4204N7197j6299
56107F022l4284k0247k8155j7805L1685L0195p1959j56409q9174Q2368J94458
56096g3305J62602K7365j23327j97629j36506J3539J20931J19057P3508O3412
56086D9647Q5936J20812J77542K13107J20037j08993l00604k87986j10475N7442
$$ y = [-180625, -65235, -84985, -67296, 87029, 246937, 272944, 212298, 198914, 280267, 405063, 498750, 507835, 429109, 318601, 230087, 152836, 59413, -11927, 5819, 104568, 203721, 245353, 226750, 161457, 77667, 31341, 40825, 26614, -93368, -253736, -287663, -146687, 18961, 55254, 10636, 60800, 242584, 356700, 198557, -153680, -383465, -301830, -71056, 29858, -20349, -7015, 151488, 264555, 167487, -25522, -99080, -34876, 22321, 6022, -28262, -48509, -76664, -94469, -62784, -32589, -104548, -260957, -350131, -267763, -73305, 89297, 116662, -6665, -204294, -340800, -327261, -206330, -87273, -13765, 49647, 135583, 256395, 433937, 647044, 767081, 658088, 357484, 69498, -40977, 16465]
56076A6465J06981M9838m8290j03372n1117O7879J20276M3868o7048r7434n1320
56065a3274J804K5470j761r2878j67944r0344J15933K23588J05536n8968n2919
56054e757L2084n1348k77675l38905r0911K24392L00202J41491m849N452P6973
56043A1149N7929n3234j32574j12371n5702k7179K0287J30490J85377L7717k03615
56032a41726k41522j9410J47457K4817j71604r9867J78636L01614J61474J9891
56022A59760M4314O0840j05264l14891l35374j89464p0256k1879P3927K33341
56012d64946L01614J88123J8022l3532L0053O0431q753p3796k9710N8686M4905
56001I1097p3033j32265l8963Q8526Q5079l5651j19193q2071J5221P9285P5323
$$ y = [16465, 123446, 173284, 124994, 21622, -29495, 38384, 158660, 202528, 135480, 38046, -13274, -11470, 14000, 12239, -80639, -248583, -338927, -222994, 594, 106130, 47162, -5757, 26327, -25021, -302696, -641601, -732512, -508120, -207918, -66427, -71276, -65824, 11149, 69078, 15844, -116730, -229101, -284803, -311982, -291695, -161205, 24172, 61889, -141726, -383248, -402658, -255201, -230384, -401988, -501855, -323219, -21605, 139869, 159760, 204074, 264914, 159650, -155241, -490615, -680079, -750335, -772214, -698287, -464946, -163332, 24791, 42813, 9281, 39334, 99765, 91012, 17216, -12494, 46192, 91097, 18064, -114201, -153164, -64638, 20441, -15210, -134403, -216474, -201253, -121968, -46645]
55990d6645K1379l2936l6021O58N894k4825J8379J80894K97630J79333r7749k62035
55978B03956k02325p8312n0795q0768o5093j2048K0729M3566Q3337J04219P7112
55967D3578N3091P6067Q9696K4324p6390j06634m2308L7693M5399m6012j75461
55956g6957k00164j5990K61237L38332Q4421k54339l25158r8611J39415J95744
55946D7930J61830J57815J05262r8335l25234l34912r9435J58551K50121J93821
55936B17414Q7849l4042j46380j64351n5005N8642L4061q2332j06887K4783J71400
55925E152J81407P0367m3034r2521r5716r1658j03687j21579q7243M1748J83816
55914a52948J80937J9492r8881k0344J15687O2181j43460j85626P4007L45029
$$ y = [-46645, -25266, -58202, -94223, -93565, -87671, -112496, -94117, 86777, 384407, 563740, 465991, 203956, 1631, -76681, -127476, -208244, -273337, -285385, -264656, -221090, -137753, -33534, 43578, 96669, 172736, 262432, 286756, 210366, 103732, 61424, 99117, 144516, 98504, -76957, -277121, -293111, -31874, 306458, 390879, 136540, -188618, -287229, -147814, 47930, 209760, 367575, 472837, 374502, 49268, -285644, -385079, -226528, 23593, 217414, 305263, 271221, 124841, -39510, -94515, -35873, -1812, -84144, -191031, -166248, 5152, 186559, 256926, 213892, 121371, 25655, -66003, -169690, -291269, -378512, -336764, -152948, 27989, 47481, -51400, -71744, 43943, 106124, -37336, -222962, -148955, 196074]
55904A96074K68599q6841k94162j22298J71866J95206p2144k73871j47455J62756
55894b270L13855J69394j02938k73610k70142j63130m8770J2649J3632M666M5694
55883c00970J25504J65710J23171M7971J9479N8111J11451R8406k3819j93652
55873B31362k69000j82396m4380l932l9912j9839N6162M8486n8028q4240N7774
55862c07943J94823J46345o563o9334k4018J0979J2322M5148Q5479M3210o4787
55851F5661j35344j50746j69165j67728o4367J07358K01847J47243J245j54697
55841c18693k40118j45087J40105L90578L47505O2269j53505j33145q713N4921
55831c883N1524J2577p0963j27993l5688J37364J48497m3386j65609n0017R1231
$$ y = [196074, 464673, 377832, 83670, -38628, 133238, 328444, 256300, -17571, -165026, -2270, 311585, 480979, 378041, 104431, -165711, -328841, -377611, -364962, -351330, -346664, -300970, -175466, -9756, 113415, 161386, 180865, 238976, 350427, 448833, 425014, 231362, -37638, -220034, -264414, -268346, -308258, -328097, -271935, -223449, -281477, -365717, -307943, -113120, 33225, 26662, -42672, -66690, -55711, -43389, 1759, 87238, 130448, 65661, -69683, -220429, -389594, -557322, -621689, -514331, -312484, -165241, -163996, -318693, -558811, -703898, -563793, -173215, 174290, 236559, 83054, -50091, -58804, -3883, 47641, 60218, -10745, -138738, -174426, -37062, 111435, 68049, -97560, -147577, -56346]
55820e6346K5231j05439l6296J53049J72009J6669l5375Q4095J15399p3136k40793
55809A9067j53301N3259J06076J2009o175J08753J83714J18912K6193N063k7965
55798D45605j63987k88806k14795K4349J83855J31650N976j9216J4544l9171j66424
55787h6420k05639r5306N2951J37554J69479J56832M4057j52208k76527k15202
55777d70429n4903M7365P8887J36393K30175K60981J86396Q5862L0415j2170q8010
55766D30962j49061j19491m0280m6698j69988k51497j44705N6367J33319P4430
55756b26642R4425K57666L08480N8116k55437k71581m1805P9162J6191M3982K31308
55745B93865K58948j8691k41864r0093J71504R2843k40651l44916r1414J38565
$$ y = [-56346, -31115, -136554, -172850, -19801, 152208, 168877, 133502, 217597, 332996, 259860, 19067, -134234, -80975, 25101, 37110, 30935, 139688, 323402, 442314, 468507, 473570, 445605, 281618, -7188, -221983, -197634, -13779, 117871, 123847, 104631, 119175, 80004, -86420, -292059, -387365, -334414, -196860, -27381, 129451, 173508, 21300, -255227, -470429, -525332, -477967, -399080, -262687, -32512, 228469, 414865, 500727, 531142, 518972, 430962, 281901, 162410, 122130, 75432, -94556, -346053, -490758, -434391, -301072, -226642, -132217, 125449, 433929, 492045, 236608, -34973, -76778, 2384, 18575, 62557, 293865, 552813, 534122, 292258, 202165, 373669, 466512, 225861, -119055, -210469, -71904]
55735g1904O9990j18110j67745j06466o9719l7787N7829J61926J98240J94274
55725A10528J75010Q3138p6780j71492j36896q1891p0891J0294K04294K91345
55715C36659Q9742j94189k02518N4862K10293O7762j60934k11989j05201o636
55705a22149L2617M6883K1761m6809o7770J9788J21688J25515P3575N1603J128
55694B57830j63190l16380k41546J6945J63752P3293l6569L7282J74863J59805
55684A26085L5728P386R2189J11489q071j45435j99206j92466j41285j0830J41153
55673a83263J53056j2783j61467r2817J43142L09126K51098L9839j30428j46359
55663A69144q1846q2747j39636p4390J65738L32792J82374j37345k51897q6875
$$ y = [-71904, -1914, -120024, -287769, -394235, -463954, -501741, -443912, -281986, -83746, 110528, 285538, 368676, 291896, 120404, -16492, -98383, -169274, -158980, 45314, 336659, 426401, 232212, 29694, 84556, 294849, 362611, 201677, -10312, -115513, -122149, -89532, -42649, -20888, -67697, -135467, -115679, 6009, 131524, 205099, 256702, 257830, 94640, -221740, -463286, -446341, -282589, -209296, -245865, -208583, -33720, 126085, 161813, 169199, 261388, 372877, 364806, 219371, 20165, -172301, -313586, -324416, -183263, -30207, -42990, -204457, -297274, -154132, 154994, 406092, 445931, 315503, 169144, 87298, 4551, -135085, -209475, -43737, 289055, 471429, 334084, 82187, -4688]
55653d688N9007K106p7817R06J10333O8749l1095q32J04412Q6105o2582j61092
55641I3512j18880o211J00040J63593J34885J1555j01560j28510j32966j59949
55631a44491j00658J01353K50614J47969o9005j03541N1835J27208M039j51025
55621A14298j86409j33429m8817O1775J28939O1778o1894p0217K2087M4350j4571
55610h2110K756R2539O2374r7917j43060J1478J20506K0982r2880j5928J23175
55599A915J09398j591l5657j1394l2706m2638M3413J08251J4124j17122r0002
55588e4009J6172q248j04032k9009J93179K63388Q3795q2519k6641J11004R8424
55577D61504n3347j64346j38933j4888J20747J62282M2350j50343k11432o3685
$$ y = [-4688, 54319, 56425, -21392, -20486, 89847, 158596, 127501, 126669, 231081, 317186, 254604, 93512, -25368, -31579, 68461, 232054, 366939, 378494, 276934, 148424, 15458, -144491, -245149, -143796, 106818, 254787, 185782, 82241, 134076, 261284, 265323, 114298, -72111, -205540, -254357, -192582, -63643, -1865, -63759, -133976, -111889, -67539, -82110, -79354, 13185, 75559, -22358, -165418, -153940, -33434, -12452, -105332, -121260, 1915, 111313, 109722, 74065, 62671, 29965, -12673, 30740, 138991, 153115, 35993, -54009, -37837, -46085, -150117, -179126, 14053, 277441, 361236, 278717, 252076, 363080, 461504, 408157, 243811, 104878, 89990, 210737, 373019, 415369, 265026, 53594, -10091]
55567a0091J30711J73454N6052q6591j55509j37955n6021M4069R5698P3935K3665
55556A51417j1174l9327p1040p4508k6666M1285Q6398R9188Q2938L9760j673j941
55544B74657K4207J6868m0506j06415j58579j97769j70137j0139K02330K68177
55534A02694J29153l3909o4215m4072r7009j23689K9393K28300J78304r9956k37011
55523c2017o4997J05597k3776k35758j17290K67173M26087J61714j59237j81986
55513A45510m9997p2018j88704j16879J27667K28691P1920r0778n0056P0747N9388
55502A35491o9972j53500j13192J7847J75053K48631J22827j38675k68974j09590
55492a54054J52029K09581K3468j72813j86011l2131J53362K28744J22123o4072
$$ y = [-10091, 120620, 294074, 350126, 263535, 108026, -29929, -85950, -41881, 53817, 127752, 151417, 140243, 100916, 29876, -44632, -71298, -30013, 56385, 155573, 238511, 278271, 276598, 274657, 298864, 315732, 275226, 168811, 10232, -187537, -357674, -367813, -165483, 102694, 231847, 197938, 133723, 89651, -7358, -131047, -101654, 126646, 304950, 204994, -32017, -97014, 8583, -15193, -250951, -368241, -101068, 325019, 486733, 327496, 145510, 95513, 23495, -165209, -282088, -154421, 74270, 146190, 55412, 5356, 76103, 135491, 65519, -87981, -201173, -183326, -8273, 240358, 363185, 224510, -44464, -154054, -2025, 207556, 231024, 58211, -127800, -159931, -6569, 222175, 344298, 280226]
55482B80226r1442J12449K72885R9462k63063l81052j29210J48936J53332J2311
55472B14834m323Q9087Q8661l8139j38000j40811j15563q9831k0104N7305L4538
55461f2346p6812j24643l6612P6168R6921O2299O3434Q6441N1754m2595j10438
55450a6429r0582k979R7036J63555J57312M9658j34161k82689k54401k4477K23643
55439a14514K42379J6311j73626r6077J01165R4819j14378j69176R7985L61709
55429B46597K54921r0121k46112j11386J8356k5294n3511Q7296K19160J22884
55419D22790j09507k29394j73092m7661P9741J72470J35234m3363j66375p6303
55409c5460P0439K7875j28553j12213R4558J98061O0120j12523j28858o5020l4306
$$ y = [280226, 188784, 301233, 574118, 673580, 410517, 29465, -99745, 49191, 202523, 214834, 210511, 299598, 388259, 350120, 212120, 71309, -44254, -134085, -154189, -96884, -62346, -139158, -263801, -300413, -224245, -127324, -65025, -1591, 84850, 136604, 94009, -16429, -107011, -109990, -12954, 150601, 307913, 357571, 223410, -59279, -313680, -338157, -114514, 127865, 144176, -29450, -125527, -24362, 70457, -43921, -213097, -115112, 246597, 501518, 411397, 165285, 53899, 72255, 46961, -6550, 80746, 299906, 422790, 313283, 83889, -89203, -136864, -57123, 115347, 250581, 207218, 40843, -35460, 34979, 62854, -65699, -177912, -83354, 114707, 174827, 62304, -66554, -131574, -165880]
55398a65880J2460R8467R0143n5922j42042l0877J08047P3262m4171n8406k5129
55387a40048q8342j45615p379K01588J68169r6949k37334r3619P9676N7485j8113
55376c20481O4558K11663J92596J6701j07560r9548o6966p7772p4098k4861J183
55365b84585l5807n9704J4992J51940K25727J62963J5314j01946j21742p0004
55355a02852j7053j0726n3174j00931p6682N8373K09907K06258K1947j32620o1975
55344e9528J30361J62927l5290k31636k18781o5228M3778O2695N7725L6457l7053
55333a53573j07198n8304J10164K47869K23758O9374p0022q7177j248P9250O8896
55322C21789j7328j02095j40769j38532r0832J2553J06898P1801j04608k53627
$$ y = [-165880, -153420, -54953, 35190, -20732, -162774, -193651, -85604, -12342, -56513, -114919, -140048, -228390, -374005, -381384, -179796, -11627, -108576, -345910, -439529, -359853, -302368, -320481, -255923, -44260, 148336, 165037, 57477, -42071, -109037, -186809, -260907, -285768, -284585, -320392, -380096, -365104, -213164, 12563, 175526, 190840, 88894, -32848, -102852, -119905, -130631, -183805, -284736, -361418, -303045, -93138, 113120, 135067, 2447, -59528, 70833, 233760, 198470, -33166, -251947, -317175, -273397, -210702, -152977, -116520, -153573, -260771, -319075, -208911, 38958, 262716, 332090, 262068, 174891, 173643, 252893, 321789, 304461, 202366, 61597, -76935, -167767, -155214, -48316, 23485, -81123, -334750]
55312c34750k05861k164J61604J74084J01791N3452N2849P4178J13897J62169
55302C51249J56590M9499q5176r6650M7668J72747Q9726j35349k24008n0849J48999
55291D24446P1158k26845l78454k08833K9257L6499r9521o5675J78006L27697
$$ y = [-334750, -540611, -542775, -381171, -207087, -105296, -51844, 1005, 75183, 189080, 351249, 507839, 557338, 472162, 375512, 423180, 595927, 685653, 550304, 326296, 275447, 424446, 495604, 268759, -109695, -318528, -289271, -252772, -352293, -417968, -239962, 87735]
$$ [...]
##END NTUPLES=NMR SPECTRUM
##END=
