##TITLE=31Pdec_LY-THF-mix
 CDcl3, 24 sc
 20.10.2020
##JCAMPDX= 6.0         $$ Bruker NMR JCAMP-DX V2.0
##DATA TYPE= NMR SPECTRUM
##DATA CLASS= NTUPLES
##ORIGIN= UXNMR, Bruker Analytische Messtechnik GmbH
##OWNER= root
$$ XWIN-NMR		Version 3.5
$$ Tue Oct 20 13:44:07 2020 Russian Standard Time (UT+4h)  she@DPX200
##.OBSERVE FREQUENCY= 81.013821
##.OBSERVE NUCLEUS= ^31P
##.ACQUISITION MODE= SIMULTANEOUS
##.ACQUISITION SCHEME= undefined
##.AVERAGES= 25
##.DIGITISER RES= 17
##SPECTROMETER/DATA SYSTEM= spect
##.PULSE SEQUENCE= zgpg30
##.SOLVENT NAME= CDCl3
##.SHIFT REFERENCE= (INTERNAL, CDCl3, 0, 182.463)
##AUDIT TRAIL= $$ (NUMBER, WHEN, WHO, WHERE, WHAT)
$$ ##TITLE= Audit trail, XWIN-NMR		Version 3.5
$$ ##JCAMPDX= 5.01
$$ ##ORIGIN= Bruker BioSpin GmbH
$$ ##OWNER= she
$$ F:/spectra/data/she/nmr/P31/1/pdata/1/auditp.txt
$$ ##AUDIT TRAIL=  $$ (NUMBER, WHEN, WHO, WHERE, WHAT)
(   1,<2020-10-20 13:42:51.65 +0400>,<she>,<DPX200>,
      <created by zg, POWCHK disabled, PULCHK disabled
       terminated by command 'halt'
       configuration hash MD5:
       00 E9 B6 7A A2 85 ED C7 34 08 36 98 17 FE 4E 26
       data hash MD5: 32K
       C9 51 10 EC 41 94 F6 E3 27 68 3D 7D F0 81 F2 EC>)
(   2,<2020-10-20 13:42:57.15 +0400>,<she>,<DPX200>,
      <Start of raw data processing
       efp BC_mod = 2 LB = 1 FT_mod = 6 PKNL = 1 PHC0 = -2272.207 PHC1 = -453.9998 SI = 64K 
       data hash MD5: 64K
       F1 5B 66 71 4B 09 13 84 2B 7C 67 3C 67 29 82 9E>)
(   3,<2020-10-20 13:43:28.39 +0400>,<she>,<DPX200>,
      <pk PHC0 = -106.0061 PHC1 = 519.8004 
       data hash MD5: 64K
       58 74 8B B4 18 BC 05 2A B8 30 11 4E A4 63 32 23>)
(   4,<2020-10-20 13:43:32.85 +0400>,<she>,<DPX200>,
      <abs ABSG = 5 
       data hash MD5: 64K
       72 E2 91 D3 5D 30 70 BA 22 F1 24 F4 44 3E 92 93>)
$$ ##END=
$$ 
$$ hash MD5
$$ B2 69 4B 30 04 79 41 F3 01 FB 0E 1F 0A CD 98 C6
##$RELAX= 
##$RELAX= 
##$RELAX= 
##$RELAX= 
##$RELAX= 
##$RELAX= 
##$RELAX= 
##$RELAX= 
$$ Bruker specific parameters
$$ --------------------------
##$DU= <F:/spectra>
##$EXPNO= 1
##$NAME= <P31>
##$PROCNO= 1
##$TYPE= <nmr>
##$USER= <she>
##$AMP= (0..31)
100 100 100 100 100 100 100 100 100 100 100 100 100 100 100 100 100 100 
100 100 100 100 100 100 100 100 100 100 100 100 100 100 
##$AQSEQ= 0
##$AQ_mod= 1
##$AUNM= <au_zg>
##$AUTOPOS= <>
##$BF1= 81.014009
##$BF2= 200.13
##$BF3= 200.13
##$BF4= 200.13
##$BF5= 200.13
##$BF6= 200.13
##$BF7= 200.13
##$BF8= 200.13
##$BYTORDA= 1
##$CFDGTYP= 0
##$CFRGTYP= 5
##$CHEMSTR= <none>
##$CNST= (0..31)
1 1 145 1 1 1 1 1 1 1 1 1 1 1 1 1 1 1 1 1 1 1 1 1 1 1 1 1 1 1 1 1 
##$CPDPRG= <waltz16>
##$CPDPRG1= <>
##$CPDPRG2= <waltz16>
##$CPDPRG3= <>
##$CPDPRG4= <mlev>
##$CPDPRG5= <mlev>
##$CPDPRG6= <mlev>
##$CPDPRG7= <mlev>
##$CPDPRG8= <mlev>
##$CPDPRGB= <>
##$CPDPRGT= <>
##$D= (0..31)
0 1 0 0 0 0 0 0 0 0 0 0.03 2e-05 3e-06 0 0 0 0 0 0 0 0 0 0 0 0 0 0 0 0 
0 0 
##$DATE= 1603186971
##$DBL= (0..7)
120 120 120 11 120 120 24 19 
##$DBP= (0..7)
150 150 150 150 150 150 150 150 
##$DBP07= 0
$$ [...]
##$SUBNAM3= <"">
##$SUBNAM4= <"">
##$SUBNAM5= <"">
##$SUBNAM6= <"">
##$SUBNAM7= <"">
##$SUBNAM8= <"">
##$SUBNAM9= <"">
##$SW= 369.568048894756
##$SWIBOX= (0..15)
0 1 3 0 0 0 0 0 0 0 0 0 0 0 0 0 
##$SW_h= 29940.119760479
##$TD= 32768
##$TD0= 1
##$TE= 0
##$TE2= 300
##$TE3= 300
##$TEG= 300
##$TL= (0..7)
0 120 53 12 22 120 120 120 
##$TP= (0..7)
150 150 150 150 150 150 150 150 
##$TP07= 0
##$TPNAME0= <>
##$TPNAME1= <>
##$TPNAME2= <>
##$TPNAME3= <>
##$TPNAME4= <>
##$TPNAME5= <>
##$TPNAME6= <>
##$TPNAME7= <>
##$TPOAL= (0..7)
0.5 0.5 0.5 0.5 0.5 0.5 0.5 0.5 
##$TPOFFS= (0..7)
0 0 0 0 0 0 0 0 
##$TUNHIN= 0
##$TUNHOUT= 0
##$TUNXOUT= 0
##$USERA1= <user>
##$USERA2= <user>
##$USERA3= <user>
##$USERA4= <user>
##$USERA5= <user>
##$V9= 5
##$VALIST= <valist>
##$VCLIST= <CCCCCCCCCCCCCCC>
##$VD= 0
##$VDLIST= <DDDDDDDDDDDDDDD>
##$VPLIST= <PPPPPPPPPPPPPPP>
##$VTLIST= <TTTTTTTTTTTTTTT>
##$WBST= 1024
##$WBSW= 4
##$XGAIN= (0..3)
0 0 0 0 
##$XL= 0
##$YL= 0
##$YMAX_a= 48200
##$YMIN_a= -85208
##$ZGOPTNS= <>
##$ZL1= 120
##$ZL2= 120
##$ZL3= 120
##$ZL4= 120
##$ABSF1= 182.463
##$ABSF2= -187.1042
##$ABSG= 5
##$ABSL= 3
##$ALPHA= 0
##$AQORDER= 0
##$ASSFAC= 0
##$ASSFACI= 0
##$ASSFACX= 0
##$ASSWID= 0
##$AUNMP= <proc_1d>
##$AZFE= 0.1
##$AZFW= 0.5
##$BCFW= 0
##$BC_mod= 2
##$BYTORDP= 0
##$COROFFS= 0
##$CY= -3
##$DATMOD= 1
##$DC= 0
##$DFILT= <>
##$DTYPP= 0
##$F1P= 0
##$F2P= 0
##$FCOR= 1
##$FTSIZE= 65536
##$FT_mod= 6
##$GAMMA= 0
##$GB= 0
##$INTBC= 1
##$INTSCL= 5.30512e-09
##$ISEN= 30
##$LB= 1
##$LEV0= 0
##$LPBIN= 0
##$MAXI= 10000
##$MC2= 0
##$MEAN= 0
##$ME_mod= 0
##$MI= 50
##$NCOEF= 0
##$NC_proc= -2
##$NLEV= 6
##$NOISF1= 182.463
##$NOISF2= 159.3651
##$NSP= 0
##$NTH_PI= 0
##$NZP= 0
##$OFFSET= 182.463
##$PC= 4
##$PHC0= -2378.213
##$PHC1= 65.80063
##$PH_mod= 1
##$PKNL= yes
##$PPARMOD= 0
##$PSCAL= 0
##$PSIGN= 0
##$REVERSE= no
##$SF= 81.014009
##$SI= 65536
##$SIGF1= 159.3651
##$SIGF2= -187.1042
##$SINO= 113.3802
##$SIOLD= 16384
##$SREGLST= <1H.CDCl3>
##$SSB= 0
##$STSI= 65536
##$STSR= 0
##$SW_p= 29940.119760479
##$SYMM= 0
##$S_DEV= 0
##$TDeff= 32768
##$TDoff= 0
##$TI= <>
##$TILT= no
##$TM1= 0
##$TM2= 0
##$TOPLEV= 0
##$USERP1= <user>
##$USERP2= <user>
##$USERP3= <user>
##$USERP4= <user>
##$USERP5= <user>
##$WDW= 1
##$XDIM= 65536
##$YMAX_p= 308852543
##$YMIN_p= -514422
$$ End of Bruker specific parameters
$$ ---------------------------------
##NTUPLES= NMR SPECTRUM
##VAR_NAME=  FREQUENCY,     SPECTRUM/REAL,   SPECTRUM/IMAG
##SYMBOL=    X,             R,               I
##VAR_TYPE=  INDEPENDENT,   DEPENDENT,       DEPENDENT
##VAR_FORM=  AFFN,          ASDF,            ASDF
##VAR_DIM=   65536,         65536,           65536
##UNITS=     HZ,            ARBITRARY UNITS, ARBITRARY UNITS
##FACTOR=    0.456856943014862, 1,           1
##FIRST=     14782.0589164895, 0,            0
##LAST=      -15158.0608439895, 0,           0
##MIN=       -15158.0608439895, -514422,     0
##MAX=       14782.0589164895, 308852543,    0
$$ Real data points
##PAGE= N=1
##DATA TABLE= (X++(R..R)), XYDATA
$$ [...]
36033a5894n4148o550O9488P2843O80k5638J9420K339j09863j31325M0912J99698
36021F1962J18811q1748j14810L1406J05810J0759p1098j038J03309O9727q2171
36010A50919j94816j70473m3913P6520J02385M4849n11J1843R858n7861r6066
35999a67266N2J46208J65250M8858m2753l2005n341k9823n3036k5125J9224M1203
35987F5446M1118J481q6214j30884l1139J26703J35254k4789j29317m4089P4870
35976a560L7888q8269j12340k0210L8946M368l1047Q554Q4598J27023J16985P4900
35964B39836L0093L693j6310o0486j10991j00844k0548L9293Q688o2800r1314
35953a41690p4075m5020J0219R7097J34569N2797p2432j04067l8238P933r504
$$ plain form
36033 -15894 -70042 -76592 -7104 65739 66419 40781 60201 62540 -47323 -178648 -137736 61962
36021 61962 180773 99025 -15785 15621 121431 132190 61092 60054 163363 233090 150919
36010 150919 -43897 -214370 -258283 -181763 -79378 -34529 -35040 -23197 -13339 -71200 -167266
35999 -167266 -167214 -21006 144244 193102 150349 118344 113003 83180 30144 5019 24243 65446
35987 65446 106564 108045 21831 -109053 -140192 -13489 121765 96976 -32341 -76430 -1560
35976 -1560 36328 -51941 -164281 -184491 -145545 -141177 -172224 -163670 -79072 47951 164936 239836
35964 239836 269929 273622 257312 196826 85835 -15009 -35557 3736 12424 -50376 -141690
35953 -141690 -215765 -260785 -250566 -153469 -18900 33897 -38535 -142602 -180840 -172907 -182411
35942a82411j2062M1234P5401L0419l5079l6807J5364N6262O5678O4980N5868
35931A38847K5333j2516l0991l1837l3089l3499k4508j8623k7271k7323O381M4863
35919b4233L1772k8923o3142k7045K7473K7903j0220p297N5496J00704O6577k385
35907A46680k3130P952K6481P211j3358k1239n2296j08022j19018m6982L4294
35896a61427L2318k6033l3002L6367Q8616N6583l643n732M0353N7345J8869k7807
35884G2807m3099l8066l3058k4346o843N139m697l6037p1533p6503j7910P8179
35872a95967J13158K7510q5933p2307O7426J56091Q5765k9306l3764L9318N3580
35861A25571R766L0227J22612J37108j329j66334k02844j13864p751M5607M0309
$$ plain form
35942 -182411 -194473 -153239 -77838 -47419 -82498 -119305 -103941 -47679 17999 82979 138847
35931 138847 164180 151664 120673 88836 55747 22248 -2260 -20883 -48154 -75477 -69096 -24233
35919 -24233 7539 -21384 -84526 -111571 -84098 -56195 -66415 -73712 -18216 82488 149065 146680
35907 146680 123550 131502 157983 165194 151836 130597 78301 -29721 -148739 -195721 -161427
35896 -161427 -129109 -155142 -188144 -151777 -63161 -6578 -10221 -15953 24400 81745 100614 72807
35884 72807 29708 -8358 -41416 -65762 -72605 -67466 -72163 -108200 -179733 -256236 -274146 -195967
35872 -195967 -82809 -55299 -141232 -213539 -146113 9978 95743 66437 32673 71991 125571
35861 125571 135337 165564 288176 425284 423955 257621 54777 -59087 -66838 -21231 19078
35850A9078J5k0905K2439P8240M0756p5239j17371k0844P5246L8127n2596m4977
35838e8031L6883M6635m0587j03154o9877M613N6100P3665M7699k6420q9777p0622
35826a92873P476O2968Q2835J07224J15883N6054l3341o1005m0004o4619j30157
35815h9559j27270l2309N1467P2232R0380J17890O5618p4274j52161o9977O5325
35804h2638J05170O0575K8498K2245l005l8638n4036p0097r5705o5774M4066J16370
35792c2969L8946j02774j24550n403R2746O5431j1086k4987J7127L4471l924n2924
35780a09896n4479J338O1859O0736J746l1714J1346O3993L2012n6015p5642J3376
35768h1340J02309Q3549p126n6603l4933j4290m0688o7197m3549n624j2716l6791
$$ plain form
35850 19078 19093 -1812 20627 98867 139623 64384 -52987 -73831 1415 39542 -13054 -58031
35838 -58031 -21148 25487 -15100 -118254 -188131 -183518 -127418 -53753 -6054 -32474 -122251 -192873
35826 -192873 -185397 -122429 -39594 67630 183513 239567 206226 145221 105217 40598 -89559
35815 -89559 -216829 -249138 -197671 -125439 -35059 82831 148449 74175 -77986 -147963 -82638
35804 -82638 22532 83107 111605 133850 130845 92207 38171 -31926 -127631 -193405 -149339 -32969
35792 -32969 5977 -96797 -221347 -226750 -134004 -68573 -79659 -104646 -87519 -53048 -56972 -109896
35780 -109896 -164375 -163037 -101178 -40442 -38696 -70410 -59064 4929 36941 -19074 -94716 -81340
35768 -81340 20969 104518 97392 40789 5856 -8434 -49122 -116319 -159868 -165492 -178208 -214999
35756b14999k064P5378R1688K3052k2774J7951N2704n333p2052l0791N2957L5982
35744A699m0251n720J30378J61730J9568j05667p1632L231k7689q6061k7885R2457
35732D4158J17070M2588j2187k5368o7118j21700j01381j9518J9575k913r439
35721a36233J4351N526k9155j3686L3486M484q7711p5530J02288K55852J83476
35710B57148m7059j92247j48680l7993O552L089L1415Q2372P9906J0137n8147
35699a3507p9897q0117p0407n938J09617J55485M1420j21587j35290R787J20210
35688g0224Q3204N331P536M0748J1478m3115l8825k544q616l3908j2891K4611
35676c7215O441l9997l2017J9376L2869J162q917K0639M5092M4322K8174j1805
$$ plain form
35756 -214999 -217063 -141685 -49997 -26945 -49719 -31768 20936 15603 -56449 -87240 -34283 1699
35744 1699 -38552 -44272 86106 247836 267404 161737 90105 93336 65647 -20414 -48299 44158
35732 44158 161228 203816 191629 166261 99143 -22557 -123938 -143456 -123881 -126794 -136233
35721 -136233 -121882 -116356 -145511 -159197 -125711 -121227 -208938 -284468 -182180 73672 257148
35710 257148 210089 17842 -130838 -168831 -162279 -159190 -127775 -45403 34503 44640 -13507
35699 -13507 -93404 -173521 -243928 -249866 -140249 15236 56656 -64931 -200221 -190434 -70224
35688 -70224 12980 18311 25847 66595 78073 34958 -3867 -6411 -15027 -48935 -61826 -37215
35676 -37215 -30774 -70771 -102788 -83412 -50543 -49381 -58298 -37659 7433 51755 79929 68124
35664F8124o5217o9231r227J7006n0227j02366k6524Q7346Q2054K410J6275J09329
35652E9752R4900o7892j97413j70272o8191P297O5080J05273O6177k8200m7847
35641a81336L1830P2251Q098m3277p019J0579n9317q2488N0390J92249J43216
35630A35176k9629r3909m659N9589p188j02109r7653j0613N8885N7238Q081k7415
35618e4206q560L0648J1028o7914r1778J0498J34111J25359j036q7090n7062J640
35606e4362l534m1860l5712J3015L6175L282m2077m5712q668K4436K8850K4597
35594a01570K9877K4059q826l1309l709L7052K2229l3689m6723K368M0362K9718
35582d0161K5217N8753O5158n678q0232n2768N9811J36736J06552J6116m7164
$$ plain form
35664 68124 2907 -66324 -75551 -58545 -108772 -211138 -237662 -150316 -68262 -65852 -49577 59752
35652 59752 154652 86760 -110653 -280925 -349116 -341819 -276739 -171466 -105289 -133489 -181336
35641 -181336 -149506 -77255 -69157 -112434 -119453 -108874 -168191 -250679 -200289 -8040 135176
35630 135176 105547 11638 6979 66568 59380 -42729 -140382 -150995 -92110 -34872 -26791 -54206
35618 -54206 -62766 -32118 -21090 -89004 -180782 -170284 -36173 89186 88150 1060 -56002 -54362
35606 -54362 -57896 -99756 -135468 -122453 -86278 -82996 -125073 -170785 -179453 -155017 -126167 -101570
35594 -101570 -71693 -47634 -56460 -87769 -91478 -54426 -32197 -65886 -112609 -110241 -69879 -40161
35582 -40161 -14944 43809 108967 103289 23057 -29711 30100 166836 273388 289504 242340
35571B42340n3249m1139n2336o6069k4052O8237J15046N6912k8671l6229O378
35560A87168j851n1937m4664K1503M4229J0074K0258Q6099P9529m2192j36601
35549A71615r6297r668O593j4419J130K2180N502J963L7484K1390q1933j27091
35537f1551l845J45468J18954l3489r7215j9120O1080O0368L1499J2984j6977
35526A98156m2818k3886Q142o28j5568J2143K4126l6150p2959J3642J10846N1961
35514B27007p7421o1073O2150M6175j18376j49685M8007J89307N7024j49289j40798
35503f6972K1274P7631n610m4510K3650P1572K4990m2524o2631n0275k0663L0792
35491d3276N9832R504p8106r6206k5086M9105O8517N9932N2721L5584R648L97
$$ plain form
35571 242340 189091 147952 95616 29547 5495 73732 188778 245690 217019 180790 187168
35560 187168 185317 133380 88716 110219 154448 164522 184780 270879 350408 308216 171615
35549 171615 75318 65650 72243 57824 58954 81134 86636 88599 126083 147473 65540 -61551
35537 -61551 -65396 80072 199026 165537 68322 49202 110282 170650 202149 215133 198156
35526 198156 155338 131452 139594 138966 123398 135541 159667 123517 50558 64200 175046 227007
35514 227007 149586 88513 150663 196838 78462 -71223 -23216 166091 223115 73826 -66972
35503 -66972 -45698 31933 26323 -18187 5463 77035 102025 59501 -3130 -53405 -74068 -43276
35491 -43276 16556 26060 -52046 -148252 -173338 -124233 -55716 4216 56937 92521 102169 102566
35479A02566j273l3227p7326n5689N2839J51954J30240o076j39142j64883q9282
35468a29299n705P035m3105q8311q1853l0300M1515J13501J52638J23247M1520
35457A00883k2066k8103j9349m8353q8643o9264J9879J08263J28685Q1132J0162
35446A73226m6137p3207p1535n0073k1625O117L4596O3483P5173M3280k7056p6682
35434B9560m4894M7154J04565P2964M882k2055r782q605j7904O857N8624O6301
35422B87667p143j07947j50092r7214J3667R6896P9753j9590r3939p1493q424
35411g7859J237l1995k7244J9806L2539j0447m6767m6383m3087l2642L7028J37211
35399h8603J47634L6322o8224o1915r279q408k1466L4136J10333R3818L002l0284
$$ plain form
35479 102566 101293 68066 -9260 -64949 -12110 139844 270084 264008 124866 -40017 -129299
35468 -129299 -135004 -127969 -171074 -259385 -341238 -371538 -330023 -216522 -63884 59363 100883
35457 100883 78817 50714 31365 -16988 -105631 -174895 -155016 -46753 81932 163064 173226
35446 173226 127089 53882 -17653 -67726 -89351 -83234 -48638 14845 90018 133298 106242 29560
35434 29560 -15334 31820 136385 209349 214231 192176 182394 173789 155885 162742 221366 287667
35422 287667 280524 172577 22485 -74729 -61062 35834 115587 95997 2058 -69435 -77859
35411 -77859 -76622 -108617 -135861 -116055 -83516 -93963 -140730 -187113 -230200 -262842 -225814 -88603
35399 -88603 59031 95353 27129 -34786 -44065 -52473 -73939 -39803 70530 164348 167350 137066
35387A37066L1449P9547L5291m1823o4021l7594j9277j8346k305L7392P2885P4147
35375B84411L0383m1299r2916q0959k3444R900j2034l4998R63O3382O2896j8317
35363A47968r1037p2878Q276O1365N0134J6473K644L286l717k3787n0116o4460
35351a5849l6066L4904Q0902L8676m3383n1790K4628P2178L1281j4195P568K6237
35339A55091m1122j27757j16522l2225Q605o130J1300P1017Q6955M0225J7436
35328F6873O0899J03336Q1077Q039p9813j50194j39525j2420J29885J28822j3529
35317A83450j19200p5291L0600O3597J5795l2439l0375K1553R4224J34864J12133
35306C98911O4493L4809j4831j18353j80818r1796O7609J17070O0532O0473J27494
$$ plain form
35387 137066 168515 248062 283353 241530 177509 139915 120638 102292 99987 137379 210264 284411
35375 284411 314794 273495 180579 99620 76176 86076 74042 39044 40007 103389 166285 147968
35363 147968 56931 -15947 -7671 53694 103828 120301 122945 126231 122514 98727 48611 -15849
35351 -15849 -51915 -17011 63891 102567 59184 7394 32022 104200 135481 121286 128854 155091
35339 155091 113969 -13788 -130310 -162535 -153930 -160060 -148760 -77743 9212 49437 66873
35328 66873 127772 231108 312185 320224 240411 90217 -49308 -61728 68157 196979 183450
35317 183450 64250 -11041 19559 83156 98951 66512 36137 57690 151914 286778 398911
35306 398911 463404 498213 483382 365029 184211 92415 160024 277094 337626 398099 525593
35295E25593R6597l8896n9558J01862K02753Q3177n1682L7046K42825L23520K93453
35284A756690L24138M13393M54446N14311P30215J012498J175541J314036J684249
35275I379517K159283K142921J203759l76384j807976k448480k231069j599912
35267F421659j091523q93822p89692n59285l11421k69041l70112l54139j88105
35258A594519j01513j80286k30350j28097k6073p4269j71282j55231n8709j0718
35248D57991k8624n6342q7747j17427p9100M0537J26454Q9326k05l6569l7013
35237B71281o2916q2551l7258L2263M4922N283l0189n3972q2106q6651m1275J7414
35225a05755M5827N3450N1216J7316k8710j3476O1203Q4034Q796n5733k9129k831
$$ plain form
35295 525593 622190 583294 523736 625598 828351 911528 859846 896892 1139717 1463237 1756690
35284 1756690 2080828 2494221 2948667 3462978 4193193 5205691 6381232 7695268 9379517
35275 9379517 11538800 13681721 14885480 14509096 12701120 10252640 8021571 6421659
35267 6421659 5330136 4436314 3646622 3087337 2775916 2506875 2136763 1782624 1594519
35258 1594519 1493006 1312720 1082370 954273 928200 853931 682649 527418 468709 457991
35248 457991 429367 373025 285278 167851 88751 129288 255742 345068 344863 308294 271281
35237 271281 208365 125814 88556 120819 165741 171024 140835 86863 4757 -81894 -123169 -105755
35225 -105755 -59928 -6478 44738 62054 33344 19868 81071 165105 173901 118168 89039 86208
35213H6208o8656j30800o1268N7081M5021p4135j04217Q390R8239M9558m7490
35202a42069p1418l8506j2702K0679Q7686J27246O8827m4491j02118o4923J2783
35191a59006P3219R7290P1782j1075j05336j21182k5982Q9248R4607k0225j16148
35180a32808o5098R2297K00986J84115J09574N9304J9079n4420j29035j39040
35170A44954r6556p9029j09756j21847n9482L6554P6971L3790k8069k8392L6876
35159a93986R4795Q2210J3216m8098n6302o753P6850J38546J07910j8275j33832
35148E6281j32090m4034Q696j1260k3803J9140N7018L0661k6206n6717n9776m5342
35136b27432Q935R2294J24657N9462l3872o0654k5818j610j4261k8990j6077K1539
$$ plain form
35213 86208 17552 -113248 -174516 -117435 -72414 -146549 -250766 -242376 -144137 -94579 -142069
35202 -142069 -213487 -251993 -264695 -244016 -156330 -29084 39743 -4748 -106866 -171789 -159006
35191 -159006 -85787 11503 83285 72210 -33126 -154308 -180290 -91042 3565 -16660 -132808
35180 -132808 -197906 -105609 95377 279492 389066 448370 467449 413029 283994 144954
35170 144954 48398 -30631 -140387 -262234 -321716 -285162 -208191 -174401 -202470 -230862 -193986
35159 -193986 -99191 -16981 -3765 -51863 -108165 -114918 -38068 100478 208388 190113 56281
35148 56281 -75809 -119843 -111147 -122407 -146210 -127070 -70052 -39391 -65597 -122314 -182090 -227432
35136 -227432 -218497 -126203 -1546 57916 24044 -36610 -62428 -64038 -78299 -107289 -123366 -101827
35124a01827N8776N4360j0418p7759o5026O845K8669j7977j6801P9956J37249
35113G6047M1239r9014j02841J4962R0514O3540J3242k0873p6563j33886j11681
35102b45314j6016N4771O8959Q3028R4819L4726o9945r1300j3678J8013o1675
35091a43612j15739k6915J08209J38074Q0406M1739K4864j7646k9559N8257J40976
35080B59054N3236j43359k01544n2223Q4667L9369n5653n44J41062J45520k0148
35069B49437j63204j61994r4262m0384M1386J55131J61853j4959k00754j69612
35059b37362K9394J34287M3674o6262l7391M4031J9466q5698j19008l3827P3458
35048b35238J22076J20569R5033N0779R744k310j3372p0488j39960j26136j4255
$$ plain form
35124 -101827 -43051 11309 891 -76868 -141894 -135049 -106380 -124357 -141158 -61202 76047
35113 76047 117286 18272 -84569 -69607 20907 84447 97689 76816 253 -133633 -245314
35102 -245314 -261330 -206559 -137600 -54572 40247 74973 5028 -86272 -99950 -81937 -143612
35091 -143612 -259351 -286266 -178057 -39983 40423 82162 107026 89380 59821 118078 259054
35080 259054 312290 168931 -32613 -84836 -169 39200 -16453 -16997 124065 269585 249437
35069 249437 86233 -75761 -170023 -210407 -169021 -13890 147963 133004 -67750 -237362
35059 -237362 -207968 -73681 -30007 -96269 -133660 -89629 -70163 -155861 -274869 -308696 -235238
35048 -235238 -113162 7407 102440 153219 162963 160653 147281 76793 -63167 -189303 -203558
35037b03558Q2366O2475l0140o5277R804J10966J19588J9332q2023p3226K5380
35026b4313Q1804K2732o6116o0745K2736N4712j4237q2331m6555N7259J13693
35015E8639O9494l5363j30407j53164o9683P1803J37640M4479j07388j27180K0825
35004b20305J58301J28313j726o1662k8835k2042p3207o8573M1894J29914Q0459
34993F2531k2410l0484L5889M3201k0667l9758J2355K4631m7383r2497k9527N4897
34981d9222M6403k6023n7479k4661J7935L5029J8851m1137j15807j18505j1001
34970c25617J18418J56762J02240L2388j0994l2487k9219l274J2153M268J3217
34959C7855N5829P7415M2626L241L394j246m3054n2259K0443P7457Q860j13576
$$ plain form
35037 -203558 -121192 -58717 -88857 -154134 -144330 -33364 86224 105556 23533 -49693 -24313
35026 -24313 57491 80223 14107 -46638 -23902 30810 16573 -65758 -112313 -55054 58639
35015 58639 128133 92770 -37637 -190801 -260484 -188681 -51041 -6562 -113950 -241130 -220305
35004 -220305 -62004 66309 64583 2921 -25914 -47956 -121163 -189736 -147842 -17928 62531
34993 62531 40121 9637 45526 88727 68060 28302 40657 65288 17905 -74592 -104119 -49222
34981 -49222 -2819 -28842 -86321 -110982 -93047 -58018 -39167 -80304 -196111 -314616 -325617
34970 -325617 -207199 -50437 51803 84191 73197 40710 11491 8217 20370 24638 37855
34959 37855 93684 171099 213725 216966 220360 219114 176060 123801 144244 221701 230561 116985
34947A16985j29583l3103L4548Q376l9725n5516o4297o8917k8151M0836O2109
34936a56438K3969p276n022l212J264M7803J09242J10577N6932K4791K6597R427
34924B38654j8721k919K2965k7512j16417j12231j5585K8835k0949m0454K4331
34913d0003N9824N362l2098J1067K8492m3452q0386P990R3756M7642l0513l064
34901B4617M0142n1304j79720j30433N7960J34930L3602m6139J8817J00469O6011
34890F8952j7292l2187J343N550j3633j4263j3345l8096n5308k9200J0903K3867
34878a02709J9205J5410l71k3103r637L9805N2054n112n0800r997N7275M0502
34866B2522m6614p9812n605Q6838R6052L4472j3517p038K3436L5577J9315j0994
$$ plain form
34947 116985 -12598 -45701 -11153 -2777 -42502 -98018 -162315 -231232 -259383 -218547 -156438
34936 -156438 -132469 -139745 -144767 -147979 -146715 -98912 10330 120907 177839 202630 229227 238654
34924 238654 219933 217014 239979 212467 96050 -16181 -31766 -2931 -23880 -64334 -40003
34913 -40003 19821 25183 -6915 4152 32644 -10808 -91194 -83204 10552 58194 27681 24617
34901 24617 64759 13455 -166265 -296698 -238738 -103808 -70206 -116345 -97528 2941 68952
34890 68952 51660 19473 20816 26366 12733 -1530 -14875 -52971 -108279 -137479 -126576 -102709
34878 -102709 -83504 -68094 -68465 -91568 -101205 -61400 -9346 -14458 -65258 -75255 -17980 22522
34866 22522 -24092 -103904 -109509 -22671 73381 107853 94336 87298 110734 146311 165626 154632
34854A54632l6780m4798l5592k5430k7796l4751k9210r911J4936N0560R8667J18675
34842A93202N7931n5527j06664l4027O6591N6269n1008j00004j2245J02466R7965
34831B14949j9206j17899j12699l6947L1560N2043K7762j6554m5928l1315K3335
34820c0899P3613O8958P701m6540k9528L6401O0268R528l5680m658M7120K6349
34808A82633m1054n3126p331j957n7586p5447q904N6362M9842J9425J6830Q58
34796H0545n5833p5684J14R1593R9040N8914N7851O6622J228j02936j28257o3888
34784B9309j5566k8864l5659O879M4543K8522o180n603K9496O6571Q3149O4334
34772B60931N852o3974j00642q7688m1104J4972N1674M5887J7667J4536K9001
$$ plain form
34854 154632 117852 73054 37462 12032 -15764 -50515 -79725 -89636 -74700 -24140 74527 193202
34842 193202 251133 195606 88942 54915 121506 177775 126767 26763 14518 116984 214949
34831 214949 195743 77844 -34855 -71802 -40242 11801 39563 23009 -22919 -54234 -30899
34820 -30899 42714 111672 119373 72833 43305 79706 139974 149502 113822 109164 156284 182633
34808 182633 141579 88453 81122 79165 21579 -53868 -62772 -6410 43432 62857 79687 80545
34796 80545 24712 -50972 -50858 40735 139775 198689 256540 323162 324390 221454 93197 29309
34784 29309 13743 -15121 -50780 -43901 642 29164 22984 17381 46877 113448 196597 260931
34772 260931 266783 202809 102167 14479 -26625 -11653 40021 85908 103575 118111 147112
34761A47112p57o4939n3494O4439J35765K7658j44252j53448J6596J60409J45219
34750B80308M4758l4806r0620j36045j27494n0779K8274N8330N7909M3578M233
34739G7646k7505L831N4088J2574r7536j03418N4711J94879J41023k8392j14488
34728A67413p7266k8825k0753j758M2649N8494L4011K1392L6146L2727q246n1440
34716B04544p1009o7378k3572P1388J55473J43195N8324K4755R2333J59687J23506
34705H71246K9519J331O8458J48054J76405J74934J78678J78239J71627K12715
34695B211206L40320M85323N25955M43824L50591L22429K76530Q5335k25700m85108
34685D330705n76140n43421m81936m09727l04399j95930j41366j35422j21255
$$ plain form
34761 147112 146355 81416 27922 92361 228126 255784 111532 -41916 -25320 135089 280308
34750 280308 325066 290260 199640 63595 -63899 -114678 -86404 -28074 29835 73413 77646
34739 77646 50141 53972 108060 120634 23098 -80320 -25609 169270 310293 281901 167413
34728 167413 90147 61322 40569 38811 81460 139954 173965 195357 231503 264230 255984 204544
34716 204544 133535 66157 42585 113973 269446 412641 470965 495720 588053 747740 871246
34705 871246 900765 902096 970554 1118608 1295013 1469947 1648625 1826864 1998491 2211206
34695 2211206 2551526 3036849 3562804 4006628 4357219 4679648 4956178 5041513 4815813 4330705
34685 4330705 3754565 3211144 2729208 2319481 2015082 1819152 1677786 1542364 1421109
34676A421109q5205p4112j06247j25475q0888j4188j6573j03806j80713j53126
34666D80776m8071J5059k9908j17071j33254n5659K5460J6766o8685j21663n5923
34655i2173Q5804J63048R3975m2026j01459n8179j4495k8541l2692K5411O2813
34644F1486j4694j34293j31257J5615J47055J36314L2045m3691m6725j3217J4564
34633B3202R819l7806r1816q0824J1771J02504R7868Q904o3841m8814K4751P1183
34621B6901M3786j9347m1407N387P0556Q8291M6812j8118o8162p6647l3573K6540
34609E1019L6081k1163p0907m6161J1887J6056l5030o4524l6825J1997N2767Q9235
34597e568J05701O9374l895n2508m5583l687M4536O7796K5361o4668q7668K7066
$$ plain form
34676 1421109 1335904 1261792 1155545 1030070 949182 934994 918421 814615 633902 480776
34666 480776 432705 447764 417856 300785 167531 111872 137332 154098 85413 -36250 -92173
34655 -92173 -6369 156679 250654 208628 107169 48990 34495 5954 -26738 -1327 61486
34644 61486 46792 -87501 -218758 -203143 -56088 80226 112271 68580 21855 8638 23202
34633 23202 33021 -4785 -96601 -177425 -165654 -63150 34718 43622 -20219 -69033 -44282 26901
34621 26901 70687 51340 9933 15320 85876 174167 220979 202861 134699 58052 24479 51019
34609 51019 87100 65937 -4970 -51131 -39244 -23188 -58218 -122742 -159567 -147570 -94803 -5568
34597 -5568 100133 169507 165612 113104 67521 63834 108370 176166 201527 136859 49191 76257
34585G6257J56036J09996q6977k00177j03560N3189P0792l5062r8939m7509L5521
34574g0433M9003n888m2435P227R8579J04561j7327j31358r1281L7459O3344l7610
34562c6159r0141j0423O5243K4560l2779J8004J04689Q4494j6130n7243j3680
34551D0435J1772k9994p5642o0711J1258R7597J42181J03237J4622l0866j2064
34540B11825j7375r1463j43470r4214j0248J5969J5610M9634P1954L4453K6537
34529F9212J30539K20737J15480j15514k15768j09048J2901q57o8688o1345j928
34518b4279J7612p576k0654q05L6638P3468P7652K2757n5110q6658o7821n4522
34506h9298n9677m5870j7830j4960r985O1073J53348J35530l783j09315p7452
$$ plain form
34585 76257 232293 342289 255312 55135 -48425 4764 75556 40494 -58445 -105954 -70433
34574 -70433 -21430 -27318 -69753 -62526 36053 140614 123287 -8071 -99352 -61893 1451 -36159
34562 -36159 -126300 -136723 -71480 -46920 -79699 -61695 42994 127488 111358 54115 40435
34551 40435 52207 22213 -53429 -114140 -102882 -5285 136896 240133 254755 223889 211825
34540 211825 194450 102987 -40483 -134697 -144945 -128976 -113366 -63732 8222 42675 69212
34529 69212 199751 420488 535968 420454 204686 95638 108539 107682 38994 -22351 -24279
34518 -24279 -6667 -14243 -34897 -35702 936 74404 152056 174813 119703 33045 -34776 -89298
34506 -89298 -148975 -194845 -212675 -227635 -237620 -176547 -23199 112331 108548 -767 -78219
34495g8219Q562L4851K1569L5047M6396l280p3629q0343l0748K858J0765M5557
34483f0614J10394J35810P1380n6169j71253j97262j03091M8945J28611O6631
34473b6618n8542j10555n1876L9116Q5990Q5542O4699L1412p917k6857j0711R473
34461B3156j0614o1955p9209k4304M9274N5828l543l5503J1751O7476L8508n7072
34449b6207j21487j09348n4276J4256R4068J50935J25235K4920n6604n0104R878
34438A266M2757J9493k1352k6410J7536O2571M3174l3471p1850j2777O4474M5008
34426A30419m4304o7084J3283P5928K9741n2538n4876J1736M2845m993p1700q6644
34414g8187m7375p929j5016n1653m7172L1807J17391J19471N3946J5992K9178
$$ plain form
34495 -78219 -69657 -34806 -13237 21810 68206 64926 -8703 -89046 -119794 -116936 -106171 -60614
34483 -60614 49780 185590 256970 200801 29548 -167714 -270805 -221860 -93249 -26618
34473 -26618 -85160 -195715 -247591 -208475 -122485 -36943 27756 59168 51251 24394 13683 23156
34461 23156 12542 -49413 -128622 -152926 -103652 -47824 -51367 -86870 -75119 -7643 30865 -26207
34449 -26207 -147694 -257042 -311318 -297062 -202994 -52059 73176 98096 41492 -8612 1266
34438 1266 44023 63516 42164 15754 33290 95861 139035 105564 33714 20937 85411 130419
34426 130419 86115 19031 32314 108242 137983 85445 30569 42305 85150 80157 8457 -78187
34414 -78187 -125562 -133491 -148507 -200160 -247332 -215525 -98134 21337 75283 91275 120453
34403A20453J9484l8885o1373O173Q2048O7007n304l0513L672J5256l4781r3362
34391D9875j00750n3359K0360Q4830R5044L0000n6763p2303M035Q2292O7720j9633
34379A31348p2110l6628J9166J1471l1087j2584O5327P9453k9748j40061j06451
34368a21904K4638P9906R345o3033m5586K267L395j0987J3175M0724J6338k4408
34356g6130j2403L2161L1801j7861m1950o719L4615K9471m838k4182k4782l4356
34344a15173n5832n0891J0832R5994J24555O0383l2875o0341j2571K8253L79o5877
34332g3164j01237p6762q488P4820J36805J38797P8605J0245o328K7297N1722
34321B52312K4328k4670k7808K5419N8578O558p9356r0744k4622K730o4645j27626
$$ plain form
34403 120453 139937 101052 39679 45852 127900 194907 189603 159090 162762 178018 143237 49875
34391 49875 -50875 -104234 -83874 956 96000 126000 69237 -3066 969 83261 150981 131348
34379 131348 59238 22610 41776 53247 22160 9576 74903 154356 124608 -15453 -121904
34368 -121904 -97266 -17360 -8015 -71048 -116634 -114367 -110972 -121959 -108784 -68060 -51722 -76130
34356 -76130 -88533 -56372 -24571 -42432 -84382 -91101 -56486 -27015 -31853 -56035 -80817 -115173
34344 -115173 -171005 -221896 -211064 -115070 9485 69868 36993 -23348 -35919 -7666 -7287 -73164
34332 -73164 -174401 -251163 -259651 -184831 -48026 90771 169376 179621 173293 200590 252312
34321 252312 276640 251970 224162 249581 308159 314717 235361 144617 119995 122725 58080 -69546
34309f9546q4014J4112M8391Q740k3879j2945J8692N5777P0969M070j25739j69507
34297b64879n2633O2583M052j08222l0785J84318K32624L5728j31902q0158L1994
34286a17280J5129m3230N383P6507K0175q4306n6784O8653J00743j37q8431p2728
34274a76306K83P4547J29420J18913J9089q2665p9504r66M1656K1972j0211m5801
34262A0427q9380p5538L8172J47427J25405K0703k9421k7422p1160j26690o3108
34251a40585Q9433J37853K0055j01030r6093l5953k2586k6646M403K0969k7934
34240a78114p6298l8425N1740R9824R1600Q2783Q8340O5094o997q0918q4764L311
34228A7176J13080J32374L4451p0564o7405J0202L5166k5108p4357m1022L2496
$$ plain form
34309 -69546 -153560 -139448 -91057 -82317 -106196 -119141 -100449 -44672 26297 30367 -95372 -264879
34297 -264879 -317512 -254929 -250877 -359099 -389884 -205566 27058 62786 -69116 -149274 -117280
34286 -117280 -102151 -145381 -139998 -63491 -43316 -127622 -184406 -115753 -15010 -15147 -103578 -176306
34274 -176306 -176023 -101476 27944 146857 165946 83281 3777 2811 44467 66439 56228 10427
34262 10427 -78953 -154491 -116319 31108 156513 177216 147795 120373 49213 -77477 -140585
34251 -140585 -51152 86701 106756 5726 -90367 -126320 -148906 -175552 -171149 -150180 -178114
34240 -178114 -254412 -292837 -241097 -141273 -49673 33110 121450 186544 179547 98629 13865 17176
34228 17176 130256 262630 297081 226517 159112 169314 204480 179372 105015 63993 96489
34217I6489P2253N8338O933n6098q5923n5866j4607l1081p8745o3975K0545P2748
34205e8989L9245o085R712M3607J8238m7788o6352m224P8043J00595M4741l3732
34193A17011n8720j0397N4793P2572M1472N528n496Q500K8020J2486o1608j30917
34181G3244q9444M4652J01543j0801j44585j07600N6401J38680O7873k9598n3438
34170D6927l9627l1990n949L9752N0669J8564J166R894r441n9205p0134k7372
34158g6746j845k4605l9295r835K9061N3412P9043R1866N3795j1377m4127n6572
34146D2775r4390j09872k2404J05891J27549M4351l351R927l0043j15152p5874
34135a20593J09558K12525R4659p0996q1158j413N449k9777J3926Q7074M6279
$$ plain form
34217 96489 168742 227080 234013 177915 91992 36126 21519 -9562 -88307 -152282 -131737 -58989
34205 -58989 -19744 -25829 -16117 27490 45728 -2060 -68412 -72636 5407 106002 150743 117011
34193 117011 58291 47894 102687 175259 216731 222259 216763 225263 253283 265769 204161 73244
34181 73244 -16200 28452 129995 119194 -25391 -132991 -76590 62090 129963 100365 46927
34170 46927 7300 -24690 -30639 9113 59782 78346 79512 89406 79965 20760 -49374 -76746
34158 -76746 -78591 -103196 -142491 -152326 -123265 -69853 9190 101056 154851 143474 99347 42775
34146 42775 -51615 -161487 -183891 -78000 49549 93900 90549 100476 70433 -44719 -120593
34135 -120593 -11035 201490 296149 225153 143995 142582 148031 118254 132180 219254 265533
34124B65533q6948j55933j10516l6999J3481N7711P3239J8907n2202m0503M5104
34113i126R5678N6224k5579q6256r6281m7261L4413Q7026Q1135M7221N454n4072
34101H8576r1747l6463O8248P7259k8825r1273l5791L357n4131o4082O5545J43110
34089D3783j0036k13620j79270K9265J16911M5460M0581J45061J43262k4585j30647
34078F165m7196N0331P238o3486k3563M5395K6188q125M8122J12187N2475o9558
34066A36173r1150l054N8759K6796l4587m8858n434N3226N5733l6662j45980j36039
34054a71077k631J00987Q6765M8769P1866P0474m6777j77215j58846k2653O2067
34043a38271M2927J6865L5047L9565k241m3395n4999n9063m8013J6278J02407
$$ plain form
34124 265533 178585 22652 -87864 -124863 -111382 -53671 19568 38475 -13727 -54230 -9126
34113 -9126 86552 142776 117197 30941 -65340 -112601 -78188 8838 89973 137194 142648 88576
34101 88576 -3171 -39634 28614 105873 77048 -14225 -50016 -46659 -100790 -164872 -99327 43783
34089 43783 33747 -179873 -359143 -329878 -212967 -167507 -126926 18135 161397 136812 6165
34078 6165 -41031 9300 16538 -46948 -70511 -25116 1072 -7053 41069 153256 205731 136173
34066 136173 45023 41969 100728 127524 92937 44079 38645 91871 147604 110942 -35038 -171077
34054 -171077 -173708 -72721 14044 62813 134679 205153 158376 -18839 -177685 -200338 -138271
34043 -138271 -95344 -78479 -43432 -3867 -6108 -49503 -104502 -163565 -211578 -195300 -92893
34032i2893J16322M0835k6599j4370K8480K3298k3696n2236m2071k0410m632J1865
34020e6107K5139J1455l4894p1501m0485N5344J29858J05657K0412j5337K6789
34009A56330N5186P891m5522k1262L3835J6449o0204q4303k3395L0980J1974l3113
33997D4846l7339j2100l586j6378k7340k7381j1884K7070O8235O5359J2860l6308
33985D6054m3013k3849K00L3827N4978Q579r2550j34684m9404O8628Q4236J4205
33973c2793j3265L6604O6772J8271m7071o7216o8739p9766n5884L0681J08407
33962a03999J00987M6789L5277O7564P2986L7229J7708L5590M0282l753o3731
33951B82929r1516p7242l5971J2449L8440K1128j6173k6126o65K0370O830l0477
$$ plain form
34032 -92893 23429 64264 37665 23295 51775 75073 51377 -859 -42930 -63340 -67972 -56107
34020 -56107 -30968 -19513 -54407 -125908 -166393 -111049 18809 124466 144878 129541 156330
34009 156330 211516 219407 173885 152623 186458 202907 142703 58400 35005 65985 77959 44846
33997 44846 7507 -4593 -8179 -24557 -51897 -79278 -91162 -64092 4143 69502 82362 46054
33985 46054 3041 -20808 -20608 13219 68197 76776 -15774 -150458 -199862 -131234 -46998 -32793
33973 -32793 -46058 -9454 57318 75589 28518 -38698 -107437 -187203 -243087 -212406 -103999
33962 -103999 -3012 43777 79054 146618 219604 256833 274541 310131 350413 346660 282929
33951 282929 191413 114171 78200 90649 129089 150217 134044 107918 107253 127623 134453 103976
33939A03976o5464p7167m8557J3271N8717M2498j0863l2305J333M7077O4145N2905
33927A49566K5086j1707l3286j4897K1501K4150j3624m1464k4995J4005M0428
33916A34763M5713L3946O058l1641o8125r1871p6064N795J12575J36440L8163
33905B45752o9284o1998J5986K6669m4909q2515l6152J6274J7498J240j1042m4856
33893b7337p0342q331J14005J57557Q2027J8228N5361J01326N1230m0066o7685
33882C65973m2871l1093k5490l11P56n2525q8702m3774K0301J8743j2942N155
33870A13220N1693N2461J1164j8368k9771l5019q190M6134N1948j1532m1286K0265
33858B02719O2101j1825r4518m1966P7384R4940K0998j814L3926P929p5932p6533
$$ plain form
33939 103976 38512 -38655 -87212 -73941 -15224 27274 16411 -15894 -14561 32516 96661 149566
33927 149566 174652 162945 129659 114762 136263 160413 146789 105325 80330 94335 134763
33916 134763 180476 214422 220480 188839 120714 28843 -47221 -41426 71149 207589 245752
33905 245752 176468 114470 130456 157125 112216 29701 -6451 9823 27321 28561 17519 -27337
33893 -27337 -97679 -106010 7995 165552 247579 265807 321168 422494 473724 433658 365973
33882 365973 323102 292009 266519 266208 266964 214439 125737 81963 102264 121007 108065 113220
33870 113220 164913 217374 228538 210170 180399 145380 137190 183324 235272 223740 182454 202719
33858 202719 264820 252995 158477 116511 193895 288835 309833 308019 341945 349874 273942 197409
33846A97409K9054R1022L3226l4672j3832L7023K5216l3223o4995m1290J7374
33835B42312O4344M3442m0259q2747j0117Q6596O8186l3054n9912J9108P2848
33824C70747L2377j6531m318J6594l424j6952J9091N6676M0113o234k6630n134
33812D56375M1612Q1894P3047J5127j2680M7616J19640Q4941k9119p4029Q590
33801H13014J19591J55657J19294O3222K8631N1755J36682K10383J90038J01193
33791A989460N5156J13236K36256L50112M07802M19919M60269N82043P15245P60398
33781F089896P92564R92706J352268J694557K036564K590709L324826M003983
33773B2878073M843283O363255P985164P532684L378213l016540p904898q935181
$$ plain form
33846 197409 226463 317485 350711 316039 302207 339230 364446 331223 266228 224938 242312
33835 242312 306656 350098 309839 227092 216975 303571 371757 338703 278791 297899 370747
33824 370747 403124 386593 382275 398869 395445 378493 397584 454260 494373 488139 461509 456375
33812 456375 497987 579881 652928 668055 655375 702991 822631 907572 878453 804424 813014
33801 813014 932605 1088262 1207556 1270778 1299409 1351164 1487846 1698229 1888267 1989460
33791 1989460 2044616 2157852 2394108 2744220 3152022 3571941 4032210 4614253 5329498 6089896
33781 6089896 6882460 7875166 9227434 10921991 12958555 15549264 18874090 22878073
33773 22878073 27721356 34084611 42069775 49602459 52980672 49964132 42059234 33124053
33765C3124053p155487n085419l873396l066781k247599j661408j444856j267753
33757G321354r22925o34824n99556o63689o15556m68983l34936k51401k19360
33748B610124k26675k07320j22217n5776r4401j75625k01460k03816k38364k32336
33738H52134j19058k966J338l0958N010K4026q2546j96819j44019K894M8362J460
33726C58858R776N7612J2805r1064j02120l5899l9482j02041p1934N2307J09423
33715A58241N2007q170k7850o6202r4455j4912J18179J31583R473q1580o3193
33704A13121k6387k2985O157O0073M2979m9671r3544l1549N2955R1428J04674
33693B47251R9053L9415n0031r1673p3800m7694k2153K0643M2952J2005j3549
$$ plain form
33765 33124053 25968566 20883147 17009751 13942970 11695371 10033963 8589107 7321354
33757 7321354 6398429 5763605 5164049 4500360 3884804 3415821 3080885 2829484 2610124
33748 2610124 2383449 2176129 2053912 1998136 1903735 1728110 1526650 1322834 1084470 852134
33738 852134 733076 730110 731448 700490 705500 729526 646980 450161 306142 309036 357398 358858
33726 358858 368634 426246 439051 347987 245867 209968 170486 68445 -3489 48818 158241
33715 158241 210248 202078 174228 108026 13571 -1341 116838 248421 257894 176314 113121
33704 113121 86734 63749 69906 129979 172958 123287 29743 -1806 51149 142577 247251
33693 247251 346304 385719 335688 244015 170215 122521 100368 121011 163963 175968 162419
33682A62419J0258L266q8966j41617l7559R9564Q2522k8491m1725L0540L2278
33671H2489j3286M8369J69375J38794l9847j28585m6621K2650l0368q8114o0352
33660E4504j8979l179N3406J29855J02817j1012m9386J16l2163j67170j99774
33649a40965m9670R0080P4269R119O017o751p8137q6757L4655J42542J11594K6699
33637A32695K81j0827o3928r1554m3375N856R830L3720Q2747N3030m1258k4194
33625D3023J29197J84107J4794j61191j17992L3639O4164p717j5912L7705K2636
33614B26453o6935j23301j16687r1142m3877L2023O8700L3092K0116R6852J60458
33603A95752R5721l3927r7839r0667o9134j4088Q7284J33917N3700m3728k4002
$$ plain form
33682 162419 172677 175943 86977 -54640 -92199 7365 89887 61396 19671 50211 82489
33671 82489 69203 117572 286947 425741 385894 257309 210688 233338 202970 114856 54504
33660 54504 35525 32346 85752 215607 318424 307412 258026 258142 225979 58809 -140965
33649 -140965 -190635 -100555 -26286 -17167 -11150 -17901 -96038 -182795 -148140 -5598 105996 132695
33637 132695 132976 122149 58221 -33333 -76708 -70852 -61022 -27302 55445 108475 67217 43023
33625 43023 172220 356327 371121 209930 91938 125577 189741 182024 166112 203817 226453
33614 226453 159518 36217 -80470 -171612 -215489 -183466 -114766 -81674 -61558 35294 195752
33603 195752 291473 257546 159707 69040 -94 -14182 73102 207019 260719 216991 192989
33592A92989N0926K9389p6305j16854m3454L7140K9410m4102r3048m9775O1142
33581b2542J16553K6976j17427j46133n5381M955J706O0720J89417K06991N8730
33570C24565m9339K0360J11033N3157n6402o4985m0672j01123j53626o4004O8713
33559D7677O8626j3843j4311M1654J2204p1271n6247M2998O1855l6131j18233
33548c5022j03157l2990M9276J22696J26628L7188m3017k1725K5811r999p2610
33537D3079m6796K4134K1332k9402k1363J7914j8927j02907j08317k9166L0046
33526b20373M0565N1339M9989o208o5770n1898k940Q363K1603R3510J44762Q0735
33514A43677k2534m0005j3657m9120r2038k6507Q6724R8312K6752J997K1989o923
$$ plain form
33592 192989 243915 273304 196999 80145 36691 73831 103241 59139 -33909 -83684 -22542
33581 -22542 94011 120987 3560 -142573 -197954 -192999 -191293 -130573 58844 265835 324565
33570 324565 275226 295586 406619 459776 403374 338389 297717 196594 42968 -21036 47677
33559 47677 116303 102460 88149 129803 142007 70736 14489 57487 119342 83211 -35022
33548 -35022 -138179 -171169 -121893 803 127431 164619 121602 99877 125688 115689 43079
33537 43079 -3717 20417 41749 12347 -9016 8898 -10029 -112936 -221253 -250419 -220373
33526 -220373 -179808 -128469 -78480 -84688 -150458 -202356 -205296 -196933 -175330 -81820 62942 143677
33514 143677 121143 81138 67481 18361 -73677 -100184 -13460 84852 111604 113601 135590 128667
33502A28667n6631l8907q924o3704j12752j3880J32097J10184l8374p9618J1564
33491c0278L5258n1076o7861L1733P1205r421l5312P4316J47553O4655l4908m377
33479A91487O9702M2648m7202p3032k6704O281j2338n8267r8334r9175m8041J3173
33467a39802M2369O4438R7307P1699m7039j33068o6087N0876M1220m8813m0098
33456a06998N1915N3728l1979k9045O6091N5183r1423j46402m826J37250J09173
33445F2667Q002k5195k7489n6286l0825R3231J73376Q0811q9103j59477j05313
33434g5601j7758M9149Q0072N0299k3541o9763o1521m0180j4541M1096P7165J3378
33422H254q9703q0015L9591J04487N6492Q276K028n6600j55277j21990P0164J88685
$$ plain form
33502 128667 72036 33129 24205 -39499 -152251 -166131 -34034 76150 37776 -41842 -30278
33491 -30278 4980 -46096 -113957 -82224 -11019 -20440 -55752 18564 166117 230772 195864 191487
33479 191487 261189 303837 256635 183603 156899 163180 150842 92575 -5759 -104934 -152975 -139802
33467 -139802 -97433 -32995 64312 136011 88972 -44096 -110183 -59307 -18087 -66900 -106998
33456 -106998 -55083 -1355 -33334 -62379 3712 58895 -32528 -178930 -183756 -46506 62667
33445 62667 70669 45474 17985 -38301 -69126 24105 197481 278292 189189 29712 -75601
33434 -75601 -93359 -44210 35862 86161 62620 -7143 -68664 -108844 -123385 -82289 -5124 8254
33422 8254 -81449 -161464 -121873 -17386 39106 47382 49410 -7190 -162467 -284457 -214293 -25608
33410b5608Q1504q4470r0400K0529P4461M8298L2921M0857K6363O064J4369J6654
33398A61542k0591n5669n6760o4780r4593q3530j1480M7087N9044Q7915J43358
33387A11543J22314j3329j41292j51754q4774j6995M8036R7122O4158l9577r1126
33376i5674l7389K4078J6956q704j0369k8647n7344j3620Q1779Q1920l5448r1175
33364a73637Q120J05881N6778l8112k0323O6125P7551L691o3048q5091p0357o820
33352a39242P7989R5957L3565m486L3127O1338K2344j8131j5826k5110n2501j4893
33340E4131O9829N2813q0385j29728K754J32668Q6469l0872l8685L6266O6150
33329B21410M5072K2766l0034j13818j08654L5840J63586J31732K4498p677L0905
$$ plain form
33410 -25608 55896 -28574 -118974 -98445 -23984 24314 57235 98092 124455 130519 144888 161542
33398 161542 140951 85282 28522 -36258 -130851 -214381 -225861 -178774 -119730 -31815 111543
33387 111543 233857 220528 79236 -72518 -157292 -174287 -126251 -29129 35029 -4548 -95674
33376 -95674 -133063 -108985 -92029 -100733 -111102 -139749 -197093 -210713 -128934 -47014 -82462 -173637
33364 -173637 -165517 -59636 -2858 -40970 -61293 4832 82383 86074 23026 -62065 -132422 -139242
33352 -139242 -61253 34704 68269 63783 96910 158248 180592 162461 146635 121525 69024 54131
33340 54131 123960 176773 96388 -33340 -30586 102082 188551 157679 118994 155260 221410
33329 221410 266482 289248 259214 145396 36742 72582 236168 367900 392398 384721 415626
33318D15626P3977J39909K25810K29788J43868J35759K59526K89938N8460k44768
33308A727893l45711k79770k48931k54875j68726m1177l7167j30075j38341k8384
33298E4736N9802N6394J7050k9380r0601j05476j3535J03061J09765J4223o7500
33287A08539q2101m9337K1820J00547J04711K4641k2997K3764O1775Q340n0765
33276B48937l0078k398m2524p5061l1249P921k1237l2766J8494J3929r0329j22247
33264a58608R496J07702P620j21420n9694Q9779J01119J0755J572O2685O1927
33253A12933J6089Q223k1115j29127j75454m8252Q1995K2747j00313o4829O3899
33242b33204Q7907L8415N0966N7512m8359j19470K296J32775K9916j48279r9130
$$ plain form
33318 415626 489603 629512 855322 1085110 1228978 1364737 1624263 1914201 1972661 1727893
33308 1727893 1382182 1102412 853481 598606 429880 388703 351536 221461 83120 54736
33298 54736 114538 170932 187982 158602 68001 -37475 -51010 52051 161816 176039 108539
33287 108539 26438 -22899 -1079 99468 204179 228820 205823 229587 291362 299702 248937
33276 248937 218859 216461 173937 98876 67627 75548 54311 21545 40039 53968 -36361 -158608
33264 -158608 -149112 -41410 -33790 -155210 -214904 -125125 -24006 -13251 -11679 51006 112933
33253 112933 129022 137245 116130 -12997 -188451 -236703 -154708 -131961 -232274 -297103 -233204
33242 -233204 -145297 -106882 -55916 1596 -46763 -166233 -163937 -31162 -1246 -149525 -248655
33231b48655Q0781P7510n5343n042J93896J90372o6446k46899j96829j01291o2357
33220d40303K8807J53306J35920N135k9914J5413n6739j79008q5716J49801J57602
33209a45696p7942j42574J00584K62357Q9266j29759q5309O9278O3392l4283k4511
33198e5197N1829N2350J3692L6075P3589M4103j5769n1420p8748p9008K109R1541
33186H5146N0151o3934n3467O6009P1494p0073j38319n2701J5728J213N2037J85670
33174A48954K01813N7373l3208P550k310j07102r3326P5735J16602q2565k27582
33163F1934j09142N6939M0401k1951N1764J24516K1156j14682p0519O4505Q3166
33152A88087J0094q464J9094J2135N184L8441L2843m4308p7599k3347j2918q8542
$$ plain form
33231 -248655 -167874 -90364 -145707 -150749 43147 233519 167073 -79826 -276655 -377946 -440303
33220 -440303 -411496 -258190 -122270 -117135 -147049 -131636 -188375 -367383 -453099 -303298 -145696
33209 -145696 -223638 -366212 -265628 -3271 85995 -43764 -129073 -59795 3597 -30686 -55197
33198 -55197 -3368 48982 62674 98749 172338 216441 200672 149252 70504 -8504 -6395 85146
33186 85146 135297 71363 17896 83905 155399 85326 -52993 -105694 -89966 -88753 -36716 148954
33174 148954 350767 408140 374932 382482 380172 273070 179744 255479 372081 289516 61934
33163 61934 -47208 9731 50132 28181 79945 204461 225617 110935 40416 104921 188087
33152 188087 198181 189717 208811 220946 226130 264571 297414 253106 175507 152160 139242 50700
33140E0700q7890M7119J20368K1486o7227m046N9341j9706j02433m1639M0637
33129A6710L93n6361k670N1835j1777p2184j748P7596K7418m1615Q466P6206L1644
33116A03913k4761K6277O8323k6363j25113o0872O3434O7532O035J6910L5181
33105A50496o2325j77996j33560L0336J35247J35429J00933M9459j8893m1801
33095A67325q732j9280r7401j12421m265J01644J12758Q9456N5434n5828j72232
33084E6458j00838J13964J81087L6996m0566N6942O3788j43633k62300p7098J51964
33073C6764J37611J5180P002J2522j02352j63487k0111J13104K8948q1850J157
33062a5512J02747L838j12725q815J30263K8719j55434j17154M7152O0961q316
$$ plain form
33140 50700 -37190 9929 130297 151783 84556 80510 139851 120145 17712 -23927 16710
33129 16710 17103 -39258 -41928 9907 -1870 -74054 -75802 1794 29212 -12403 -3937 72269 103913
33116 103913 79152 105429 173752 147389 22276 -38596 24838 92370 98405 115315 150496
33105 150496 88171 -89825 -223385 -193049 -57802 77627 178560 228019 209126 167325
33095 167325 158593 139313 41912 -70509 -74774 26870 139628 229084 284518 228690 56458
33084 56458 -44380 69584 250671 287667 247101 304043 367831 224198 -38102 -115200 36764
33073 36764 174375 189555 196557 209079 106727 -56760 -76871 36233 65181 -16669 -15512
33062 -15512 87235 91073 -21652 -30467 99796 128515 -26919 -144073 -96921 -35960 -44276
33051d4276O0830J56655M1307j49545j14061P7628J34881P0607R4615J45780K2463
33040D96884j59071j26309M4927N9215p2665r6639r58J3569m6069j4079N7294
33029A56099m213j12704n9545P6652O4262m9957m8537M0852M0694j490O0656J22184
33017B84953J6027j13777n3155N2868l7646j69875n1153J82828J81775k027m4623
33006B46195M8460K0874q4796k0470J27477O0319j48403j52657M1507J04082j6147
32995B26441o3045k584l7516j29998m9732J29777J14426o0325q8001L6193L4226
32984A09862r6398q3849P6116J11549k417k5610O1303N5181k4078J2786Q8088
32973B82533j3392j64422p9918J19415R2642q2081n4795J16207P2470j40879j45068
$$ plain form
33051 -44276 16554 173209 214516 64971 -49090 28538 163419 234026 328641 474421 496884
33040 496884 337813 211504 256431 315646 242981 146342 145384 158953 112884 98805 156099
33029 156099 151886 39182 -20363 56289 120551 70594 22057 62909 103603 102113 162769 284953
33017 284953 300980 187203 134048 186916 149270 -20605 -71758 111070 292845 290818 246195
33006 246195 294655 315529 230733 210263 337740 398059 249656 96999 138506 242588 226441
32995 226441 163396 160812 123296 -6702 -56434 73343 187769 127444 39443 75636 109862
32984 109862 13464 -70385 5731 117280 114863 89253 150556 205737 181659 194445 282533
32973 282533 269141 104719 24801 144216 236858 154777 99982 216189 288659 147780 2712
32962B712N6363J04140k0717j0517J03298P247k00689j12978J92136K12897q5726
32951B48166k07240j1890R7267k8661o2579R5900J32930k4194p0410L7188M152
32940B10629j42662m9463K23304K15310p9415j62615M9467Q3141j66859k20094
32930c9257P3501K42150O6278o9508L8611P2517r4924j28476N9079R5984r6374
32919B19581j18878J02250J34716j05369j61842N8443P9736j78434j69456K22848
32909H3595L59677k0904l03665q6721J59365K7451j32803M73J01906p5447j65997
32898e3070O4783K21412M8048p7107Q1118J37414j12045k21718N1796K42312M1052
32887D23995j41083L337J16397m7798j24265O9962J09458j58655k11187J43343
$$ plain form
32962 2712 59075 163215 142498 131981 235279 242526 41837 -71141 120995 333892 248166
32951 248166 40926 29036 126303 97642 35063 130963 263893 239699 169289 206477 210629
32940 210629 67967 18504 241808 457118 377703 215088 264555 347696 180837 -39257
32930 -39257 34244 276394 342672 273164 311775 384292 289368 160892 219971 315955 219581
32919 219581 100703 202953 337669 232300 70458 128901 208637 30203 -139253 83595
32909 83595 443272 422368 118703 31982 191347 218798 85995 86468 188374 112927 -53070
32898 -53070 11713 233125 281173 204066 285184 422598 310553 88835 140631 382943 423995
32887 423995 282912 286249 402646 354848 230583 300545 410003 251348 40161 183504
32877A83504K98102m7173k90083l7484J84586k0573j74617P9216K45051l0183
32867C90346k31017J4146K01096k5345j54576J20285K07814j98345l79310Q7089
32857C2183M28670O0157l13426j4618L54241J00964k50482l3792K69367L7748
32847F71012k45504J084K51486o4614l44186M0301M29875P2386m19575k07129
32837A85136K15534N0844k42643P0340M66420J65822k95929p8521L28562Q1969
32827I47534l48494j19035L15235J16470k78680p7368K50285m8708m06689l1398
32817C19152M33854J13497l31980K4323M96596J07744m21277m7106M83847O3818
32807A242468n25575r1465N60035J39394n38887q9058O75042K72816m91460n5640
$$ plain form
32877 183504 481606 434433 144350 106866 291452 270879 96262 175478 420529 390346
32867 390346 159329 173475 374571 349226 194650 314935 522749 324404 -54906 32183
32857 32183 460853 521010 207584 192966 547207 648171 397689 363897 633264 671012
32847 671012 425508 426592 678078 613464 269278 309579 739454 811840 392265 185136
32837 185136 400670 451514 208871 279211 745631 911453 615524 537003 865565 947534
32827 947534 599040 480005 795240 911710 633030 555662 805947 757239 350550 319152
32817 319152 753006 866503 534523 558846 1055442 1163186 741909 694803 1178650 1242468
32807 1242468 716893 625428 1185463 1324857 785970 696912 1371954 1644770 1153310 1097670
32797A097670P68404L17484o01574k22699O74505K70760o20188j08780Q93936
32788B469518L43668p56965j35071J163968O07815p64936j78998J322510P19926
32779D791435q59391k9395J982333J254424r32744O1021K919442J842769k037421
32770H992473o27813P421307J2986360J0262943M814655L371103M958825P158803
32762E9338656J1490722J7125590J9960585K4016990L9925578O1585021N9516977
32755B92960119J5892424m3285781p2275727n8539752l1381436j8727778j7806843
32748F6835226j4073810p318956n543192p412588n955379j981721j257407l226971
32740B0065202k990016q75772r46715k708117k384120l60585j40720j534771j410284
$$ plain form
32797 1097670 1866074 2183558 1581984 1359285 2033790 2304550 1684362 1575582 2469518
32788 2469518 2813186 2056221 1921150 3085118 3692933 2927997 2748999 4071509 4791435
32779 4791435 3932044 3902649 5884982 7139406 6206662 6267683 9187125 11029894 8992473
32770 8992473 8364660 15785967 28772327 39035270 43849925 47221028 52179853 59338656
32762 59338656 70829378 87954968 107915553 131932543 171858121 233443142 292960119
32755 292960119 308852543 265566762 193291035 134751283 103369847 84642069 66835226
32748 66835226 52761416 45442460 39899268 32486680 26531301 24549580 23292173 20065202
32740 20065202 17075186 16199414 15252699 12544582 10160462 9799877 9659157 8124386 6714102
32731F714102J15212K13850j015931r74917K43474K04225j008349j045921J14044
32722C559789K79014o59874p04603K66005L97328m49599n62015K00722K70980
32713B597747m43959m74585K06457J68955n65170n42670K54161L89355k33941
32704A356350k94840K81296K46675m02890l88842L04816L77935k47660l11996
32695I20844K82106K92662l93151n04850J70489L99052j55335m02855K2649J93858
32685H25469j69543k05812K64957L41960j55643l20932O2999J55215k21176k48862
32675C28632J86989K19554k65726l49570J35906K60518k02715l36191J51825L86948
32665E16170J4332j95443R1420J79126j81661k59223J79948L40042r3831l40586
$$ plain form
32731 6714102 6829314 7043164 6027233 5052316 5295790 5500015 4491666 3445745 3559789
32722 3559789 3838803 3178929 2474326 2740331 3137659 2688060 2126045 2326767 2597747
32713 2597747 2153788 1679203 1885660 2054615 1489445 946775 1200936 1590291 1356350
32704 1356350 1061510 1342806 1589481 1186591 797749 1102565 1480500 1232840 920844
32695 920844 1202950 1495612 1102461 597611 768100 1167152 1011817 608962 631611 825469
32685 825469 655926 450114 715071 1057031 901388 580456 643455 798670 577494 328632
32675 328632 515621 735175 469449 119879 255785 516303 313588 -22603 129222 516170
32665 516170 530502 335059 426479 605605 423944 164721 344669 684711 590880 250294
32655B50294N945K64076P924j95446J7139J34384j19586k15385P9034J97096r2830
32644C32645k07214R1365K09327r8858k29602P7837K13012j04610k55101Q0568
32634A09369K87448r477k43072r710J85694n2450k57483l4338J99791O1874j02561
32623A35085J2825Q0859j03908j37959J61272K96327M879k24616p6252L4481j52126
32612C0867k03829J00066K45849m7240k43034J9384K49137N2332j38085M9371
32602A14818J88303q0081k93380l0774K68689J17571j40665l3727J71748P6232
32592C58734n9790R7071K23337k5861k68918o7674K33670J18297j94332k15786
32582A98748n8236q5553j71335l7917J10623n491j39998P034J66461J1464j72978
$$ plain form
32655 250294 256239 520315 528239 332793 349932 484316 364730 149345 228379 425475 332645
32644 332645 125431 216796 426123 327265 97663 175500 388512 283902 28801 109369
32634 109369 396817 387340 144268 134558 320252 267802 10319 -24019 175772 237646 135085
32623 135085 147910 228769 124861 -13098 148174 444501 449380 224764 148512 182993 30867
32612 30867 -172962 -72896 172953 125713 -117321 -97937 151200 203532 65447 114818
32602 114818 303121 223040 -70340 -101114 167575 285146 144481 110754 282502 358734
32592 358734 298944 396015 619352 593491 324573 256899 490569 608866 414534 198748
32582 198748 140512 54959 -116376 -154293 -43670 -49161 -189159 -182125 -15664 -4200 -177178
32571a77178j0715K32314J31665j12359p9163R0658K4700j43814o6640J27701
32561A7169J03892l2583P514J06784J5702j06156j3436R9255k4133j58407k2279
32550f678J34848j2980k09922o1745K24900K11739K0l6962K9604q4885k30428
32539d2489r4139J45272J08988q4026o8568O7967K285j52052o5140J34298Q0171
32528C2567j29420j17627O4858P6061m6257k954J38318Q2786p5813k5626J24978
32517A21871L1308k03413j88655K8821O7788o2452j7843J72895J42970r7043j50219
32506a53972M6166J32210j983o5605M9449J07043K1522j4924L7333N055q5390
32495G6904k0287J47352J34067o1836j53032p6188m2708q0793j0891J19248O8722
$$ plain form
32571 -177178 -187893 44421 176086 63727 -15436 75222 99922 -43892 -110532 17169
32561 17169 121061 88478 95992 202776 218478 112322 98886 198141 174008 15601 -6678
32550 -6678 128170 115190 -94732 -156477 68423 280162 280182 243220 272824 187939 -42489
32539 -42489 -136628 8644 117632 33606 -34962 33005 35290 -116762 -181902 -47604 32567
32528 32567 -96853 -214480 -149622 -73561 -119818 -122772 15546 98332 22519 -3107 121871
32517 121871 153179 -50234 -238889 -210068 -142280 -204732 -222575 -49680 93290 -3753 -153972
32506 -153972 -107806 24404 22421 -43184 6265 113308 134830 119906 157239 162294 76904
32495 76904 56617 203969 338036 276200 123168 46980 4272 -76521 -87412 31836 100558
32484A00558j08063r6198J23275K28109J04599k3269n2029j20547k25214j72748
32474b41527J6394Q9404N448j5464P1423P1235l8112n3409M3201L8192r0774j12123
32462b16112L4702J36284Q7817J7039j3701p5518j25210m3559P9362N2314n3814
32451a20396k5133P0561k205j64286j19030R6334J47799k197m5498Q7604J11033
32440C4586o2134j49192j2503J19227Q8887L9765O4809L9080n7117m4739Q7465
32429A48134J09605k5112o9653O6685J42568J2348j37303j39567r3427j00046
32419h5768p5792K1044P6241N9291Q5604J41706N8506j45921k20007q1020N3705
32408a12411M3726J5708O3525P2607k3119q9785k7575Q1621J46315J61398R7439
$$ plain form
32484 100558 -7505 -103703 19572 247681 352280 329011 276982 156435 -68779 -241527
32474 -241527 -225133 -135729 -130281 -145745 -74322 -3087 -41199 -94608 -51407 -13215 -103989 -216112
32462 -216112 -181410 -45126 42691 59730 46029 -29489 -154699 -198258 -118896 -66582 -120396
32451 -120396 -145529 -74968 -77173 -241459 -360489 -264155 -116356 -118553 -164051 -76447 34586
32440 34586 -27548 -176740 -189243 -70016 18871 58636 123445 162525 105408 60669 148134
32429 148134 257739 232627 162974 229659 372227 384575 247272 107705 14278 -85768
32419 -85768 -161560 -140516 -64275 -4984 80620 222326 280832 134911 -85096 -166116 -112411
32408 -112411 -68685 -52977 10548 83155 60036 -29749 -57324 24297 170612 332010 429449
32397D29449o6057j95676j50068l8791n3185j12530j8070J30354Q0774p9520m2278
32386a15598J50000J53743n1240j19019L0571Q5792n2642r5940N3740R6625r0704
32375D5328j97861l8401J23071O5129k5414L7317Q8715l0409j47487q0087M7539
32364a12560O8634M5606N8968L4880l0995j212R6546M5996j35345j50179N5697
32353b3964J64610M8508j7300R6075J16677p5675j62175K9962J61229k6844k27737
32342H3366r8943J54558J70489K3589j7558J1282m5727r2704j7612J187j63315
32331H612k44713r831K70402K20714m3818j69466j42605j54442j40524N2076K42991
32320a10604J56367p8113j25173J248L3491l8217o871J05172Q6943m4684p7496
$$ plain form
32397 429449 363392 167716 17648 -21143 -74328 -186858 -204928 -74574 6200 -73320 -115598
32386 -115598 34402 188145 136905 17886 48457 134249 81607 -14333 39407 136032 45328
32375 45328 -152533 -190934 -67863 -2734 -28148 9169 97884 67475 -80012 -160099 -112560
32364 -112560 -43926 1680 60648 95528 64533 63321 159867 205863 70518 -79661 -23964
32353 -23964 140646 189154 171854 267929 384606 308931 146756 176718 337947 311103 83366
32342 83366 -15577 138981 309470 333059 315501 326783 281056 188352 170740 171927 8612
32331 8612 -236101 -245932 24470 245184 201366 31900 -110705 -265147 -405671 -353595 -110604
32320 -110604 45763 -32350 -157523 -156275 -122784 -161001 -167872 -62700 24243 -20441 -97937
32309i7937P796N2242M6455Q9492J11063j0455j46913r1278O6104Q3043j5488
32298I4124k3457M3135L000j14075j20153l1816k0965o7630j4517R6905R6790
32287e8659K7775O0566J34257M9429j29383j41248K3694J10423K8921n1127m1866
32276A2782l8819o2961j4330R1812J22086O6228K6750j809q1471j19542r19J32716
32264A32523N4967j47197j82796k5033P7297L2448r877l982o7230j62559q9709
32253c91148J35831K37161J02918m9709l9756L5339L2043k0189m6261n8241o5771
32242a27783l3712J2082L664k6095N916N4709J7711m9574j5915O4485K9832p7247
32230a41927n8305Q2073J21521l725r5277k6307Q4162J04782O6557L3190L771
$$ plain form
32309 -97937 -90141 -37899 8556 98048 209111 198656 51743 -39535 26569 109612 94124
32298 94124 70667 113802 116802 2727 -117426 -149242 -170207 -237837 -252354 -155449 -58659
32287 -58659 -30884 29682 163939 213368 83985 -57263 -33569 76854 105775 54648 12782
32276 12782 -26037 -88998 -103328 -11516 110570 176798 203548 201739 120268 726 -193 132523
32264 132523 187490 40293 -142503 -167536 -90239 -57791 -67668 -71650 -138880 -301439 -391148
32253 -391148 -255317 -18156 84762 35053 -4703 30636 62679 42490 -3771 -62012 -127783
32242 -127783 -161495 -149413 -145749 -171844 -165928 -111219 -93508 -143082 -158997 -94512 -64680 -141927
32230 -141927 -200232 -118159 3362 -363 -95640 -121947 -37785 66997 133554 166744 170515
32219A70515p62N5145R8437K1829j10947j35293n5462k7171p9902q9872k8944
32208a82427n84j9027J0915Q3171R0173L6482K3842L3180l7423j33620j01048
32197a96366L1077Q6732M9957N9553J12466O8392n2458q2469k4219m1622j23750
32186a12707q8401N5765R7353J3106J1352J24765J34383r426p3870K2215M5540
32175B20075j12571k07049o2765J11585P7988n7489q2027k9471l4183n0039K1647
32164b04299R6896M6529o6704r8413n0240r542J9272O2654P0844O548o0711o0561
32152b47727j8769K7271Q3093J11640M8566m7070l5901O1542P2298l1040p4198
32141e0295O816N1818k6112q6609l0297K7749o672l6702J2946M3832n641k4694
$$ plain form
32219 170515 169753 224898 323335 345164 234217 98924 43462 16291 -63611 -153483 -182427
32208 -182427 -183011 -202038 -191123 -107952 -17779 18703 42545 75725 38302 -95318 -196366
32197 -196366 -165289 -78557 -28600 30953 143419 211811 159353 76884 52665 11043 -112707
32186 -112707 -201108 -145343 -47990 -34884 -23532 101233 235616 226190 152320 174535 220075
32175 220075 107504 -99545 -162310 -50725 27263 -30226 -112253 -141724 -175907 -225946 -204299
32164 -204299 -107403 -60874 -127578 -225991 -276231 -285773 -266501 -203847 -133003 -126455 -187166 -247727
32152 -247727 -266496 -239225 -156132 -44492 4074 -42996 -78897 -17355 54943 23903 -50295
32141 -50295 -43479 8339 -17773 -104382 -134679 -106930 -113602 -150304 -137358 -93526 -99167 -123861
32129a23861M4748P8390J7670M107R6428J06591p7449k42537j56775P3191J81309
32118A812J10261q733q4498q3578J9844J39608R9398q1839j36958M3335J95873
32107B14525R2678r1398q9069J9420j084j02251o4057Q3439J08486j7926r4528
32096E8235l9902K1550J6201N611J2007j5398n7360m2406M079M444r231M6533
32084D363J27304J19652M0275n56O025j5051n1524k9420K2539R440n2860o2835
32072A17352j4772J782l1490m1133J243M5113N1859K3410k6725n3948j065Q7447
32060A59073P1048p4437j76353j14190o867m084m0268J5843J01666P2746k6281
32049b2104l4749M6549P5235K0407j7119q219j9484n2960m6026j5898l5270q2774
$$ plain form
32129 -123861 -79113 -723 16947 21054 117482 224073 146624 -95913 -252688 -179497 1812
32118 1812 112073 103340 18842 -64736 -44892 94716 194114 112275 -24683 18652 214525
32107 214525 307203 215805 126736 146156 145072 42821 -21236 62203 170689 152763 58235
32096 58235 18333 39883 56084 61695 73702 58304 944 -41462 -37383 -32939 -42170 4363
32084 4363 131667 251319 291594 291038 297063 282012 230488 201068 223607 233047 180187 117352
32072 117352 102580 104362 72872 31739 32982 78095 129954 153364 126639 72691 71626 159073
32060 159073 230121 155684 -20669 -134859 -141726 -145810 -186078 -170235 -68569 4177 -22104
32049 -22104 -56853 -10304 64931 85338 68219 60000 40516 -12444 -58470 -74368 -109638 -192412
32037a92412p6474k9852j9422l0135J0705Q1020J01750Q8234J06389J20213M7855
32026B07871o7677j09445p3694m3872j9391N4678J22446O9850o9433j38213q4960
32015a51840n789L7287P4876J03424O3556l1180q2817n1651J559K4387K2328N883
32003A0023j6988j4301J8019J9462l2197n0318K0677P8326J1367j02923j07455
31992a66308p436O0278M7702J9619Q31l2765m4332J8057R1273O8442k4257o8817
31980c7713m1444j1991K505L1438L9105k1691q2360m5066M0929N2381K881Q907
31968f2119P7193J03435O4062L5747L4561K093n4468o5953l8077l6598m9703j1835
31956a662N3135N9949J5888M019L1512L0375j3762n9274r7285j23121p9032M6349
$$ plain form
32037 -192412 -268886 -298738 -318160 -348295 -337590 -256570 -154820 -66586 39803 160016 207871
32026 207871 140194 30749 -42945 -86817 -106208 -51530 70916 140766 71333 -66880 -151840
32015 -151840 -157629 -120342 -45466 57958 121514 90334 7517 -44134 -42575 -18188 4140 10023
32003 10023 -6965 -21266 -3247 16215 -15982 -66300 -45623 32703 44070 -58853 -166308
31992 -166308 -173744 -113466 -65764 -46145 -45314 -78079 -122411 -104354 -13081 55361 31104 -37713
31980 -37713 -79157 -91148 -88643 -57205 -18100 -39791 -122151 -167217 -126288 -73907 -71026 -62119
31968 -62119 15074 118509 182571 218318 252879 254972 200504 134551 96474 59876 10173 -1662
31956 -1662 51473 111422 127310 131329 162841 193216 179454 120180 22895 -100226 -179258 -132909
31944a32909J36629J03225L2836L3082M3854k3531q5183l3224L5612k0036j07637
31933a7282m8596Q8889R3904k0217n5883R200J5185n1160l9530N0049N1293m8368
31921B7484p7964l489K6138j1389K7982J32572J00349q8510j84945p0587N9183
31910f3176M0747k2463j9333m2293j55849k02779m9276J66400K23882J15338m865
31899a3667l7917J4207J01100J31350M7263n7963m1149N2170L7375r8048j57106
31888b2385n3974O4366Q2391O1957M8250k3556j35681j44628l1151M1041P377
31877a05993l169N6352N3525l7348m0820Q9939J39405o289j41745q0615M9533
31866b7225N5679j7238l8159k3289j9982K7769J14072R4493n0453j17898k3967
$$ plain form
31944 -132909 3720 106945 139781 172863 216717 193186 108003 74779 110391 90355 -17282
31933 -17282 -65878 23011 116915 96698 40815 50015 65200 14040 -25490 24559 75852 27484
31921 27484 -50480 -53969 -27831 -39220 -11238 121334 221683 133173 -51772 -122359 -63176
31910 -63176 -22429 -44892 -64225 -106518 -262367 -465146 -514422 -348022 -124140 -8802 -13667
31899 -13667 -51584 -37377 63723 195073 242336 184373 143224 195394 232769 134721 -22385
31888 -22385 -76359 -11993 70398 132355 180605 157049 21368 -123260 -154411 -113370 -105993
31877 -105993 -109162 -52810 715 -36633 -77453 12486 151891 145602 3857 -76758 -27225
31866 -27225 28454 11216 -26943 -50232 -70214 -42445 71627 166120 115667 -2231 -26198
31855b6198L2098n9419r0841P1837J89423M9993j30531o8335R2776M7882j25547
31844a6862j24460L6486P9587l3973q0914k000M5878L3446P5705J22536R128j78546
31832c3989j63097N9206J71497K7131j47788j42079m1219N484K8011R4152J38218
31821d473Q1512k6537r7429j12589q0482q521M4875J7841l8387k4131L4238L1122
31809a82961j2016K4761J22827J22465r457j08662o6605K6157N5244L7498L0265
31798C9516K9993K9175M8563N9078m695j06648j13465P864J16312Q4258l9854
31787A50097j15919q1841Q344N8077J5111p1833r3064k1091L3519j7073q9237
31776b24910n2737N6209Q8984J6449m1900r808O1395J00876R3192M8595j968m587
$$ plain form
31855 -26198 5900 -53519 -144360 -72523 116900 166893 36362 -31973 60803 108685 -16862
31844 -16862 -141322 -104836 -25249 -59222 -140136 -142136 -96258 -62812 12893 135429 144557 -33989
31832 -33989 -197086 -137880 33617 60748 -87040 -229119 -270338 -264854 -236843 -142691 -4473
31821 -4473 77039 50502 -46927 -159516 -239998 -248519 -203644 -185803 -224190 -248321 -214083 -182961
31809 -182961 -194977 -170216 -47389 75076 65619 -43043 -109648 -83491 -28247 9251 39516
31798 39516 69509 98684 147247 206325 201630 94982 -18483 -10619 105693 189951 150097
31787 150097 34178 -47663 -39319 18758 33869 -37964 -131028 -152119 -118600 -135673 -224910
31776 -224910 -277647 -221438 -132454 -116005 -157905 -167713 -106318 -5442 87750 136345 134377 129790
31764A29790L2877P410j18733j99778r3118J05558J82818J08400L4153L4344M1123
31753B64844J8225M613j2840q6729j65823j39093k5283N0024N9866Q3061J18282
31742A69147Q3441p92k6941q575o5879j83365j96098o0975O3190O2790N326k6807
31730a85538m7606n2161J8326J23727J21016p531r8044n7857J946k2288n8263
31719b64273j3074N7435N9331J8594J2517L9153M9780L1085j0497o4759q1089
31708a65797j5357O4793M3541n5405q7298j5320M0432J6669o872J4312J0154l4375
31696a90523j6636Q6023J36069N8756k5831r526L0034q401o6916n0660j109l478
31684f2198l3436l0731k1909m2929m1292K1054O7612L3047j1298J6597N8263K6294
$$ plain form
31764 129790 162667 170077 51344 -148434 -241552 -135994 46824 155224 189377 223721 264844
31753 264844 283069 287682 274842 188113 22290 -116803 -142086 -92062 -32196 50865 169147
31742 169147 252588 251796 224855 216280 150401 -32964 -229062 -290037 -226847 -164057 -158731 -185538
31730 -185538 -233144 -285305 -266979 -143252 -22236 -29767 -127811 -185668 -183722 -206010 -264273
31719 -264273 -277347 -219912 -160581 -141987 -129470 -90317 -40537 -9452 -19949 -84708 -165797
31708 -165797 -181154 -116361 -72820 -128225 -215523 -230843 -190411 -173742 -180614 -166302 -156148 -190523
31696 -190523 -207159 -121136 14933 73689 47858 38332 68366 59965 -6951 -57611 -58720 -62198
31684 -62198 -95634 -126365 -148274 -191203 -232495 -211441 -143829 -110782 -122080 -105483 -47220 -20926
31672b0926k4228J4250J07005J21482K8803o8192q7163m3284P733K2661j3527
31661D4614o6192p1985j7501M5977Q2769R7121O8471l2476j41377j41149m5521
31650a77249l628o6492j00016q955J07321J25536P7329L8357j9686j25666j82846
31639c35995j03651K4401N9880J7018R790N4410P1394L7523P076J2269L9406O6637
31627c9842N5964k7586j25280j06011M5642J68985J43353M9491J3565J5544k0425
31616A73400o2673m4521k584n82m519L1744N2414Q427k3047K6398P0307J4575
31604B39339o2185n1743k4056q7406j47347m5323J33608J48897k6512j72588j59240
31593b54556q2565m1167l87O7835J02722P5379L8258J3622k4733m3161J8849R4356
$$ plain form
31672 -20926 -45154 -30904 76101 197583 226386 158194 71031 27747 35480 58141 44614
31661 44614 -21578 -93563 -111064 -65087 17682 114803 183274 150798 9421 -131728 -177249
31650 -177249 -180877 -247369 -347385 -356340 -249019 -123483 -46154 -7797 -27483 -153149 -335995
31639 -335995 -439646 -415245 -355365 -338347 -328557 -274147 -202753 -165230 -158154 -145885 -106479 -39842
31627 -39842 16122 -11464 -136744 -242755 -197113 -28128 115225 164716 178281 193825 173400
31616 173400 110727 66206 63622 63040 58521 90265 142679 151106 128059 154457 224764 239339
31604 239339 177154 125411 101355 13949 -133398 -178721 -45113 103784 77272 -95316 -254556
31593 -254556 -337121 -378288 -378675 -310840 -208118 -132739 -94481 -80859 -105592 -148753 -129904 -35548
31581c5548M4940j01132j51300l6913Q2600P0671l202j4885L3303P4976R1458
31570E4968P5134J268q7099q6105N069N3831J555l9020J2826N2985k5651j27858
31558a08097r7035K7530P1921K033l8202L5067J23190J02649p226r1487q4236
31547f3893j4346N0892O5341K8674k0061m0469l0446j7169j0477J1155N9205J03075
31535A21481J03129O6059L7035L2291J5219l7545q4505q0990o0901q4514j20796
31524i4037p7922L7380J01584O0004J6728N9194J01647K5609j04156j16672O634
31513A5993J05254P6315m906l3950j9100j5954k2711j5051j3556m0606n7148j4359
31501c9779N7017P3606J0596o4759p9270l5881J0635L4053N4741P8474O5317n927
$$ plain form
31581 -35548 9392 -91740 -243040 -279953 -197353 -126682 -129884 -144769 -111466 -36490 54968
31570 54968 130102 131370 44271 -41834 -36765 17066 18621 -20399 -7573 45412 19761 -108097
31558 -108097 -205132 -177602 -105681 -103648 -141850 -106783 16407 119056 111830 20343 -63893
31547 -63893 -78239 -27347 37994 66668 46607 6138 -24308 -41477 -51954 -40799 18406 121481
31535 121481 224610 290669 327704 359995 375214 337669 253164 172174 111273 26759 -94037
31524 -94037 -171959 -134579 -32995 27009 43737 102931 204578 230187 126031 9359 15993
31513 15993 121247 197562 192656 158706 139606 123652 100941 85890 72334 31728 -25420 -39779
31501 -39779 17238 90844 101440 36681 -42589 -78470 -67835 -33782 20959 99433 164750 158823
31489A58823p8196p8402k2163Q684j4184m2527m8580n6485n9877n727R9635J59851
31477B0852J15437J9680n9524j21830j63046j25613k196J01907R9597L8488P158
31466f9090J0982K3193N9819J06067P3815n1777j30153o3113L2996P391p9609
31455g9479p6158r181j5038o4012j927J48024J78941L3112r3419n6012L3945J4451
31443A3247q4750j25693o7035K5399Q6498Q3374J0420p9902j03293m6127J9824
31432b68038M7883O2952P8795O2793J4277j2442J855J0423j1409k8701k2153j9290
31420h3055k8119j9893L721N257j4758j7238o04L529J739J6950J6875l0750o2025
31407b08371m228P2358M5704l7473j8307R5204J15319j6562j20490o1662N1095
$$ plain form
31489 158823 80627 2225 -19938 -11254 -25438 -67965 -116545 -173030 -232907 -238634 -138999 20852
31477 20852 136289 155969 96445 -25385 -188431 -314044 -316240 -214333 -114736 -76248 -69090
31466 -69090 -58108 -34915 24904 130971 204786 153009 22856 -40257 -7261 130 -79479
31455 -79479 -155637 -164818 -179856 -243868 -245795 -97771 81170 114282 20863 -35149 -1204 13247
31443 13247 -71503 -197196 -264231 -238832 -152334 -68960 -58540 -138442 -241735 -287862 -268038
31432 -268038 -220155 -157203 -78408 -15615 -1338 -13780 -11925 -1502 -12911 -41612 -63765 -83055
31420 -83055 -111174 -131067 -127346 -122089 -136847 -154085 -154689 -151160 -149421 -132471 -115596 -146346 -208371
31407 -208371 -212599 -140241 -94537 -132010 -150317 -55113 60206 43644 -76846 -138508 -87413
31396h7413O3007k17l2672l2455m9983o5078m2240j5261r037K8088J12096J43588
31384A2423N1110p4386r7978j7674P2669J17161J02654J5918j05631j60133j11486
31373a95353n2059m9510l2035O6724J52693J00128l9759j04297m8289K6665M3683
31362a31409K7645J9818J9402J6465J2348N367l256n828j1045k8390k1202M9556
31350e0529J22535Q4175m8202j16698n0938K9770J9115j4945K0743P0640M1200
31339A06866k7004m0785j5000j3353j6683J1088J2357o4120j33768r4684J374
31328b73712M4240M9290Q7288J14505N2169l5868l5602P105k9625r9942n2156
31317a72308Q8023J27224J2145r0050n8376L2242P7206P7592N6109N252l0035
$$ plain form
31396 -87413 -24406 -24623 -57295 -89750 -139733 -204811 -247051 -262312 -271349 -243261 -131165 12423
31384 12423 63533 -10853 -108831 -126505 -53836 63325 165979 181897 76266 -83867 -195353
31373 -195353 -247412 -296922 -328957 -262233 -109540 -9412 -49171 -153468 -201757 -175092 -131409
31362 -131409 -103764 -83946 -64544 -48079 -35731 -30364 -33620 -39448 -50493 -78883 -100085 -50529
31350 -50529 72006 156181 107979 -8719 -59657 -29887 -10772 -25717 -4974 65666 106866
31339 106866 79862 39077 24077 10724 -5959 5129 17486 -46634 -180402 -275086 -273712
31328 -273712 -229472 -180182 -92894 21611 73780 37912 2310 9415 -20210 -120152 -172308
31317 -172308 -84285 42939 55084 -34966 -93342 -61100 16106 93698 149807 155059 125024
31306A25024K0854J00680O5161p8972j58137j08497o9134j16632j17152K5894
31296c10911J67623J36441N698l3030L9892R0038N8608R20m8851q9539p4402K1870
31284c5643R3418K2072j14347j19814K9439J40356Q5168l0386n1893N412K5359
31273D9141j5862m1783j6767J0514q66k7311l0028r774Q078J4772K4196M4913
31261I223N8273L4799k0703n5130k5576L3757M2766j7619p4629o4781k1159j5872
31249a16651n0331o2769k9728M027P2k6888m8641n7060m2415Q577P0730Q8883
31237b62194N6560L3863N3918O8392L1777j5948j2854K2477K1686k7604p2431
31226a02358p3231l6108J5710N3934N0534J3467j2005j1125j8500l4436k187P5049
$$ plain form
31306 125024 145878 246558 311719 232747 74610 -33887 -103021 -219653 -336805 -310911
31296 -310911 -143288 -6847 -1149 -34179 5713 95751 154359 155279 106428 16889 -57513 -35643
31284 -35643 57775 79847 -34500 -154314 -124875 15481 100649 70263 18370 23782 49141
31273 49141 33279 -8504 -25271 -14757 -15623 -42934 -72962 -82736 -74658 -59886 -35690 9223
31261 9223 67496 102295 81592 26462 886 34643 77409 59790 -14839 -79620 -100779 -116651
31249 -116651 -166982 -229751 -259479 -255452 -255380 -282268 -330909 -387969 -430384 -421807 -351077 -262194
31237 -262194 -205634 -171771 -117853 -49461 -17684 -33632 -46486 -24009 -2323 -29927 -102358
31226 -102358 -175589 -211697 -195987 -142053 -91519 -78052 -90057 -101182 -119682 -154118 -156305 -81256
31214h1256R5208K3162j7323N8249J23115L7359q9228n5856Q0721Q0264q1630
31203A72785j74446j04049m8387j12707j35954P728J64700J50030L7696j97K2100
31192b0701j0123p4678p0076j2382J4531K1112N4420O6542P896l8119J5539Q4220
31180C8181M2349n4898o4643M964L7150J9003J9892J9620m3622j05105n4538N4824
31168h6823P6542J3940p954K2164P597l9543j1403O9399O1593m1651r0847l8622
31156f5608l133l3759k9890M6935Q7042L4383j6103l951n387o2050p9529K229
31144a28821Q8496Q1002J8973j8393k5354j0376M5900J01768O2319m8588p2345
31133I4581M0439J24548M9357p6164q4889p645J2854l2430l2464L4082O3708k411
$$ plain form
31214 -81256 13952 37114 19791 78040 201155 238514 149286 93430 174151 254415 172785
31203 172785 -1661 -105710 -154097 -266804 -402758 -395030 -230330 -80300 -42604 -42801 -20701
31192 -20701 -30824 -105502 -175578 -187960 -173429 -152317 -97897 -31355 -23459 -61578 -46039 38181
31180 38181 80530 25632 -39011 -34047 3103 22106 41998 61618 17996 -87109 -141647 -86823
31168 -86823 -10281 3659 -4295 17869 25466 -14077 -25480 43919 105512 63861 -26986 -65608
31156 -65608 -68741 -102500 -132390 -85455 1587 35970 19867 15916 10529 -51521 -131050 -128821
31144 -128821 -40325 40677 59650 41257 15903 5527 51427 153195 215514 166926 94581
31133 94581 135020 259568 308925 232761 147872 140227 153081 120651 88187 122269 185977 183566
31121A83566r6568j25481p0925J9915Q7026R5055N4394O052k5192m5814o3158
31110A8870p3978q0843q1114n1406R907M7263J7387l0271j4658N9182J16418J12837
31098D9594M5087q1284k00122j79729P10J51887J11887l903J0233J02739O5925
31087G3024p2015p3799P9354J27326k3857j33546m1413O7840N137j05253p8793
31076a75995P840L291k4204M8100J18546L5783r0734n2269R3458J17755J0467
31065I2038k8510M3672N2184o9583j63247j12930o196M2261M4087M7204M5738
31054a3282L8012M5798L9896k8205j01789o6453N3845R8550J0071p8886o1405
31043f3848j5836n3198j21658q8243M6398J37161R0612j8255m9986K8739J15903
$$ plain form
31121 183566 86998 -38483 -109408 -89493 -2467 92588 146982 153034 127842 82028 18870
31110 18870 -55108 -135951 -217065 -268471 -258564 -211301 -193914 -224185 -238843 -179661 -63243 49594
31098 49594 94681 13397 -186725 -366454 -365744 -213857 -101970 -105873 -95640 7099 73024
31087 73024 1009 -72790 6564 133890 110033 -23513 -64926 2914 8051 -97202 -175995
31076 -175995 -168155 -164864 -189068 -140968 -22422 13361 -77373 -129642 -36184 81571 92038
31065 92038 63528 107200 159384 89801 -73446 -186376 -192572 -150311 -106224 -59020 -13282
31054 -13282 24730 70528 110424 82219 -19570 -86023 -32178 66372 76443 -2443 -63848
31043 -63848 -79684 -132882 -254540 -342783 -296385 -159224 -68612 -86867 -136853 -108114 7789
31032G789J03359o04r4885j04688m0786M0484Q3973N3929l0024q0129l6642K9430
31020f8794J081r9597j27425l2097P0769Q5371N5667M2272K0637j9233r429O3937
31008a6841R5200K7660l9937k2974O071l4669q1541n6854k3025n1164o3119K4941
30996b36252J21375J06378M7706O8070J01807J0573j37680j48421j5996P7355
30986e085N7862K8058M2905M0051P745J4432M7294J5033o5909p8600k1102j7871
30974F4813q3849q1914K7442R3796J9370q3091p7821k789L1869K2559L3959O4125
30962B8469N4897k900n0653l7894J4444K8162l7318j01779m5557R7319J40130
30951H7320J0808j17380q3563J7331J9269k9044J4682R8937P3519j6562j5711
$$ plain form
31032 7789 111148 110544 15659 -89029 -129815 -89331 -5358 48571 18547 -61582 -98224 -68794
31020 -68794 -67713 -167310 -294735 -326832 -256063 -170692 -115025 -72753 -52116 -71349 -80778 -16841
31008 -16841 78359 106019 66082 43108 49179 14510 -67031 -123885 -146910 -198074 -261193 -236252
30996 -236252 -114877 -8499 39207 107277 209084 219657 81977 -66444 -82440 -5085
30986 -5085 52777 80835 123740 163791 171536 185968 233262 248295 182386 103786 82684 64813
30974 64813 -19036 -100950 -73508 20288 39658 -43433 -121254 -124043 -92174 -69615 -35656 28469
30962 28469 83366 80466 29813 -8081 6363 34525 -2793 -104572 -150129 -52810 87320
30951 87320 98128 -19252 -102815 -85484 -66215 -95259 -80577 18360 91879 75317 59606
30940E9606L2252l0176j27689m4634J43759J24177j13858k00150J9800K15033
30930G8120J07694r1672p0718P9639Q4924k9272l7894N7495O2245l9086p6018
30919A25457k0795k2616j10961j32932k4280Q1003O8141q788n2029n5017n7516
30908b10333o7469o7609l5497M6175J45111J78004J19518O1339Q1048J13077N2259
30897D15623o9206j25719q3076k4510j3444l4145n5378o3311m2935R75K5111Q942
30885f1073l374K1342M3437K6991J0131K6144L0285j0367l5118M427L8596q541
30873H2880p9596p8573l1110j6238q795N7997J28817R1393k5242q0596l6564J3762
30861A8135K0415K0183P730o6758j49360j02986P2015J92301J37702R031m0253
$$ plain form
30940 59606 91858 61682 -66007 -110641 33118 157295 43437 -156713 -136913 78120
30930 78120 185814 94142 23424 103063 187987 158715 120821 178316 240561 201475 125457
30919 125457 104662 82046 -28915 -161847 -186127 -105124 -36983 -45771 -97800 -152817 -210333
30908 -210333 -277802 -345411 -380908 -334733 -189622 -11618 107900 169239 250287 363364 415623
30897 415623 346417 220698 137622 113112 99668 65523 10145 -53166 -96101 -95126 -70015 -61073
30885 -61073 -64447 -43105 332 27323 37454 63598 93883 83516 48398 52825 91421 82880
30873 82880 3284 -75289 -106399 -122637 -131432 -73435 55382 146775 121533 40937 4373 18135
30861 18135 38550 58733 66463 -295 -149655 -252641 -180626 11675 149377 158408 118155
30850A18155q877J2566O446J7453L7140J0885n8522r8175n8257L0538R2107P3080
30838A74539r127o9507l4189O4945J08971L3041q5286j17405l8598N4392P1054
30827A52830K2429k3519l7205l9253l9000j6014K5477L4031j9556q4243q8667
30816a12690l8235M56k95k666K5527O9244R9157R5976M4783m0112r2184n9065
30804a0104J5022M4532K7834K8040M0354l040q3433q5211J8306R7218N4433l3600
30792A10351n2907k3098k6598n3695l9465N98p296o1128p3205O109J23207J79467
30780H2340J17225l1974j56109j53704m1825O4910R3178P0248M0293Q366j2469
30769H0479M687K7985j1070q9788j00320k2113L6580J7734m363J8377K0826k0186
$$ plain form
30850 118155 109278 121844 128290 145743 182883 193768 135246 37071 -21186 9352 101459 174539
30838 174539 165412 95905 61716 126661 235632 268673 183387 65982 27384 81776 152830
30827 152830 175259 151740 114535 75282 36282 20268 45745 79776 60220 -24023 -112690
30816 -112690 -150925 -150469 -150764 -153430 -127903 -58659 40498 136474 181257 141145 48961 -10104
30804 -10104 4918 49450 77284 105324 145678 142638 59205 -26006 -7700 89518 143951 110351
30792 110351 57444 34346 7748 -45947 -85412 -84814 -92110 -153238 -226443 -220334 -97127 82340
30780 82340 199565 167591 11482 -142222 -184047 -119137 -25959 44289 84582 92948 80479
30769 80479 85166 113151 102081 12293 -88027 -110140 -73560 -55826 -60189 -41812 -20986 -41172
30757d1172o552R2637J34591K5250j01994r2234j6299k9188r9393q0110L5806
30746a78658J28089J49002J28853N2346q2699j52222n3325R0055P6162o3194j15367
30735b0958k2477O1624M7523J6595K2061k585p7538j03297k8179N5148M8778k6078
30723b9383q8028q4946r184Q5213R3315j1595r6119l4829R1948J16564M2117J827
30711G6900J2273j9192o9259j8542R7903J03460k0571q8284k0821L3690k2365
30700F5192o9618q34Q7678P0158j1978n8128o5397n9196r174P1696Q1851m767
30688I7483o5473k5621J5571l0201q0558m1591J7068k9k8638L4435J28865J24514
30676A45825L9876o070k889l6500j00855r2240N673P9700N7885L579k876J5630
$$ plain form
30757 -41172 -47724 44913 179504 204754 102760 10526 -5773 -34961 -134354 -214464 -178658
30746 -178658 -50569 98433 227286 279632 196933 44711 -8614 81441 157603 94409 -20958
30735 -20958 -43435 18189 65712 82307 104368 101783 24245 -79052 -107231 -52083 -3305 -29383
30723 -29383 -117411 -202357 -211541 -126328 -33013 -44608 -140727 -175556 -83608 32956 75073 76900
30711 76900 89173 69981 722 -17820 80083 183543 162972 74688 53867 87557 65192
30700 65192 -4426 -5260 82418 152576 140598 82470 17073 -42123 -51297 20399 102250 97483
30688 97483 32010 6389 21960 -8241 -88799 -130390 -113322 -113351 -141989 -107554 21311 145825
30676 145825 185701 179631 176742 140242 39387 -52853 -47180 32520 90405 93984 91108 106738
30664A06738j0761p5557r3870k1719O7841O6025k5218q7573m9630J6785J9311
30653h7628j5428j6157m067l1168m6966K1361J04251P6928k1486m3240J4270J7237
30641c2093m4944l7754N4296P9996n719n8057p039L2401O759L1028J28810J19942
30629B67626p0443k28895j70013j9643K3606M492N7361J20512O2988m5268m9276
30618d6953J4550M877n6850m7824R752M905k9613J7907R7400O3004n7052r2020
30606a17917j0590N0342K9091K311R004O464l044J6308J4423o7774j32391m0961
30594b44734J26169J49823J0143q3233k0782P2848P9713M7768M0404K0336l3142
30583A65313n4075j5471J5020N157O678K5912o352q0705p6273M4326J43071R3645
$$ plain form
30664 106738 95977 20420 -73450 -95169 -27328 38697 13479 -74094 -123724 -106939 -87628
30653 -87628 -103056 -119213 -123280 -154448 -201414 -180053 -75802 1126 -20360 -63600 -49330 -32093
30641 -32093 -77037 -114791 -60495 19501 13782 -44275 -51314 -18913 -12154 18874 147684 267626
30629 267626 197183 -31712 -201725 -221368 -197762 -193270 -135909 -15397 47591 2323 -46953
30618 -46953 -32403 -27526 -84376 -132200 -122448 -117543 -147156 -129249 -31849 31155 -25897 -117917
30606 -117917 -128507 -78165 -49074 -46763 -37759 -31295 -34339 -18031 -3608 -71382 -203773 -244734
30594 -244734 -118565 31258 41401 -41832 -62614 10234 89947 137715 178119 198455 165313
30583 165313 111238 95767 110787 115944 122622 148534 142182 61477 -14796 29530 172601 266246
30571B66246m8803j41482j28154n7208j93L494k0409M926R6272J45084O2326o0230
30559A21869p2861n269k395n5376j6648J08726J29958j0025j17672n4562N5704
30548H1449N8471R208K1003L7366n1195j78113j80170m3400R1229J26376P8886
30537E1110q367r7782j23469m1856Q4400J34802O6595m5617r3768l2153Q1572
30526b4533J26675M6244o4847o8943K2935P2846L3153L387L5483M1030l0191p5845
30514A17394k0195L2561l1612j29159j08100J303M5626N750N794P5133Q8316j6643
30502F6168j16547p9111M4711R5486J8024q1729q0895J5013R0728O6604q335l2541
30490b424O298K7482n360k6763J3869O0337M3458J577J6580O9823O4333j8386
$$ plain form
30571 266246 217443 75961 -52193 -109401 -109594 -106100 -126509 -121583 -25311 119773 182099 121869
30559 121869 49008 43739 41344 -14032 -30680 78046 208004 197979 80307 25745 81449
30548 81449 139920 149128 170131 207497 156302 -21811 -201981 -245381 -154152 -27776 51110
30537 51110 42743 -55039 -178508 -220364 -135964 -1162 65433 19816 -73952 -106105 -24533
30526 -24533 102142 148386 83539 14596 37531 110377 143530 146917 182400 223430 193239 117394
30514 117394 97199 129760 98148 -31011 -139111 -137808 -92182 -86432 -80638 -5505 82811 66168
30502 66168 -50379 -129490 -84779 10707 28731 -52998 -133893 -118880 -28152 38452 30117 -2424
30490 -2424 3874 31356 25996 -767 13102 73439 116897 118474 135054 204877 269210 250824
30478B50824q3524o6047k3497l8868r0413q4275N208R4532J03683N5496K0793
30467A43912K585n2197j30129j32507k2091R2707R5750K2461j2413M392n023m4486
30455c7039k7504N8102J02340L9976m5711n2946n555J0963r105Q04O3112J18620
30443B16057J01355J2846p8521j04202p0474n1771q4195j00617k7891Q5312J20343
30432A8242N1841k9328m9628k0088K4940O1479N0324k3797q8886o4296L946K487
30420f2764o2503p5139r471L5326K0252K2200O5690P0448K3830K7243R2610P6061
30408B23783p8055k03683j56036k6829L0109L4922P5976J08789N4257j3975J4931
30397F4189P0335P494j24448j38841j4320O7774L832r8041j03372j8378P6744
$$ plain form
30478 250824 167300 101253 77756 38888 -51525 -135800 -130592 -36060 67623 123119 143912
30467 143912 146497 94300 -35829 -168336 -190427 -97720 -1970 20491 8078 12470 7447 -37039
30455 -37039 -64543 -6441 95899 135875 90164 37218 31663 42626 33521 34325 97437 216057
30443 216057 317412 330258 251737 147535 77061 25290 -58905 -159522 -187413 -102101 18242
30432 18242 70083 40755 -8873 -28961 -4021 57458 107782 83985 -4901 -69197 -65251 -62764
30420 -62764 -125267 -200406 -209877 -174551 -154299 -132099 -66409 4039 27869 55112 147722 223783
30408 223783 145728 -57955 -213991 -240820 -210711 -175789 -99813 8976 63233 49258 64189
30397 64189 134524 142018 17570 -121271 -135591 -67817 -63985 -162026 -265398 -283776 -207032
30386b07032J38231J50319R9723P206p2928j08379j04778p5142l6202j0366J0349
30375b08999O0419J21090J13505K5007m5573l9427k9913o9220o4705N5144J64711
30364H2039J06913m8104j00336j9608M8023L6034J6130J4783k3724p8565n3157
30353a9572L4172M6074m2522q5479J595J10514J14490L2535n2191j12015j39170
30342a11569j00940m266P8010R5948O5191N413p0915j04017l6728O9811R2093
30331b1969K5967j7779m735j2500n9795o6385j6553N933j4352K330M7607J1269
30319a20962r0078q7537M8084J18004K4090m9746M4241J45613N4808j21447j54320
30308a89250o8092m6785q0120j0530J27150J29451j2455p3328L4126J21259M3094
$$ plain form
30386 -207032 -68801 81518 181241 188447 115519 7140 -97638 -172780 -208982 -219348 -208999
30375 -208999 -148580 -27490 86015 111022 65449 26022 -3891 -73111 -137816 -82672 82039
30364 82039 188952 140848 40512 20904 68927 104961 121091 135874 112150 33585 -19572
30353 -19572 14600 60674 18152 -67327 -65732 44782 159272 191807 139616 27601 -111569
30342 -111569 -212509 -216775 -138765 -42817 22374 27787 -43128 -147145 -183873 -114062 -21969
30331 -21969 3998 -13781 -18516 -31016 -90811 -157196 -173749 -167816 -182168 -179838 -132231 -120962
30319 -120962 -211040 -298577 -250493 -132489 -108399 -158145 -113904 31709 86517 -34930 -189250
30308 -189250 -257342 -304127 -384247 -394777 -267627 -138176 -150631 -223959 -189833 -68574 -25480
30297b5480q4711j02229l7300M743J8693M0082M2758J4345J9194P8392R5553Q767
30285G2807q5268o8478K6304Q5348P3470K3172m9329j11148q3479L5901J03388
30274B2688J5183j12690r7844L7157J12497O8625J5656J8134J7572j0384l535
30263H3059L6499J5317o8574q0866J7833O9476l1298j43391r4506M2721P8390
30252g5340J0212j0820L8062L0315n6884q9296j3876M8476J6107k4255J0164N4094
30240f3041K9178j1858M842L3292L103l8967j5811K9446J0398l4290M96R1344
30228C8132J03471N083p7275n0424J7331J5163n1034q5388l8163M5747R5432Q6344
30216A04419M1152j4503p1050j06067p4397K6633J06132O9288m1730q4339j1323
$$ plain form
30297 -25480 -110191 -212420 -249720 -244977 -226284 -186202 -143444 -129099 -109905 -31513 64040 72807
30285 72807 -12461 -80939 -54635 30713 104183 127355 78026 -33122 -116601 -80700 22688
30274 22688 37871 -74819 -172663 -135506 -23009 45616 61272 79406 96978 86594 83059
30263 83059 119558 134875 66301 -14565 3268 72744 41446 -101945 -196451 -153730 -75340
30252 -75340 -65128 -75948 -37886 -7571 -64455 -153751 -167627 -119151 -103044 -127299 -117135 -63041
30240 -63041 -33863 -45721 -40879 -7587 -4484 -43451 -59262 -29816 -19418 -53708 -53212 38132
30228 38132 141603 146686 69411 18987 36318 51481 447 -84941 -123104 -77357 18075 104419
30216 104419 145571 131068 60018 -46049 -120446 -93813 12319 81607 39877 -44462 -55785
30205e5785O9163O7209L3576M0388M9156k316p0982q1164n7135o6477q7957n3990
30193b16314K0558O5299O7731N3798Q878o6743q6356K439Q4220K1698j09694j10969
30181b65455L7677J50107J15740K2426k9892n7163q1024n6463K0696P2859P0388
30170a04P3928R4830N2457o3925j28322n6247O6693J14829P7505J3951m2619o6271
30158A36705k5655M1488L9457l7908p4525q464O9560O3087M344l3680n0721o3174
30146F0514l7840L2004P4901M3047j8403o1619r6830j13883o5565J4298J6285
30135a53091n3031m2699R1254J76984Q7003o2067j09529q2024o3510o083J28502
30124h8291J93665O1046j20616j19404J8487O0674k8079p1892j8495P08m4198
$$ plain form
30205 -55785 13378 80587 114163 154551 203707 201391 130409 49245 -7890 -74367 -162324 -216314
30193 -216314 -195756 -130457 -62726 -8928 -50 -66793 -153149 -150710 -66490 -44792 -154486 -265455
30181 -265455 -227778 -77671 38069 60495 30603 -26560 -107584 -164047 -143351 -70492 -104
30170 -104 73824 168654 221111 157186 28864 -27383 39310 154139 231644 245595 202976 136705
30158 136705 111050 152538 191995 154087 79562 71098 140658 203745 208089 174409 123688 60514
30146 60514 22674 54678 129579 172626 154223 92604 -4226 -118109 -183674 -169376 -153091
30135 -153091 -206122 -248821 -157567 19417 106420 44353 -65176 -147200 -210710 -216793 -88291
30124 -88291 105374 166420 45804 -73600 -55113 5561 -22518 -94410 -112905 -112197 -156395
30113a56395k0375Q9653J14626q949j05378m3802N3890K8586o6457q5211k2846
30102b22658K5784M2474P0487Q9682M5547l1851n4314p807L1225R573l8396m5483
30090h5737Q761P8233R5555M1556l2689o6023n1919k0612Q969J9652j5102p1222
30078i0578n5379O5407J63646R7071p4503j51322o8586L1601K6381k8371k1216
30067a05849M5296Q2869M4885l1940p0418j8315Q2879J10041J1604q6199l8565
30056B6288Q5023Q2830o8465j69127j00590J7548N3595N7681J06330J24254K7502
30045B42869q4798o7736K7864M0867k8329k9223O6824J01332j9521j67760j71451
30034h9062m2561O5351O5199J1886j1285m105k0964p0573r4169n2540R522K6580
$$ plain form
30113 -156395 -176770 -87117 27509 18560 -86818 -130620 -76730 -48144 -114601 -199812 -222658
30102 -222658 -196874 -154400 -83913 5769 51316 19465 -34849 -42656 -11431 -1858 -40254 -85737
30090 -85737 -76976 1257 96812 138368 105679 39656 -12263 -32875 -23906 -4254 -19356 -90578
30078 -90578 -145957 -80550 83096 180167 105664 -45658 -114244 -82643 -56262 -84633 -105849
30067 -105849 -60553 22316 67201 35261 -35157 -53472 29407 139448 151052 64853 26288
30056 26288 111311 194141 125676 -43451 -144041 -126493 -72898 -15217 91113 215367 242869
30045 242869 158071 90335 118199 159066 130737 101514 168338 269670 250149 82389 -89062
30034 -89062 -131623 -66272 -1073 10813 -472 -4577 -25541 -96114 -190283 -242823 -233301 -206721
30022b06721R711J8719N4105N5287Q495k9856l3859l9703m8028J630J05590J47971
30010D3341N7287p3895j13491o1444p702J0589J1536n904l0848M973J21938J94651
29998A51031R5625r7715j84023j09698j0415J5916J4413K4996j545p0118p4626
29987b46159L4989J37736J05527j0448p1649n3756l3790l4091j1576K7659L2408
29976a23150J6556M3612R6187Q1726q360o3211k0498L8601K5357k3329k9407q346
29964B5738j7854l2635J2275Q1996O6885m6320j35585j06005m936O4553P4039
29953a7849O5104O6882O9927N5352J6490k9751m3283n858L1933M57q2175j16204
29941A1025n6130K4878M0594k208m4861n9722m1185K3044J08455J35928O7548
$$ plain form
30022 -206721 -197010 -178291 -124186 -68899 -60404 -90260 -124119 -163822 -211850 -210220 -104630 43341
30010 43341 100628 26733 -86758 -148202 -155904 -145315 -133779 -139683 -170531 -165558 -43620 151031
29998 151031 246656 148941 -35082 -144780 -155195 -139279 -124866 -99870 -101415 -171533 -246159
29987 -246159 -211170 -73434 32093 21645 -50004 -103760 -137550 -171641 -183217 -155558 -123150
29976 -123150 -106594 -62982 33205 114931 106571 43360 22862 61463 86820 63491 34084 25738
29964 25738 7884 -24751 -12476 69520 136405 90085 -45500 -151505 -156441 -91888 -17849
29953 -17849 47255 114137 184064 239416 255906 226155 182872 177014 208947 209404 127229 11025
29941 11025 -45105 -20227 20367 18159 -26702 -86424 -127609 -104565 3890 139818 207366
29930B07366k2614m1134J868L0687K3354J5206J4605m110l9690o4132o9130n8597
29918f321k3387K3431K9701j3610k6452M3956J16050Q2823j9185o4338k7816K389
29906A17241j5195l1627k1861k0558l3022k2397J830j1354n0568m6970P710M9199
29894g7572M7985K5149k5225j05226j23273P429J78935J76451j0031j45939q5502
29883a36819L8746N1777j3809l0329P316K1232M132O10J3109L2012P7796J23500
29871A89273P6067o7809j58722r9101M024J8099k203O0396J52686J32445J9848
29860C25003k7679L0159O6954J442r5667j30218r5264k9170L5196O0649K6896
29849A68301k9997o1926p4807q8760p4844j1639M2934K9458r288K42L7211L7390
$$ plain form
29930 207366 184752 143618 145486 176173 199527 214733 229338 225228 185538 121406 52276 -6321
29918 -6321 -29708 -6277 23424 9814 -16638 27318 143368 226191 207006 142668 114852 117241
29906 117241 102046 70419 48558 28000 -5022 -27419 -25589 -36943 -87511 -134481 -126771 -77572
29894 -77572 -29587 -4438 -29663 -134889 -258162 -250733 -71798 104653 94622 -51317 -136819
29883 -136819 -98073 -46296 -60105 -90434 -83118 -61886 -57754 -57144 -44035 -12023 65773 189273
29871 189273 265340 197531 38809 -60292 -56268 -38169 -40372 20024 172710 305155 325003
29860 325003 297324 327483 394437 395879 300212 169994 74730 45560 80756 141405 168301
29849 168301 138304 76378 1571 -87189 -162033 -173672 -130738 -101280 -110568 -110326 -73115 -35725
29837c5725J4407J4233P286m2419o1500K3244J12089N2871r4125j15218K6559
29826i8298J31234P7080j0939L728N1118J728j07191j39979p3380l060J6449K2342
29814a29168M6549N7756J7827m7388n9333K2556J26654J30811K5316n2331p963
29803A31286O3638K9154o5165p8144k1066k9401j03815r3469L0300R9388K3189
29792a4105o4737m0620J5509p326n2303k5428J9751J51j7756N5215J25767M6168
29780D0286j17942j60309m6430N1836L4154j2889n278J9543K6488N6569J03418
29769a0554O9398n9926j32178l7457J04751J04580k3354r1561j6704Q2830Q4166
29758G3991K4741Q353L8495L4070l0090q6751q0880m0325j6228m326L0064P6062
$$ plain form
29837 -35725 -21318 -7085 201 -42218 -103718 -80474 31615 84486 -9639 -124857 -98298
29826 -98298 32936 110016 99077 102805 153923 155651 48460 -91519 -164899 -167959 -151510 -129168
29814 -129168 -82619 -24863 -7036 -54424 -113757 -91201 35453 166264 191580 139249 131286
29803 131286 194924 224078 158913 80769 59703 30302 -73513 -166982 -136682 -37294 -14105
29792 -14105 -78842 -119462 -103953 -111279 -163582 -189010 -169259 -169108 -186864 -131649 -5882 40286
29780 40286 -77656 -237965 -284395 -232559 -198405 -211294 -216572 -197029 -170541 -113972 -10554
29769 -10554 58844 -1082 -133260 -170717 -65966 38614 15260 -76301 -93005 -10175 73991
29758 73991 98732 107085 145580 179650 149560 62809 -18071 -58396 -74624 -78950 -48886 27176
29746B7176P9653K2939m3679o5492m7329k9798k6039j4075J7526M9187O0537N6099
29734H6705M7074K5041k3216p8465r3265m8316J3409L3450J1209R71L3814P4275
29722H2686O8106P372o7490j08432r0451k7718K6608K5349j4201l0562q612R77
29710a36368k2699k0774M7373J16004R9486K4619j2369M120L98m8056p2149l0195
29698e0610J5774m102n7201n3733K8796J18625J40204R6051M8285L2384J2075
29687C26548n8371j42134j45465n2297L0680J1300o0788p1049k900N5202M3761
29676f5513k740j9194J9787Q4618J05726L4630p0213p7999L3462J09727K7152
29665A79443j12911j29435l2880J6951j5072l347R0620J31245L0297j08442j45810
$$ plain form
29746 27176 106829 129768 86089 20597 -26732 -56530 -82569 -96644 -79118 -29931 30606 86705
29734 86705 133779 158820 135604 57139 -36126 -84442 -71033 -37583 -26374 -25403 8411 82686
29722 82686 150792 158164 90674 -17758 -108209 -135927 -109319 -83970 -98171 -128733 -137345 -136368
29710 -136368 -159067 -179841 -132468 -16464 83022 107641 95272 99392 99790 51734 -20415 -50610
29698 -50610 -34836 -38938 -96139 -149872 -121076 -2451 137753 233804 282089 314473 326548
29687 326548 268177 126043 -19422 -71719 -41039 -29739 -90527 -161576 -164476 -109274 -65513
29676 -65513 -68253 -87447 -67660 16958 122684 157314 87101 9102 42564 152291 179443
29665 179443 66532 -62903 -95783 -78832 -93904 -97251 -6631 124614 154911 46469 -99341
29654i9341q0401O117O1008N3795k9085j19001j02243J9078J10445R7999N5392
29643b6237M5373J7755n6389r2250l5325L0990L1932L2410J00220J54958R2276
29632B95713l6280j07445j09228j03375q1948o054P3401P7970L9381M0931O3556
29621A46622K4913n9628q7049k3005O2882J02161P5122j4748j20463j45923n7357
29610i6473M2745M7278n375j5801P976q198n0801m3136J4025N4244O0612M8645
29598E5741j2659j26548j73733n3068J26606J68307P1055R899M8126O7695L132
29587A84553n1379k1341K7740J4495m3782r0081r1087k3242Q6926J15393j8866
29576H9329j76272j40942N2024J43379L8309o3710p651Q3988N2057l2701j9998
$$ plain form
29654 -99341 -179742 -173625 -112617 -58822 -87907 -206908 -309151 -290073 -179628 -81629 -26237
29643 -26237 19136 36891 -19498 -111748 -147073 -116083 -84151 -51741 48479 203437 295713
29632 295713 259433 151988 42760 -60615 -142563 -148617 -75216 2754 42135 83066 146622
29621 146622 171535 111907 24858 1853 64735 166896 242018 227270 106807 -39116 -96473
29610 -96473 -53728 -6450 -11825 -27626 -19650 -27848 -78649 -121785 -107760 -53516 7096 55741
29598 55741 43082 -83466 -257199 -310267 -183661 -15354 55701 65600 113726 181421 184553
29587 184553 133174 111833 139573 154068 110286 20205 -70882 -94124 -7198 108195 89329
29576 89329 -86943 -227885 -175861 -32482 5827 -57883 -65534 18454 70511 37810 17812
29565A7812O0800P6165J1023n1148q0341q5303l7066N1941O6344m6848j43493
29554a60114p2382Q3405J27280M1533k5801j6989j2205l9834l1704J9777L3826
29543e3208k304o901L4745L6560j8824k9943M3556R6027N0452j5200j3353J893
29531A23500n1376j15733q2171J7697N4866R451j3627K3071L0044l4539o7505
29520a06322J6681J28887J22881P152q1482q4786p5254r7863r0082n853R0054
29509a75987J21341J07090R2117N0742m2992j14595p5945K4984O1477J6498q560
29498E6170K9070N6607K9335O815L4036N0311j4172j22909j77697j31737j8289
29487b02460Q7775J14878N4901r600o61L6706J105q5756r3873j583N1756q549
$$ plain form
29565 17812 78612 154777 165800 114652 34311 -50992 -88058 -36117 30227 -16621 -160114
29554 -160114 -232496 -149091 -21811 19722 -6079 -23068 -35273 -75107 -106811 -87034 -53208
29543 -53208 -55512 -62413 -27668 8892 -9932 -39875 3681 99708 150160 134960 121607 123500
29531 123500 72124 -43609 -125780 -108083 -53217 -43766 -57393 -34322 -4278 -38817 -106322
29520 -106322 -89641 39246 162127 169279 87797 3011 -72243 -170106 -260188 -266041 -175987
29509 -175987 -54646 52444 144561 195303 152311 37716 -38229 -13245 48232 64730 56170
29498 56170 85240 141847 171182 177997 212033 262344 248172 125263 -52434 -184171 -202460
29487 -202460 -114685 193 55094 45494 44833 81539 82644 -3112 -96985 -98568 -46812 -55361
29475e5361o5132o916Q1921O2960l6457r1354q1776p2645n6734J7090R7244P7403
29463a29757j9058n7684l782L0997k1612q2624n6732L6567J08457J02542K6313
29452f6373n3101m4196O2012J36504O2689p6475r0668L8901J24185M8423p4391
$$ plain form
29475 -55361 -120493 -127409 -45488 17472 -18985 -110339 -192115 -264760 -321494 -304404 -207160 -129757
29463 -129757 -148815 -206499 -210281 -179284 -200896 -283520 -340252 -303685 -195228 -92686 -66373
29452 -66373 -119474 -163670 -101658 34846 97535 21060 -69608 -30707 93478 141901 67510
$$ [...]
##END NTUPLES=NMR SPECTRUM
##END=
