##TITLE=31Pdec_LY-Dixlofos.P.3
 CDCl3, 24 sc
 28.10.2020
##JCAMPDX= 6.0         $$ Bruker NMR JCAMP-DX V2.0
##DATA TYPE= NMR SPECTRUM
##DATA CLASS= NTUPLES
##ORIGIN= UXNMR, Bruker Analytische Messtechnik GmbH
##OWNER= root
$$ XWIN-NMR		Version 3.5
$$ Wed Oct 28 12:54:57 2020 Russian Standard Time (UT+4h)  she@DPX200
##.OBSERVE FREQUENCY= 81.013821
##.OBSERVE NUCLEUS= ^31P
##.ACQUISITION MODE= SIMULTANEOUS
##.ACQUISITION SCHEME= undefined
##.AVERAGES= 24
##.DIGITISER RES= 17
##SPECTROMETER/DATA SYSTEM= spect
##.PULSE SEQUENCE= zgpg30
##.SOLVENT NAME= CDCl3
##.SHIFT REFERENCE= (INTERNAL, CDCl3, 0, 182.463)
##AUDIT TRAIL= $$ (NUMBER, WHEN, WHO, WHERE, WHAT)
$$ ##TITLE= Audit trail, XWIN-NMR		Version 3.5
$$ ##JCAMPDX= 5.01
$$ ##ORIGIN= Bruker BioSpin GmbH
$$ ##OWNER= she
$$ F:/spectra/data/she/nmr/P31/1/pdata/1/auditp.txt
$$ ##AUDIT TRAIL=  $$ (NUMBER, WHEN, WHO, WHERE, WHAT)
(   1,<2020-10-28 12:53:39.25 +0400>,<she>,<DPX200>,
      <created by zg, POWCHK disabled, PULCHK disabled
       configuration hash MD5:
       00 E9 B6 7A A2 85 ED C7 34 08 36 98 17 FE 4E 26
       data hash MD5: 32K
       25 D1 52 51 AC 79 CD 4B A3 19 BD E5 F3 99 3C A3>)
(   2,<2020-10-28 12:53:53.46 +0400>,<she>,<DPX200>,
      <Start of raw data processing
       efp BC_mod = 2 LB = 1 FT_mod = 6 PKNL = 1 PHC0 = -2353.517 PHC1 = 15.40078 SI = 64K 
       data hash MD5: 64K
       B3 5D C3 2D C5 B9 48 E5 7D 81 1C 9C 77 FE CF 89>)
(   3,<2020-10-28 12:54:07.20 +0400>,<she>,<DPX200>,
      <pk PHC0 = -3.40767 PHC1 = 0 
       data hash MD5: 64K
       15 8F E0 B0 8A E5 45 9B 65 B5 9B E4 48 BA 8D 39>)
$$ ##END=
$$ 
$$ hash MD5
$$ C3 6E 49 DA 95 73 40 9F 80 9E A8 CD 37 EF 3D E8
##$RELAX= 
##$RELAX= 
##$RELAX= 
##$RELAX= 
##$RELAX= 
##$RELAX= 
##$RELAX= 
##$RELAX= 
$$ Bruker specific parameters
$$ --------------------------
##$DU= <F:/spectra>
##$EXPNO= 1
##$NAME= <P31>
##$PROCNO= 1
##$TYPE= <nmr>
##$USER= <she>
##$AMP= (0..31)
100 100 100 100 100 100 100 100 100 100 100 100 100 100 100 100 100 100 
100 100 100 100 100 100 100 100 100 100 100 100 100 100 
##$AQSEQ= 0
##$AQ_mod= 1
##$AUNM= <au_zg>
##$AUTOPOS= <>
##$BF1= 81.014009
##$BF2= 200.13
##$BF3= 200.13
##$BF4= 200.13
##$BF5= 200.13
##$BF6= 200.13
##$BF7= 200.13
##$BF8= 200.13
##$BYTORDA= 1
##$CFDGTYP= 0
##$CFRGTYP= 5
##$CHEMSTR= <none>
##$CNST= (0..31)
1 1 145 1 1 1 1 1 1 1 1 1 1 1 1 1 1 1 1 1 1 1 1 1 1 1 1 1 1 1 1 1 
##$CPDPRG= <waltz16>
##$CPDPRG1= <>
##$CPDPRG2= <waltz16>
##$CPDPRG3= <>
##$CPDPRG4= <mlev>
##$CPDPRG5= <mlev>
##$CPDPRG6= <mlev>
##$CPDPRG7= <mlev>
##$CPDPRG8= <mlev>
##$CPDPRGB= <>
##$CPDPRGT= <>
##$D= (0..31)
0 1 0 0 0 0 0 0 0 0 0 0.03 2e-05 3e-06 0 0 0 0 0 0 0 0 0 0 0 0 0 0 0 0 
0 0 
##$DATE= 1603875218
##$DBL= (0..7)
120 120 120 11 120 120 24 19 
##$DBP= (0..7)
150 150 150 150 150 150 150 150 
##$DBP07= 0
##$DBPNAM0= <>
##$DBPNAM1= <>
##$DBPNAM2= <>
##$DBPNAM3= <>
##$DBPNAM4= <>
##$DBPNAM5= <>
##$DBPNAM6= <>
##$DBPNAM7= <>
##$DBPOAL= (0..7)
0.5 0.5 0.5 0.5 0.5 0.5 0.5 0.5 
##$DBPOFFS= (0..7)
$$ [...]
##$SUBNAM2= <"">
##$SUBNAM3= <"">
##$SUBNAM4= <"">
##$SUBNAM5= <"">
##$SUBNAM6= <"">
##$SUBNAM7= <"">
##$SUBNAM8= <"">
##$SUBNAM9= <"">
##$SW= 369.568048894756
##$SWIBOX= (0..15)
0 1 3 0 0 0 0 0 0 0 0 0 0 0 0 0 
##$SW_h= 29940.119760479
##$TD= 32768
##$TD0= 1
##$TE= 0
##$TE2= 300
##$TE3= 300
##$TEG= 300
##$TL= (0..7)
0 120 53 12 22 120 120 120 
##$TP= (0..7)
150 150 150 150 150 150 150 150 
##$TP07= 0
##$TPNAME0= <>
##$TPNAME1= <>
##$TPNAME2= <>
##$TPNAME3= <>
##$TPNAME4= <>
##$TPNAME5= <>
##$TPNAME6= <>
##$TPNAME7= <>
##$TPOAL= (0..7)
0.5 0.5 0.5 0.5 0.5 0.5 0.5 0.5 
##$TPOFFS= (0..7)
0 0 0 0 0 0 0 0 
##$TUNHIN= 0
##$TUNHOUT= 0
##$TUNXOUT= 0
##$USERA1= <user>
##$USERA2= <user>
##$USERA3= <user>
##$USERA4= <user>
##$USERA5= <user>
##$V9= 5
##$VALIST= <valist>
##$VCLIST= <CCCCCCCCCCCCCCC>
##$VD= 0
##$VDLIST= <DDDDDDDDDDDDDDD>
##$VPLIST= <PPPPPPPPPPPPPPP>
##$VTLIST= <TTTTTTTTTTTTTTT>
##$WBST= 1024
##$WBSW= 4
##$XGAIN= (0..3)
0 0 0 0 
##$XL= 0
##$YL= 0
##$YMAX_a= 50101
##$YMIN_a= -63997
##$ZGOPTNS= <>
##$ZL1= 120
##$ZL2= 120
##$ZL3= 120
##$ZL4= 120
##$ABSF1= 0
##$ABSF2= 0
##$ABSG= 0
##$ABSL= 0
##$ALPHA= 0
##$AQORDER= 0
##$ASSFAC= 0
##$ASSFACI= 0
##$ASSFACX= 0
##$ASSWID= 0
##$AUNMP= <proc_1d>
##$AZFE= 0.1
##$AZFW= 0.5
##$BCFW= 0
##$BC_mod= 2
##$BYTORDP= 0
##$COROFFS= 0
##$CY= -3
##$DATMOD= 1
##$DC= 0
##$DFILT= <>
##$DTYPP= 0
##$F1P= 0
##$F2P= 0
##$FCOR= 1
##$FTSIZE= 65536
##$FT_mod= 6
##$GAMMA= 0
##$GB= 0
##$INTBC= 1
##$INTSCL= 5.30512e-09
##$ISEN= 30
##$LB= 1
##$LEV0= 0
##$LPBIN= 0
##$MAXI= 10000
##$MC2= 0
##$MEAN= 0
##$ME_mod= 0
##$MI= 50
##$NCOEF= 0
##$NC_proc= -2
##$NLEV= 6
##$NOISF1= 182.463
##$NOISF2= 159.3651
##$NSP= 0
##$NTH_PI= 0
##$NZP= 0
##$OFFSET= 182.463
##$PC= 4
##$PHC0= -2356.925
##$PHC1= 15.40078
##$PH_mod= 1
##$PKNL= yes
##$PPARMOD= 0
##$PSCAL= 0
##$PSIGN= 0
##$REVERSE= no
##$SF= 81.014009
##$SI= 65536
##$SIGF1= 159.3651
##$SIGF2= -187.1042
##$SINO= 113.3802
##$SIOLD= 16384
##$SREGLST= <1H.CDCl3>
##$SSB= 0
##$STSI= 65536
##$STSR= 0
##$SW_p= 29940.119760479
##$SYMM= 0
##$S_DEV= 0
##$TDeff= 32768
##$TDoff= 0
##$TI= <>
##$TILT= no
##$TM1= 0
##$TM2= 0
##$TOPLEV= 0
##$USERP1= <user>
##$USERP2= <user>
##$USERP3= <user>
##$USERP4= <user>
##$USERP5= <user>
##$WDW= 1
##$XDIM= 65536
##$YMAX_p= 453978926
##$YMIN_p= -644670
$$ End of Bruker specific parameters
$$ ---------------------------------
##NTUPLES= NMR SPECTRUM
##VAR_NAME=  FREQUENCY,     SPECTRUM/REAL,   SPECTRUM/IMAG
##SYMBOL=    X,             R,               I
##VAR_TYPE=  INDEPENDENT,   DEPENDENT,       DEPENDENT
##VAR_FORM=  AFFN,          ASDF,            ASDF
##VAR_DIM=   65536,         65536,           65536
##UNITS=     HZ,            ARBITRARY UNITS, ARBITRARY UNITS
##FACTOR=    0.456856943014862, 1,           1
##FIRST=     14782.0589164895, 0,            0
##LAST=      -15158.0608439895, 0,           0
##MIN=       -15158.0608439895, -644670,     0
##MAX=       14782.0589164895, 453978926,    0
$$ Real data points
##PAGE= N=1
##DATA TABLE= (X++(R..R)), XYDATA
$$ [...]
35961I235j18888j18862J5700J34953Q6814n5891j06204m1283J858k3331j7509
$$ 9235 -109653 -228515 -212815 -77862 8952 -46939 -153143 -194426 -192568 -215899 -233408
35950b33408N6259R1023J8669p3112p9247k2003J3561N207j1256j4924j3552j4192
$$ -233408 -177149 -86126 -67457 -140569 -219816 -241819 -228258 -223051 -234307 -249231 -262783 -276975
35938b76975q666K4630R6873J68929J68741Q1568j8131o0123n1586k5314Q784
$$ -276975 -285641 -261011 -164138 4791 173532 255100 236969 176846 125260 99946 108730
35927A08730K0000l6108j10387p9034N2850J05764o715j16312n7516O1182M0970
$$ 108730 128730 92622 -17765 -96799 -43949 61815 55100 -61212 -118728 -57546 -16576
35916a6576p4228q1162M3406J26891Q7665J1528m1841r4585j17839m8528N4859
$$ -16576 -90804 -171966 -128560 -1669 85996 97524 55683 -38902 -156741 -205269 -150410
35905a50410O4230n985k2477L5351O0353L1655L6831O7319O773j36696j92575
$$ -150410 -86180 -92165 -114642 -79291 -18938 12717 49548 116867 123640 -13056 -205631
35894b05631q4487N5708R5304O0240K5708j886k9871l4255k1211k6360l3042k00
$$ -205631 -290118 -234410 -139106 -78866 -53158 -55044 -84915 -119170 -140381 -166741 -199783 -199983
35882a99983L7522K4033P449N9480J06757K6416j19511j52461o2911k600J233
$$ -199983 -162461 -138428 -130979 -71499 35258 61674 -57837 -210298 -273209 -275809 -274576
35871b74576O9937J89249J74227r818j49517j08790j6871j6004m3689j575N6332
$$ -274576 -204639 -15390 158837 149019 -498 -109288 -126159 -142163 -185852 -187427 -131095
35860a31095M9456J9204K0632J6103r672J6154R6058J00754j6031j04502n0557
$$ -131095 -81639 -62435 -41803 -25700 -35372 -19218 76840 177594 161563 57061 6504
35849F504L6203J0393p5374q1745j2434K6056J2122J2610N1605Q7244Q1671K5709
$$ 6504 42707 53100 -22274 -104019 -116453 -90397 -78275 -65665 -14060 73184 154855 180564
35837A80564n8069j02602o0148N156j0252p7602o9373K3496O9401K1424j2273
$$ 180564 122495 19893 -40255 -35099 -45351 -122953 -192326 -168830 -99429 -78005 -90278
35826i0278K3938L6909k9389q5186n8928j1084N02J7031O2959Q3215O2884N6395
$$ -90278 -66340 -29431 -58820 -144006 -202934 -214018 -213516 -196485 -133526 -50311 12573 68968
35814F8968M8863l4416j36030r3887P7651J61874P4455j8262j0828k1780j12083
$$ 68968 117831 83415 -52615 -146502 -68851 93023 167478 149216 138388 116608 4525
35803D525j17679N0972J93956J21198n1516j22113j11528j29198j27088l0029
$$ 4525 -113154 -62182 131774 252972 201456 79343 -32185 -161383 -288471 -318500
35793c18500O1271L8022l714N1741J05620L4441n4237j3769N5565r722j16663
$$ -318500 -257229 -219207 -222921 -171180 -65560 -31119 -85356 -99125 -43560 -53282 -169945
35782a69945p8839L2545K0121o3317r766J40405J40663l2227j28540l3765P8965
$$ -169945 -248784 -216239 -196118 -259435 -269201 -128796 11867 -20360 -148900 -182665 -103700
35771a03700N9730k3476o5165o2412j5958R4021J83828J23979l4520r3320o460
$$ -103700 -43970 -67446 -132611 -195023 -210981 -116960 66868 190847 156327 63007 56547
35760E6547N9342Q954n2562m2721l9541r9805j31663o7098J048j6918m1613L7673
$$ 56547 115889 124843 72281 29560 -9981 -109786 -241449 -308547 -307499 -324417 -366030 -328357
35748c28357J58256J62810L3445q1950p2443L775J8182n3727j10605p3844L116
$$ -328357 -170101 -7291 26154 -55796 -128239 -124464 -106282 -160009 -270614 -344458 -341342
35737c41342K7087J8732O9269J58947J60130N0533l2157j3927J327n9329q6738
$$ -341342 -314255 -295523 -226254 -67307 92823 143356 111199 97272 98599 39270 -47468
35726d7468O860R4057L0728q2522n3747P9811J14814J0921p2069m8696o359j7922
$$ -47468 -40608 53449 84177 1655 -52092 27719 142533 153454 81385 32689 26330 8408
35714H408m1499l3713j0939K1715P2214Q9601J6466r0564j14531m3659L0384N8464
$$ 8408 -33091 -66804 -77743 -56028 16186 105787 122253 31689 -82842 -126501 -96117 -37653
35702c7653O2769M7320p16m4923m4085k8976l6454k5684L3398O8337K7396K492
$$ -37653 25116 72436 71720 26797 -17288 -46264 -82718 -108402 -75004 -6667 20729 23221
35690B3221P7655J49364P8765n8750p9751R542L4625n8482j42047j25482m8930
$$ 23221 100876 250240 329005 270255 190504 200046 234671 176189 34142 -91340 -140270
35679a40270L7082J15294J34953O0282l2627n2433m0295o9542p6091K0443J08676
$$ -140270 -103188 12106 147059 207341 174714 122281 81986 12444 -63647 -43204 65472
35668F5472L2227j14075r6730O9754J23019l6370j95919j57595R659J22566J08192
$$ 65472 97699 -16376 -113106 -43352 79667 43297 -152622 -310217 -300558 -177992 -69800
35657f9800P462r7108j11508j4609P7775N4626j8947j7071K5954j116n0941N351
$$ -69800 -62338 -159446 -270954 -285563 -207788 -153162 -172109 -189180 -163226 -164342 -215283 -209932
35645b09932J15482J12200J2527j2774M6227L2213o5907q0663J9994O8313j686
$$ -209932 -94450 17750 30277 17503 63730 95943 30036 -50627 -30633 37680 35994
35634C5994n7264k9608j2304l9107k2917K5864j6178j24772j23193J749O1732
$$ 35994 -21270 -50878 -63182 -102289 -125206 -99342 -115520 -240292 -363485 -361736 -300004
35623c00004R489J7392J31940J66762N0288l6570K681K4003l6961k2209J02642
$$ -300004 -290515 -273123 -141183 25579 75867 39297 41978 65981 29020 6811 109453
35612A09453J04966r8783k21568n9883J45696J02911o1216n5793Q2537J08993
$$ 109453 214419 115636 -105932 -165815 -20119 82792 21576 -34217 48320 157313
35602A57313N205n6241n4425r6053j43226p6273L9219L6937m8408l1658J04625
$$ 157313 162518 106277 51852 -44201 -187427 -263700 -224481 -187544 -235952 -267610 -162985
35591a62985J88703J35848K8939n6171j10650j04610k0712N2423K4011m0970k1531
$$ -162985 25718 161566 190505 134334 23684 -80926 -101638 -49215 -25204 -66174 -87705
35580h7705N5244O7352O38n6920p0180n9867j2339O8940Q9505j1698j30725j31520
$$ -87705 -32461 34891 35529 -21391 -91571 -151438 -163777 -94837 -5332 -17030 -147755 -279275
35568b79275l6501M8932J08302J63455J55060M2452o7409o2671j4744n4530j47281
$$ -279275 -315776 -266844 -158542 4913 159973 202425 135016 72345 57601 3071 -144210
35557a44210j65590j02022l2127M5484J47524J78940P0127m5751q673R3280N6925
$$ -144210 -309800 -411822 -443949 -398465 -250941 -72001 -1874 -47625 -56298 36982 93907
35546I3907r1744j37338k8669O0137K7893k8922j9943J7760M2151P0918Q8551
$$ 93907 2163 -135175 -163844 -103707 -75814 -104736 -124679 -106919 -64768 6150 94701
35535I4701M7694j4499j2500K6922k933r0619j07992k7629K6658j9228q7432q7538
$$ 94701 142395 127896 115396 142318 139385 48766 -59226 -86855 -60197 -79425 -166857 -254395
35523b54395l0247L2991P3376O7532J7620j0040L2983P6171K6315o5319o9808
$$ -254395 -284642 -251651 -178275 -110743 -93123 -103163 -70180 5991 32306 -33013 -102821
35512a02821Q464M0814j2537n6021l6373j4043l0524m2857k4353j0586j5684r175
$$ -102821 -94357 -53543 -66080 -122101 -158474 -172517 -203041 -245898 -270251 -280837 -296521 -305696
35500c05696P303K091o532J8921L4851k4991r7077m3516J19996K03635J03270
$$ -305696 -298393 -296302 -302834 -283913 -249062 -274053 -371130 -414646 -294650 -91015 12255
35489A2255n0430p5327L0384J19611R4727q12o5397o3436n1801p9500q9662N023
$$ 12255 -38175 -113502 -83118 36493 131220 130408 65011 1575 -50226 -129726 -219388 -214365
35477b14365J45441J48232k9082j76041j03203Q5059J50611O6093P555M9399P4816
$$ -214365 -68924 79308 50226 -125815 -229018 -143959 6652 72745 80300 129699 204515
35466B04515K146q5538q8584k8389J9064K3295j0004o3732r3448n7169J9293O3231
$$ 204515 206661 121123 32539 4150 23214 46509 36505 -27227 -120675 -177844 -158551 -95320
35454i5320M3867p338m7474m6220O326O7207O4319m45l9903k0720j5911n5502
$$ -95320 -51453 -58791 -106265 -152485 -146159 -78952 -14633 -15078 -54981 -75701 -91612 -147114
35442a47114n1213L4334Q2465J3086n4978n62P6381K2565r4209r9856j2104J3352
$$ -147114 -198327 -163993 -81528 -68442 -123420 -123982 -47601 -25036 -119245 -219101 -231205 -217853
35430b17853k9804j0856P3831R2833K6249q744J9758K5786m488j716J2092m3104
$$ -217853 -247657 -258513 -184682 -91849 -65600 -74344 -54586 -28800 -33288 -35004 -22912 -66016
35418f6016j02990k6947J23454J28642k9834j13838j971J31790J12840R770l9816
$$ -66016 -169006 -195953 -72499 56143 26309 -87529 -89500 42290 155130 164900 125084
35407A25084m5514o7890p2493j9375L0683J9756m579J4635M5794M2017J2741l2072
$$ 125084 79570 11680 -60813 -80188 -49505 -29749 -34328 -19693 26101 68118 80859 48787
35395D8787r8982j31521m5142J09976J61569N1509p7594r5628m5616j8383o136
$$ 48787 -50195 -181716 -226858 -116882 44687 96196 18602 -77026 -122642 -141025 -147161
35384a47161K5797L9547j792m7844l4250K1692N7356M0515k0004p7959o2722L3225
$$ -147161 -121364 -81817 -83609 -131453 -165703 -144011 -86655 -46140 -66144 -144103 -206825 -173600
35372a73600R8850L9480o2265n2707N2397R3150K0781m7684l9745j4359j4636
$$ -173600 -74750 -35270 -97535 -150242 -97845 -4695 16086 -31598 -71343 -85702 -100338
35361a00338q214m590n7841j20500p3239O3147J27698P0528J4573K1892K596p6886
$$ -100338 -108552 -113142 -170983 -291483 -364722 -301575 -173877 -103349 -88776 -66884 -64288 -141174
35349a41174j00429r472Q0499O7671M853k8304l0536R089J21361K11457J10613
$$ -141174 -241603 -251075 -170576 -102905 -98052 -126356 -156892 -147803 -26442 185015 295628
35338B95628j35137k43505q3972J22203J33946K0856j3604L7265L5068m2947r5272
$$ 295628 160491 -83014 -166986 -44783 89163 110019 96415 133680 168748 125801 30529
35327C0529q1048n2482m2961l7611k1538R418M1200K7131l7159m2253R0418K15743
$$ 30529 -50519 -103001 -145962 -183573 -205111 -195693 -154493 -127362 -164521 -206774 -116356 99387
35315I9387J21242j20364k05679n3225P8267J7265p2833k7402L0027n0364j44444
$$ 99387 220629 100265 -105414 -158639 -80372 -63107 -135940 -163342 -133315 -183679 -328123
35304c28123p0133R2735J51979J09717P6700L2348q1024j59702q9239J8977o426
$$ -328123 -398256 -305521 -153542 -43825 32875 65223 -15801 -175503 -264742 -245765 -252191
35293b52191r2947m2699J21461J86524Q3686m5924r6776r4595n9969K6859J23836
$$ -252191 -345138 -387837 -266376 -79852 3834 -42090 -138866 -233461 -293430 -266571 -142735
35282a42735J50628J08158N0855j5394q4977p9559L2530J26895Q8043m106j3279
$$ -142735 7893 116051 166906 151512 66535 -13024 19506 146401 234444 230338 217059
35271B17059L1299L4577M3459J38873K31414K23756K82168O21567J035682R91240
$$ 217059 248358 282935 326394 465267 696681 920437 1202605 1824172 2859854 3851094
35261C851094K98029n80692j030182r08962n46055k84856j97709j67833r4653
$$ 3851094 4149123 3568431 2538249 1629287 1083232 798376 600667 432834 338181
35252C38181J747K8703m5011j30015j25452m8162R248R722j5587m6482p5875o4101
$$ 338181 339928 368631 323620 193605 68153 19991 29239 38961 23374 -23108 -98983 -163084
35240a63084J4690J00930J10373M8061j3345m1167n3726n5013l4457o019J4506
$$ -163084 -148394 -47464 62909 110970 97625 56458 2732 -52281 -86738 -92757 -78251
35229g8251L8206O1732N0588Q654q579K745k5943r4347q9110L2321J34892R5445
$$ -78251 -40045 21687 72275 80929 72350 75095 49152 -45195 -134305 -101984 32908 128353
35217A28353j1699m3435j023J8617m809k5763l7458m1254O887J00874J28231L2008
$$ 128353 116654 73219 72196 90813 86004 60241 22783 -18471 -11584 89290 217521 249529
35205B49529p1871o7632j8028k8017n1454j168O1301L2027l5500k6797K4341J5340
$$ 249529 177658 110026 91998 63981 12527 11359 72660 104687 69187 42390 66731 82071
35193H2071k0436J0431N8611J7190n6597k5979O9090O6079m0918j00163o6132
$$ 82071 61635 72066 130677 147867 91270 65291 134381 200460 159542 59379 -6753
35182f753m4940p2056n4755L8012J12000J05542N8951J1592l2796m2899K625L4346
$$ -6753 -51693 -123749 -178504 -140492 -28492 77050 136001 147593 114797 71898 74523 108869
35170A08869j5582p7908m9217K0619R888n7146n7828N326K3923l949J6358O9378
$$ 108869 93287 15379 -33838 -13219 -3331 -60477 -118305 -112979 -89056 -93005 -76647 -7269
35158g269L8722p2847j27947p4646l443K8545N7565Q4195N2120k4008n8325l3133
$$ -7269 31453 -41394 -169341 -243987 -247430 -218885 -161320 -77125 -25005 -49013 -107338 -140471
35146a40471p181L456K1555J9349k6551m1665L0545Q6994J8894o8505n710J34942
$$ -140471 -147652 -144196 -122641 -103292 -129843 -171508 -140963 -53969 -35075 -103580 -109290 25652
35134B5652J29798l1323j28663o2914K8353L1196k532j6295l9298o8298m6769
$$ 25652 155450 124127 -4536 -67450 -39097 -7901 -10433 -26728 -66026 -134324 -181093
35123a81093K939p50l5177o086O2280O0229K338j115L3601p131r3766q0455K6240
$$ -181093 -178154 -178904 -214081 -220167 -157887 -97658 -95320 -96435 -62834 -69965 -163731 -244186 -217946
35110b17946P0381K7566K8592Q3409M9423q0928j27721k5889O8955N0682L237
$$ -217946 -147565 -119999 -91407 -7998 41425 -39503 -167224 -193113 -124158 -73476 -70239
35099g0239n37j0430l7654p181O0173M0411n7435p6412R013M0961k9449n2889
$$ -70239 -70776 -81206 -118860 -126041 -65868 -25457 -82892 -159304 -150291 -109330 -138779 -191668
35087a91668L0626P1731j3556r1249n0016K7651M9481N7992Q3341N6830k6009
$$ -191668 -161042 -89311 -102867 -194116 -244132 -216481 -167000 -109008 -25667 31163 5154
35076E154n3794j59K1543k4074l4449J0976M664n1221j6680R9720R8883o5443
$$ 5154 -48640 -48799 -27256 -51330 -85779 -74803 -70139 -121360 -138040 -38320 60563 -4880
35064d880j75917r9578K3022N6669O4918R6449N9264m8112n9768N1768P6602o5188
$$ -4880 -180797 -280375 -257353 -200684 -135766 -39317 19947 -28165 -87933 -36165 40437 -24751
35052b4751j50470k7823J27096J28205O1192M1202j3894j36560j35881O5306K06138
$$ -24751 -175221 -203044 -75948 52257 113449 154651 140757 4197 -131684 -66378 139760
35041A39760Q7481p8702l0230R9447M4602j16194j25954j0107J4525m2994j876
$$ 139760 227241 148539 118309 217756 262358 146164 20210 10103 24628 -18366 -20242
35030b0242J09327R0125o2013j48464j07814o1786m7922J5389J09540J16741L8922
$$ -20242 89085 179210 117197 -31267 -139081 -200867 -248789 -233400 -123860 -7119 31803
35019C1803m257J4595J8384m458l824m412o0100j15488q0692O408M6668M0303
$$ 31803 27546 42141 60525 56067 52243 47831 -12269 -127757 -208449 -202041 -155373 -115070
35007a15070L4476J093p8163j06832j7725Q1489O8068k736k2105j3470k8261n193
$$ -115070 -80594 -79501 -157664 -264496 -282221 -200732 -132664 -135400 -157505 -170975 -199236 -204429
34995b04429Q4779J13410J2191n8555K4066R7236j3837j59104j01093O9420Q6515
$$ -204429 -119650 -6240 5951 -52604 -28538 68698 54861 -104243 -205336 -135916 -49401
34984d9401m1301p9574J1933N1325r865k8598L6476O4268J0482m4358p7154j20586
$$ -49401 -90702 -170276 -158343 -107018 -116883 -145481 -109005 -44737 -34255 -78613 -155767 -276353
34972b76353j14134Q259J31783J05149Q349J8477Q4404K7738r7044o9948R6531
$$ -276353 -390487 -382228 -250445 -145296 -136947 -118470 -34066 -6328 -103372 -173320 -76789
34961g6789J61452O1310j8127k394k9852j33683j43984m766J00132N3404j8333
$$ -76789 84663 145973 127846 125452 95600 -38083 -182067 -186833 -86701 -33297 -51630
34950e1630P438N3865K2894l0788k8140l042l770J201L2516M1358P078k1520k2199
$$ -51630 -44192 9673 32567 1779 -26361 -29403 -33173 -31972 544 41902 48980 27460 5261
34937E261k3155j5582L4633Q6250O5511K100j5940m666m9397j26218j21121j9448
$$ 5261 -17894 -33476 1157 87407 152918 155018 139078 134412 85015 -41203 -162324 -181772
34925a81772P6925J08461R0106J9197r3635j45173n7680O9345R2350M5688M8562
$$ -181772 -104847 3614 93720 112917 19282 -125891 -183571 -114226 -21876 23812 72374
34914G2374P0890J0564o7782k0078R7805R7462j9866p1675j8426j1551r6747j30266
$$ 72374 143264 153828 86046 65968 163773 261235 241369 169694 151268 139717 42970 -87296
34902h7296m2867M4588L3564j8396l1630r796K0516L8047K298p0099o2690N8483
$$ -87296 -130163 -85575 -52011 -70407 -102037 -111833 -91317 -53270 -50972 -121071 -183761 -125278
34890a25278J22249K781j35425q6000M3137K5873n6360M1548K35010J84639j26686
$$ -125278 -3029 -248 -135673 -221673 -178536 -152663 -209023 -167475 67535 252174 125488
34879A25488l13644j67902O6154J16970M1727O564J0056q988k4513k2122m8815
$$ 125488 -188156 -356058 -289904 -172934 -131207 -124643 -114587 -123575 -148088 -170210 -219025
34868b19025p7804k0446Q0184Q5385J4841J9342Q4822M2701r8797j37413l5935
$$ -219025 -296829 -317275 -237091 -151706 -136865 -117523 -32701 10000 -88797 -226210 -262145
34857b62145J6750l4634j8544J11400J62418N3224m0696j8035j5710j05414j34377
$$ -262145 -245395 -280029 -298573 -187173 -24755 28469 -12227 -30262 -45972 -151386 -285763
34846b85763k4761N9696J0389l6830K7081Q5071K9844m5601m5847k7164k3101
$$ -285763 -310524 -250828 -240439 -277269 -250188 -165117 -135273 -180874 -226721 -253885 -276986
34835b76986L9895J33299R6122o3082j09757L8201J57623Q7198l8571p0443o6991
$$ -276986 -237091 -103792 -7670 -70752 -180509 -142308 15315 102513 63942 -6501 -73492
34824g3492p8346o746J42511J66839P922j03774l1387M2231l1173r6607r536Q2789
$$ -73492 -151838 -158584 -16073 150766 158688 54914 23527 65758 34585 -62022 -71558 11231
34812A1231K4319o2957k9692K5267j8897n9143J145L1352o4907j24540j9045Q5288
$$ 11231 35550 -27407 -57099 -31832 -50729 -109872 -108727 -77375 -142282 -266822 -285867 -200579
34800b00579K7264n2520N856P1766m2n2561P6313J91454M9635j80400j60786P1209
$$ -200579 -173315 -225835 -219979 -148213 -148255 -200816 -124503 66951 116586 -63814 -224600 -153391
34788a53391J88199Q7269m4688r5928j20653j21326m3069N2266N5571J700j3890
$$ -153391 34808 122077 77389 -18539 -139192 -260518 -303587 -251321 -195750 -194050 -207940
34777b07940j5898n1751m3382N9377J26212N8497j2841L7944Q6731p247j20983
$$ -207940 -223838 -275589 -318971 -259594 -133382 -74885 -87726 -49782 36949 29702 -91281
34766i1281q9161j0544m4507r3460J211J26765Q9431k7541k8771K7961k4724j04308
$$ -91281 -180442 -190986 -235493 -328953 -327742 -200977 -111546 -139087 -167858 -139897 -164621 -268929
34754b68929k4783J23748J09703k9573p4099k2809m3350j03916k9759J29550J55811
$$ -268929 -293712 -169964 -60261 -89834 -163933 -186742 -230092 -334008 -363767 -234217 -78406
34743g8406M6999l635K3392k4489j27094j00346M9647J13170L1794l7201k1260
$$ -78406 -31407 -35042 -11650 -36139 -163233 -263579 -213932 -100762 -68968 -106169 -127429
34732a27429j0756l1943j1588L5400L2441K3863Q4743J13092j8441j81675j58876
$$ -127429 -138185 -170128 -181716 -146316 -113875 -90012 -5269 107823 89382 -92293 -251169
34721b51169j0850L6281q313M0184J47501J04011o0983r1562N2028J26282J8990
$$ -251169 -262019 -225738 -234051 -193867 -46366 57645 -3338 -94900 -42872 83410 102400
34710A02400j06615j26679j00828o4182K2025Q5924R835j08584o4616Q7524J05044
$$ 102400 -4215 -130894 -231722 -295904 -273879 -187955 -178120 -286704 -351320 -263796 -158752
34699a58752j2854k7602Q8116R3112o5057j28506K0285J52256Q5149m4145o3204
$$ -158752 -171606 -199208 -111092 -17980 -83037 -211543 -191258 -39002 46147 2002 -61202
34688f1202k8018l5345k7932M5207Q9729L6351l0711k9859j533N970P170q032
$$ -61202 -89220 -124565 -152497 -107290 -17561 18790 -11921 -41780 -43313 -37343 -30173 -38205
34676c8205o2688q2685J1755J18164P4973n2606o1022M3362O7278j3148k8706
$$ -38205 -100893 -183578 -171823 -53659 21314 -31292 -92314 -48952 18326 5178 -23528
34665b3528M4065M5728l4608k3328Q8326R0951o9202j81226j23186k3128J7331
$$ -23528 20537 66265 31657 8329 96655 187606 118404 -62822 -186008 -209136 -191805
34654a91805O0752J13262O8541m2303m4573N7483O0090o5070j06876j0479J7449
$$ -191805 -131053 -17791 50750 8447 -36126 21357 81447 16377 -90499 -100978 -83529
34643h3529q8015j07861M8329J46165K9593j12671q7969J434J1081J3231Q1226
$$ -83529 -171544 -279405 -231076 -84911 -55318 -167989 -255958 -254524 -243443 -230212 -148986
34632a48986Q8370m3703j39124m4506J01285R7632m525k7225N7489J51853J87970
$$ -148986 -60616 -104319 -243443 -287949 -186664 -89032 -93557 -120782 -63293 88560 276530
34621B76530J25478m9358k19517k09091m0940P4303O0551M5671O1690k1489j77100
$$ 276530 402008 352650 133133 -75958 -116898 -42595 17956 63627 125317 103828 -73272
34610g3272j69636M1070J71695N9782q1167m0503O5082N9406R354L0287M9529
$$ -73272 -242908 -201838 -30143 29639 -51528 -92031 -26949 32457 41811 72098 121627
34599A21627j2320o3177m1952n3105j17473o5512J26574J95686J3868j54530p7197
$$ 121627 109307 46130 4178 -48927 -166400 -231912 -105338 90348 104216 -50314 -127511
34588a27511O6000K3040r5133n5333O5696M8608n6732l9927Q5462J29620N7080
$$ -127511 -61511 -38471 -133604 -188937 -123241 -74633 -131365 -171292 -85830 43790 100870
34577A00870j0017k7970l5136k2156J868n3560j74901j71396J9588J62072P9227
$$ 100870 90853 62883 27747 5591 7459 -46101 -221002 -392398 -372810 -210738 -131511
34566a31511m3745K1561J48398Q7736q9231j23645q587M3498j6105m1297J0052
$$ -131511 -175256 -153695 -5297 82439 -6792 -130437 -139024 -95526 -111631 -152928 -142876
34555a42876L2401j906j5007O100R353J983R687j0320o4220m5372P6345J31222
$$ -142876 -110475 -112381 -127388 -121288 -111935 -109952 -100265 -110585 -174805 -220177 -143832 -12610
34543a2610P2j57770j29503L3795J31045J14865P6436M4681l179l4601k9694m2334
$$ -12610 -12538 -170308 -299811 -266016 -134971 -20106 56330 101011 97832 63231 33537 -8797
34531h797o8479j3915R2855P4034p6571j11789N5879J59171K2161j14339o128
$$ -8797 -77276 -91191 1664 75698 -873 -112662 -56783 102388 124549 10210 4082
34520D082J60111R7755q3050r9682O184K881q6218q3562m4170j23663j96082l6154
$$ 4082 164193 261948 178898 79216 85400 88281 2063 -81499 -125669 -249332 -445414 -481568
34508d81568K17252K19248j6182j37304k0724R3434M6643l9541n4172m9368n0288
$$ -481568 -264316 -45068 -61250 -198554 -219278 -125844 -79201 -118742 -172914 -222282 -272570
34497b72570j986N9208L7993j3695K9097J11066P6929l5713n7843j091k1746j08099
$$ -272570 -274556 -215348 -177355 -191050 -161953 -50887 26042 -9671 -67514 -68605 -90351 -198450
34485a98450r8302R802N5112O648j6259L51l6056q9714l6407P9047R5773K4415
$$ -198450 -296752 -286950 -231838 -225190 -241449 -241098 -277154 -366868 -403275 -324228 -228455 -204040
34473b04040J0259M1723j4399j11087o2852J05347J54676J3731j13297o9389O5828
$$ -204040 -193781 -152058 -166457 -277544 -340396 -235049 -80373 -66642 -179939 -249328 -183500
34462a83500J53700J53394P4997l8136q1276j1439M3671k9163j20564p5607L0261
$$ -183500 -29800 123594 198591 160455 79179 67740 111411 82248 -38316 -113923 -83662
34451h3662K7657m5934m2015J1309m874l6371K7233Q3050j9202j49241p9046J00334
$$ -83662 -56005 -101939 -143954 -132645 -137519 -173890 -146657 -63607 -82809 -232050 -311096 -210762
34439b10762J12554k7760n9556N0973P9938k3918p2504j7564j7457r1116o8019
$$ -210762 -98208 -125968 -185524 -134551 -54613 -78531 -151035 -168599 -186056 -277172 -345191
34428c45191O9447J34233P1541K5502L5775j1439j00484p7931L9010O1240l2770
$$ -345191 -275744 -141511 -69970 -44468 -8693 -20132 -120616 -198547 -159537 -98297 -131067
34417a31067o1669L0638J08778J15936J15951Q1707n2025j60160p8422O7934L7792
$$ -131067 -192736 -162098 -53320 62616 178567 260274 208249 48089 -30333 37601 75393
34406G5393r0656n1322J10906J15272k4724k7429J10079R9070p7186j12917L5185
$$ 75393 -15263 -66585 44321 159593 134869 107440 217519 316589 239403 126486 161671
34395A61671M9552j43408k07799o047J49451O1271l4999M1634Q7576n3702j69254
$$ 161671 211223 67815 -139984 -146031 3420 64691 29692 71326 158902 105200 -64054
34384f4054q0791K5840k8917q7029J1433J06452L3032n7741R081J05563N5228
$$ -64054 -144845 -119005 -147922 -234951 -223518 -117066 -84034 -141775 -132694 -27131 28097
34373B8097m5079l0567L9175M0467J7861L7934K7920m8407p3794j589L4158k7516
$$ 28097 -16982 -47549 -8374 32093 49954 87888 115808 67401 -6393 -7982 26176 -1340
34361a340o2895k6885m3551j15962o3685J18252J76912K6728r0613k8746M2300
$$ -1340 -64235 -91120 -134671 -250633 -314318 -196066 -19154 7574 -83039 -111785 -69485
34350f9485M490K071R6164R6578n5000j23156j3483L4371q6548j20974N1839J39710
$$ -69485 -64995 -62924 33240 129818 74818 -48338 -61821 -27450 -113998 -234972 -183133 -43423
34338d3423l4071j66659O22K13095J54287j8765j3315P6445K1847p7355k2502
$$ -43423 -77494 -244153 -243531 -30436 123851 105086 91771 168216 190063 112708 90206
34327I0206O7766l108j11526o4243J2265n8911j13306M8955K22503J13072j36005
$$ 90206 157972 154864 43338 -20905 -8640 -67551 -180857 -131902 90601 203673 67668
34316F7668j89786q2343o9144j16480j8619J38793J17384n58M6313J86731J22093
$$ 67668 -122118 -204461 -273605 -390085 -408704 -269911 -152527 -153085 -106772 79959 202052
34305B02052j22515k14773o0418R0116P9584J0192l0059o6918o9477J6274Q8599
$$ 202052 79537 -135236 -195654 -105538 -25954 -15762 -45821 -112739 -182216 -165942 -77343
34294g7343K2437p8132l4459Q5805Q8240p242m1465k5360o6173r4754J0736J32889
$$ -77343 -54906 -133038 -167497 -81692 6548 -694 -42159 -67519 -133692 -228446 -217710 -84821
34282h4821P6966p2378q8067K126l868r3917q3870K3426O6177M7606R3549J49237
$$ -84821 -7855 -80233 -168300 -166174 -170042 -263959 -347829 -324403 -258226 -210620 -117071 32166
34270C2166O1511q9613q5738M4431P2192l1051p4298o095L1320k377k143L7150
$$ 32166 93677 4064 -81674 -37243 34949 3898 -70400 -76495 -45175 -47552 -49695 -12545
34258a2545J8686k8177Q345P8060L7262p6170j02964m8466l8228m7827L8202J52442
$$ -12545 6141 -22036 -13691 64369 101631 25461 -77503 -125969 -164197 -212024 -173822 -21380
34246b1380J22985j3457n9910J3145N6219J8318k0223m4551q9832r2375N745Q7799
$$ -21380 101605 88148 28238 41383 97602 115920 95697 51146 -38686 -131061 -125316 -37517
34234c7517L4942m4634o116N4642r820r1460k1458Q7597L9655n8396J2728J46012
$$ -37517 -2575 -47209 -53325 1317 -8503 -99963 -121421 -33824 5831 -52565 -39837 106175
34222A06175P3081j36154j69633n128Q2797J5357j1587O2536P8046Q49j9255L7284
$$ 106175 179256 43102 -126531 -131659 -48862 -33505 -45092 17444 95490 96339 77084 114368
34210A14368K8244n3856p4131l6007n5142q4865Q551J41959J22051J566j6882
$$ 114368 142612 88756 14625 -21382 -76524 -161389 -152838 -10879 111172 112738 95856
34199I5856L3670l7153j80611j79780n9259k6952o5714L901J17020O3960n8856
$$ 95856 129526 92373 -88238 -268018 -327277 -354229 -419943 -416042 -299022 -235062 -293918
34188b93918K5379K29470J93507p1285j60899L7074J68168L8033r5687k7004P0597
$$ -293918 -268539 -39069 154438 83153 -77746 -40672 127496 165529 69842 42838 113435
34177A13435K1712n5342l4293m983l0307n920Q3654Q3244k7921o0345M1992R2544
$$ 113435 135147 79805 45512 40529 10222 4302 87956 171200 143279 82934 124926 217470
34165B17470O79q7927q1323o9357q7339n2877R399j2973n5075L9851J71558R3416
$$ 217470 218149 130222 48899 -20458 -107797 -160674 -151275 -164248 -219323 -179472 -7914 85502
34153H5502j29223j82484l6026L1269l7152n23J59342J49915q1092k02083o0622
$$ 85502 -43721 -226205 -262231 -230962 -268114 -268637 -109295 40620 -40472 -242555 -303177
34142c03177Q2142M9134J6480R9602J22394L179n8560J6878K1549j11870j41109
$$ -303177 -221035 -171901 -155421 -55819 66575 69754 11194 28072 49621 -62249 -203358
34131b03358K1993J09653j9150j19649j9107Q3988K3970l6261L2411O3408m6650
$$ -203358 -181365 -71712 -90862 -210511 -229618 -145630 -121660 -157921 -125510 -62102 -108752
34120a08752j02077J1278Q7563m561p0738J3747N1140p0111j15683N3420J74751
$$ -108752 -210829 -199551 -111988 -116549 -187287 -173540 -122400 -192511 -308194 -254774 -80023
34109h0023L6859j36771q8151M3181K8070m1817O849Q3299N6529L5934J13055
$$ -80023 -43164 -179935 -268086 -224905 -196835 -238652 -231803 -148504 -91975 -56041 57014
34098E7014J13277p8417k28131j10183J11479J65684Q0076J3743n0110j50297
$$ 57014 170291 91874 -136257 -246440 -134961 30723 110799 124542 74432 -75865
34088g5865j47780K4812J58019Q5575l5780k2552K4061l6791r9482l8407L8515
$$ -75865 -223645 -198833 -40814 44761 8981 -13571 10490 -26301 -125783 -164190 -125675
34077a25675J6689n110M5518L6321q1140j10423L0322J14213J2484n3925O7555
$$ -125675 -108986 -114096 -68578 -32257 -113397 -223820 -193498 -79285 -66801 -120726 -53171
34066e3171J57452L4456r5315k3414P7744j050j13698o2735K2957l2343r9039
$$ -53171 104281 138737 43422 20008 97752 96702 -16996 -79731 -56774 -89117 -188156
34055a88156j7221P5379K8970r773Q9502J36853k2179j66654p4006Q0491N6336
$$ -188156 -205377 -129998 -101028 -110801 -21299 115554 93375 -73279 -147285 -66794 -10458
34044a0458l6869j5900R480q6151j30073J0853J14652M494q8502M3790J65202
$$ -10458 -47327 -63227 -53747 -139898 -269971 -259118 -144466 -139972 -228474 -184684 -19482
34033a9482L1508j29030l5303J12809J6958j47664o2993J42033J55057M2906L7603
$$ -19482 12026 -117004 -152307 -39498 -22540 -170204 -233197 -91164 63893 106799 144402
34022A44402N0746q3232j74469j6009J43173N519j98463j08659R6222L8175j41605
$$ 144402 195148 111916 -62553 -78562 64611 70130 -128333 -236992 -140770 -102595 -244200
34011b44200n6249J82441J68325m8819r0324L7890K2773j07617p1786N6785j4380
$$ -244200 -300449 -118008 50317 1498 -88826 -50936 -28163 -135780 -207566 -150781 -165161
34000a65161j70773o6534J79805J49135r9474j16254J16194J63002n1346j25240
$$ -165161 -335934 -402468 -222663 -73528 -173002 -289256 -173062 -10060 -61406 -186646
33990a86646N8327J40846j9290j07143L5925J44962N4053l7712M763K7573n4534
$$ -186646 -128319 12527 -6763 -113906 -77981 66981 121034 83322 88085 115658 61124
33979F1124r8075m8128k8112m1969L3517J32061O4849r6181j04520J5432K7792
$$ 61124 -36951 -85079 -113191 -155160 -121643 10418 75267 -20914 -125434 -110002 -82210
33968h2210n3819j0602J21782J03050l9923n8989L8635K9040o7610m5705L4848
$$ -82210 -136029 -146631 -24849 78201 38278 -20711 17924 46964 -20646 -66351 -31503
33957c1503m3442j75975r1244R8649O1955j18831p2694J63510K01662J9269k9972
$$ -31503 -74945 -250920 -342164 -243515 -181560 -300391 -373085 -209575 -7913 11356 -18616
33946a8616Q4130K7928k02443k21995K9274J66164N0260l0734K7579o598j39336
$$ -18616 65514 93442 -109001 -330996 -301722 -135558 -85298 -116032 -88453 -95051 -234387
33935b34387p8444J53832J76078m9535j13730R1784J76827j7072j39482J057J16532
$$ -234387 -312831 -158999 17079 -32456 -146186 -54402 122425 105353 -34129 -33072 83460
33924H3460K0530o1757M038J6316q9557q0932O3609N1667j34508j35415J13684
$$ 83460 103990 42233 46271 62587 -26970 -107902 -44293 7374 -127134 -262549 -148865
33913a48865K18500L5570p9484M2683Q9471q8635j73334n906R8071l6298j15016
$$ -148865 69635 105205 25721 68404 157875 69240 -104094 -110000 -11929 -48227 -163243
33902a63243K9256J07721l8752j09844O6593J87395N0344p8846p836K6108j26404
$$ -163243 -133987 -26266 -65018 -174862 -108269 79126 129470 50624 42788 68896 -57508
33891e7508k00589m2077P9828L988k0641J26412J61112k8330j10311N9244J31397
$$ -57508 -258097 -300174 -220346 -216358 -236999 -110587 50525 22195 -88116 -28872 102525
33880A02525p0646j93748k5114J02013l8052j30404M3423J59684j1736j39812
$$ 102525 31879 -161869 -186983 -84970 -123022 -253426 -210003 -50319 -62055 -201867
33870b01867L2768J87203M1461j22149k9635O7902n4980j17461Q5787K09321n207
$$ -201867 -169099 18104 59565 -62584 -92219 -24317 -79297 -196758 -110971 98350 93143
33859I3143j98050m5519J36197R090j45606j762J65351L1767j25347K4723J96467
$$ 93143 -104907 -150426 -14229 -5139 -150745 -152507 12844 44611 -80736 -56013 140454
33848A40454K7892k10318j14830J12394Q8015m4047K2605J28201J7758j02199
$$ 140454 168346 -41972 -156802 -44408 43607 -440 22165 150366 168124 65925
33838F5925J1304J18961m834o9544J40075K39396m8501k69048j7348K85299J48015
$$ 65925 77229 196190 191356 121812 261887 501283 452782 183734 166386 451685 599700
33827E99700j00478J0600J83163p222k13344N368K65051J01233n9707K69653N80599
$$ 599700 499222 509822 692985 685763 472419 477787 742838 844071 784364 1054017 1634616
33816A634616L20802J01219N87808J061149P72777Q70927K722866M767574L735352
$$ 1634616 1955418 2056637 2644445 3705594 4478371 5349298 8072164 12839738 16575090
33807A6575090o03467m436494m644171k405395p97187o96535q14742m54140j95631
$$ 16575090 15971623 11535129 6890958 4485563 3688376 2991841 2177099 1722959 1527328
33798A527328l49889m36952k08911j1427m9094j17390r2529o6545l3455O6860
$$ 1527328 1177439 740487 531576 520149 471055 353665 261136 194591 161136 227996
33788B27996R7556o5218k29857j68619j193M5401K5981Q1162J00983n0432j95299
$$ 227996 325552 260334 30477 -138142 -139335 -93934 -67953 13209 114192 63760 -131539
33777a31539r2337J47103K22017Q0088q5480j47624j18459l1171O0023P3319K1656
$$ -131539 -223876 -76773 145244 225332 139852 -7772 -126231 -157402 -97379 -24060 -2404
33766b404J3023N5824L6339o0638j15429r4080p7518n5985M5341J35287N2116
$$ -2404 10619 66443 102782 42144 -73285 -167365 -244883 -300868 -255527 -120240 -68124
33755f8124j06950q5695Q7536J18943n3392j62288p2553M3418O9708J04707J61763
$$ -68124 -175074 -260769 -173233 -54290 -107682 -269970 -342523 -299105 -229397 -124690 37073
33744C7073R0694r0871j48540k4592O5189K2980L446O2634L7551j09313j75653
$$ 37073 127767 36896 -111644 -136236 -71047 -48067 -44621 18013 55564 -53749 -229402
33733b29402p0368M5192O7380Q3139J11878M0639j05013j43157m9252K0853L9475
$$ -229402 -299770 -254578 -187198 -104059 7819 48458 -56555 -199712 -248964 -228111 -188636
33722a88636J03629J36288k0994k23505j59764J10074K00307K1238j09167l2797
$$ -188636 -85007 51281 30287 -193218 -352982 -242908 -42601 -21363 -130530 -163327
33712a63327M6162J0842P409O5620J1288j28825r9084R4244J37318k7171q0904
$$ -163327 -117165 -106323 -98914 -33294 -22006 -150831 -249915 -155671 -18353 -45524 -126428
33701a26428Q5327J71236K5493r3226j8119M2405n2476j09099j1111M0692n8303
$$ -126428 -41101 130135 155628 62402 44283 86688 34212 -74887 -85998 -45306 -103609
33690a03609q7969O1996J38002l2190k15680j61163K4683J26655J36809J14831
$$ -103609 -191578 -129582 8420 -23770 -239450 -400613 -375930 -249275 -112466 2365
33680B365L3646n9486k1547J11068J27576J1802l1624K0548k8140j69578j61124
$$ 2365 36011 -23475 -45022 66046 193622 205424 173800 194348 166208 -3370 -164494
33669a64494L341M9722o1974o3101Q5179R4166q5810j35826L8422J25609j772
$$ -164494 -161153 -111431 -173405 -236506 -151327 -57161 -142971 -278797 -240375 -114766 -116538
33658a16538o7958L9510M9517j21051j51452O6987J74741l938j25584L0899J54159
$$ -116538 -184496 -144986 -95469 -216520 -367972 -300985 -126244 -130182 -255766 -224867 -70708
33647g0708k618j60441n2470Q5244j5734j59126q2617O8171O9756K7694P7324
$$ -70708 -73326 -233767 -286237 -200993 -216727 -375853 -458470 -390299 -320543 -292849 -215525
33636b15525P4971n4432o9888J33086K42957O0379j25599n2461O7976k040p9624
$$ -215525 -140554 -194986 -264874 -131788 111169 171548 45949 -6512 61464 59424 -20200
33625b0200K8343J07727l9838j75733o2715Q1453P504r0582K4744J54145M7304
$$ -20200 8143 115870 76032 -99701 -162416 -80963 -73459 -164041 -139297 14848 62152
33614F2152j05093l7222R1072L0711o7127K5651J37897L0680j15553l4955J05414
$$ 62152 -42941 -80163 10909 41620 -25507 144 138041 168721 53168 18213 123627
33603A23627J7511j55231r7459J05608J39407J579p4330n4041o0777p8114m3639
$$ 123627 141138 -14093 -111552 -5944 133463 135042 60712 6671 -54106 -132220 -175859
33592a75859m0336r4726l5038J68635K34487L4738j24293j1639J23817J8684j34098
$$ -175859 -216195 -310921 -345959 -177324 57163 91901 -32392 -44031 79786 98470 -35628
33581c5628q0791J9834n0287j19517K0024J68649Q2284o5122k9011M4051m9711
$$ -35628 -116419 -96585 -146872 -266389 -246365 -77716 4568 -60554 -89565 -45514 -95225
33570i5225j31110O539J52998N9698q4383k1056Q7995J2086p2995N3377J84543
$$ -95225 -226335 -219796 -66798 -7100 -91483 -112539 -24544 -12458 -85453 -32076 152467
33559A52467P1976q1957j5301Q4807k7514j48730l5084Q3332n0364j72255J7113
$$ 152467 224443 142486 127185 211992 184478 35748 664 83996 33632 -138623 -121510
33548a21510K34029R9432j58364j35664J2294n2426j40228O9816K99799J19471
$$ -121510 112519 211951 53587 -82077 -69783 -122209 -262437 -192621 107178 226649
33538B26649k07094j32674J96425K08650p5811j46049M3633O4259j33066j63604
$$ 226649 19555 -113119 83306 291956 216145 70096 113729 177988 44922 -118682
33528a18682K6592R4629j7755l2244O0755L249j60420j42050K0382N2381J354
$$ -118682 -92090 2539 -15216 -47460 13295 16544 -143876 -285926 -265544 -213163 -211809
33517b11809R9504K09126M4411k04734j41984R5222O5815j54135j22439J22026
$$ -211809 -112305 96821 141232 -63502 -205486 -110264 -44449 -198584 -321023 -198997
33507a98997J38039p2958q6816J16326J28681q1396j14148Q0325J17684o7099
$$ -198997 -60958 -133916 -220732 -104406 24275 -57121 -171269 -90944 26740 -40359
33497d0359j11655N4947R1659p0864j06680N5544J11512p972l4721O6569M6434
$$ -40359 -152014 -97067 -5408 -76272 -182952 -127408 -15896 -23868 -58589 7980 54414
33486E4414p1541q563J69344J11692j36233j71571K7000P4848p5405o4419J45519
$$ 54414 -17127 -25690 143654 255346 119113 -52458 -25458 49390 -26015 -90434 55085
33475E5085J77956l4422j23750J1733N2167q9145j14953L8169P5126n4712o2613
$$ 55085 233041 198619 74869 86602 138769 49624 -65329 -27160 47966 -6746 -69359
33464f9359P2338L6477j78585k03820L3171J79972J01682M5536Q8959L3333r1604
$$ -69359 2979 39456 -139129 -342949 -309778 -129806 -28124 17412 106371 139704 48100
33453D8100l3994J26502N5689j83091j97982Q130N7607o8344k9456J47708R5976
$$ 48100 14106 140608 196297 13206 -184776 -176646 -119039 -187383 -216839 -69131 26845
33442B6845j32795j15139J17408J10797j20263q8702K10857K36342r2474k20540
$$ 26845 -105950 -221089 -103681 7116 -113147 -201849 9008 245350 152876 -67664
33432f7664L4168J90209K7691p3603M8807M9410j53576j67380O7311J06914j18097
$$ -67664 -33496 156713 184404 110801 159608 209018 55442 -111938 -44627 62287 -55810
33421e5810j30760J43866J72650j61441k72811N2654K47294J6277j44788O6040
$$ -55810 -186570 -42704 129946 -31495 -304306 -251652 -4358 11919 -132869 -66829
33411f6829J86687q6784k95614q6325J44998L5027j02979L1099J44809N433o3922
$$ -66829 119858 33074 -262540 -348865 -203867 -168840 -271819 -240720 -95911 -90478 -154400
33400a54400J30266K02255n5154k03624K1886J81201l2794j87471O1930K86975
$$ -154400 -24134 178121 122967 -80657 -58771 122430 89636 -97835 -35905 251070
33390B51070P2651k14231j13384J20419O9362q4635r221J16397J8565j05632k1100
$$ 251070 323721 109490 -3894 116525 185887 101252 92031 208428 226993 121361 100261
33379A00261N3710p7701j47318L6612J53758k7021j78113l5112J00114k9482j28747
$$ 100261 153971 76270 -71048 -34436 119322 92301 -85812 -120924 -20810 -50292 -179039
33368a79039M3023J72054O535j40673j0025J04437l5202j39646j0627M1231j30429
$$ -179039 -136016 36038 42573 -98100 -108125 -3688 -38890 -178536 -189163 -147932 -278361
33357b78361j37199J56527K52337n5830k03496J19187L36165L5694k39833k521
$$ -278361 -415560 -259033 -6696 -62526 -266022 -146835 189330 225024 -14809 -17330
33347a7330K63409L0787k66654p5246K17110L4424k82380j31932K17437J68102
$$ -17330 246079 276866 10212 -65034 152076 186500 -95880 -227812 -10375 157727
33337A57727j00763p0365R2623n5585k75383q0845K80963K44865n9163j19681
$$ 157727 56964 -13401 79222 23637 -251746 -332591 -51628 193237 134074 14393
33327A4393N232o1892j89785l5303J89181R1532j14722j7920J77879N8394j75224
$$ 14393 19625 -42267 -232052 -267355 -78174 13358 -101364 -119284 58595 116989 -58235
33316e8235j02110R4330J3114j56123k6588J90345R5270j06139k4038J32951o86
$$ -58235 -160345 -66015 -52901 -209024 -235612 -45267 50003 -56136 -80174 52777 52091
33305E2091j80947m4646J19833o7581k58651R84L46412K14124j20171p8877J44975
$$ 52091 -128856 -173502 -53669 -121250 -379901 -378917 -32505 181619 61448 -17429 127546
33294A27546M0630j84461m2621K24292J07548j46636k2185K14782K2879l07650
$$ 127546 168176 -16285 -58906 165386 272934 126298 104113 318895 341774 34124
33284C4124j68937J77975Q2049k41319j21431K69969K45820r4618j09233J32274
$$ 34124 -134813 43162 125211 -116108 -237539 32430 278250 183632 74399 206673
33274B06673N6060k21623j31764J64998O3767k55071j32583K53650J64778k90301
$$ 206673 262733 41110 -90654 74344 138111 -116960 -249543 4107 168885 -121416
33264a21416l25132P6638J89264o7798p1803K20838K20012q1721r3982J73908
$$ -121416 -446548 -369910 -180646 -248444 -320247 -99409 120603 38882 -55100 118808
33254A18808J37318j56469r5327K36045J41503l22040l65458Q5482K64546j2692
$$ 118808 256126 99657 4330 240375 381878 59838 -305620 -220138 44408 31716
33244C1716r9544J65670J84463j63071k54482O7350K13148j026p2906J15097Q6212
$$ 31716 -67828 97842 282305 119234 -135248 -67898 145250 144224 71318 186415 272627
33233B72627j85517j60743J62977J78585j44424j64998J83605K42029j09024k31765
$$ 272627 87110 -73633 89344 267929 123505 -41493 142112 384141 275117 43352
33223D3352L0174J00710j42025j41492J63276J61995k01352k53626J19098K40580
$$ 43352 73526 174236 32211 -109281 53995 215990 14638 -238988 -119890 120690
33213A20690n4711j37533J44402J79425j45262j77944J94354K69008j14860k41360
$$ 120690 65979 -71554 72848 252273 107011 -70933 123421 392429 277569 36209
33203C6209J04116K30706r7526k11799J26371K47973j07702k87800j0421J19019
$$ 36209 140325 371031 273505 61706 188077 436050 328348 40548 30127 149146
33193A49146j45519k01624J54553K69331p8614k10932J17164K15780j73518l28478
$$ 149146 3627 -197997 -43444 225887 147273 -63659 53505 269285 95767 -232711
33183b32711O2145K76069o0379k75423K1403K12120o4546k06085J10310K51542
$$ -232711 -170566 105503 45124 -230299 -208896 3224 -61322 -267407 -157097 94445
33173I4445j02678k80724P9334L11804K5701j49268J46480K59832j56247l82639
$$ 94445 -8233 -288957 -209623 102181 127882 -21386 125094 384926 228679 -153960
33163a53960l108K64497n2365k73981P3330K98765j01289m11576k8776L96911
$$ -153960 -157068 107429 55064 -218917 -145587 153178 51889 -359687 -388463 8448
33153H448J87947j58356l2325J50530q8759k85974j2708K05123n8015k28524J30936
$$ 8448 196395 38039 5714 156244 67485 -218489 -231197 -26074 -84089 -312613 -181677
33142a81677L87742L3111l07397o9094J78824j02941l33219K6810L57401O0537
$$ -181677 206065 239176 -68221 -137315 41509 -61432 -394651 -367841 -10440 50097
33132E0097k56504N6546M32850J81987k08008o4384J95801j3959k57876m780K44294
$$ 50097 -206407 -149861 282989 464976 256968 192584 388385 374426 116550 111770 356064
33121C56064n4326l61805j01207J89857n9741k75721J24165M86389J13761l57628
$$ 356064 301738 -60067 -161274 28583 -31158 -306879 -182714 303675 417436 59808
33111E9808j22067K92940Q1653k94700o3382L22785Q3159l56734k08117J60041
$$ 59808 -62259 230681 312334 17634 -45748 277037 360196 3462 -204655 -44614
33101d4614R054k94083n0571L35052J47876k10520k9766K83822L5435l25701p1416
$$ -44614 -35560 -329643 -380214 -45162 102714 -107806 -137572 146250 181685 -144016 -215432
33090b15432L28160Q6996l49230j54815K79305J39313k14772j0824L57171J04574
$$ -215432 112728 199724 -149506 -304321 -25016 114297 -100475 -111299 245872 350446
33080C50446l47233j58190K84120J24531k83842j04246L03845R9307l43473j43250
$$ 350446 3213 -154977 129143 253674 -30168 -134414 169431 268738 -74735 -217985
33070b17985L52121K37242j97457r1247K57861K0849m40160k31741K98721K10312
$$ -217985 134136 371378 173921 82674 340535 361384 -78776 -310517 -11796 198516
33060A98516k15282p7845L27808J10629l94279k38704K70731J69532k61870p4227
$$ 198516 -16766 -94611 233197 343826 -50453 -289157 -18426 151106 -110764 -184991
33050a84991M25320K49029k97357j75805L46022K09103l49940k50813L12383K50999
$$ -184991 240329 489358 192001 16196 362218 571321 221381 -29432 282951 533950
33040E33950k92887k51643K69892K44929k35013k03624K03047N2334m15664j92991
$$ 533950 241063 -10580 259312 504241 269228 65604 268651 320985 -94679 -287670
33030b87670M31314L15479l23015k83947L08448K70585l14424k80945L00351K63536
$$ -287670 143644 459123 136108 -147839 160609 431194 116770 -164175 136176 399712
33020C99712l26586k80207L67141M03808j99076k70500K35455K01922l57738k95795
$$ 399712 73126 -207081 160060 563868 364792 94292 329747 531669 173931 -121864
33010a21864L43424L38545l01470l16132L24485L28271l77691m58178K52218M27999
$$ -121864 221560 560105 258635 -57497 266988 595259 217568 -240610 11608 439607
33000D39607j95509l76739J78670L20739k04340k88236K62051L24896k57385l33825
$$ 439607 244098 -132641 46029 366768 162428 -125808 136243 461139 203754 -130071
32990a30071K37818K79180l30188l52643L43753M51735k32121l93282K30560L59386
$$ -130071 107747 386927 56739 -295904 47849 499584 267463 -125819 104741 464127
32980D64127k74668m06160K19496L27017l22652m19805K73654M01458k91750m00891
$$ 464127 189459 -216701 2795 329812 7160 -412645 -138991 262467 -29283 -430174
32970d30174L60166N28741k48632m77743K79139N34999k20725n35193J52279M43880
$$ -430174 -70008 458733 210101 -267642 11497 546496 325771 -209422 -57143 386737
32960C86737k22778m79014K21255N04438j74972m38300K49988M84180k68048n48345
$$ 386737 163959 -315055 -93800 410638 235666 -202634 47354 531534 263486 -284859
32950b84859K07194M97925k82239n88682K47785O40607j85950o53923J26402O52316
$$ -284859 -77665 420260 138021 -450661 -202876 437731 251781 -402142 -275740 376576
32940C76576l1552n29780J03072N51829o6890m53699K13636N94381j22159n57447
$$ 376576 345024 -184756 -81684 470145 403255 -50444 163192 757573 635414 77967
32930G7967J12368M99448j97732n40219K63025O68779j96390p41272K0201N39968
$$ 77967 190335 689783 492051 -48168 214857 883636 687246 -54026 -33825 506143
32920E06143j97816o60228J72985P33397n2743o12572J74199P42356n7397o56360
$$ 506143 308327 -351901 -178916 554481 501738 -110834 63365 805721 748324 91964
32910I1964J27884P27401o7689o92217P7305O67819j45926p54558Q6184P26793
$$ 91964 219848 947249 879560 187343 264648 932467 786541 31983 118167 844960
32900H44960r8132o86420K45481Q92843j12848q80702R0930Q78486j38825r98783
$$ 844960 746828 60408 305889 1198732 1085884 205182 296112 1174598 1035773 36990
32890C6990Q0008J140357K10353q66434k6028R97186J38436q43584K28027J573720
$$ 36990 116998 1257355 1467708 601274 575246 1572432 1710868 867284 1095311 2669031
32880B669031P14627q94195p33706J64800k85988r72066q5689R10601R4181r33558
$$ 2669031 3383658 2489463 1755757 1920557 1634569 662503 576814 1487415 1581596 648038
32870F48038j06471R46968Q2629j024574j36552J037603J56270j056258j59786
$$ 648038 541567 1488535 1571164 546590 410038 1447641 1603911 547653 387867
32861C87867J110778K12415j117687k25135J175608L32136j082286k53015J169030
$$ 387867 1498645 1711060 593373 368238 1543846 1875982 793696 540681 1709711
32852A709711L23109j123537k27808J343400N52929r66659r0332J679676J296504
$$ 1709711 2032820 909283 681475 2024875 2577804 1611145 1520813 3200489 4496993
32843D496993J32325P37136J154156j089174l034380j189392J440867M50603j783466
$$ 4496993 4629318 5366454 6520610 5431436 2397056 1207664 2648531 3099134 1315668
32834A315668p23852J550759N09805j792898o92169J772093P46567j768988p43438
$$ 1315668 591816 2142575 2652380 859482 167313 1939406 2685973 916985 173547
32825A73547J852819Q29812j807428o69484K144870R38906k114393r15484K369532
$$ 173547 2026366 2856178 1048750 379266 2524136 3463042 1348649 433165 2802697
32816B802697J212855k286505j165756K597223J630317k225551j227775K857511
$$ 2802697 4015552 1729047 563291 3160514 4790831 2565280 1337505 4195016
32808D195016J870574k457293j455627L203357K301500k501259j331812M103259
$$ 4195016 6065590 3608297 2152670 5356027 7657527 5156268 3824456 7927715
32800G927715L048838k787117j480100N517742N027389j973647j164936O786951
$$ 7927715 10976553 8189436 6709336 12227078 17254467 15280820 14115884 20902835
32792B0902835O262806j947014P2038J1763173J2197161J592018N436280K4646711
$$ 20902835 27165641 25218627 25290665 37053838 49250999 50843017 56279297 80926008
32784H0926008K7591799J3780100L2785719R8769783J34947008O5178509o7980657
$$ 80926008 108517807 122297907 155083626 253853409 388800417 453978926 385998269
32777C85998269j44298327j14523587m4497755j1075861j7303900k5431905j7972465
$$ 385998269 241699942 127176355 82678600 71602739 54298839 28866934 10894469
32770A0894469J076094K5221004L8998887K2865990j3986856l3295224j8614242
$$ 10894469 11970563 37191567 76190454 99056444 85069588 51774364 33160122
32763C3160122J509423l91456j1418373q086810K861462J999109o319638n171493
$$ 33160122 34669545 34278089 22859716 14772906 17634368 19633477 13313839 8142346
32755H142346K677233K366555m243715l850655K317226K227843l295949l200492
$$ 8142346 10819579 13186134 8942419 5091764 7408990 9636833 6340884 3140392
32747C140392K040113K190995k587712k793953J680803K022126k063018k379397
$$ 3140392 5180505 7371500 4783788 1989835 3670638 5692764 3629746 1250349
32739A250349J472050J831148j735398j975154J571907J925965j513093k055678
$$ 1250349 2722399 4553547 2818149 842995 2414902 4340867 2827774 772096
32731G72096J093826J637025j314240j827903J003967J540676j137870j635510
$$ 772096 1865922 3502947 2188707 360804 1364771 2905447 1767577 132067
32723A32067R77235J498161j040970j614852Q15641J424362q90837j514475O97878
$$ 132067 1109302 2607463 1566493 -48359 767282 2191644 1300807 -213668 484210
32714D84210J346183p17636j285787P56449J323755p04717j354434N41125J168029
$$ 484210 1830393 1112757 -173030 583419 1907174 1202457 -151977 389148 1557177
32705A557177o34884j191442O19309J187639o13345j228590N15189J139788n80009
$$ 1557177 922293 -269149 350160 1537799 924454 -304136 211053 1350841 770832
32696G70832j245225M49026J225692k92154j007447M38362J077581m05625j108048
$$ 770832 -474393 -25367 1200325 908171 -99276 339086 1416667 1011042 -97006
32687i7006K94979R88347l50511r94848L49622R97149l55922j069572J90438Q58959
$$ -97006 197973 1186320 835809 -159039 190583 1187732 831810 -237762 -47324 811635
32677H11635l95882j043302K81265J077774j14774r23397J49786Q86245j59298
$$ 811635 415753 -627549 -346284 731490 616716 -306681 -156895 729350 570052
32668E70052q51523K01713Q99663j30947q16362K19453R26520j07142q89952K0568
$$ 570052 -281471 -79758 819905 688958 -127404 92049 1018569 911427 21475 42043
32658D2043P22199k08229r13633L4197Q23034r761p54370K4766O97465j06853
$$ 42043 764242 556013 -357620 -323423 499611 489850 -264520 -239754 457711 350858
32648C50858p67689O6606P78030o976p08225N9152P58370k42p19426J890P14140
$$ 350858 -416831 -350225 427805 420829 -287396 -228244 530126 529884 -189542 -187652 526488
32637E26488M265p36498q1613O71836J33087m95224N6502N63624j61949p85913
$$ 526488 530753 -205745 -287358 384478 517565 22341 78843 642467 480518 -305395
32627c05395n2970O84532Q2551n81186L8128O91573K5126p22101j43166N86347
$$ -305395 -358365 326167 408718 -172468 -134340 557233 582359 -139742 -282908 303439
32617C03439M1574o63068r8725O70397J96436n42888j26575N36631Q1115o05104
$$ 303439 345013 -318055 -416780 253617 450053 -92835 -219410 317221 398336 -206768
32607b06768j80423M96628J11720n03538p2583N72499J62335m92353j41502M28761
$$ -206768 -387191 109437 221157 -282381 -354964 217535 379870 -112483 -253985 174776
32597A74776K0963n42530o5427N93313J83820m67753j00037M91897O4599n72488
$$ 174776 195739 -346791 -412218 181095 364915 -102838 -202875 289022 353621 -218867
32587b18867j51024N24010J47072n07449j13565N79534K16663m93695j74593N13922
$$ -218867 -369891 154119 301191 -206258 -319823 259711 476374 -17321 -191914 322008
32577C22008J81451n63014l12686M05870K16388m20303j95735M36371K09266m10464
$$ 322008 503459 -59555 -372241 33629 250017 -170286 -366021 70350 279616 -130848
32567a30848j68194M58949K07771m47461k27184M12325J83865m65205k21694M87819
$$ -130848 -299042 159907 367678 -79783 -306967 105358 289223 -175982 -397676 90143
32557I0143L01503m28337l26870L54236K96756l07420k32529L08675J38447m71331
$$ 90143 391646 -36691 -363561 -9325 287431 -19989 -252518 56157 194604 -276727
32547b76727l01439L84690L26543k74885j80969M29578L26536l28601k94622L11198
$$ -276727 -578166 -193476 133067 -141818 -322787 106791 433327 104726 -189896 121302
32537A21302K54868l90620l97273K38811L49793j31750j74897K23387J00295m19306
$$ 121302 376170 -14450 -411723 -172912 176881 45131 -129766 93621 193916 -225390
32527b25390k89868L50567L66248k00027k38418K58438K44028k64426k28253L17439
$$ -225390 -515258 -164691 201557 1530 -236888 21550 265578 1152 -227101 90338
32517I0338L08790k43290k76071K17996J87318l67567l61699K41639L36248j90411
$$ 90338 399128 155838 -120233 97763 285081 -82486 -444185 -202546 133702 -56709
32507e6709k73741K36269L22914j76888k86405J63041K40703j96904k34574K45730
$$ -56709 -330450 -94181 228733 51845 -234560 -71519 169184 -27720 -262294 -16564
32497a6564L14967j49076k13424K49447K95267k25271l58921R8187K41533j44527
$$ -16564 298403 149327 -64097 185350 480617 255346 -103575 -5388 236145 91618
32487I1618k11006K17288K87621j65946k85477J05304J73064k29781k60389K01554
$$ 91618 -119388 97900 385521 219575 -65902 39402 212466 -17315 -277704 -76150
32477g6150K63902k15368l07701J81371L21182j39563l07458R5657K29681j56493
$$ -76150 187752 -27616 -335317 -153946 167236 27673 -279785 -184128 45553 -110940
32467a10940k27855K42335L77128r0294k80437J20013K68876j49656l04796J22369
$$ -110940 -338795 -96460 280668 190374 -90063 29950 298826 149170 -155626 -33257
32457c3257K90509j53724l72043N1027L34671K6226j99146N5796J69415j59419
$$ -33257 257252 103528 -268515 -217488 117183 143409 -55737 59 169474 10055
32447A0055k69832R8861K26357j57464k86248J50371L66397n178k04557J55882
$$ 10055 -259777 -160916 65441 -92023 -378271 -227900 138497 133319 -71238 84644
32437H4644L35070o3801l01380M7725K64860r5264l42686k8916J77088j61490
$$ 84644 419714 355913 54533 102258 367118 271854 -70832 -99748 77340 -84150
32427h4150l60066M4655L58226M3841k69327j2589K80290P6454j56160L8022J90954
$$ -84150 -444216 -399561 -41335 2506 -266821 -279410 880 77334 -78826 -40804 150150
32416A50150r6265l12851m9872J87217n412j46974J05238K20413j26179l21194
$$ 150150 53885 -258966 -308838 -121621 -127033 -274007 -168769 51644 -74535 -395729
32406c95729L4486L25176Q2129j46235Q9786K58257o3363l07783j7366K44590
$$ -395729 -361243 -36067 46062 -100173 -10387 247870 184507 -123276 -140642 103948
32396A03948j5253k69076k2028K21311k2517k51026J6511K66936k216k81518l5382
$$ 103948 88695 -180381 -202409 18902 -3615 -254641 -238130 28806 26590 -254928 -290310
32385b90310K59927N6033k12560j3002K43195M7996j82821N0469L10658N6939
$$ -290310 -30383 25650 -186910 -199912 43283 91279 -91542 -41073 269585 326524
32375C26524l01974j87061R1573K6656j02647J02567K76820K5770k14592M361
$$ 326524 24550 -162511 -70938 -44282 -146929 -44362 232458 258228 43636 47997
32365D7997K35388j4295l06472j06729J85372K4154k32841o3403J84713J1206
$$ 47997 283385 269090 -37382 -144111 41261 65415 -167426 -230829 -46116 -34910
32355c4910k21174j1915K58173O7248j98732J0481L10729J04785k58971j42440
$$ -34910 -256084 -267999 -9826 57422 -141310 -130829 179900 284685 25714 -116726
32345a16726J86765J11152j63004p4917J84299R8683j43520p4696R4019o5563
$$ -116726 70039 181191 18187 -56730 127569 226252 82732 8036 102055 36492
32335C6492k80940r7737J96245J22844m9673J17321K89123j1067l90835k38164
$$ 36492 -244448 -342185 -145940 -23096 -72769 44552 333675 322608 -68227 -306391
32325c06391J54072J45232r7876m0668J46449J0951j89699J6871L14193J49447
$$ -306391 -152319 -7087 -104963 -145631 818 11769 -177930 -161059 153134 302581
32315C02581j87883j03100J68806M8997k37585j11453K09868J32014j62663j04054
$$ 302581 114698 11598 180404 229401 -8184 -119637 90231 222245 59582 -44472
32305d4472J28929n881k81431j07521K87618K39411j14090j26573J28485P7195
$$ -44472 84457 78576 -202855 -310376 -22758 216653 102563 -24010 104475 181670
32295A81670j87961j15039J79157J23666j85757j85886N7978M2161j31272O957
$$ 181670 -6291 -121330 57827 181493 -4264 -190150 -132172 -90011 -221283 -214326
32285b14326K64625J09476k35430j50298J82878J06582k33523j50806K48862K48096
$$ -214326 50299 159775 -75655 -225953 -43075 63507 -170016 -320822 -71960 176136
32275A76136j17239j44116J76922J63936k15892k73214Q8030K07616q0151k05810
$$ 176136 58897 -85219 91703 255639 39747 -233467 -145437 62179 -17972 -223782
32265b23782J388O5228j15936q5083J95323K27266l0407p3064J37568R2772k27510
$$ -223782 -222394 -157166 -273102 -358185 -162862 64404 33997 -39067 98501 191273 -36237
32254c6237k67166L8695J33126r2880j19170J62796K36223l5469j65244J0008
$$ -36237 -303403 -264708 -131582 -224462 -343632 -180836 55387 19918 -145326 -135318
32244a35318P9316p4573q0413R6662N6107j75145j10147K34494K83642m8133k00717
$$ -135318 -56002 -130575 -210988 -114326 -58219 -233364 -343511 -109017 174625 126492 -74225
32233g4225p362O7200j11878j14905J37653J79713p4245j39789R4276J56532o9704
$$ -74225 -81587 -14387 -126265 -241170 -103517 76196 1951 -137838 -43562 112970 43266
32222D3266j24029J06771J65509n8639j11558J07149J30220j42574k18553L7510
$$ 43266 -80763 26008 191517 132878 21320 128469 258689 116115 -102438 -64928
32212f4928J43810o0510j30567Q0891J48177m5625o7347J68267J82679j17895
$$ -64928 78882 18372 -112195 -31304 116873 71248 3901 172168 354847 236952
32202B36952k10398M8942J37733j24792k32225K1189J53461n2126j42170Q6104
$$ 236952 26554 75496 213229 88437 -143788 -122599 30862 -21264 -163434 -77330
32192g7330J81008n6838j68879N9706J79775l7740j71891m819O6477j30883j69235
$$ -77330 103678 46840 -122039 -62333 117442 79702 -92189 -97008 -30531 -161414 -330649
32181c30649J14343K50043L5063p8297J07204J40011j47959k42398O9025K42844
$$ -330649 -216306 33737 68800 -9497 97707 237718 89759 -152639 -83614 159230
32171A59230j0630j93134L540J21953j19025k40173N7510K77688O1740j49923
$$ 159230 148600 -44534 -40994 80959 -38066 -278239 -220729 56959 118699 -31224
32161c1224o561Q8235j57612k78689M4133K96383O3348j85374J1121K40560K8539
$$ -31224 -37785 50450 -107162 -385851 -341718 -45335 18013 -167361 -156240 84320 112859
32150A12859k55966j18119J47810P2179j16268k1924J31851J4482j13582M6847
$$ 112859 -143107 -261226 -113416 -41237 -157505 -179429 -47578 -33096 -146678 -99831
32140i9831J80493k3404k06962j5160J90372J6732j92568k5683J92878M3050j67213
$$ -99831 80662 57258 -149704 -164864 25508 42240 -150328 -176011 16867 59917 -107296
32129a07296k3047J60489m2894k98715j21285J90955J09124j44938n9427J94329
$$ -107296 -130343 30146 -12748 -311463 -432748 -241793 -132669 -277607 -337034 -142705
32119a42705J40254p8707l4964J22119L720j95421o5754J83210J02516j26378
$$ -142705 -2451 -81158 -116122 5997 9717 -185704 -251458 -68248 34268 -92110
32109i2110m1025K11300J68810o7920q0329M4245m8148k06520o5116J71919O0720
$$ -92110 -133135 78165 246975 179055 98726 142971 94823 -111697 -176813 -4894 55826
32098E5826k25755j92921O8338R3559o4422R884K43099K05958n4823j17618J5027
$$ 55826 -169929 -362850 -294512 -200953 -265375 -255491 -12392 193566 138743 21125 36152
32087C6152q556j44366m6305K04653K05818k3896j07524j6174l3259j28924m2074
$$ 36152 27596 -116770 -163075 41578 247396 223500 115976 99802 66543 -62381 -104455
32076a04455J30599Q4804p9622l8520J15964N7773j20950r5502L8044l2103j69648
$$ -104455 26144 110948 31326 -7194 108770 166543 45593 -49909 -11865 -43968 -213616
32065b13616l2030K15451J55897q7122o7570J34444O8517k05187k01773Q4867
$$ -213616 -245646 -30195 125702 38580 -28990 105454 173971 -31216 -232989 -148122
32055a48122J67396n3734j64659k1423P1114Q988K6485J33820P3982j12932j07767
$$ -148122 19274 -34460 -199119 -220542 -149428 -140440 -113955 19865 93847 -19085 -126852
32044a26852P6984J12066j8826j5843J15604O3738j61408k15514n3646K1713m2740
$$ -126852 -49868 62198 43372 27529 143133 206871 45463 -170051 -223697 -201984 -244724
32033b44724O46J45764J16009p6712j22202K2292R2991L3729K4773M6773n2076
$$ -244724 -244078 -98314 17695 -59017 -181219 -158927 -65936 -32207 -7434 39339 -12737
32022a2737j35650J9450K12368R5714j60481j17178J43177J58809p3252j23338
$$ -12737 -148387 -128937 83431 179145 18664 -98514 44663 203472 130220 6882
32012F882N5339P5318j19377j63994J1017P6892k7421r457J39597R7877j31766
$$ 6882 62221 137539 18162 -145832 -134815 -57923 -85344 -94801 44796 142673 10907
32001A0907j83158r548M9702n8550k6356J58058J52547o4286j29777J4752M3527
$$ 10907 -172251 -181799 -132097 -190647 -217003 -58945 93602 29316 -100461 -85709 -42182
31990d2182p4787j1532K19583K06646q9786k15720k1729J11926Q611l8300Q5981
$$ -42182 -116969 -128501 91082 297728 207942 -7778 -29507 82419 91030 52730 138711
31979A38711Q7988j06302j55376M3364J36555k5717j27468k958Q1006k7830j11816
$$ 138711 226699 120397 -34979 8385 144940 119223 -8245 -11203 69803 41973 -69843
31968f9843o5374o8180j23004l107K10950J61077j02268j26083J25884J73164
$$ -69843 -135217 -203397 -326401 -329508 -118558 42519 -59749 -185832 -59948 113216
31958A13216r8516k09140L3228J85328l397j59077k1041R9903k5071j06804N0661
$$ 113216 14700 -194440 -161212 24116 20719 -138358 -159399 -59496 -84567 -191371 -140710
31947a40710J44161k1321j31913K5999J47970N848j18026L227J05851k3524j23447
$$ -140710 3451 -17870 -149783 -123784 24186 30034 -87992 -84765 21086 -2438 -125885
31936a25885J1938J16941j5661j18667J6558J14749m7091j91001o3828Q5694m82
$$ -125885 -113947 2994 -12667 -131334 -114776 -27 -47118 -238119 -301947 -216253 -216735
31925b16735j03279J7565J48013N3626n8695L8049J42756M1395o1378L1886Q7310
$$ -216735 -320014 -302449 -154436 -100810 -159505 -121456 21300 62695 1317 33203 120513
31914A20513j01458k55078q7549J53863J14666o4484n3867Q8921J15875N8090
$$ 120513 19055 -236023 -323572 -169709 -55043 -119527 -173394 -84473 31402 89492
31904H9492N9866L5170j01766j57886n93J31115K9864r0291J0740J46938N2687
$$ 89492 149358 184528 82762 -75124 -75717 55398 85262 -5029 5711 152649 205336
31893B05336j32143j33316j7073m287o9026p6553o7090q9473k6263J35188J68162
$$ 205336 73193 -60123 -77196 -81483 -150509 -227062 -294152 -383625 -409888 -274700 -106538
31882a06538O912p2134O5724J47423l034j27143k2801P6762k4924r1206P4768
$$ -106538 -99626 -171760 -106036 41387 38353 -88790 -111591 -34829 -59753 -150959 -76191
31871g6191K08295O2506j21198o7610K8886p8646j80889j6077J97440J38986m9216
$$ -76191 132104 194610 73412 5802 34688 -43958 -224847 -240924 -43484 95502 46286
31860D6286o7950J548m8423r2726M1217J50538R873j65709r4644N1979m938j11828
$$ 46286 -21664 -20116 -68539 -161265 -120048 30490 40363 -125346 -219990 -168011 -172949 -284777
31848b84777J374J72355J00561q9841j00067l175l1992q6509L7434J86060J19670
$$ -284777 -283403 -111048 -10487 -100328 -200395 -203570 -235562 -322071 -284637 -98577 21093
31837B1093j0203M5408J31748l753j77852q2967J21912Q4349j06878j13395L3662
$$ 21093 10890 56298 188046 184293 6441 -76526 45386 129735 22857 -90538 -56876
31826e6876N3500l3014n339P7988J7310q3371n558J28746P2872o8128n1595K9134
$$ -56876 -3376 -36390 -41729 36259 53569 -29802 -35360 93386 166258 98130 46535 75669
31814G5669l3847j08013J0944J28502j9378k18954j19254J24146J26621l8621
$$ 75669 41822 -66191 -55247 73255 53877 -165077 -284331 -160185 -33564 -72185
31804g2185l5354P5502L275j39311k5474K17155J84842p3159j48997k872M1210
$$ -72185 -107539 -32037 -28762 -168073 -193547 23608 208450 135291 -13706 -16578 24632
31793B4632n4669k9186J00818O9290p7452n1081R0125K3468k03058k18607M812
$$ 24632 -30037 -59223 41595 110885 33433 -17648 72477 95945 -107113 -325720 -320908
31782c20908J22447M5585K5317J08913P7512o2547o7761N5431O6232k6026k426
$$ -320908 -198461 -152876 -127559 -18646 58866 -3681 -71442 -16011 50221 24195 21769
31771B1769Q7133J1048j39574p8950J06229Q2170j04722j10550N5826O9775p1433
$$ 21769 108902 119950 -19624 -98574 7655 89825 -14897 -125447 -69621 154 -71279
31760g1279p0000N1116j0244j92200j27557J45382J98737k0453j07754N5677J39480
$$ -71279 -141279 -90163 -100407 -292607 -420164 -274782 -76045 -96498 -204252 -148575 -9095
31749i095K6280j4293Q7311P5144p0109o9309O6010J8129j83552j58829Q4747
$$ -9095 17185 2892 90203 165347 95238 25929 91939 110068 -73484 -232313 -147566
31738a47566J09982j34071j83702Q6243K24527L8847p3837R2942J74349l6217
$$ -147566 -37584 -171655 -355357 -269114 -44587 -5740 -79577 13365 187714 151497
31728A51497j75131l084J43719L770j22919K9165J78845L7099j57556j02330L5246
$$ 151497 -23634 -26718 117001 120771 -2148 27017 205862 242961 85405 -16925 18321
31717A8321k039o8833M7446J74300P0185j26889j57193o2537j7199r393K2948
$$ 18321 16282 -52551 -5105 169195 239380 112491 -44702 -107239 -124438 -133831 -110883
31706a10883J3257m2402r822Q3267J8293j77890j77447Q0595K17762L7647j47010
$$ -110883 -97626 -140028 -149850 -66583 -48290 -226180 -403627 -323032 -105270 -67623 -214633
31695b14633p2957N7408K0506k5793P8778J43596Q491j13299k4417R1199K9769
$$ -214633 -287590 -230182 -209676 -235469 -156691 -13095 -4604 -117903 -142320 -51121 -21352
31684b1352o2425r890N1960j8692o9728K4298Q2628l1139j20796k3931P7357J1314
$$ -21352 -83777 -93667 -41707 -60399 -130127 -105829 -23201 -54340 -175136 -199067 -121710 -110396
31672a10396o6645o587M5283j8648j8390J26658J57376n3776j96491m2043J35667
$$ -110396 -177041 -183628 -138345 -156993 -175383 -48725 108651 54875 -141616 -183659 -47992
31661d7992M4636j15248m9087R5978M3775q7361l8967Q8678M8906p7990n9183
$$ -47992 -3356 -118604 -167691 -71713 -27938 -115299 -154266 -65588 -16682 -94672 -153855
31650a53855M9535M1838m5694m4191K4486N6988R7527J64309Q9825j67315l18757
$$ -153855 -104320 -62482 -108176 -152367 -127881 -70893 26634 190943 280768 113453 -205304
31639b05304j65772N7522P8230J8401Q6671J50110J2765j57163r8780P5132Q9147
$$ -205304 -371076 -313554 -235324 -216923 -130252 19858 32623 -124540 -223320 -148188 -59041
31628e9041k3519m7562P594m844n1346k4046J1525k8119m1980L3848M7917n9357
$$ -59041 -82560 -130122 -122528 -127372 -178718 -202764 -191239 -219358 -261338 -227490 -179573 -238930
31616b38930o6874J22313K25007N4568j08188j4J37808k637k19410j55056P3425
$$ -238930 -305804 -183491 41516 96084 -12104 -12118 125690 123053 -96357 -251413 -177988
31605a77988J15541N182J6180J12522N9817q5455q9199Q714J2275k4036M9338
$$ -177988 -62447 -57265 -41085 71437 131254 45799 -43400 -34686 -22411 -46447 2891
31594B891R7998o0119k25269j04759J41317J40673n8104j03351L5844Q0634j3843
$$ 2891 100889 40770 -184499 -289258 -147941 -7268 -65372 -168723 -132879 -52245 -66088
31583f6088l2611L9619J3528r1117p5726L4019L8557l6119k293R3340N1361p3870
$$ -66088 -98699 -59080 -45552 -136669 -212395 -178376 -139819 -175938 -178231 -84891 -33530 -107400
31571a07400o4110L9924K0881q6804p1019L2057J2443q6298m6935Q0961O0023
$$ -107400 -171510 -131586 -110705 -197509 -268528 -236471 -224028 -310326 -357261 -276300 -216277
31560b16277p0292n2109J04434J32294j2188j00918n6189k1149k2600M9571J43802
$$ -216277 -286569 -338678 -234244 -101950 -114138 -215056 -271245 -292394 -314994 -265423 -121621
31549a21621R8364l6363p5271l6158n4013o3585N5113J44151J942j80832q2104
$$ -121621 -23257 -59620 -134891 -171049 -225062 -288647 -233534 -89383 -87441 -268273 -350377
31538c50377J72214J88648k6608j09266J1385N0343n5745o0266O8828O8328j04699
$$ -350377 -178163 10485 -16123 -125389 -114004 -63661 -119406 -179672 -110844 -42516 -147215
31527a47215j73443l9696Q2694J02070J57827K32261J21669j25124j97740m0686
$$ -147215 -320658 -360354 -277660 -175590 -17763 214498 336167 211043 13303 -27383
31517b7383O4893J0858k109Q0916N0801j17835j62681j0832Q1121L64m1787N2675
$$ -27383 37510 48368 46259 127175 177976 60141 -102540 -113372 -32251 -31887 -73674 -20999
31505b0999P9006n7141j42417m8121N2132K4333j4538K2437L2592k4031l4377
$$ -20999 58007 866 -141551 -189672 -137540 -113207 -127745 -105308 -72716 -96747 -131124
31494a31124O006l0253r4848N684K07846K13813k607j23926k3222N2144m2441
$$ -131124 -125118 -155371 -250219 -244535 -36689 177124 174517 50591 27369 79513 37072
31483C7072j11869k1043O7838L1205r441K2245J1204o4585n3067M6802L9302q1155
$$ 37072 -74797 -95840 -28002 3203 -6238 16007 27211 -37374 -90441 -43639 -4337 -85492
31471h5492p9736P6175J30423R953m3849N2099O4856q0066j22820L9456J36423
$$ -85492 -165228 -89053 41370 51323 7474 59573 124429 44363 -78457 -39001 97422
31460I7422J7930p8042J1139P7624k5694q3807N8571J73048N6434j03383q4827
$$ 97422 115352 37310 48449 126073 100379 16572 75143 248191 304625 201242 116415
31449A16415j2738o3726j13531m288J22667P8748l7988m8329L943Q654J2469N4063
$$ 116415 103677 39951 -73580 -77868 44799 123547 85559 37230 41173 49827 62296 116359
31437A16359K4192r3353j04273O1568J75292Q1423m2862j9230L8177q660n5734
$$ 116359 140551 47198 -57075 4493 179785 261208 218346 199116 237293 228633 172899
31426A72899j475K9530n1100r0609R583P4685l0358j47214j14961l4702k2845
$$ 172899 171424 200954 149854 59245 68828 143513 113155 -34059 -149020 -183722 -206567
31415b06567O567R4473Q3764n8973r3998Q0105K01919Q7084n6146k3578L3245
$$ -206567 -200000 -105527 -21763 -80736 -174734 -94629 107290 194374 138228 114650 147895
31404A47895m4678q6394N6703J65788L1683j39397p9801P2751N3688n4844k9793
$$ 147895 103217 16823 73526 239314 270997 131600 51799 124550 178238 123394 93601
31393I3601N6627Q725r4935o1739M3447M4652r090J5178N0630J581j6802Q1349
$$ 93601 150228 158953 64018 2279 45726 90378 81288 96466 147096 148677 131875 213224
31381B13224J14252m5618j76405p7697M6647m3076j62264m1517J47834Q7849r9429
$$ 213224 327476 281858 105453 27756 74403 31327 -130937 -172454 -24620 63229 -36200
31370c6200p0362J18849J34762k0857m9347P1686P0545q6168j30746J2434J10292
$$ -36200 -106562 12287 147049 126192 76845 148531 219076 132908 2162 14596 124888
31359A24888M6922k1814L346K2863k0463n0796m5671n9985o1595K2626J23895
$$ 124888 171810 149996 153342 176205 155742 104946 59275 -710 -62305 -39679 84216
31348H4216J16905L2611k3832o9933j42338j33689J8187J30894M1958q9817m5489
$$ 84216 201121 233732 209900 139967 -2371 -136060 -117873 13021 54979 -34838 -80327
31337h0327O5993J7236j08149p0512Q0035J05020J5171J0234P1107J4417j11120
$$ -80327 -14334 2902 -105247 -175759 -95724 9296 24467 34701 105808 120225 9105
31326I105q6949N4977O7257p5685j52436r8911p0992r9062l7156J17732J84628
$$ 9105 -77844 -22867 44390 -31295 -183731 -282642 -353634 -452696 -489852 -372120 -187492
31315a87492J10099L2709K3940K7396L4720O4967K7006j27047k03630k9369J95587
$$ -187492 -77393 -44684 -20744 6652 41372 106339 133345 6298 -197332 -226701 -31114
31304c1114J57143n7153r6555O5905J14943m8930j66727q7909K0242J8348m657
$$ -31114 126029 68876 -27679 38226 153169 104239 -62488 -150397 -130155 -111807 -116464
31293a16464K2221J6670m6548n8731P917M4547J5508M841L2234L2176P903M227
$$ -116464 -94243 -77573 -124121 -182852 -174935 -130388 -114880 -110039 -77805 -45629 -37726 -33499
31281c3499k3149j01379r9309O4814J98912J03767p3182p2826L4500J4663o7451
$$ -33499 -56648 -158027 -257336 -192522 6390 110157 36975 -35851 -1351 13312 -54139
31270e4139J8318J80355J25768q9505j21132O2601J32357j6207j13564k8145L7828
$$ -54139 -35821 144534 270302 180797 59665 122266 254623 238416 124852 96707 134535
31259A34535k9490p0812j0421M998o0476m3286P0955Q7242j7719l7272N5845M1822
$$ 134535 105045 34233 23812 28810 -31666 -74952 -3997 83245 65526 28254 84099 125921
31247A25921j09319j48383j1004M8839p1368j36291j8198P9168K3745j1572Q3984
$$ 125921 16602 -131781 -142785 -93946 -165314 -301605 -319803 -240635 -216890 -228462 -144478
31236a44478J35399L3601m5265J7542O0702l0514j03471m6220N903l2789k0176
$$ -144478 -9079 24522 -20743 -3201 57501 26987 -76484 -122704 -116801 -149590 -169766
31225a69766R8719J30501o495r2596O459R4654J6521n9780J8363Q8434j1424j24843
$$ -169766 -71047 59454 52959 -39637 -33178 61476 77997 18217 36580 125014 113590 -11253
31213a1253o5506M4462J5250p2595n6041L878k0741o1621j0722M8705J4505j5639
$$ -11253 -76759 -32297 -17047 -89642 -145683 -141805 -162546 -224167 -234889 -186184 -171679 -187318
31201a87318O3717J36664O5244n2910n5115J6494L0218j180j79Q078j4674j1368
$$ -187318 -123601 13063 78307 25397 -29718 -13224 16994 15814 15635 23713 9039 -2329
31189b329L6947L5135l3649l4344O6507R6901k0009j02431k2032O6013M841r0552
$$ -2329 34618 69753 36104 1760 68267 165168 145159 42728 20696 86709 91550 998
31177I98o2209R049j6778p4292l8197L9875N3584L8157N3920M1771l0345n6649
$$ 998 -61211 -52162 -68940 -143232 -181429 -141554 -87970 -49813 4107 45878 15533 -41116
31165d1116P122L2351l5999m8446N9987R8891n3163k00020j35894K8451Q7347
$$ -41116 -33994 -1643 -37642 -86088 -26101 72790 19627 -180393 -316287 -287836 -200489
31154b00489O5060P1005N0339n5361j02605K3422J56362R8990m6764p0507o732
$$ -200489 -135429 -64424 -14085 -69446 -172051 -148629 7733 106723 59959 -10548 -17280
31143a7280j9317q3328o3012J6448L8791K7484O5690R7688L6419m5188m1372r040
$$ -17280 -36597 -119925 -182937 -166489 -127698 -100214 -34524 63164 99583 54395 13023 3983
31131C983l9083p2110l4581p11k6849o664J04578J28012m1785j90557j02647P7435
$$ 3983 -35100 -107210 -141791 -142502 -169351 -176015 -71437 56575 14790 -175767 -278414 -200979
31119b00979R2946p374j6553L6828j5373j22912j01995J3812L7424k7312j8768
$$ -200979 -108033 -115407 -131960 -95132 -110505 -233417 -335412 -321600 -284176 -311488 -330256
31108c30256O1722O5883n036q546N9590O3395j0341l3665K5985O9209N1930J7851
$$ -330256 -268534 -202651 -207687 -216233 -156643 -93248 -103589 -137254 -111269 -42060 9870 27721
31096B7721k6310r0543j04141j1935Q7328O3604m6106j10672r4806l7900N0144
$$ 27721 1411 -89132 -193273 -205208 -117880 -54276 -100382 -211054 -305860 -343760 -293616
31085b93616J31892J07672j9224q5132j2439N8339K5317J432O4031P3019m6546
$$ -293616 -161724 -54052 -73276 -158408 -170847 -112508 -87191 -85759 -21728 51291 4745
31074D745r8590M6166J64458M0223j35068p5220J04514R6168p0098j18421k6285
$$ 4745 -93845 -47679 116779 157002 21934 -53286 51228 147396 77298 -41123 -67408
31063f7408j1450r4599q3354L6188P0573j8981o5886j6412J0563j2709J3750Q4842
$$ -67408 -78858 -173457 -256811 -220623 -150050 -169031 -234917 -251329 -240766 -253475 -239725 -154883
31051a54883Q1760k891n7977m7891j3108N5584J43177J19916n6845j87840j17239
$$ -154883 -73123 -76014 -133991 -181882 -194990 -139406 3771 123687 66842 -120998 -238237
31040b38237m496m0058q8095N3024K27797J57828n4855q6663N8128R8982J410
$$ -238237 -242733 -282791 -370886 -317862 -90065 67763 12908 -73755 -15627 83355 84765
31029H4765p761Q9178O9921q1308j30152k9103R173p9012j11654k4354L4436J7987
$$ 84765 77004 166182 236103 154795 24643 -4460 4713 -74299 -185953 -210307 -175871 -157884
31017a57884M0452Q7560J9428j08763q4362P5682J32181M2822O703O3038K8434
$$ -157884 -117432 -29872 -10444 -119207 -203569 -127887 4294 47116 53819 116857 145291
31006A45291j17798j67394o5281Q151o661K4340R7685M9818q1799o9447P3108
$$ 145291 27493 -139901 -205182 -197031 -203692 -179352 -81667 -31849 -113648 -183095 -109987
30995a09987Q0421p0336q8958R8077J91209M1229j00722m1890M6059j2202r7033
$$ -109987 -29566 -99902 -188860 -90783 100426 141655 40933 -957 45102 32900 -64133
30984f4133p0292j7492j4273L2482J29279J01243p2425j51264l5772N2433k9274
$$ -64133 -134425 -151917 -166190 -133708 -4429 96814 24389 -126875 -162647 -110214 -139488
30973a39488j01743j5769Q7254P3857N3773J04515Q1062p8136j68167o8075L1630
$$ -139488 -241231 -257000 -169746 -95889 -42116 62399 143461 65325 -102842 -170917 -139287
30962a39287j9932o4256M4010J50387R5423P512L7635P8703J3011l5680L2037
$$ -139287 -159219 -223475 -179465 -29078 66345 73857 111492 190195 203206 167526 199563
30951A99563N0271r8769k01855o0596J29266Q3058j02175j32466j959N6089j7011
$$ 199563 249834 151065 -50790 -111386 17880 100938 -1237 -133703 -135662 -79573 -96584
30940i6584o7094k8421J5345K1005J7362L228k0135o21N0822K8390o8808q1038
$$ -96584 -163678 -192099 -176754 -155749 -138387 -135159 -155294 -155915 -105093 -76703 -145511 -226549
30928b26549M0662J17520M4975k2523L7743Q9644O201q4126m8488k601o3996r5733
$$ -226549 -185887 -68367 -23392 -45915 -8172 81472 87673 3547 -44941 -47542 -111538 -207271
30916b07271K8292J36915M5289q9187k4464J35993J19121n1641j16582j4967O7052
$$ -207271 -178979 -42064 3225 -85962 -110426 25567 144688 93047 -23535 -38502 28550
30905B8550K9259m6218q7706q3494J76J37147J68839K5154r9722j9309J30345
$$ 28550 57809 11591 -76115 -159609 -159433 -22286 146553 171707 71985 52676 183021
30894A83021J03203n7737j17809m4261m849m2744m7453j1518l6129r4949n1620
$$ 183021 286224 228487 110678 66417 61568 18824 -28629 -40147 -76276 -171225 -222845
30883b22845Q1918J35953M8086n8504p5215k2263L6979N7185P366p4836p5456
$$ -222845 -140927 -4974 43112 -15392 -90607 -112870 -75891 -18706 -11340 -86176 -161632
30872a61632L4875J12089L7407r0020j01823o874O1177N4783K3810k579j4826
$$ -161632 -126757 -14668 22739 -67281 -169104 -175978 -114801 -60018 -36208 -38787 -53613
30861e3613J1310M2947m656j00541q9084M9639J19383J6408r0802m9901K8092
$$ -53613 -42303 644 -4012 -104553 -193637 -143998 -24615 -8207 -99009 -148910 -120818
30850a20818L282l2112M4204J24938O5673m2620m6958j1578o7996j43057r4948
$$ -120818 -117536 -149648 -105444 19494 85167 42547 -4411 -15989 -83985 -227042 -321990
30839c21990K2028P3633Q0872J07386Q0575l4768p3938N4525J36864j0412j79972
$$ -321990 -299962 -226329 -145457 -38071 42504 7736 -66202 -11677 125187 114775 -65197
30828f5197q5266J53416K02220M2631o9740n4070l5977k9595M0335Q1126m0555
$$ -65197 -150463 2953 205173 247804 178064 123994 88017 58422 98757 179883 139328
30817A39328j90571j42498K0916M5143m4591j9417R7746P0035r3778j37756j8847
$$ 139328 -51243 -193741 -172825 -127682 -172273 -191690 -93944 -23909 -117687 -255443 -274290
30806b74290L8491k9347l9549N1861O6099l4094o5381J6650L3050o0542p5679
$$ -274290 -235799 -265146 -304695 -252834 -186735 -220829 -286210 -269560 -236510 -297052 -372731
30795c72731N1292J29553N1950l8152k9978j5388o2033p1436K2138J25111J43871
$$ -372731 -321439 -191886 -139936 -178088 -208066 -223454 -285487 -356923 -334785 -209674 -65803
30784f5803Q8809j3644j28110j44679j6464Q6685N567j06781r509J87178J73066
$$ -65803 23006 9362 -118748 -263427 -279891 -193206 -187639 -294420 -303929 -116751 56315
30773E6315k9547r8999K9243Q1125l6545q6444K8990Q6112k5975j04006l5625
$$ 56315 26768 -72231 -42988 38137 1592 -84852 -55862 30250 4275 -99731 -135356
30762a35356j1190j30573j71245J8059K22496K03519N1376l2423m2136m3598L557
$$ -135356 -146546 -277119 -448364 -430305 -207809 -4290 47086 14663 -27473 -71071 -67514
30751f7514R0567O7507r2699j71777m0111J20114J16201L3359K3675L9750p898
$$ -67514 23053 90560 -2139 -173916 -214027 -93913 22288 55647 79322 119072 111174
30740A11174m2312J2980N0784k6010j04706n6419L7645M2694n759j1634J941j3487
$$ 111174 68862 81842 132626 106616 1910 -54509 -16864 25830 20071 8437 10378 -3109
30728c109r875L6763M0302k7408n2190J3605M6602j6208m9461J6992M7344m6189
$$ -3109 -12984 23779 64081 36673 -15517 -1912 44690 28482 -20979 -3987 43357 -2832
30716b832j21223n7766K4185l945m1516L2384J10475N2608m3255r092R7234J04013
$$ -2832 -124055 -181821 -157636 -161581 -203097 -170713 -60238 -7630 -50885 -59977 37257 141270
30704A41270J7074k9202j6788k7360n8526m8052j6664k2698l8436j0175L0422
$$ 141270 158344 129142 112354 84994 26468 -21584 -38248 -60946 -99382 -109557 -79135
30693g9135L3788K7162L9164K9358j4539k5753R595N796n1812m6553O2409J38456
$$ -79135 -45347 -18185 20979 50337 35798 10045 19640 25436 -26376 -72929 -10520 127936
30681A27936Q0468k7397q2309j04443j10894m1405P6855R2709j8817p8992k604
$$ 127936 208404 181007 98698 -5745 -116639 -158044 -81189 11520 -7297 -86289 -88893
30670h8893N5309j1281p0767k1057R440p4698j23388j8101Q0252J0758q7643k6526
$$ -88893 -33584 -44865 -115632 -136689 -127249 -201947 -325335 -343436 -263184 -252426 -340069 -366595
30658c66595R3272Q2951J2761M9628J16671L9716j00723r2310L4951P5653J2322
$$ -366595 -273323 -190372 -177611 -127983 -11312 28404 -72319 -164629 -129678 -54025 -41703
30647d1703K082N7795M4980l5853m9335P409K524p0011p4028J9213Q7899P3427
$$ -41703 -39621 18174 63154 27301 -22034 -14625 -12101 -82112 -156140 -136927 -49028 24399
30635B4399L7773Q823m4032q7119n3644J2695J1273l7247k6605M5512Q0344M6265
$$ 24399 62172 70995 26963 -60156 -113800 -101105 -89832 -127079 -153684 -108172 -27828 18437
30623A8437j598m0054p9801q6370k8781L4822L5567K927n334j410L184N7448J49079
$$ 18437 16839 -23215 -103016 -189386 -218167 -183345 -147778 -144851 -150185 -151595 -148411 -90963 58116
30610E8116J49910R998j27597j36670q2680n3712L08R5588Q7114p5653j66623
$$ 58116 208026 218024 90427 -46243 -128923 -182635 -182327 -86739 375 -75278 -241901
30599b41901o712K12530K04297K0813q2818o8087p4478q6246J6032J50896J26528
$$ -241901 -248613 -36083 168214 189027 106209 38122 -36356 -122602 -106570 44326 170854
30588A70854r848m0097L9603K5948j11416j75890q4547L0606Q1239J08013R5520
$$ 170854 161006 120909 160512 186460 75044 -100846 -185393 -154787 -73548 34465 129985
30577A29985k3144j59729j40166k945L6545n9428j02394j3878O3029L7341m908
$$ 129985 106841 -52888 -193054 -195999 -159454 -218882 -321276 -335154 -272125 -234784 -239692
30566b39692o352k1345l6885M5049J83634J97063N4942n5884l0466J3367k6817
$$ -239692 -246044 -267389 -304274 -259225 -75591 121472 176414 120530 90064 103431 76614
30555G6614p6039n2249n936K887q21q044n8932j17994q1232M0980J11310P5827
$$ 76614 575 -51674 -57610 -54723 -55544 -63588 -122520 -240514 -321746 -280766 -169456 -93629
30543i3629K0424r250n7515r7287k4987J26280J69623L8588j02264j02939j9155
$$ -93629 -73205 -82455 -139970 -237257 -262244 -135964 33659 72247 -30017 -132956 -152111
30532a52111K4197R481j7167l6570l1102K2334Q4115P7700Q403m4613n3714m8220
$$ -152111 -127914 -118433 -135600 -172170 -203272 -180938 -96823 -19123 -10720 -55333 -109047 -157267
30520a57267j9043M7755P7416N007o9742p340J23542J25762j5367j15680q7655
$$ -157267 -176310 -128555 -51139 -46132 -115874 -123214 328 126090 110723 -4957 -92612
30509i2612l2713k0415M622N6992N8564K347j5900K6505M0860o514n2649p3344
$$ -92612 -125325 -145740 -141118 -84126 -25562 -23215 -39115 -12610 28250 21736 -30913 -104257
30497a04257r4524p7313K6693J24213Q3757l0753m3752L8641N2470k6621o1198
$$ -104257 -198781 -276094 -249401 -125188 -41431 -72184 -115936 -77295 -24825 -51446 -112644
30486a12644j8404J169l994N3404J10813K0505j40304j36883K2874Q6206p114
$$ -112644 -131048 -129879 -133873 -80469 30344 50849 -89455 -226338 -203464 -117258 -124372
30475a24372l9402O2701R4234k2110o7470O9584J67513M8744j28352j62153j08517
$$ -124372 -163774 -101073 -6839 -28949 -96419 -26835 140678 189422 61070 -101083 -209600
30464b09600q2822l3869P3247J07381J6036l0108N6432Q8902n7065j80684q2155
$$ -209600 -292422 -326291 -253044 -145663 -129627 -159735 -103303 -14401 -71466 -252150 -334305
30453c34305R5170J20651M8735N0013P5936l578r9683n1695N9299M0804p6537
$$ -334305 -239135 -118484 -69749 -19736 56200 52622 -47061 -98756 -39457 1347 -75190
30442g5190j16203p0491o2855p6835M487J41040J72276Q1834N080m95L212r593
$$ -75190 -191393 -261884 -324739 -401574 -397087 -256047 -83771 -1937 3143 2648 5860 -3733
30430c733j1038k1657o8365q5324n787J01894J27083P6598J5987n1870j15165
$$ -3733 -14771 -36428 -104793 -190117 -195904 -94010 33073 109671 125658 73788 -41377
30419d1377q0422O7997J57092N5148j01595j05512P613M8842j6350p3706r4660
$$ -41377 -121799 -53802 103290 158438 56843 -48669 -41056 7786 -8564 -82270 -176930
30408a76930j33121j42759l2025J24447J51990M7727j8476K2316O1049K7052n450
$$ -176930 -310051 -452810 -484835 -360388 -208398 -160671 -179147 -156831 -95782 -68730 -74180
30397g4180K5503O0609L0482l3292n4824j4939L7431M0376j2852m7357O211Q7201
$$ -74180 -48677 11932 42414 9122 -45702 -60641 -23210 17166 4314 -43043 -36832 50369
30385E0369N9516p7847j57753q5235K3924L4915j2857j8208P996J2999K4110O0319
$$ 50369 109885 32038 -125715 -210950 -187026 -152111 -164968 -183176 -175180 -162181 -138071 -77752
30373g7752L9215p6995j54016o7656Q3976J18853L6184k7884l4852n5263r4852
$$ -77752 -38537 -115532 -269548 -337204 -253228 -134375 -98191 -126075 -160927 -216190 -311042
30362c11042q0921l258O8431R4480R3258Q7798R5645J18708R7471k6681j62097
$$ -311042 -391963 -395221 -326790 -232310 -139052 -51254 44391 163099 260570 233889 71792
30351G1792j31447M5648J23719m372j24271m1659J04847Q7346m1856p8598j8011
$$ 71792 -59655 -14007 109712 105340 -18931 -60590 44257 131603 89747 11149 -6862
30340f862o322m8560l5295J3355j0226p0605m6788K7632K1834l7174q439R4142
$$ -6862 -13184 -61744 -97039 -83684 -93910 -164515 -211303 -183671 -161837 -199011 -207450 -113308
30328a13308J17434L9502p953J4732J0057m7685o9881l7316l1212o2598n2291
$$ -113308 4126 43628 35675 50407 60464 12779 -57102 -94418 -125630 -188228 -240519
30317b40519M081K3667j478L176L6678K5048j6158O286P8630P8535j7122q1271
$$ -240519 -236438 -212771 -214249 -211073 -174395 -149347 -165505 -159219 -80589 -2054 -19176 -100447
30305a00447l0805O1750Q9489M0500k1712l4387J0336M3332n929p9551m2982Q0185
$$ -100447 -131252 -69502 19987 60487 38775 4388 14724 58056 52127 -27424 -70406 9779
30293I779Q8915p2569j67870k1944J68276J17866j05834k04932j00466L1510R2039
$$ 9779 98694 26125 -141745 -163689 4587 122453 16619 -188313 -288779 -257269 -165230
30282a65230J26240J10379j8982j41666o5404J30162J59975k3684j51439o3851
$$ -165230 -38990 71389 52407 -89259 -154663 -24501 135474 111790 -39649 -103500
30272a03500O8050N5181k8980k1288O8009J08057M1127p7577j49319r8052M6834
$$ -103500 -35450 19731 -9249 -30537 37472 145529 186656 109079 -40240 -138292 -91458
30261i1458J33483N6216q3872j08466r899P3028P6365M6405M289n2301o3923q83
$$ -91458 42025 98241 14369 -94097 -103996 -30968 45397 91802 96091 43790 -20133 -21016
30249b1016K7386n8242j19263p021J41316R0944q2785r3436Q1332J61516K3622
$$ -21016 6370 -51872 -171135 -178156 -36840 54104 -28681 -122117 -40785 120731 144353
30238A44353j30936j30423n5522k1964r081O499j3221k6984N7150J62636J03659
$$ 144353 13417 -117006 -172528 -194492 -203573 -197074 -210295 -237279 -180129 -17493 86166
30227H6166q8282j65313n0528N6486L6586J7827P8660Q2139m3724j29935m6192
$$ 86166 -2116 -167429 -217957 -161471 -124885 -107058 -28398 53741 10017 -119918 -166110
30216a66110P2880N7863l5428o3243k0544K1147N2583P5978N4112P114J6564O4965
$$ -166110 -93230 -35367 -70795 -134038 -154582 -133435 -80852 -4874 49238 56352 72916 137881
30204A37881L8309n5772o9858K0422N4688l0009q5159k2759K6971m3419j31272
$$ 137881 176190 120418 50560 70982 125670 95661 10502 -12257 14714 -28705 -159977
30193a59977j13992l7256J6473O8576J30209J18898Q244r3181j07284p9372m3744
$$ -159977 -273969 -311225 -294752 -226176 -95967 22931 31175 -62006 -169290 -248662 -292406
30182b92406K8113R6335O9167o117J1246Q8111N4850n5693j7462J70021K16493
$$ -292406 -264293 -167958 -98791 -104908 -93662 -5551 49299 -6394 -23856 146165 362658
30171C62658J7268j56341j11447k8863q9625j44029k0676J30351R8695k7297n3931
$$ 362658 379926 223585 112138 83275 -6350 -150379 -171055 -40704 57991 30694 -23237
30160b3237j8671m8642p9709p47R4857P3708J6945N2076R4116J5640q4249m9513
$$ -23237 -41908 -90550 -170259 -171006 -76149 -2441 14504 66580 160696 176336 92087 42574
30148D2574M0180J5689p4557p0729L071J0660l3362k2297J6820p793n0862j9718
$$ 42574 82754 98443 23886 -46843 -43772 -33112 -66474 -88771 -71951 -79744 -130606 -150324
30136a50324L1154P446k9927J2248N7528j898q2688n0119L4048L1365j6154J8355
$$ -150324 -119170 -111724 -141651 -129403 -71875 -73773 -156461 -206580 -172532 -141167 -157321 -138966
30124a38966R4634Q2213K852k5105m568j7054m4504k3136J3630J5898L0633P7527
$$ -138966 -44332 37881 40733 15628 11060 -5994 -50498 -73634 -60004 -44106 -13473 64054
30112F4054N6643n6381r9982N046P8931j4912j12293l9301O8509K3453o3768j2440
$$ 64054 120697 64316 -35666 -30620 48311 33399 -78894 -118195 -49686 -26233 -90001 -102441
30100a02441O6288p980j03325p763J38745O9568j05547q1192P7501M2022j67507
$$ -102441 -36153 -44133 -147458 -155221 -16476 53092 -52455 -133647 -56146 -14124 -181631
30089a81631j90661M1084J82645O5103o0566j11Q4955K4213p3889o2145P548M0796
$$ -181631 -372292 -331208 -148563 -83460 -144026 -144137 -59182 -34969 -108858 -171003 -163455 -122659
30077a22659M7253K0742q3952j75749q7301J19481J80115L3240q2361k0674P0249
$$ -122659 -75406 -54664 -138616 -314365 -401666 -282185 -102070 -68830 -151191 -171865 -101616
30066a01616M6418j1307k180J8745k608r275J2588j7008q3773o2662L8417N8189
$$ -101616 -55198 -66505 -68685 -49940 -52548 -61823 -49235 -66243 -150016 -212678 -174261 -116072
30054a16072k3051k7884R2509J49977M8613m8330j5440L0744k1100o9327j0452
$$ -116072 -139123 -167007 -74498 75479 124092 75762 60322 91066 69966 639 -9813
30043i813N8052K2206m8329m9700k4318l9821m6646K634M1103J9129L27J9326
$$ -9813 48239 70445 22116 -27584 -51902 -91723 -138369 -135735 -94632 -75503 -75176 -55850
30031e5850L424o2232o4994K9993Q2195L655q7065o3932J7427N4698O3937Q2610
$$ -55850 -52426 -114658 -179652 -149659 -67464 -63809 -150874 -214806 -197379 -142681 -78744 3866
30019C866N8231l8566j23343j30235j03470p0294K2604J55342J88274P7257k9168
$$ 3866 62097 23531 -99812 -230047 -333517 -403811 -381207 -225865 -37591 39666 10498
30008A0498j9231J9245j9586q0222p4244l4789j6774J3223O8775P0197m343l9729
$$ 10498 -8733 10512 -9074 -89296 -163540 -198329 -215103 -201880 -133105 -62908 -67251 -106980
29996a06980K8257R2323N6965o386q048M417l1952n8261j1270M6063L4915j3220
$$ -106980 -78723 13600 70565 64179 56131 60548 28596 -29665 -40935 5128 40043 26823
29984B6823m5562q1881j22716r3825K0683J16443J23587R0746N0540l7225j40667
$$ 26823 -18739 -100620 -223336 -317161 -296478 -180035 -56448 34298 84838 47613 -93054
29973i3054j39335l3958K1606j8040j3617P7086Q9470l9273j08132J9307J63947
$$ -93054 -232389 -266347 -244741 -262781 -276398 -199312 -109842 -149115 -257247 -237940 -73993
29962g3993J19966k1573o4320k4125j7767j6367M3047O6366k4168q3178K7510
$$ -73993 45973 24400 -39920 -64045 -81812 -98179 -55132 11234 -12934 -96112 -68602
29951f8602J52380P1429j16560j47987k9409Q437o8518o0299Q4257J65860O9365
$$ -68602 83778 155207 38647 -109340 -138749 -130312 -198830 -259129 -174872 -9012 60353
29940F0353p0989j16557j06681j13164j05776n2588j718J6284M4803R8572J13207
$$ 60353 -10636 -127193 -233874 -347038 -452814 -505402 -507120 -490836 -446033 -347461 -234254
29929b34254N1946k6199n0480k3764M522Q24k6769l2010K2497R7167J05461M3074
$$ -234254 -182308 -208507 -258987 -282751 -278229 -277405 -304174 -336184 -313687 -216520 -111059 -67985
29917f7985Q274M6470P2502J5661o3096q2228o0538l6295J7642R4861R8307L582
$$ -67985 -59711 -13241 59261 74922 11826 -70402 -130940 -167235 -149593 -54732 43575 47157
29905D7157n2193J5645P4786o819j16743p6443N2933P8338M192k333O7989M8425
$$ 47157 -5036 10609 85395 78576 -38167 -114610 -61677 16661 20853 18520 86509 134934
29893A34934r0111j62860p0911M1336K2658o6113q0890j2004M3472M3830K9194
$$ 134934 44823 -118037 -188948 -147612 -124954 -191067 -271957 -283961 -240489 -196659 -167465
29882a67465K6958J9916L602J0936N3893P5222J2450q6402q8531L0043J07257
$$ -167465 -140507 -120591 -116989 -106053 -52160 23062 35512 -50890 -139421 -109378 -2121
29871b121K0994r8353n6541P2867M9676j17451j52867K9767J67393P8922n0873
$$ -2121 18873 -79480 -136021 -63154 -13478 -130929 -283796 -254029 -86636 -7714 -58587
29860e8587k0446M4133l8900j38933l9874J47572J46957k6165j08604k6370L8944
$$ -58587 -79033 -34900 -73800 -212733 -252607 -105035 41922 15757 -92847 -119217 -80273
29849h0273m020m6970k4802P23J4934O6247J01270J9390j02542p9077P4352J39341
$$ -80273 -84293 -131263 -156065 -155342 -140408 -74161 27109 46499 -56043 -135120 -60768 78573
29837G8573L3631q0163p3098j5991j194j511J1664j5636r8179j45647r5422k537
$$ 78573 112204 32041 -41057 -57048 -58242 -59753 -48089 -63725 -161904 -307551 -402973 -405510
29825d05510N3208N5117K1077k1185k6503J4851M1122K1307K9175J04049J30729
$$ -405510 -352302 -297185 -276108 -297293 -323796 -308945 -267823 -246516 -217341 -113292 17437
29814A7437J4221j20186r4659L5893Q5064M8224O4008J14580M6897j14802j66797
$$ 17437 31658 -88528 -183187 -147294 -62230 -14006 50002 164582 211479 96677 -70120
29803g0120o6992J852l5714l2857P5123J25702J9414q8156m4803N0323L1771n8040
$$ -70120 -137112 -135260 -170974 -203831 -128708 -3006 16408 -71748 -116551 -66228 -34457 -92497
29791i2497n9125M7851J32706J04603l877r8375j01493j7630N1903K3225m2768
$$ -92497 -151622 -103771 28935 133538 129661 31286 -70207 -87837 -35934 -12709 -55477
29780e5477k5319N8354P7250P549l3951k456J596p1889j16897m3215P8090J24285
$$ -55477 -80796 -22442 54808 62357 28406 25950 27546 -44343 -161240 -204455 -126365 -2080
29768b080P2286k2689j02884j13528k8573Q5606J17438M6476m6269r9217j06391
$$ -2080 70206 47517 -55367 -168895 -197468 -111862 5576 52052 5783 -93434 -199825
29757a99825n7443L6506Q2671J0695q7540p1497K5212N4415L958o052M1798M4699
$$ -199825 -257268 -220762 -138091 -127396 -214936 -286433 -261221 -206806 -202848 -208900 -167102 -122403
29745a22403l145K872N9378M8323k8445m0304J6125j901j01431j12154O574Q0587
$$ -122403 -125548 -122676 -63298 -14975 -43420 -83724 -67599 -69500 -170931 -283085 -276511 -195924
29733a95924K9171q706L9493M3638m7820p2263L3133N9715j17249k66712j41146
$$ -195924 -166753 -175459 -135966 -92328 -140148 -212411 -179278 -119563 -236812 -503524 -644670
29722f44670J22948K20183J26385M8481M8002Q870q2138r7583n099P9598Q4947
$$ -644670 -521722 -301539 -175154 -126673 -78671 -69801 -151939 -249522 -254621 -175023 -90076
29711i0076N6124L3875P369j5936j7057k6207o7995p9241N539J20608J36145L5999
$$ -90076 -33952 -77 7292 -8644 -25701 -51908 -119903 -199144 -193605 -72997 63148 99147
29699I9147p3348j09643p9907k2206L1703M9426J9942k7985o3815p9745o0274
$$ 99147 25799 -83844 -163751 -185957 -154254 -104828 -84886 -112871 -176686 -256431 -316705
29688c16705J1079R3433J12862O7658K4908N39m5030p7542m759J32383J50331
$$ -316705 -305626 -212193 -99331 -31673 -6765 -6226 -51256 -128798 -133557 -1174 149157
29677A49157p540j47567r1413O7962J16217K1489o2856m0012K5993L3456k7758
$$ 149157 141617 -5950 -97363 -29401 86816 108305 45449 5437 31430 64886 37128
29666C7128p8779m5623M4687P5313q056r7978p1562J3897J4311n2459l9811N6132
$$ 37128 -41651 -87274 -42587 32726 24670 -73308 -144870 -130973 -116662 -169121 -208932 -152800
29654a52800P6233k2901r5715o8827m5351o9899k7285J13084J84304R4791p80
$$ -152800 -76567 -99468 -195183 -264010 -309361 -379260 -406545 -293461 -109157 -14366 -15146
29643a5146L8364J06754N3400o3738j05255p7945n9566l4359L0377O9882L2907
$$ -15146 23218 129972 183372 119634 14379 -63566 -123132 -157491 -127114 -57232 -24325
29632b4325j6351l0235o5101j22421q2512O9009J45252M5651o2706k7095L9017
$$ -24325 -40676 -70911 -136012 -258433 -340945 -271936 -126684 -81033 -143739 -170834 -131817
29621a31817r600p6279k4306M3048k5215j22265n8112R3817J17147J6400k7133
$$ -131817 -141417 -217696 -242002 -198954 -224169 -346434 -404546 -310729 -193582 -177182 -204315
29610b04315J5728J7462l7618m5906p793j3960m0275J4925J15851J24599K9099
$$ -204315 -188587 -171125 -208743 -254649 -262442 -276402 -316677 -301752 -185901 -61302 -32203
29599c2203n2328o3059l8720J808M1513J8768n6049m9586P1280J17360k7916j66269
$$ -32203 -84531 -147590 -186310 -184502 -142989 -124221 -180270 -229856 -158576 -41216 -69132 -235401
29587b35401q1962R0217Q6604m5303n9430M8603O8055k4503m2257N4961J10526
$$ -235401 -317363 -227146 -140542 -185845 -245275 -196672 -128617 -153120 -195377 -140416 -29890
$$ [...]
##END NTUPLES=NMR SPECTRUM
##END=
