##TITLE=31Pdec_LY-Dixlofos.P.2
 CDCl3, 24 sc
 28.10.2020
##JCAMPDX= 6.0         $$ Bruker NMR JCAMP-DX V2.0
##DATA TYPE= NMR SPECTRUM
##DATA CLASS= NTUPLES
##ORIGIN= UXNMR, Bruker Analytische Messtechnik GmbH
##OWNER= root
$$ XWIN-NMR		Version 3.5
$$ Wed Oct 28 13:05:10 2020 Russian Standard Time (UT+4h)  she@DPX200
##.OBSERVE FREQUENCY= 81.013821
##.OBSERVE NUCLEUS= ^31P
##.ACQUISITION MODE= SIMULTANEOUS
##.ACQUISITION SCHEME= undefined
##.AVERAGES= 24
##.DIGITISER RES= 17
##SPECTROMETER/DATA SYSTEM= spect
##.PULSE SEQUENCE= zgpg30
##.SOLVENT NAME= CDCl3
##.SHIFT REFERENCE= (INTERNAL, CDCl3, 0, 182.463)
##AUDIT TRAIL= $$ (NUMBER, WHEN, WHO, WHERE, WHAT)
$$ ##TITLE= Audit trail, XWIN-NMR		Version 3.5
$$ ##JCAMPDX= 5.01
$$ ##ORIGIN= Bruker BioSpin GmbH
$$ ##OWNER= she
$$ F:/spectra/data/she/nmr/P31/1/pdata/1/auditp.txt
$$ ##AUDIT TRAIL=  $$ (NUMBER, WHEN, WHO, WHERE, WHAT)
(   1,<2020-10-28 13:03:26.31 +0400>,<she>,<DPX200>,
      <created by zg, POWCHK disabled, PULCHK disabled
       configuration hash MD5:
       00 E9 B6 7A A2 85 ED C7 34 08 36 98 17 FE 4E 26
       data hash MD5: 32K
       C7 50 F0 2E AA 20 E1 0B B6 E4 1E 28 39 A1 74 F8>)
(   2,<2020-10-28 13:03:29.26 +0400>,<she>,<DPX200>,
      <Start of raw data processing
       efp BC_mod = 2 LB = 1 FT_mod = 6 PKNL = 1 PHC0 = -2356.925 PHC1 = 15.40078 SI = 64K 
       data hash MD5: 64K
       56 D8 7C A9 20 F6 86 CD 06 CC E9 29 73 F7 19 84>)
(   3,<2020-10-28 13:03:58.43 +0400>,<she>,<DPX200>,
      <pk PHC0 = -50.24701 PHC1 = 116.6 
       data hash MD5: 64K
       5D 4F 92 00 C4 30 C9 ED A0 53 AD B2 85 D0 16 7C>)
$$ ##END=
$$ 
$$ hash MD5
$$ 3B 9F 5C E2 65 96 C3 8B A7 95 53 39 65 E7 AF AB
##$RELAX= 
##$RELAX= 
##$RELAX= 
##$RELAX= 
##$RELAX= 
##$RELAX= 
##$RELAX= 
##$RELAX= 
$$ Bruker specific parameters
$$ --------------------------
##$DU= <F:/spectra>
##$EXPNO= 1
##$NAME= <P31>
##$PROCNO= 1
##$TYPE= <nmr>
##$USER= <she>
##$AMP= (0..31)
100 100 100 100 100 100 100 100 100 100 100 100 100 100 100 100 100 100 
100 100 100 100 100 100 100 100 100 100 100 100 100 100 
##$AQSEQ= 0
##$AQ_mod= 1
##$AUNM= <au_zg>
##$AUTOPOS= <>
##$BF1= 81.014009
##$BF2= 200.13
##$BF3= 200.13
##$BF4= 200.13
##$BF5= 200.13
##$BF6= 200.13
##$BF7= 200.13
##$BF8= 200.13
##$BYTORDA= 1
##$CFDGTYP= 0
##$CFRGTYP= 5
##$CHEMSTR= <none>
##$CNST= (0..31)
1 1 145 1 1 1 1 1 1 1 1 1 1 1 1 1 1 1 1 1 1 1 1 1 1 1 1 1 1 1 1 1 
##$CPDPRG= <waltz16>
##$CPDPRG1= <>
##$CPDPRG2= <waltz16>
##$CPDPRG3= <>
##$CPDPRG4= <mlev>
##$CPDPRG5= <mlev>
##$CPDPRG6= <mlev>
##$CPDPRG7= <mlev>
##$CPDPRG8= <mlev>
##$CPDPRGB= <>
##$CPDPRGT= <>
##$D= (0..31)
0 1 0 0 0 0 0 0 0 0 0 0.03 2e-05 3e-06 0 0 0 0 0 0 0 0 0 0 0 0 0 0 0 0 
0 0 
##$DATE= 1603875805
##$DBL= (0..7)
120 120 120 11 120 120 24 19 
##$DBP= (0..7)
150 150 150 150 150 150 150 150 
##$DBP07= 0
##$DBPNAM0= <>
##$DBPNAM1= <>
##$DBPNAM2= <>
##$DBPNAM3= <>
##$DBPNAM4= <>
##$DBPNAM5= <>
##$DBPNAM6= <>
##$DBPNAM7= <>
##$DBPOAL= (0..7)
0.5 0.5 0.5 0.5 0.5 0.5 0.5 0.5 
##$DBPOFFS= (0..7)
$$ [...]
##$SUBNAM2= <"">
##$SUBNAM3= <"">
##$SUBNAM4= <"">
##$SUBNAM5= <"">
##$SUBNAM6= <"">
##$SUBNAM7= <"">
##$SUBNAM8= <"">
##$SUBNAM9= <"">
##$SW= 369.568048894756
##$SWIBOX= (0..15)
0 1 3 0 0 0 0 0 0 0 0 0 0 0 0 0 
##$SW_h= 29940.119760479
##$TD= 32768
##$TD0= 1
##$TE= 0
##$TE2= 300
##$TE3= 300
##$TEG= 300
##$TL= (0..7)
0 120 53 12 22 120 120 120 
##$TP= (0..7)
150 150 150 150 150 150 150 150 
##$TP07= 0
##$TPNAME0= <>
##$TPNAME1= <>
##$TPNAME2= <>
##$TPNAME3= <>
##$TPNAME4= <>
##$TPNAME5= <>
##$TPNAME6= <>
##$TPNAME7= <>
##$TPOAL= (0..7)
0.5 0.5 0.5 0.5 0.5 0.5 0.5 0.5 
##$TPOFFS= (0..7)
0 0 0 0 0 0 0 0 
##$TUNHIN= 0
##$TUNHOUT= 0
##$TUNXOUT= 0
##$USERA1= <user>
##$USERA2= <user>
##$USERA3= <user>
##$USERA4= <user>
##$USERA5= <user>
##$V9= 5
##$VALIST= <valist>
##$VCLIST= <CCCCCCCCCCCCCCC>
##$VD= 0
##$VDLIST= <DDDDDDDDDDDDDDD>
##$VPLIST= <PPPPPPPPPPPPPPP>
##$VTLIST= <TTTTTTTTTTTTTTT>
##$WBST= 1024
##$WBSW= 4
##$XGAIN= (0..3)
0 0 0 0 
##$XL= 0
##$YL= 0
##$YMAX_a= 49720
##$YMIN_a= -78326
##$ZGOPTNS= <>
##$ZL1= 120
##$ZL2= 120
##$ZL3= 120
##$ZL4= 120
##$ABSF1= 0
##$ABSF2= 0
##$ABSG= 0
##$ABSL= 0
##$ALPHA= 0
##$AQORDER= 0
##$ASSFAC= 0
##$ASSFACI= 0
##$ASSFACX= 0
##$ASSWID= 0
##$AUNMP= <proc_1d>
##$AZFE= 0.1
##$AZFW= 0.5
##$BCFW= 0
##$BC_mod= 2
##$BYTORDP= 0
##$COROFFS= 0
##$CY= -3
##$DATMOD= 1
##$DC= 0
##$DFILT= <>
##$DTYPP= 0
##$F1P= 0
##$F2P= 0
##$FCOR= 1
##$FTSIZE= 65536
##$FT_mod= 6
##$GAMMA= 0
##$GB= 0
##$INTBC= 1
##$INTSCL= 5.30512e-09
##$ISEN= 30
##$LB= 1
##$LEV0= 0
##$LPBIN= 0
##$MAXI= 10000
##$MC2= 0
##$MEAN= 0
##$ME_mod= 0
##$MI= 50
##$NCOEF= 0
##$NC_proc= -2
##$NLEV= 6
##$NOISF1= 182.463
##$NOISF2= 159.3651
##$NSP= 0
##$NTH_PI= 0
##$NZP= 0
##$OFFSET= 182.463
##$PC= 4
##$PHC0= -2407.172
##$PHC1= 132.0008
##$PH_mod= 1
##$PKNL= yes
##$PPARMOD= 0
##$PSCAL= 0
##$PSIGN= 0
##$REVERSE= no
##$SF= 81.014009
##$SI= 65536
##$SIGF1= 159.3651
##$SIGF2= -187.1042
##$SINO= 113.3802
##$SIOLD= 16384
##$SREGLST= <1H.CDCl3>
##$SSB= 0
##$STSI= 65536
##$STSR= 0
##$SW_p= 29940.119760479
##$SYMM= 0
##$S_DEV= 0
##$TDeff= 32768
##$TDoff= 0
##$TI= <>
##$TILT= no
##$TM1= 0
##$TM2= 0
##$TOPLEV= 0
##$USERP1= <user>
##$USERP2= <user>
##$USERP3= <user>
##$USERP4= <user>
##$USERP5= <user>
##$WDW= 1
##$XDIM= 65536
##$YMAX_p= 384982683
##$YMIN_p= -752848
$$ End of Bruker specific parameters
$$ ---------------------------------
##NTUPLES= NMR SPECTRUM
##VAR_NAME=  FREQUENCY,     SPECTRUM/REAL,   SPECTRUM/IMAG
##SYMBOL=    X,             R,               I
##VAR_TYPE=  INDEPENDENT,   DEPENDENT,       DEPENDENT
##VAR_FORM=  AFFN,          ASDF,            ASDF
##VAR_DIM=   65536,         65536,           65536
##UNITS=     HZ,            ARBITRARY UNITS, ARBITRARY UNITS
##FACTOR=    0.456856943014862, 1,           1
##FIRST=     14782.0589164895, 0,            0
##LAST=      -15158.0608439895, 0,           0
##MIN=       -15158.0608439895, -752848,     0
##MAX=       14782.0589164895, 384982683,    0
$$ Real data points
##PAGE= N=1
##DATA TABLE= (X++(R..R)), XYDATA
$$ [...]
35999i3691k137K6714M6107O2660J6361q6081j23217l0806Q5319J03748N8514
35988F3491M8282O3988L6882j0685q500J2051l4153j10281r1427J9936P5076J0086
35976G4746n8935l0534L5945M8613K8883L2102L1875q728l9971r717K9264N166
35964A38709m5206m4114q998q328l3748l1557j4776k5181k8016K8130Q5696N1497
35952F4108l3366m6546R043J3634n1852o8570R588P7319O3722L4470L7420O475
35940A15445q4329j21980l3476O6112M6340k5868n934P6706O4374o5002j50319
35929a17931p6570Q0441J65976J08996m1682j64799j48198K043J40072J39135
35919H7483M7694lQ219k7312j10850j11835K1011J48689J32875K9606j5339J1834
$$ y = [-93691, -95828, -69114, -23007, 39653, 56014, -30067, -153284, -184090, -98771, 4977, 63491, 111773, 175761, 212643, 201958, 193458, 205509, 171356, 61075, -30352, -10416, 64660, 74746, 15811, -14723, 21222, 69835, 98718, 130820, 162695, 153967, 113996, 104279, 133543, 138709, 93503, 49389, 40391, 32063, -1685, -33242, -48018, -73199, -101215, -73085, 12611, 64108, 30742, -15804, -6761, 6873, -44979, -113549, -103961, -26642, 37080, 71550, 108970, 115445, 31116, -90864, -124340, -58228, -11888, -37756, -43690, 33016, 97390, 32388, -117931, -194501, -114060, 51916, 160912, 119230, -45569, -193767, -191724, -51652, 87483, 135177, 135174, 143393, 116081, 5231, -106604, -85593, 63096, 195971, 225577, 210238, 222072]
35907B22072J53q9702j59069j17913o815O7071N9615J2277k1274k5204q230J7690
35895d9329L4004K1475p307m670M6463P9769J4777j15768j75220r3032L8499R1128
35883a19211O3704M0821M0893J3730l3167k9303K5842M5367O870L012P7532J24733
35871B60823M7385p9236j18359p4334m8663m4033K5712J37019J40723o051j41766
35860I9220j19795p389L7672o274m2786l3864k3557j8699J9682P0384O2835P469
35848D4898l682M4573M9662l9803j23767r5068M091N6263L0537j8733n6577p4425
35836a82031l8539O1938J40540R6008l3504r9537l8854N3070O8543K1187j0755
35825C8066o915j1134m6011p1387l3521N5761J02376K6225j15003j59414m6924
$$ y = [222072, 222225, 132523, -26546, -144459, -151274, -84203, -24588, -12311, -33585, -58789, -67019, -49329, -15325, 6150, -1157, -5827, 40636, 120405, 135182, 19414, -155806, -248838, -210339, -119211, -55507, -14686, 26207, 39937, 6770, -22533, 3309, 48676, 55546, 58558, 136090, 260823, 308208, 228972, 110613, 36279, -12384, -56417, -30705, 106314, 247037, 240986, 99220, -20575, -27964, 9708, 3434, -39352, -73216, -96773, -115472, -95790, -25406, 37429, 44898, 41216, 85789, 135451, 95648, -28119, -123187, -119096, -62833, -32296, -51029, -107606, -182031, -220570, -158632, -18092, 77916, 44412, -55125, -93979, -40909, 27634, 48821, 38066, 31151, 20017, -25994, -97381, -130902, -75141, 27235, 53460, -61543, -220957, -267881]
35814b67881P7230N4981m9189m0930J00411J78201P3964p7057r7873k4911j7577
35803i0631r4823j16953j5235R8626R3895P09m0651K4586R3074M9199o4559r3201
35791a55964J3775J21039R9477J4231J4016R2726J07320J5918o4662o4514o1225
35780A32137j10682j27976l6723Q3320J10117M8115k3009q0775j27448j05232
35770b38156K3914J62559J68554L9792r0873j21017n4123N3744J31939J13136
35760A89469M051q6836p0629N455L5606L097l0753l5024j8017K2467O7617N3615
35748A40118k4311n3107L5564J17108L6906j34673j82524n6445P7917R9550O4523
35737A20626M6743J7603m9862r5975p1555j7890J3118K9934M3172K4714k5163
$$ y = [-267881, -190651, -135670, -184859, -225789, -125378, 52823, 126787, 49730, -48143, -73054, -90631, -185454, -302407, -317642, -219016, -125121, -124412, -165063, -140477, -47403, 1796, -62763, -155964, -142189, -21150, 78327, 92558, 106574, 199300, 306620, 322538, 257876, 193362, 132137, 21455, -106521, -143244, -59924, 50193, 98308, 75299, -5476, -132924, -238156, -214242, -51683, 116871, 156663, 65790, -55227, -109350, -55606, 76333, 189469, 193520, 106684, 36055, 41510, 77116, 80213, 49460, 14436, -3581, 18886, 86503, 140118, 115807, 62700, 98264, 215372, 252278, 117605, -64919, -121364, -43447, 56103, 120626, 167369, 184972, 135110, 39135, -32420, -50310, -37192, -7258, 35914, 60628, 35465]
35726C5465m9661k1388J2386O600k4025m8951n8032l8638J4522O0242N5866L7294
35714a8320O5433J02398N3254o4727j20060n9951J6472J7393k3456l5568j5150
35703h2282J0693L1921K6460k6659p3411k4785R4307J44199O2900m6282o8917
35692D8144j8964K7660M1052K6186p243k1916J3498M6702K777o9169m9128L8394
35680G7993L6298p3063j06125K2164J37425P9608m5015n6041J2083J0746n1164
35669D4909m7420K7532O3839L9108L1637N1635K6039n3617j12554j19980j10818
35658a59690q9199k6997N2267R5547J09028J23682J03737K729j17299j42602o8083
35647a16880P708K7100P574l6595q9472q1851K4820J25484Q2859n6990j07522
$$ y = [35465, -14196, -35584, -23198, -16598, -40623, -89574, -147606, -186244, -171722, -111480, -55614, -18320, 47113, 149511, 202765, 138038, 17978, -41973, -25501, -8108, -31564, -67132, -82282, -71589, -39668, -13208, -39867, -113278, -138063, -43756, 100443, 163343, 117061, 48144, 29180, 56840, 97892, 124078, 116835, 94919, 108417, 155119, 157896, 88727, 39599, 77993, 114291, 41228, -64897, -42733, 94692, 174300, 129285, 73244, 85327, 96073, 44909, -2511, 25021, 88860, 127968, 159605, 211240, 237279, 183662, 71108, -48872, -159690, -248889, -275886, -223619, -128072, -19044, 104638, 208375, 211104, 93805, -48797, -116880, -109172, -82072, -74498, -111093, -200565, -282416, -257596, -132112, -49253, -106243, -213765]
35636b13765j1105Q2021M1627o8364j04498l2629O2514R2468M3239k1363j9731
35625a49586M8729Q4305J9865o7444o0213K5362P7895O9497O4611O6272N117j00476
35613H3934j25835l2840N4074L4828k2423j1247M0137L3054l0153n1781O364O8414
35601D6526N4842j4633n3040j3668N7874Q0370L3427k3944l3979o410J4943J5400
35589A57708P219l284j1045n020M705p796k6857m833L6641K502j14600j67844
35577a32504n4792J05174J26729K5409k9022J4060L6720k1224o3114j1619O2047
35566E7864N7832j0309o1442n9738k2159K3681M5035J9077k7876m1813j3160K2487
35554a0521N2194Q9124J10427O6046m0565j42033j80346j39779k8485J05524J68370
$$ y = [-213765, -224870, -142849, -101222, -169586, -274084, -306713, -244199, -151731, -108492, -129855, -149586, -100857, -16552, 3313, -64131, -124344, -98982, -21087, 48410, 113021, 179293, 184410, 83934, -41901, -74741, -20667, 14161, -8262, -19509, 20628, 53682, 23529, -28252, -21888, 46526, 101368, 86735, 33695, 20027, 77901, 158271, 191698, 167754, 133775, 127365, 142308, 157708, 164927, 161643, 150598, 145578, 150283, 142487, 115630, 110797, 147438, 149940, 35340, -132504, -187296, -82122, 44607, 70016, 40994, 55054, 91774, 70550, 7436, -4183, 57864, 115696, 105387, 43945, -15793, -37952, -14271, 30764, 49841, 21965, -19848, -33008, -10521, 41673, 130797, 241224, 307270, 266705, 124672, -55674, -195453, -223938, -118414, 49956]
35543D9956J13501J8190j5514l123k5007p1716o4614p802J2524k3456m6140k2649
35531h5850J1734M3267Q1760Q5948J5472o0223m6307P267j7983q7039o0916L9251
35519g3619M5624n0160n2981R5022J78909M9410j26326j26599m711M0120j8449
35508d3760n1021j6175J1821J1109L5982R0136J09244O3393j3266p3760p7355
35497D6348q056O9438M7026o9376j29974m5601P6476R4867L3241N364K9090L9494
35485A88337J9652l796m2079j07920j43906r2072L966N5663M5833J4098j5759
35474g7983k1558L0897J08350J00595j9639j16372p2976L4031O0129O613k0762
35463A1325N179K7959L0468L3991K1856j9416l7657o249n634q6511j34333l0044
$$ y = [49956, 163457, 181647, 166133, 163010, 138003, 66287, 1673, -6129, 6395, -17061, -63201, -85850, -74116, -30849, 50911, 136859, 152331, 92108, 45801, 53068, 35085, -51954, -112870, -73619, -27995, -78155, -131136, -36114, 142795, 192205, 65879, -60720, -65431, -25311, -43760, -94781, -110956, -99135, -88026, -52044, 38092, 147336, 210729, 197463, 123703, 46348, 38292, 107730, 154756, 85380, -44594, -90195, -13719, 81148, 114389, 119753, 148843, 188337, 207989, 204193, 162114, 54194, -89712, -181784, -177818, -122155, -76322, -62224, -77983, -99541, -68644, 39706, 140301, 120662, 4290, -68686, -34655, 25474, 32087, 11325, 16504, 44463, 74931, 108922, 130778, 111362, 73705, 67456, 61822, -24689, -159022, -189066]
35451a89066J22135J14964m5698j36907l7290J26240J84408J27221M7096j464
35441C11639k4295m2813o7766q0262m3950K6898N4715R955k9792q944l64p4851
35429C0170j49070j05724L869M0427Q380K6676R7030R5389N85n7070j0459N0335
35417C0538M5097J0671j0081m0055p0016k9335P5107J20599M9656k8309o957N0375
35405A97290K1117p8149j21737o5397L24j2840p8823j05124n0738L3387P2607
35394a88083N1006P848k8024n4729n3805J114P2593P3448o759o5386k8655M7805
35382a71627P9483O9173N2318J7843l0411k6012M7615Q9754L4239l0811j5718
35371A15846P965n4139j23956p2079N0732R2621M3324N687j0428o0091q7741n040
$$ y = [-189066, -66931, 48033, 2335, -134572, -171862, -45622, 138786, 266007, 313103, 311639, 287344, 244531, 176765, 96503, 52553, 79451, 134166, 144121, 114329, 105385, 105021, 30170, -118900, -224624, -220755, -180328, -171948, -145272, -48242, 47147, 47732, -9338, -19797, 30538, 75635, 86306, 76225, 36170, -33846, -63181, 11926, 132525, 182181, 153872, 146915, 197290, 218407, 140258, 18521, -46876, -46552, -59392, -138215, -243339, -294077, -260690, -188083, -137077, -129229, -157253, -211982, -265787, -264673, -192080, -118632, -125391, -190777, -219432, -171627, -92144, -22971, 29347, 47190, 16779, -9233, 38382, 128136, 162375, 131564, 115846, 123811, 69672, -54284, -126363, -75631, 16990, 60314, 66001, 55573, -4518, -92259, -97299]
35359i7299R6630N0791q7953j03156K5391Q3267k2665j25732q6418J6019O6210
35348a84915P7073P9259L6395l8225n2101J229J3513m0487n4629J994K3522k2822
35336a60194k8682L8492O1653M081o408P3488R5835r762q7375k7163L3898l5378
35324d7515j12243l6309R7684R3718k4393p0725P101Q9253Q5706J6866n9193q1250
35312d1300j2688P6804N8263n0552p2659M0453R4908l1798j61379r2992O7359
35301a25581Q8707j5963n6727j011J8948k5911l3553J1882J5236l9358o1506k1374
35289b46211J5457J8898K5428M8529O9118Q6497Q7831K9106o4783p8314J1991
35278C547N6368l7401j30499p1451N0945O3501o809j1156O2059J10140J06015
$$ y = [-97299, -669, 50122, -37831, -140987, -115596, -32329, -54994, -180726, -267144, -251125, -184915, -107842, -28583, 7812, -30413, -82514, -81285, -67772, -108259, -162888, -160894, -137372, -160194, -188876, -150384, -88731, -84650, -91058, -17570, 78265, 68503, -18872, -46035, -12137, -47515, -159758, -196067, -98383, -4665, -29058, -99783, -92682, -3429, 82277, 99143, 39950, -41300, -53988, 22816, 81079, 30527, -42132, -1679, 93229, 61431, -99948, -192940, -125581, -36874, -52837, -109564, -110575, -91627, -117538, -151091, -139209, -123973, -163331, -224837, -246211, -230754, -211856, -186428, -137899, -68781, 17716, 105547, 134653, 69870, -8444, 3547, 59915, 22514, -107985, -179436, -128491, -64990, -71799, -82955, -20896, 89244, 195259]
35267A95259Q2937L9695K7415J71230M27005N47521N28684P71745J395032J688057
35257E874580Q72378o94540j740270j587400q39555l89678l52450l21500j69686
35248F51879r0944j25457j15571k9233J6639n624k2764k2142l1008j4445M4796
35237B56126O1483j4763q9657q0759n1836o5041n2011L0349P8929K7862j6079
35226H4603K3586L9394l7308o2307N9691J41087j52j95101j65432K8170J02140
35215A8371J8050q445P4685P6915o7883j69052q9472O7771J62021J82794J42893
35204D08648J3215j54310k21885j59546q2945m9816M496Q2747P6768k4116p1337
35193a78081L745P4201M2367n547J1432J2601o0708p9801O4190K26070J90550
$$ y = [195259, 278196, 317891, 345306, 516536, 943541, 1491062, 2019746, 2791491, 4186523, 5874580, 6746958, 6052418, 4312148, 2724748, 1885193, 1495515, 1143065, 821565, 651879, 560935, 435478, 319907, 290674, 307313, 301689, 278925, 256783, 225775, 211330, 256126, 317609, 302846, 213189, 132430, 80594, 15553, -36458, -6109, 72820, 100682, 84603, 108189, 147583, 110275, 47968, 107659, 248746, 248594, 53493, -111939, -83769, 18371, 36421, 27976, 102661, 179576, 111693, -57359, -146831, -79060, 82961, 265755, 408648, 421863, 267553, 45668, -113878, -196823, -246639, -242143, -159396, -82628, -106744, -178081, -174336, -100135, -57768, -63315, -51883, -39282, -99990, -179791, -115601, 110469, 301019]
35182C01019j258j19057q0792j8067k8397n9399n3276l4564j7678L2004J03418
35171B3953J22651O7116k877m9847r4872j30388j10031n1283l0350m0887J2889
35160b83926J30225J62276L5850j01358q1340M3157R9592N6486K2217L1758Q747
35149A23684o3201r4887m8013R92j755n953L4797P7358O8977K6918j1999m3014
35137F3904n5491k6509J4381P114k3523J0699Q8085O9202o8755j47616m9589Q8417
35125b9681Q8485J584j6313K1019n399o5550l1252O0829M6362o9479j03396j4093
35113a16884K3390o4700j10354j086J14451Q1702Q97L3933J12633O9102n3204
35102H9880o5081M1518P2955n0664j72748j45880k7013N0069O2726O7521P4323
$$ y = [301019, 299761, 180704, 99912, 81845, 53448, -5951, -59227, -93791, -111469, -79465, 23953, 146604, 213720, 210843, 160996, 66124, -64264, -174295, -225578, -255928, -296815, -283926, -153701, 8575, 44425, -56933, -138273, -95116, 4476, 60962, 83179, 114937, 123684, 60483, -34404, -82417, -81425, -83180, -89133, -54336, 23022, 91999, 118917, 106918, 63904, 8413, -18096, -3715, 3399, -20124, -9425, 78660, 147862, 79107, -68509, -118098, -29681, 58804, 60388, 44075, 65094, 59695, -5855, -37107, 23722, 70084, 605, -102791, -116884, -93494, -158194, -268548, -269634, -155183, -73481, -72584, -38651, 73982, 143084, 89880, 24799, 66317, 139272, 88608, -84140, -230020, -257033, -206964, -144238, -76717, -2394]
35091b394M8868p319n5175p3581o8930m9162k2917o288l231N671L5499P2771R2998
35078c3190Q7197O0241K0629j6005l0870k4694k2937m2910o6505o2099k5626J8025
35066a38744M8430O2343N6155K6149o572p375J5840P805m7568p8948k5437N3133
35054c4789M6561m2768j03808q2857l8618j7586M674K4572j1797p2081k4970J41554
35042b11913K36519J31909k6723m1426L4422K1503n8814l5913Q0746R6487l0273
35031A96524j07781l2951M6797m381r5553q4493j21M5188L3349O282l3574p4467
35019a05181m7789O2735J50230J16684p52j04283j47364j15992r993R2893P7358
35008c1454l1732o2908M8972J47530R5702j7147m1580m892k3624q7986r9947m9296
$$ y = [-2394, 46474, 39155, -16020, -89601, -158531, -207693, -230610, -236898, -240129, -234458, -198959, -126188, -33190, 54007, 114248, 134877, 118872, 88002, 63308, 40371, -2539, -69044, -131143, -156769, -138744, -90314, -27971, 28184, 54333, 47761, 40386, 56226, 64031, 16463, -62485, -87922, -34789, 11772, -30996, -134804, -217661, -256279, -273865, -269191, -244619, -256416, -328497, -353467, -211913, 24606, 156515, 129792, 88366, 122788, 144291, 85477, 49564, 130310, 226797, 196524, 88743, 55792, 102589, 98208, 2655, -81838, -81959, -36771, -3422, 2860, -30714, -105181, -152970, -90235, 59995, 176679, 175927, 71644, -75720, -191712, -201705, -108812, -31454, -63186, -126094, -77122, 70408, 166110, 148963, 107383, 102491, 78867, -9119, -109066, -158362]
34996a58362J330M3394R5681J13157N5245j5423k6851k3228p1962j20354q2202
34985a89575J661L2606K2240M5593Q1963N2359k5365o0352l3712N030M1471P5840
34973D9759N8456k5908p6296j6047N8742K2423o7460p1301m776J6580J405L8306
34961a6117Q2377K0677q0222m3732J00645J31063m312j00359l9082L4739j0550
34950G5127p7766m4627J8500M86m2718n638O6460O6861K3438L8584R6885R0932
34938C06524P775m9565k3177K6235J9486m2107r3134p7830k790O5371O5876J2964
34926B15628k5871j8528L844L896k3773o6853r8556p8575n710N1163L8177J706
34914c452J0838L5162K397n9364o2693j8769j3270l8037m920O8344O0163l4829
$$ y = [-158362, -157032, -113638, -17957, 95200, 150445, 135022, 108171, 84943, 12981, -107373, -189575, -187914, -155308, -133068, -87475, -5512, 46847, 21482, -38870, -72582, -67552, -26081, 49759, 108215, 82307, 6011, -10036, 48706, 71129, 3669, -67632, -72408, -55828, -54423, -16117, 66260, 86937, 6715, -37017, 63628, 194691, 190379, 90020, 50938, 85677, 75127, -2639, -47266, -28766, -28280, -70998, -76636, -10176, 56685, 80123, 118707, 215592, 306524, 314299, 264734, 241557, 267792, 287278, 245171, 152037, 74207, 71417, 136788, 202664, 215628, 189757, 171229, 175073, 178969, 155196, 88343, -10213, -88788, -94498, -43335, -5158, -3452, 7386, 42548, 44945, -14419, -77112, -95881, -109151, -147188, -152108, -83764, -23601, -58430]
34902e8430o5913L0500J16465O9068l9330p9875n5123l7937l3645j3210P619J8717
34890a41094N5841J04968O9401p0144j68038j02307M1606R9677O0552L3551N0803
34879C4816M7368N818j6614L55J4063P433J0454K7256J9368k8069p9689r4427
34867e1868o0502L104N2315N0050J5604M348K1304J4565k3150k8522J5034K7540
34855C9822l3444q1336l3348M6677M5576k4170o3423m9988l8414l0564K0175Q5359
34843a17078P6193j095k8135M7302J22997R1101j0486o8191n2691k5824j9272
34832A4821M647O1405Q7845K5095p8484j07543k3520Q3981J09891N2059j7499
34821B12698n6738p4322p4259m5562j148K8651L8995M1092K4759j5178l6368k658
$$ y = [-58430, -124343, -93843, 22622, 91690, 52360, -27515, -82638, -120575, -154220, -167430, -159811, -141094, -85253, 19715, 89116, 18972, -149066, -251373, -209767, -110090, -49538, -15987, 34816, 82184, 88002, 71388, 71743, 85806, 93239, 103693, 130949, 150317, 122248, 42559, -51868, -112370, -109266, -56951, -6901, 8703, 13051, 34355, 48920, 25770, -2752, 12282, 39822, 6378, -74958, -108306, -61629, -16053, -40223, -103646, -153634, -192048, -222612, -202437, -117078, -40885, -41980, -70115, -22813, 100184, 191285, 180799, 112608, 59917, 34093, 14821, 19468, 80873, 168718, 193813, 115329, 7786, -15734, 68247, 178138, 230197, 212698, 155960, 81638, 7379, -38183, -39331, -10680, 28315, 69407, 94166, 78988, 42620, 39962]
34809C9962L7429R119o1603p4535j1951L4232J1980j8646j127K7320J4836j8092
34797a1076k9535k6588k9223k1230J1696M3877N1480M6954M1707K4531O18l851
34785I9360N003o616k8455j3884K4953J7892m0575o3854r216N0857M4627K921
34773H3013j2158k876J1J681J4769K2852J5824O003j6357p0490j06818l8316J10245
34760G383J87904J13024j0008l9977J7164N0000K856p8505j19598q3596J95N0870
34748I7712K2019k9561k5445P055j1899o0457n0164j274j7130p6544m1898Q9366
34736i8220J45249N8203k3384L506L2598l0692q7839m0880J8831r994l9543L5728
34724c6437J19624P2925l4275m2329K6847L1827l2587m9113M963M1738K4600j0961
$$ y = [39962, 77391, 86510, 24907, -49628, -61579, -27347, -15367, -34013, -35140, -7820, 7016, -11076, -40611, -67199, -96422, -117652, -105956, -62079, -10599, 36355, 78062, 102593, 103211, 99360, 104363, 97747, 69292, 55408, 80361, 98253, 57678, -6176, -15392, 35465, 80092, 83013, 70855, 67979, 67990, 69671, 84440, 107292, 123116, 129119, 112762, 42272, -64546, -102862, 7383, 195287, 308311, 298303, 258326, 275490, 325490, 328346, 249841, 130243, 46647, 46842, 97712, 119731, 90170, 64725, 71780, 59881, -576, -50740, -52014, -69144, -145688, -187586, -98220, 47029, 105232, 81848, 85354, 117952, 87260, -579, -41459, -22628, -32622, -72165, -36437, 83187, 156112, 121837, 79508, 106355, 138182, 105595, 56482, 61445, 103183, 127783, 116822]
34712A16822m9160o9820q101J22908J68612M8018q0376m7331N3325L3427o0384
34701B27940m0532P5982R1881k7861j03804m4159L7825L7647j3691o1082q1583
34690I8563k4795J21919K20835J32721l7996o3535N2144Q1905m4522j32040n7579
34679C47620L5972l905j01726j09917l8943N381l607j8858j4963N620L2744K9985
34667A65403k8533q5858o0765J7319M3271M596j3581Q626L115l5508k9017L0513
34655A9581N4458J5091j3983k990p642l7453k8769J8563K1564l5436o9656m6216
34643a12888j7471n28L5765N3324j7451j09559p5316O3175J17785L1370l7580
34632f9374P160N0153r944q4604o7106o713J7147M2056J12617J56328R9587j856
$$ y = [116822, 67662, -2158, -10259, 112649, 281261, 329279, 248903, 201572, 254897, 288324, 227940, 187408, 263390, 355271, 327410, 223606, 179447, 217272, 254919, 241228, 180146, 98563, 73768, 195687, 416522, 549243, 511247, 447712, 499856, 581761, 537239, 405199, 347620, 383592, 379687, 277961, 168044, 129101, 134482, 130875, 112017, 97054, 102674, 135418, 165403, 136870, 51012, -9753, 7566, 50837, 55433, 41852, 50478, 53593, 18085, -10932, 19581, 74039, 89130, 75147, 72157, 64515, 27062, -1707, 16856, 38420, 2984, -66672, -112888, -130359, -130887, -95122, -41798, -59249, -168808, -244124, -180949, -63164, -31794, -69374, -62214, -12061, -22005, -106609, -173715, -180428, -163281, -121225, -8608, 147720, 247307, 245451]
34620B45451o1506q8100j13344j00552k6977L9673M1707K0223K5625L3642K2000
34609C7842K9808O8098P2119J4029l5727k5812l425j5439l1971k6715l1129n4666
34597b988n2807j9592p427k2453j5479K548k8101p1570k2839R4632J33321O1573
34585D8818J0827L5945L4762k7864l8518K9563K9340q7689j39453j1894J22274
34574F111P0725p6793j16951m6911R17R330M6558Q1170L2524n6004p1605j1701
34562a32630L5401L5196R620l5004o8236j0605J32077K03858R7819p0093j17646
34551G9757l8816M2722P4811Q9411Q6116M2418j0848l7575o5331j14266j30171
34540A8228p8683k2871j6667j2101L5998P1038L7691j1355o997K7750M1530L2137
$$ y = [245451, 183945, 95845, -17499, -118051, -145028, -105355, -63648, -43425, -17800, 15842, 37842, 67650, 135748, 207867, 221896, 186169, 160357, 156932, 141493, 109522, 82807, 51678, -2988, -55795, -75387, -82814, -105267, -120746, -118198, -146299, -217869, -240708, -146076, -12755, 48818, 59645, 95590, 130352, 102488, 63970, 93533, 122873, 35184, -104269, -116163, 6111, 76836, 43, -116908, -163819, -162902, -153572, -107014, -25844, 6680, -49324, -120929, -132630, -97229, -62033, -52413, -87417, -155653, -166258, -34181, 169677, 267496, 197403, 79757, 40941, 83663, 158474, 247885, 334001, 376419, 365571, 327996, 262665, 148399, 18228, -60455, -83326, -99993, -112094, -76096, -5058, 32633, 21278, 14281, 42031, 83561, 115698]
34528A15698j657p0836j09504k5526J09249J01410n8801j43309l8579P5222L6690
34517i943l8480M276P8957L7826n3282n1331K300j5019o9972n5346N617L4856
34505a29541O0757J17266J14964M418p2424O101J21202J09459K9077J4993K2047
34494C98319n3364j39875j20125n7672o0512o3369J4380N6427m0319j12169J7012
34483a61267J85359J24918q7073j53484l3406N3571K3743r247j0673l6708k7896
34472a32163R0801J72142L9111j58365j33394N6054R6105n3041j18153l462Q3207
34461f1158L5912n01M5395N1304j9323m1168N426j546n3472j8319N6004j3763
34449a5209j72346j63738J5413Q8265j2254l4381J11676J81533N0430o5281j8282
$$ y = [115698, 114041, 43205, -66299, -91825, 17424, 118834, 60033, -83276, -121855, -46633, -9943, -48423, -44147, 34810, 72636, 19354, -31977, -29677, -44696, -114668, -170014, -164397, -129541, -68784, 48482, 163446, 167864, 95440, 101541, 222743, 332202, 361279, 376272, 398319, 344955, 205080, 84955, 27283, -33229, -96598, -82218, -25791, -66110, -178279, -161267, 24092, 149010, 61937, -91547, -124953, -71382, -47639, -56886, -67559, -104267, -132163, -41362, 130780, 169891, 11526, -121868, -65814, 30291, -22750, -140903, -144365, -61158, -25246, -25747, 19648, 70952, 51629, 10461, 15887, 14341, -39131, -57450, -1446, -15209, -187555, -351293, -335880, -247615, -259869, -294250, -182574, -1041, 49389, -15892, -34174]
34438c4174K5060m7996n9303R6220J98312P2572r8175r8823l0245o0007r4593
34427a31152N879J16447N2618r4554j12079p169O0751O2161P5599R2433N5057
34416A75991K57r007n220l2881m9863k5997j5253l1965k110P3541P8075j3176
34404A42392p2710n2627o0350j15829q2604M9254Q4649l2736q5717L4864J11867
34393g9547j7053j49808n5881J35115J71435Q3933N0551M9189l8847j33797q1291
34382f6001M3701N1500l7648n7727L10J5163r526K7187R8968R4340L3460K2350
34370B16077M1115j1527j10111j39496r5783o4164m4536K0862R2643Q0306L530
34359a1084m3355l9799j8605L2618J13744J36944N0248m5910m3030M772p650n3886
$$ y = [-34174, -9114, -57110, -116413, -20193, 178119, 250691, 152516, 53693, 23448, -36559, -131152, -125273, -8826, 43792, -50762, -162841, -170010, -109259, -47098, 28501, 120934, 175991, 176248, 167241, 162021, 129140, 79277, 53280, 38027, 6062, 3952, 77493, 155568, 142392, 69682, 17055, -43295, -159124, -241728, -192474, -107825, -140561, -226278, -191414, -79547, -96600, -246408, -302289, -167174, 4261, 88194, 138745, 187934, 149087, 15290, -66001, -22300, 29200, -8448, -66175, -65865, -50702, -60228, -33041, 65927, 160267, 193727, 216077, 257192, 245665, 135554, -3942, -99725, -163889, -208425, -187563, -94920, -14614, -11084, -54439, -94238, -112843, -80225, 33519, 170463, 220711, 174801, 131771, 136543, 128893, 75007]
34347G5007n2675k9636m8830p1044k9594L2712L7595K288j8898l1040l7240L024
34335a68331O1974L4378o5139p2022N1719J18771L3006k7604P0394J52033K8395
34324B17574j56674j52711p953M1605l7886q3191l6814J8849N8271J08356J16764
34313H6190L5369m4666l3119j1155p0580j15106l4672O4539M1201j3139N1336
34302d3802J36070N4974j05590r9767O7284J46122L7676r4947j12091n7290j8215
34291h9576j8040m7172o2338M024J17710J27974L349p1111J2060Q1737j6736j31845
34279h9964o6713O5684M4798o9133o7720K7216M5992R187N1248J13415M8756n9604
34267E3162k1978R8859Q7998l8095q4319m0356n0735q9623j4140J13743J06903
$$ y = [75007, 22332, -7304, -56134, -127178, -156772, -124060, -86465, -84177, -103075, -134115, -171355, -168331, -106357, -71979, -137118, -209140, -157421, -38650, -5644, -33248, 37146, 189179, 217574, 60900, -91811, -99764, -58159, -96045, -179236, -216050, -197201, -138930, -30574, 86190, 121559, 76893, 43774, 32619, -37961, -153067, -187739, -123200, -81999, -95138, -43802, 92268, 147242, 41652, -58115, 9169, 155291, 192967, 98020, -14071, -71361, -89576, -107616, -154788, -217126, -213102, -95392, 32582, 35931, -35180, -23120, 58617, 41881, -89964, -156677, -90993, -46195, -115328, -183048, -155832, -109840, -100653, -49405, 64010, 112766, 53162, 31184, 130043, 218041, 179946, 95627, 55271, 4536, -85087, -99227, 14516, 121419]
34256A21419M270k903O0088J3285j02419q6443K7504K4229p7126n8221O3475M7938
34244C5096j08222j43359j031Q2596K3806J9137J40133J88493O8581m9845n3634
34233B01751m3151p0715m2675L1254J0149p9818m4243J10454J44935L296q5499
34222A35738j6443L1255m4671r1654j7809L7249j4473n2945l767L4626K4077O2187
34210H3370J33644Q3861p0961j14746M66P3094K1796K155O2304L6095j03638j42496
34198F4944j4448N5444m6960j21778k5178Q3862N0463k3599j5417Q301j9371k8440
34186c2177k346m0360j18214p1699Q2105J18348l064n3666M9899J06479K5424
34175F0729j3971O0619O3094o2146q9619O1774J38838l266j44358j02723k6074
$$ y = [121419, 125689, 122786, 182874, 196159, 93740, 7297, 34801, 59030, -18096, -76317, -12842, 35096, -73126, -216485, -217516, -134920, -111114, -91977, 48156, 236649, 305230, 255385, 201751, 158600, 87885, 45210, 76464, 86613, 6795, -37448, 73006, 217941, 221237, 135738, 119295, 150550, 105879, 14225, -3584, 33665, 19192, -33753, -37520, -2894, 21183, 83370, 217014, 300875, 229914, 115168, 115634, 188728, 210524, 212679, 274983, 311078, 207440, 64944, 50496, 105940, 58980, -62798, -87976, -4114, 46349, 22750, 7333, 15634, -3737, -32177, -34523, -74883, -193097, -264796, -182691, -64343, -67407, -121073, -71174, 35305, 60729, 46758, 107377, 170471, 108325, 18706, 80480, 219318, 216052, 71694, -31029, -57103]
34164e7103n3932n4622O4771J40503P7404L9668R5351M6659j51196k03745J9286
34153c6956J96401P3820j17655r2548K2098K864m6415L7715J16584L3901m6443
34142A43366L8008R3354p6947k57665j67548M8089Q3037j4289o202P0607K3942
34131b2248r1083q5136J695J0890j0834O2040J38575O7800o2423q5417m9769o8406
34119a94316o4022M4956J08387m546j23408m9255R7150J02830K6601L0777O5625
34108D0779K9528K2898J31219J80780K5953j49580j32800l9633n3907p1091N0345
34097C4491J45055K2340j51443j28642m697N553k5783N8312J33864L3859p9255
34086D3654J0948J48828P2950j03057r9617L2088M2359o2316r6610n9630m9385
$$ y = [-57103, -111035, -165657, -100886, 39617, 117021, 156689, 252040, 298699, 147503, -56242, -36956, 159445, 233265, 115610, 23062, 45160, 48024, 1609, 39324, 155908, 189809, 143366, 181374, 274728, 197781, -59884, -227432, -179343, -96306, -110595, -116797, -46190, -22248, -113331, -198467, -196772, -185882, -196716, -134676, 3899, 71699, 9276, -76141, -125910, -194316, -258338, -213382, -104995, -109541, -232949, -282204, -185054, -82224, -55623, -24846, 40779, 70307, 93205, 224424, 405204, 431157, 281577, 148777, 109144, 55237, -15854, 34491, 179546, 201886, 50443, -78199, -82896, -77343, -103126, -44814, 89050, 122909, 43654, 54602, 203430, 276380, 173323, 73706, 105794, 148153, 85837, -10773, -70403, -119788]
34075a19788lJ41849J91778K8337j24796o6348J9430o3733j20518M4029J80608
34064A10845K5142j71646p1833J22913M3646j54907q9506J34182J37198k6146
34054E9888k1846R7409K6942j51380j07613R3672J12523l1397n1103J6039p7232
34043c4098k18537j04785J47059J79041M6197O4283J59776L5718j67612q3419
34033B3623J43576O7634k15510k05821Q7445J61118o7338j56273J3650P5166o3393
34022a36123n7679J51019J86497m3340j67914m4324K8575p3404j02556J1294K6915
34011b21040q1162n9050Q4661P6906l6593N7761K78326K16177r1648j68697N4552
34000A10193J32466o3532j47618J8200J00471j6942l8662R5610P9910r9301r0155
$$ y = [-119788, -119791, 22058, 213836, 242173, 117377, 51029, 70459, 6726, -113792, -69763, 110845, 135987, -35659, -107492, 15421, 59067, -95840, -185346, -51164, 86034, 59888, 38042, 135451, 162393, 11013, -96600, -2928, 109595, 78198, 27095, 43134, -34098, -252635, -357420, -210361, -31320, 14877, 79160, 238936, 274654, 107042, 23623, 167199, 234833, 19323, -186498, -99053, 62065, -5273, -161546, -147896, -72730, -136123, -193802, -42783, 143714, 100374, -67540, -111864, -83289, -156693, -259249, -247955, -221040, -302202, -361252, -276591, -199685, -236278, -178517, 99809, 315986, 224338, 55641, 110193, 242659, 179127, 31509, 49709, 150180, 133238, 94576, 190186, 270096, 170795, 80640]
33989H0640J03118O5233k20588k72352J5412J73609K5004l8990J34063J64993
33979B30142q4748k16349m5573Q3167j961r660J53141J55931p4263j66634k3253
33968f0P691j35887r4728J38886J33138j16915j05874K00888K29261j23488k44576
33957a11664O5045K20103l5695j63221J05160K44831l3602k22815o167J51177
33947B13152n9128j96953K3171J63887l4329j10837J75973K98560m3937l05902
33937A23657r7786J12940n6362j88036M4493J96439m7228k07904M7994K26577
33927A54784k4497k00050P1024K67103j8540k64396k6402J96792m4631k46192
33917a35005O3603L59439Q8434k82372j50977J33002K9242j64141K003K05154
$$ y = [80640, 183758, 248991, 28403, -243949, -228537, -54928, -29924, -68914, 65149, 230142, 145394, -70955, -116528, -33361, -35322, -44982, 108159, 264090, 189827, 23193, -60, 7631, -128256, -222984, -84098, 49040, -67875, -173749, 27139, 256400, 132912, -111664, -46619, 173484, 137789, -25432, 79728, 324559, 290957, 68142, 61975, 213152, 154024, -42929, -19758, 144129, 109800, -1037, 174936, 473496, 429559, 123657, 25871, 138811, 82449, -105587, -61094, 135345, 88117, -119787, -71793, 154784, 130287, -69763, 1261, 268364, 249824, -14572, -40974, 155818, 111187, -135005, -71402, 288037, 376471, 94099, -56878, 76124, 105366, -58775, -56772, 148382]
33907A48382M7444j11568Q6319K18267o7357k73659l73K33401j2831k32621O284
33896D1688J86310q9508k30546J59333L74002o7315l77792O3629M63022N3638
33886E76461m41569j56133L13065J00891k84522l9101L31749N3421l44898q7715
33876B1649K72417n1072m68933j42318L46260J21684k66958L0765M39979J18858
33866D22331l02162L9638M48875J7354m79359k8752N54791J31877n02714j16826
33856A85053N20584R9597o33215k80100M72831J90181m84593j21506N96034J81096
33846G25962o37523k50367O40283L29701n37395k27260O17007K32861o75031k41037
33836b2799P90775M16124o29396k34632Q50710L99375q00460l62602R03534M45440
$$ y = [148382, 195826, 84258, 170577, 388844, 321487, 47828, 47455, 280856, 268025, 35404, 41688, 227998, 138490, -92056, 67277, 441279, 373964, -3828, 59801, 522823, 576461, 134892, -21241, 291824, 392715, 108193, 69092, 400841, 454262, 109364, 21649, 294066, 242994, -225939, -368257, -21997, 99687, -167271, -136506, 303473, 422331, 120169, 159807, 608682, 626036, 146677, 117925, 672716, 804593, 301879, 185053, 705637, 805234, 172019, -108081, 364750, 554931, 70338, -51168, 544866, 725962, 88439, -161928, 478355, 808056, 270661, 43401, 660408, 893269, 218238, -22799, 767976, 1184100, 554704, 320072, 1170782, 1570157, 769697, 407095, 1310629, 1756069]
33826A756069q92239l57016J165881O73858r31519l73769J439451R44410r10707
33817B514419k10082K025891J413805r47516k5511L126065K783761j9553J297357
33808A1958636N712948N610096K295912N213246J2813575J3080042R612272K3999510
33800I0296237N6887297O9449615K9844705l5939798o9796811n2695183k0491274
33793F7554788q604001j2240609j0915818l945465k709749o272626n355952o98522
33785A6812046j07738l139449l079018n1917K48802k083147k025688L63067N53920
33776G490878j455032j534451L95321N79022j087330j144263N16138O40690r24244
33767C476729j103475L46257N68430p27222q85262M06575O61218m72302p09572
$$ y = [1756069, 863830, 506814, 1672695, 2346553, 1415034, 1041265, 2480716, 3425126, 2514419, 2304337, 4330228, 5744033, 4796517, 4771006, 7897071, 10680832, 10661279, 11958636, 17671584, 23281680, 25577592, 30790838, 43604413, 56684455, 66296727, 90296237, 147183534, 216633149, 246477854, 210538056, 140741245, 88046062, 67554788, 58950787, 46710178, 35794360, 31848895, 29139146, 22866520, 17510568, 16812046, 16704308, 13564859, 10485841, 10433924, 10682726, 8599579, 6573891, 6936958, 7490878, 6035846, 4501395, 4896716, 5475738, 4388408, 3244145, 3760283, 4400973, 3476729, 2373254, 2719511, 3287941, 2560719, 1675457, 2082032, 2743250, 2270948, 1561376]
33758A561376K75254L79846o09922o40892M39891N57770m84413o36788L59492
33749A201614N07377n03617p18543K58708N57895k90900n35742L20448O22968
33740A420208j53989m71486J85356L77239l54814n82814J75626N32974n3367l32091
33730G42842J86651L28576l02007m95546J47183M00215j93470m63259P0946L13831
33720G35962j87684l78034J63761L90351j10933l02738K23323M29650j11532l81830
33710D70296O8461K73597j79672l23360K28945M51182j06329m19664L5076L01476
33700H00008j49360l89249J24792M78274O8566k81350J6423K18146j74411l80250
33690C31589Q1327L67595p7621m27190m5342L31049N5993k28141N9289K88364
$$ y = [1561376, 1836630, 2216476, 1606554, 965662, 1405553, 1963323, 1478910, 842122, 1201614, 1708991, 1205374, 486831, 745539, 1303434, 1012534, 476792, 797240, 1420208, 1266219, 794733, 980089, 1357328, 1002514, 419700, 595326, 1128300, 1074933, 742842, 929493, 1258069, 956062, 460516, 607699, 1007914, 814444, 351185, 422131, 735962, 548278, 170244, 334005, 724356, 613423, 310685, 534008, 963658, 852126, 470296, 538757, 812354, 632682, 309322, 538267, 989449, 883120, 463456, 498532, 800008, 650648, 261399, 386191, 864465, 933031, 651681, 668104, 886250, 711839, 331589, 412916, 780511, 702890, 275700, 230358, 561407, 617400, 389259, 448548, 736912]
33680G36912q2718l97861q3893K40678L758k27945N5362K60877j01745l89547
33670A3878n8642K69812L0641j93084J29003L74182j6141l82168o6420L28247
33660D29308Q8249k73666m9572L06199R5153k83006j49883J50351p141k88958
33650A7034j04715K13132R9472j09784J12122L59111M3564m05626k63864J87143
33640A47589K20727m3944k8013J62564O5308j52030o4349J15603j7890k05266
33630B00299l8224J75647j3287k84661j32945J68081J09273q4626L9714K30942
33620C70213M8847k16724q7531J65839O5834j31001J6447K00207l4615l10543
33610H6973p3400L07390J69025k14091j43806K08288J67340j65901j59024J32308
$$ y = [736912, 654194, 256333, 172440, 413118, 416876, 188931, 244293, 505170, 403425, 13878, -44764, 225048, 255689, 62605, 191608, 565790, 549649, 167481, 101061, 429308, 517557, 243891, 194319, 500518, 595671, 312665, 162782, 313133, 305992, 17034, -87681, 125451, 224923, 115139, 227261, 586372, 629936, 224310, -39554, 147589, 368316, 324372, 296359, 458923, 524231, 372201, 307852, 423455, 405565, 200299, 162075, 337722, 324435, 39774, -93171, 74910, 184183, 99557, 139271, 370213, 419060, 202336, 114805, 280644, 346478, 215477, 231924, 432131, 397516, 86973, 13573, 320963, 489988, 275897, 132091, 340379, 507719, 341818, 182794, 315102]
33600C15102J24532j49953j51673J04439J35186l9022k350J55830J9197k57283
33590B54005j82755J14327J05590j46957j54176L7490r283j97527p0590K46198
33580c678K28009o2579j03292J08124J26947k3433N5261K53763J10043k54536
33570D34629k88477j0408O7321p9636k0561J99719J21544j87135k01842O9431
33560A04585J08820j16473j25396J12386J32166q3933o9393J78877J63051j38124
33550B66566j99428N2573J13142j14878j50560J04276J68712p1653j40507R6713
33540A24956J72955p0184j84562J2597J13869n7569j23973O3856J20769r4719
33530G7995j75629M5912J61680l4578j61108K0946J87077J01070K1365J18973
$$ y = [315102, 439634, 289681, 138008, 242447, 377633, 338611, 336261, 492091, 511288, 254005, 71250, 185577, 291167, 144210, -9966, 27524, 18241, -179286, -249876, -3678, 224331, 161752, 58460, 166584, 293531, 270098, 325359, 579122, 689165, 434629, 146152, 135744, 203065, 123429, 102868, 302587, 424131, 236996, 35154, 104585, 213405, 96932, -28464, 83922, 216088, 132155, 62762, 241639, 404690, 266566, 67138, 119711, 232853, 117975, -32585, 71691, 240403, 168750, 28243, 124956, 297911, 227727, 43165, 55762, 169631, 112062, -11911, 51945, 172714, 77995, -97634, -51722, 109958, 75380, -85728, -64782, 122295, 223365, 244730, 363703]
33520C63703J29519q0153k08718r8801k6644j24732j12165J15177K25650O9151
33510B51987m0571N8196P6687j16457j91148K4403J97680Q9811m9205K052N7799
33499C61234k7321n2698Q1249J22098m7840j60726o6377K076q5335j03535M6713
33488F9538J11124j9001q2604L8830R2145l3466q0164N8755J14913k5740r4000
33477A50330K9814Q2203n3171j12324K4399J06366K4564M440R1937K5914j82750
33466A91722j66093R7161J53267j11387k22808K6756J97374J9977j25189M4139
33456A04919J87306J9623j49139l8948P1022o5842j57016L0633J65805k0222j85297
33445c7156j0498J85536M8686j40362j1705J88378P6353j47528j03953N7845L10
$$ y = [363703, 493222, 413069, 204351, 105550, 78906, -45826, -157991, -42814, 182836, 251987, 211416, 269612, 346299, 229842, 38694, 63097, 260777, 350588, 301383, 303435, 361234, 333913, 281215, 362464, 484562, 436722, 275996, 209619, 211695, 126360, 22825, 69538, 180662, 161661, 79057, 117887, 210032, 176566, 96402, 155157, 270070, 244330, 150330, 180144, 262347, 209176, 96852, 121251, 227617, 252181, 256621, 348558, 374472, 191722, 25629, 122790, 276057, 164670, -58138, -31382, 165992, 185969, 60780, 104919, 292225, 311848, 162709, 123761, 194783, 128941, -28075, 2558, 168363, 148141, -37156, -47654, 137882, 186568, 46206, 34501, 222879, 299232, 151704, 47751, 105596, 105906]
33434A05906j35518m0140J32784O9227q5455j5843J46817Q6959q8442p5397N1326
33423A52224L2841n7561j7442K7803j10194k29270o9433J66464J43807k0229k4925
33412e915M1376n8925j71927k3836K05691J60926m7709n2409J10066J19529r479
33401B67388n374R6762L3492j42891j39292L0227P9795k2756m5222M2314M2613
33390B37056o2623r4279k6467J2087K4264Q8863J11154l1632j99255j71340r137
33379a21309P1120N0103L8753K4861k6386p817J14818J46321l587r8042K2359
33368B11194J25911Q768j17213l0577O5769n8734j90618o6943J05406L0462j10181
33357b6756j0949J53754N5552j43517p5884J48673J57732j152r367Q1451j6860
$$ y = [105906, -29612, -69752, 63032, 132259, 46804, 30961, 177778, 264737, 176295, 100898, 152224, 185065, 127504, 110062, 137865, 27671, -201599, -271032, -104568, 39239, 19010, -5915, 35461, -23464, -195391, -219227, -13536, 147390, 99681, 47272, 157338, 276867, 267388, 262014, 358776, 392268, 249377, 110085, 140312, 220107, 197351, 152129, 194443, 237056, 174433, 80154, 53687, 65774, 90038, 178901, 290055, 258423, 59168, -112172, -121309, -50189, -86, 38667, 63528, 37142, 29325, 144143, 290464, 286877, 188835, 211194, 337105, 345873, 228660, 198083, 263852, 205118, 14500, -52443, 52963, 83425, -26756, -37705, 116049, 171601, 28084, -47800, 100873, 258605, 257453, 248086, 329537, 312677]
33346C12677k10359j63353O0963J02915n0371j00587j4799j761k2349J09344K49107
33335B71427J20639j22644j15152N9755L0274j55311j20915J13689J59662k0495
33325B20929p0171P7028J06189m7301q8473N0582R4693k9872q2322p405k2165
33314B01712j41558j29336K1421N5580n2541o0916N9447Q9198J8160N0471J52736
33303B64374R3692p1802o3119R5159J13402j6770m1812K3957n9812k20237j51579
33292c4547Q1191J09000p6172j21044K4724N9483m6564j2536J42362R6313j22928
33281I9282j37539P2951J26999l4742o5021P6456M0573j76747j59683J21936J89897
33270A54362o5751j53258J25946L06472R6576j36077p3679L4460n3661j15172
$$ y = [312677, 102318, -61035, -72, 102843, 52472, -48115, -62914, -64675, -87024, 22320, 271427, 392066, 269422, 154270, 214025, 244299, 88988, -31927, 81762, 241424, 220929, 150758, 227786, 333975, 286674, 198201, 248783, 343476, 313604, 231282, 223877, 201712, 60154, -69182, -47761, 7819, -44722, -105638, -46191, 43007, 61167, 111638, 264374, 358066, 286264, 223145, 318304, 431706, 414936, 373124, 397081, 337269, 117032, -34547, 46644, 155644, 79472, -41572, -16848, 42635, -3929, -16465, 125897, 222210, 99282, -38257, 34694, 161693, 126951, 61930, 138386, 178959, 2212, -157471, -35535, 154362, 88611, -64647, 61299, 367771, 464347, 328270, 254591, 289051, 235390, 120218]
33260A20218K3845J04430m2420j39008r26R9676k9878j31742j4862Q1125j4597
33249E5861o7086N9237R5056q4607j52953N9596K01662L5741j16467J9090J64210
33238B69340M1175r9119J6563J47960J5203j53273o1522R0164J704j53884p2574
33227D1737J09921R2524m9623o7249q21j2562k8454N7102R7565k1141j06354r234
33215A03411O9870m0852j43783m4540Q7885O6435K4168Q0794O5102r6130j32900
33204C9460P3654J94167J9893j36626j3300J13835l2594j90591n9724J16159R162
33193A33495j74136r6714P8523L4622q8540o365J31587N4422o8409L6039J66848
33182B01372J3567k04497r1898J95576K15712O845m7720O4355L7686j20575j23779
$$ y = [120218, 144063, 248493, 206073, 67065, 66139, 165815, 135937, 4195, -10667, 70458, 55861, -11225, 48012, 143068, 58461, -94492, -34896, 166766, 202507, 86040, 105130, 269340, 310515, 211396, 227959, 375919, 391122, 237849, 176327, 266491, 268195, 114311, 41737, 151658, 244182, 194559, 127310, 126489, 113927, 85473, 142575, 240140, 218999, 112645, 103411, 173281, 132429, -11354, -55894, 31991, 98426, 122594, 203388, 268490, 172360, 39460, 113114, 307281, 327174, 190548, 177248, 291083, 258489, 67898, 8174, 124333, 133495, -40641, -137355, -58832, -24210, -112750, -119115, 12472, 66894, -1515, 34524, 201372, 214939, 10442, -81456, 114120, 329832, 336677, 288957, 353312, 390998, 270423, 146644]
33171A46644K5125N8866l7263m6029K7639P28q3954m6662M7284J8360n2540O712
33159F4910Q4074l474j10046p760J61162J21489m1338o8198o311n6133j41859
33148c484q0248K7275L769l0388P6938J36295l8415j99732o6615J42246Q9341
33137E6982p0487p610J54149J07391k9215K4288J14133m7388k54921j39984J20482
33126B7820J01142j00043q3199Q1776L1875j35258l7463K17733J97634m0200o3651
33115A98166J03447M8472j98130j91938Q0771J69140j0753p2957O5057N7760j44472
33104A04563j77180K9378J18980l587k4219J33113J65188Q722l5028R2771R4440
33093E07141q4882j45405j6485L4329m9411l8833N5180j8899j92781j32515J17663
$$ y = [146644, 171769, 230635, 193372, 147343, 174982, 175710, 91756, 45094, 92378, 110738, 58198, 64910, 148984, 145510, 35464, 27704, 188866, 310355, 269017, 200819, 194508, 138375, -3484, -83732, -56457, -52688, -83076, -6138, 130157, 91742, -107990, -174605, -32359, 56982, -13505, -21115, 133034, 240425, 211210, 235498, 349631, 302243, 47322, -92662, 27820, 128962, 28919, -54280, 27496, 59371, -75887, -113350, 104383, 302017, 261817, 198166, 301613, 350085, 151955, -39983, 40788, 209928, 199175, 126218, 191275, 249035, 104563, -72617, -43239, 75741, 72154, 47935, 181048, 346236, 354958, 319930, 412701, 507141, 422259, 276854, 260369, 294698, 245287, 206454, 261634, 242735, 49954, -82561, 35102]
33082C5102J75517K0703k863J08827J7560k28771k07767P3107J41424p6176j27559
33071g0896R7861J61904q2346k16676m5785Q2858j4531m8407J03500J43029j9328
33060I1183o4396Q0960P9182j12285q9282K10402L02314N156k35327j53557o1815
33049E2535j44258r9582J75454K78807M2776j25472k997N8226j31136j93758P1282
33038a8123K50810O4030j32000l2415Q2116l8685j14657P1678K04123L7461j20700
33027B53638m174J17246j79r6669M3317J37991l2428j73743m3325Q5844k5521
33016B61997j24651J357R3986m0303j25713K1783J03369o7624j68600J0116J50847
33005A16564L7920l0245J14798J24716j53256k73047P470K26385M5487j40209
$$ y = [35102, 210619, 231322, 228459, 337286, 354846, 126075, -81692, -8585, 132839, 56663, -70896, 26965, 188869, 106523, -110153, -155938, -73080, -87611, -136018, -32518, 110511, 91183, 26787, 107747, 186929, 74644, -14638, 195764, 498078, 503234, 267907, 114350, 52535, -91723, -191305, -15851, 262956, 305732, 180260, 177263, 235489, 104353, -89405, -18123, 232687, 296717, 164717, 132302, 214418, 175733, 61076, 132754, 336877, 374338, 253638, 249464, 366710, 366531, 269862, 313179, 451170, 418742, 244999, 201674, 287518, 261997, 137346, 138703, 232689, 192386, 66673, 88456, 191825, 124201, -44399, -34283, 116564, 154484, 124239, 239037, 363753, 210497, -62550, -55080, 171305, 216792, 76583]
32995G6583J7358J59077m7203k30621l5075J77879K8134j50943J7834K09360M2739
32984B65122j64639k7390J48909j0770j89759q712J96985J9584k04910l7381K00239
32973A87278M3508k07019o5899J98338R3139j48741m8773J81902R0263j07995
32963B16001K6693K55310J10781j84045j47260M6745k4178j54866M1592K66949
32953D53722N6328k79095j83760J07192L9336j96858q4105J71363N7460j83234
32943d1651O061L69960K62857j40764j78644O7210R940k49414j30805K46998K52890
32932D74638p0648j32181O7433K9444j77177o1293K38351J64525j48838j01659
32922B82595J93632J07357k72995k77734Q0533J56769q8825q2360J86703J56771
$$ y = [76583, 93941, 253018, 205815, -24806, -59881, 117998, 146132, -4811, 13023, 222383, 265122, 100483, 73093, 222002, 211232, 21473, 12761, 209746, 229330, 24420, -12961, 187278, 230786, 23767, -42132, 156206, 249345, 100604, 51831, 233733, 323996, 216001, 242694, 498004, 608785, 424740, 277480, 324225, 300047, 145181, 186773, 453722, 510050, 230955, 47195, 154387, 193723, -3135, -87240, 84123, 141583, -41651, -35590, 334370, 597227, 456463, 277819, 345029, 354969, 105555, -25250, 221748, 474638, 403990, 271809, 339242, 368686, 191509, 130216, 368567, 533092, 384254, 282595, 476227, 583584, 310589, 32855, 113388, 270157, 181332, 98972, 285675, 442446]
32912D42446j63010j99084N4607N1192j90925j25466K01977K16606n0365m0698
32902A97280J90032R3855k00865p8930K94024J86736k83443k95870J48052K32041
32892D82912j33195j94844J57179K27047o4477l9931L20645K83225j65609k24131
32882F48821J67226J86130k45184k57134K69544M07034m8588j21524N38597R48003
32872B492925M67379k39359m98947n38745n79537l29659J20912J59958j84846
32863H70081j87589J95534K22101j59014j87121J64528R6617l62959k94111K99277
32853F57344L85129j26005j83268L35305L48328k71911l64246K57640L90364j98268
32843A230412k75931M01020N36416j32159k26975N50982P96250L62224R62384
$$ y = [442446, 279436, 80352, 134959, 186151, -4774, -130240, 71737, 288343, 237978, 197280, 387312, 481167, 280302, 201372, 495396, 682132, 398689, 102819, 250871, 482912, 349717, 154873, 312052, 539099, 474622, 434691, 755336, 1038561, 872952, 648821, 816047, 1002177, 756993, 499859, 769403, 1176437, 1127849, 1006325, 1544922, 2492925, 2960304, 2720945, 2221998, 1683253, 1103716, 774057, 894969, 1054927, 870081, 682492, 878026, 1100127, 941113, 753992, 918520, 1015137, 652178, 358067, 657344, 1042473, 916468, 733200, 1068505, 1416833, 1144922, 780676, 1038316, 1428680, 1230412, 954481, 1355501, 1891917, 1759758, 1532783, 2083765, 2880015, 3242239, 4204623]
32834D204623K604790K614512m4192k533415k338932q57168m70898p68667l08921
32825B101732K91307j28378o93716j75308N36100J78416m22903q8641L46149j68181
32815A776577o20574O2504O99253O8752n89943P1672P89314J01635p06742n1198
32805A601250P94575J49953p18840n6209Q54457J90202p01650R9713J143903L46874
32795C704228p35476K10957J552305P03692o27474N04676K398220J697866m3562
32786I365432P96652K739003K003261M11669K407456N907853N425687L244447
32778C2301460O634723J3720805J5053228J2709147K3852900N6035237Q8504074
32771B48811574Q9207417M6963692j9087178p6290945r9185672q2327220m3779033
$$ y = [4204623, 6809413, 9423925, 9379733, 6846318, 4507386, 3650218, 3179320, 2410653, 2101732, 2393039, 2264661, 1570945, 1395637, 1931737, 2110153, 1687250, 1598609, 1944758, 1776577, 1156003, 1218507, 1917760, 1986512, 1396569, 1468241, 2257555, 2359190, 1652448, 1601250, 2395825, 2545778, 1826938, 1770729, 2625186, 2815388, 2113738, 2213451, 3357354, 3704228, 2968752, 3179709, 4732014, 5435706, 4808232, 5312908, 7711128, 9408994, 9365432, 10162084, 12901087, 14904348, 15316017, 17723473, 23631326, 29057013, 32301460, 38936183, 52656988, 67710216, 80419363, 104272263, 160307500, 248811574, 338018991, 384982683, 365895505, 289604560, 190418888, 108091668, 64312635]
32764F4312635j2734924m628625r603416j0154914l907769o04342l092128m286901
32756A5299616j235382N33924j758414l332163j218673O40976p32227k139031
32748F058626p64580P27720k79029j506430n22536O77609j74263j277973m66405
32739B472739O32553q3671j151394m91156O48890K48049o89551l07035N36117
32730A815541J48373o70766l30822M23837Q0160o58244l13063M77397K48331m85395
32720G35349l25508L40025K42481l06746k02644K33102L0306m00811j19699L97208
32710F23063J67329l50884j62742L10136R1593m05226j91087L55105K23510k93032
32700C67765k27621J92756R0446k97143j37524L05727J94977k24233j30663K43441
$$ y = [64312635, 51577711, 46949086, 37345670, 27190756, 23282987, 22678645, 19586517, 15299616, 14064234, 14598158, 12839744, 9507581, 8288908, 8929884, 8197657, 6058626, 5294046, 6021766, 5742737, 4236307, 3713771, 4391380, 4217117, 2939144, 2472739, 3105292, 3021621, 1870227, 1379071, 2027961, 2276010, 1586459, 1279424, 1815541, 1963914, 1293148, 962326, 1386163, 1466323, 808079, 495016, 972413, 1220744, 735349, 409841, 749866, 992347, 685601, 482957, 716059, 746365, 345554, 225855, 623063, 790392, 439508, 276766, 586902, 678495, 273269, 82182, 437287, 660797, 367765, 140144, 332900, 423346, 126203, -11321, 294406, 489383, 265150, 134487, 377928]
32690C77928J01371l13626j94137K31759J44818k67195j97255K09408J86581j38043
32680A41609n1670K84299J60902k29711j36875K64783J88465k42093k30203J65729
32670C15235J78077j79090j81822J71085J81416j73361k25257P2014J04488j58903
32660A03882j34256J82800K04501p5836q1978J81512J33531k13876k49143N7500
32650A08637J12175j32069j06956K10973K14941j52974k56834N0464J80653p1327
32640A57683j99847R381J33937k749l0874J58581J80707n5997j53772j156M4963
32629B40857j03108j21393K1219n825j77375j14398J37922J41923p8543n5442
32619a14163K05974K02252j04041j90669M8936J35885n8089j05785Q9057J02643
$$ y = [377928, 479299, 165673, -28464, 203295, 348113, 80918, -116337, 93071, 279652, 141609, 89939, 374238, 535140, 305429, 168554, 433337, 621802, 379709, 149506, 315235, 493312, 314222, 132400, 303485, 484901, 311540, 86283, 158297, 262785, 103882, -30374, 152426, 356927, 281091, 199113, 380625, 514156, 300280, 51137, 108637, 220812, 88743, -18213, 192760, 407701, 254727, -2107, 48357, 229010, 157683, -42164, -32783, 101154, 98405, 67531, 226112, 406819, 350822, 197050, 195894, 240857, 137749, 16356, 37575, 31750, -145625, -260023, -122101, 19822, -58721, -114163, 91811, 294063, 190022, -647, 48289, 184174, 126085, 20300, 109357, 212000]
32609B12000j29846j45272J31676J99997o1575j48662R9491J86438q2768k21382
32599D0097P042J41426r1456k64401n8305J77234J17644J3412J08075J64824j793
32588C53799j34528n8040k202o8658Q274K54362K61737p0013k65704q8266O1098
32577B51859q3153j80162O426J25924p2040k32860o5786J14133J1832r0247Q0846
32566a33228K29019N9130j38794k8003J56707P9439p9663k3202Q8759P85j12632
32555I8317p052J33532N8847o2528J533Q3801k3312j30165l5070M5884r4936k01728
32543a32877j8004J92667J03568p9532j4823J45129P5934r5106n6679Q5308M0074
32532B45659r1281k9808J16605N1064j42628j53954j624N8539K0647N2981R5632
$$ y = [212000, 82154, -63118, 68558, 268555, 206980, 58318, 157809, 344247, 261479, 40097, 47139, 188565, 97109, -167292, -225597, -48363, 69281, 82693, 190768, 355592, 353799, 219271, 161231, 159029, 90371, 98645, 353007, 614744, 544731, 279027, 190761, 251859, 168706, -11456, -5030, 120894, 48854, -184006, -249792, -135659, -123827, -214074, -133228, 95791, 154921, 16127, -11876, 144831, 224270, 144607, 121405, 210164, 210949, 98317, 91265, 224797, 283644, 221116, 222649, 306450, 283138, 152973, 117903, 163787, 68851, -132877, -150881, 41786, 145354, 65822, 50999, 196128, 272062, 176956, 120277, 205585, 245659, 154378, 124570, 241175, 292239, 149611, -4343, -5967, 52572, 73219, 126200, 221832]
32521B21832r339j39605q0526O4787O7472j801M6978J10965n433j65005j14173
32510c848M5913M1998q1053q4212J1147J8942j9527M2257J06840K1104o7424L1969
32498F4106J38893J367j93831j09764J23599J16520r9591j55097p630M1551n2451
32487a32328k4501J50324J90274L5363n5557M013J0085q9069q5532O2196J20421
32476A85689K463q8713m1211O292j9229J186R0956R2585l2475j18440q9665n6182
32464f6744n8430n891Q1050O2876l6186l1611Q6848J21655K1178l5289K7177N7658
32452B24291k1656p8324l0877J1144k8472o0022j7460K6112J6319L968J1318j0027
32440D6314m4495j2118O6955P9980J0873m3640m4196k9617N149P4473R0638j6721
$$ y = [221832, 212493, 72888, -7638, 57149, 124621, 122820, 169798, 280763, 275330, 110325, -3848, 42065, 84063, 3010, -81202, -70055, -51113, -70640, -28383, 78457, 99561, 32137, 64106, 202999, 204366, 10535, -99229, 24370, 140890, 41299, -113798, -121428, -79877, -132328, -156829, -6505, 183769, 219132, 163575, 167588, 177673, 88604, 3072, 65268, 185689, 188152, 99439, 58228, 64520, 45291, 46477, 137433, 230018, 197543, 79103, -10562, -66744, -125174, -131065, -50015, 12861, -23325, -54936, 31912, 153567, 174745, 139456, 166633, 224291, 202635, 124311, 93434, 104578, 76106, 16084, -1376, 24736, 41055, 45023, 56341, 46314, 1819, -10299, 56656, 136636, 147509, 103869, 59673, 30056, 35205, 109678, 200316, 183595]
32428A83595j22543o1967Q9777J21917K0802m3124j5041P477k07K1531L5859l5722
32416B02354j15769p3812K3640K0407l6788Q899J05602P2054n6371q1842o647
32405F1727j0557r2310p8534J8955J0925r1869o9167J04986K02239J34499O3020
32394B53914N8381K559j00573p4133P8989J19832k1087j19430n6231m001p4573
32383F3647j10669J171J07805O1667m2137o8193m5877k8315K3626Q8096M5658
32372I6479q5870j16802L245Q5377K1648n1739k7690j175m0391m5374K7854N4402
32360h0036j2098k9111O4779J22811O4627J6601M3452J4872j10148j48687j6256
32349f9194R1989K9068o2086k9878K7628m575k4649O0981J19275L0417p7319o2501
$$ y = [183595, 61052, -915, 88862, 210779, 231581, 188457, 173416, 180893, 180686, 202217, 238076, 202354, 86585, 12773, 36413, 56820, 20032, 28931, 134533, 206587, 150216, 68374, 61727, 51170, -41140, -119674, -100719, -89794, -181663, -250830, -145844, 56395, 190894, 253914, 312295, 314854, 214281, 140148, 219137, 338969, 317882, 198452, 142221, 138220, 63647, -47022, -45851, 61954, 123621, 81484, 13291, -32586, -60901, -37275, 50821, 96479, 10609, -106193, -102948, -17571, 4077, -47662, -75352, -76527, -116918, -162292, -134438, -80036, -92134, -121245, -56466, 66345, 130972, 147573, 191025, 205897, 95749, -52938, -69194, 22795, 51863, -10223, -40101, -12473, -17048, -41697, 19284, 138559, 168976, 91657, 29156]
32337B9156k1274p0790j01785K580J06037M0098r4739j06714k6299R800K8160
32326b05770J15747J90560J28878Q37n1157m6617o6200n8227L1934Q5237l726
32315A21496j03045m7607P0546O6742j2825P03P8427N8382m9207q7435k7812K2082
32303I0447L5185O4929Q1312J9920n8739n7497k4611n4992r3154l9022L9777K0227
32291B3782m0714j4415M3169n459r5563n1706Q4790J01867k3430q9041j1234O0321
32279a7633K1486l2377r089K7463J105l8392j5172M4700N9764J214p8982q5367
32267a21280L5228J95391K16943N3873j16914j24100k3846K5965M033j4136l1776
32256I9381q6499j11238k9329P3363O0778k1250j7656P2744J03636K9061m2795
$$ y = [29156, 7882, -62908, -164693, -162113, -56076, -15978, -110717, -217431, -243730, -233930, -205770, -90023, 100537, 229415, 230252, 179095, 132478, 66278, 8051, 39985, 125222, 121496, 18451, -29156, 41390, 108132, 95307, 96010, 174437, 232819, 183612, 96177, 68365, 90447, 125632, 190561, 271873, 291793, 233054, 175557, 150946, 95954, 2800, -36222, 3555, 23782, -16932, -31347, 11822, 6363, -89200, -140906, -56116, 45751, 22321, -66720, -77954, -17633, 3853, -28524, -37613, -10150, -9045, -47437, -62609, -17909, 41855, 43069, -35913, -121280, -86052, 109339, 326282, 380155, 263241, 139141, 115295, 141260, 145293, 131157, 99381, 12882, -98356, -127685, -54322, 6456, -14794, -32450, 40294, 143930, 172991, 130196]
32245A30196l8556K510L2165K9618m0220j62230k07404q7071P7717J05365K1364
32234a36546j801P2656J16489O5713r473n5212q2647p6335j4470L8093J0896l1277
32222a03914J4859J02846J15937P5786P9498Q8578K80j17057j01845R354K0003
32211A84325r2709j37947l8793N0173J8143l7220p958N6515P2042M8015J4602
32200A29188l6189p8358n6822n682k2591r4691r7239L875R6369R8568M9442J75
32188a3955m0847m1691K6794R2141N8306k4243k8761K7529K1580l6636k0941N7213
32176G6489M8560n6566r3799j5182K8008l9076r2019m4623J5558K3057N0042J25543
32164B5992J45768O7392p633l2249q8451j68249j16714Q0938J93585Q4346o5925
$$ y = [130196, 91640, 94150, 126315, 155933, 115713, -46517, -253921, -340992, -263275, -157910, -136546, -138347, -65691, 50798, 116511, 107038, 51826, -30821, -107156, -121626, -83533, -72637, -103914, -89055, 13791, 129728, 205514, 285012, 373590, 373870, 256813, 154968, 164322, 184325, 91616, -46331, -85124, -34951, -16808, -54028, -61986, -5471, 66571, 114586, 129188, 92999, 14641, -42181, -47863, -70454, -165145, -262384, -258509, -162140, -63572, -14130, -13955, -54802, -96493, -69699, 22442, 80748, 56505, 27744, 55273, 76853, 40217, 19276, 76489, 125049, 68483, -25316, -40498, -12490, -51566, -143585, -188208, -172650, -149593, -99551, 25992, 171760, 239152, 231519, 199270, 110819, -57430, -174144, -93206, 100379, 184725, 118800]
32153A18800n4422L4427K1155n3770l8794M6674P1621L4666L1360N4157J9030
32142B84904o2786j07056j01528q6336m7748L3581Q8963M8342l2396m7980M895
32131b5145N2596N8800K5772m3177j02048p5057J1590K5152o2626r9333O115J18915
32119a08446R4953R057l243J1234n8567j44683j02620K0459N0778k1137l7388
32108b89603N3065J26238J00520L5198j1926n7243r0881n7977J9446L8852j9404
32097a53715m6686K5651J19158J28447O5344K0057L1067N0681K2151m2766p2674
32086A46715k7749L4140K5455m3538p5920l4752J2834K2782L5710O4202L9559
32075A99438n3944j10693o4702n334k3902n8267j7530M7853M8638L0384P6873
$$ y = [118800, 64378, 98805, 119960, 66190, 27396, 74070, 145691, 180357, 211717, 265874, 284904, 222118, 115062, 13534, -72802, -120550, -86969, 1994, 50336, 17940, -30040, -25145, 27451, 86251, 112023, 68846, -33202, -108259, -96669, -71517, -134143, -233476, -227361, -108446, -13493, -4436, -7679, 3555, -55012, -199695, -302315, -281856, -231078, -252215, -289603, -236538, -110300, -9780, 25418, 13492, -43751, -134632, -192609, -173163, -134311, -153715, -200401, -174750, -55592, 72855, 138199, 158256, 189323, 240004, 262155, 219389, 146715, 118966, 153106, 178561, 135023, 59103, 24351, 37185, 59967, 95677, 159879, 199438, 145494, 34801, -29901, -35235, -59137, -117404, -134934, -87081, -38443, -8059, 68814]
32064F8814J23529N4756o8873p8290L3384R9423L8975n2699r0158j01504j10418
32053h3061p3796P346M8305J2412k7108r380K8847L8203L4032L8680K8935p929
32041C5486l3569j8703J3238L5631N5145O9950M9817p986n2794m6939k0780k7169
32029E1327o4730p7654k8639M4611O2088J367n9014l7748L0014M6494J3986L3498
32017A5600J19634J49661O1753k9798j8725J9117k9770j07578q7471n412k420
32006H4591p7122q7989L933P9822P1586N1660O9673O0082j7520q2509o2100p597
31994H6510M342l991K1831M7597p88j01396j43386p2012M0246Q5539M0907k9135
31982b3736o2969n3534j3775N2158J10255Q8770j8258q7403j3348J09357R2939
$$ y = [68814, 192343, 247099, 178226, 99936, 133320, 232743, 271718, 219019, 128861, 27357, -83061, -156857, -149511, -101206, -88794, -115902, -125282, -96435, -58232, -24200, 14480, 43415, 35486, 1917, -16786, -3548, 32083, 87228, 157178, 206995, 199009, 146215, 99276, 78496, 51327, -13403, -91057, -119696, -75085, -12997, -11630, -70644, -108392, -78378, -31884, -17898, 15600, 135234, 284895, 346648, 316850, 298125, 317242, 287472, 179894, 92423, 87011, 84591, 7469, -80520, -76587, 3235, 74821, 126481, 196154, 256236, 238716, 156207, 94107, 86510, 90852, 86861, 108692, 156289, 155501, 54105, -89281, -161293, -121047, -35508, 5399, -23736, -86705, -140239, -154014, -101856, 8399, 97169, 78911, -8492, -21840, 87517, 180456]
31971A80456n6398j29794l5718O1950K0772n4800j5206P2588N9929j1373R662
31960A02068J08066J29600M1828l9964o7290r7547j22038n3838Q8091J59277R1651
31949C39904l1497j24141j76300j68789o3850Q5642J55934J15831N2098K0495
31939B05327j603j3338J4276L5179k6616j18482j07983o906K8931m3609q2330
31928a17154j294R3980R3419M2191K1100J1305k3725m5405k2764j21l960J1016
31916E8588N6060O4585K0584O698N0756N4351l7286j20455r1843j1618K607m5811
31904G216o6347k2037N2712J11341J06596J7318q2691p4863L1213Q3071O115q2390
31892H7254o2838N603N37p1252j14393r8103n7893p736N0795Q3731O8786L5384
$$ y = [180456, 124058, -5736, -41454, 20496, 41268, -13532, -28738, 43850, 103779, 92406, 102068, 210134, 339734, 381562, 341598, 274308, 176761, 54723, 885, 88976, 248253, 339904, 308407, 184266, 7966, -160823, -224673, -139031, 16903, 132734, 184832, 205327, 203724, 190386, 204662, 239841, 213225, 94743, -13240, -20146, 8785, -34824, -117154, -118448, -24468, 68951, 111142, 132242, 143547, 119822, 74417, 51653, 51532, 47572, 58588, 114648, 179233, 199817, 206515, 257271, 311622, 274336, 153881, 62038, 50420, 53027, 7216, -59131, -81168, -28456, 82885, 189481, 206799, 124108, 49245, 80458, 163529, 169644, 87254, 24416, 30019, 30556, -40696, -155089, -253192, -311085, -318821, -268026, -184295, -115509, -80125]
31880h0125P337k8133n4318j9675N7119Q3202M0190J5582L5937J6052n6837n7414
31868d1083N6177J28484N2351l6937J5764J13916O1531j18130k21864j58651j8364
31857a66806R7480J45275R3217l1869j00815l4737N8001M1919l0615k9619J8942
31846F0373O967k9511J7587Q8421L0937j12194j43513l7306K6245k1927m2815
31835a56736L5267R1944N1257J3081M3243M7470k4315n3405K5595P0097l5068
31824A08430j55961j12424L5105J02601P6180P4938R8818M2565o8308p9840L3275
31813A55379J12256O5895J359K6656P5920M0937l8640m6141J9411N1760J0821
31802D75613l3554l5834m3450r4845j36808j03906k2377L1431L8057L1593J6761
$$ y = [-80125, -72788, -100921, -155239, -174914, -117795, -34593, 5597, 21179, 57116, 73168, 16331, -41083, 15094, 143578, 195929, 158992, 174756, 288672, 350203, 232073, 10209, -148442, -166806, -69326, 75949, 169166, 137297, 36482, 1745, 59746, 101665, 71050, 41431, 60373, 67340, 37829, 55416, 143837, 174774, 62580, -80933, -118239, -91994, -113921, -156736, -121469, -29525, 21732, 34813, 78056, 125526, 101211, 47806, 73401, 143498, 108430, -47531, -159955, -124850, -22249, 53931, 128869, 227687, 270252, 201944, 122104, 155379, 267635, 333530, 334889, 361545, 437465, 478402, 439762, 393621, 413032, 464792, 475613, 442059, 406225, 362775, 267930, 131122, 27216, 4839, 36270, 74327, 105920, 122681]
31791A22681k9644p9715o3618J8347O8784K2334n5728n3748M0050J27572J18958
31780B36273K2807p0536p5032O359P7165N5766j7643l5825J7088M4428n034n5762
31768B00054l5867M834r957m6110j9644N5431Q5162L6585l3039p2673p8847n2731
31756C3198K387M4092K4368l7060p0975m7817M55L5916M4390K5747j144n314O914
31743E5157j2637o7734q2418j2395O7079O3501N643j0296K8637N1719K6709j0536
31731A02429l0330l2410j5460P609j034l2781q119R3633J52612O8498o6626r2414
31719A45607k0985L630m9222o4122J2239R5588J14194Q7052L3123n6141j32941
31708A68022j20429m6752j8618m5976l5187K8485N0434P545m989M7694P7125M0649
$$ y = [122681, 93037, 13322, -50296, -31949, 36835, 59169, 3441, -50307, -10257, 117315, 236273, 259080, 188544, 113512, 119871, 197036, 252802, 235159, 199334, 216422, 260850, 255816, 200054, 164187, 169021, 159064, 112954, 93310, 148741, 233903, 270488, 237449, 164776, 85929, 33198, 35585, 79677, 104045, 66985, -3990, -51807, -51352, -15436, 28954, 54701, 53557, 48243, 55157, 42520, -25214, -107632, -120027, -52948, 10553, 16196, 5900, 34537, 86256, 112965, 102429, 72099, 39689, 24229, 31838, 30804, -1977, -10096, 83537, 236149, 304647, 238021, 145607, 124622, 128252, 79030, 14908, 27147, 122735, 236929, 323981, 357104, 300963, 168022, 47593, 841, -17777, -63753, -98940, -70455, -20021, -12476, -17465, 30229, 107354, 148003]
31696A48003J0581J3626k7870j16960j21098M616R8879K7569j06744j25715k4426
31685b19539P5889J16854J12635O8665J6145L2182J08222J07193k3367j21374
31675B73505m8137O8839K4622j32417j82640q6823j4424l2041p460J25766K22009
31664B10799J40490m4934j57895j36937n1638J8059L7934J0025k7582k5589J3912
31653a3356L3417o10n4191p6815n5283p158L8402M9411K2798M270K9896N7896
31641B8677J8209p4670j25700q2756Q373Q3132J26033J38734J05611L0202l7792
31630B18053n1922k2484M633L989j2057j7197j056J5937m0m9694q1303m3186M6514
31617A0187J06257P3115l1325j16876j06917j6493N6184L8821k4905l6010J8436
$$ y = [148003, 158584, 172210, 144340, 27380, -93718, -89102, 9777, 37346, -69398, -195113, -219539, -143650, -26796, 85839, 154504, 170649, 202831, 311053, 418246, 394879, 273505, 225368, 294207, 318829, 186412, 3772, -83051, -97475, -129516, -136976, -11210, 210799, 351289, 306355, 148460, 11523, -40115, -22056, 15878, 25903, -1679, -27268, -13356, 20061, 19451, -34740, -111555, -166838, -173996, -135594, -86183, -63385, -59115, -29219, 28677, 46886, -27784, -153484, -236240, -227867, -144735, -18702, 120032, 225643, 255845, 218053, 166131, 143647, 148280, 152269, 140212, 123015, 121959, 137896, 137856, 88162, 6859, -36327, 10187, 116444, 189559, 158234, 41358, -65559, -82052, -25868, 12953, -11952, -47962, -29526]
31606b9526N0970J0429m6115n0933j7753J0868L2507M3864Q699o2061p6766K778
31594a23039P0819K8335m9238k8037N9058O3981k7608p5981k6244J2598k3169
31583a18525l8253L4769Q8910J4345r9297q8794K4227O8083o045n1627L8075J63154
31571B9022J66458N4571l5478m2732m0667q5489j13991m8972O6494J23531J00054
31560A72801O6518M9781k669r6073j33586n6561M5631N7206L198j1190J9008P190
31548A21254n1566n6326K3956Q0397K9846n7442p5602m0893l4172m9749j6210
31537a26507N9304Q3136K2114l8890k1462L8125N2453L111n3519o7410l3906K5451
31525e8000P4279O9918Q756m7120l8532L788R85m6578n2193J4829O6899L2402
$$ y = [-29526, 21444, 31873, -14242, -65175, -82928, -72060, -39553, 4311, 13010, -49051, -125817, -123039, -52220, -23885, -73123, -101160, -42102, 21879, -5729, -81710, -107954, -95356, -118525, -156778, -122009, -33099, -18754, -118051, -206845, -182618, -114535, -120580, -172207, -134132, 29022, 195480, 250051, 214573, 171841, 131174, 45685, -68306, -117278, -50784, 72747, 172801, 239319, 289100, 286431, 190358, 56772, 211, 45842, 103048, 106246, 95056, 114064, 121254, 69688, 13362, 37318, 117715, 147561, 90119, 14517, -26376, -60548, -110297, -126507, -67203, 15933, 38047, -843, -22305, 15820, 68273, 71384, 17865, -49545, -83451, -58000, 16279, 86197, 94953, 47833, 9301, 13089, 14074, -32504, -84697, -69868, -2969, 29433]
31513B9433k8266k2460K4769K4590j8146k3155J1462O054m5792n5325J76K9242
31501f7418j0359l2228K2623P7360O0782L7630P9338J11303L4709p9286q1067
31490A53387J7056N8947j1302q5404q1708m5198k1784K2147R2298J02134N61j23322
31478G7812j46589o4872K9808P2612O3077K1004k9933n7632m9806k9303j0550
31467a24372K7028Q5939J09659M9592m8824q6820l8105J8210L398o4500j03720
31456a72515o7573J9201R9173J19336M8142q5987j71155j01130P6443J74332R2382
31445C0649m0100m4098N0647O7476k8127q0112j0467M8423k1281j25241j14241
31434b66472j7584K9741Q982J2446O4704R2542N4755j2185o3185p2161k3497M5994
$$ y = [29433, 1167, -21293, 3476, 28066, 9920, -13235, -1773, 4281, -41511, -96836, -96660, -67418, -77777, -110005, -87382, -10022, 50760, 88390, 167728, 279031, 313740, 234454, 153387, 170443, 229390, 218088, 132684, 50976, 5778, -16006, 6141, 98439, 200573, 201134, 77812, -68777, -133649, -103841, -31229, 31848, 52852, 22919, -34713, -84519, -113822, -124372, -97344, -11405, 98254, 147846, 99022, 12202, -25903, -7693, -4295, -68795, -172515, -240088, -220887, -121714, -2378, 45764, -40223, -211378, -312508, -236065, -61733, 30649, -9451, -53549, -2902, 64574, 36447, -43665, -54132, -5709, -26990, -152231, -266472, -284056, -254315, -245333, -232887, -168183, -75641, -20886, -33071, -96256, -168417, -191914, -145920]
31422a45920N1852r063j4415R4317J75531Q4679q0627j11171M23P2916K8199l4396
31410A12325m7950n8714p8734m8782J8513L2778o232m093M2179L3775k8101k4492
31398e7528N8376R0752L5048Q335M4747K2084q3736j06502K2398J23025N8581
31387B15580m0348k2854K0939m2863j24600q4192j0626o2257j54137q8259Q9151
31376c04466J49816N8106k324L2653K6400o4222q1355N7792J95713J58745j2164
31365B14694j53780j78939j03862J2897R0140P2942Q981m986L1235K9971k3105
31354c812m2296J048K6918q711m4002l2190j0655P3M2054J05995R7070q896r0231
31341C2365m9884L8539N0167j2446o0154o3653n2938k4589M2455J07751J02692
$$ y = [-145920, -94068, -103131, -117546, -23229, 152302, 236981, 156354, 45183, 45606, 118522, 146721, 112325, 64375, 5661, -73073, -121855, -103342, -70564, -76796, -80889, -38710, -4935, -33036, -57528, 848, 91600, 126648, 134983, 179730, 201814, 118078, 11576, 33974, 156999, 215580, 175232, 152378, 173317, 130454, 5854, -78338, -88964, -151221, -305358, -393617, -304466, -154650, -96544, -98868, -66215, -39815, -104037, -185392, -127600, 68113, 226858, 214694, 60914, -118025, -221887, -208990, -118850, -45908, -36927, -41913, -10678, 19293, -3812, -46108, -45060, -18142, -26853, -70855, -103045, -113700, -113627, -71573, 34422, 131492, 122596, 32365, -17519, 21020, 71187, 58741, -1413, -65066, -118004, -142593, -100138, 7613, 110305]
31330A10305L3007k7364l7872k4693j9668k3284k8970l7862m2873k9514M60K3125
31318a05203J4026k6376o4724o0588j3426L2520M9639O2271Q5837P5973L270o4969
31306a1750n1439n207l1126r6045n4909J02940J94046J01516n1449r6391n7019
31295e6833n0882o1669J0158J26391J35837K3005m7070J9306R9102M1408j10871
31284A27882j90083j28817j7433L6077K1824Q23J4564M0373K7155k5976m4466
31273a38077K9319J27243J09902m3641j75121j37451J1765R0755L3383n0544n0367
31262a92834J4048O6139Q4277Q0616M0811l7886r4579p3448j8537j6404n6031
31251b03828l7743O5022J44745J06663N304l3424J4201M9481p94q2299q7455K400
$$ y = [110305, 143312, 115948, 78076, 53383, 33715, 10431, -18539, -56401, -99274, -128788, -128328, -105203, -91177, -117553, -182277, -242865, -256291, -223771, -174132, -111861, -26024, 49949, 53219, -11750, -63189, -68396, -99522, -195567, -250476, -147536, 46510, 148026, 96577, 186, -56833, -107715, -169384, -159226, -32835, 103002, 126007, 78937, 98243, 197345, 238753, 127882, -62201, -191018, -208451, -172374, -150550, -149727, -135163, -94790, -67635, -93611, -138077, -108758, 18485, 128387, 84746, -90375, -227826, -216061, -125306, -91923, -142467, -192834, -178786, -112647, -28370, 52246, 93057, 55171, -39408, -112856, -131393, -147797, -203828, -241571, -176549, -31804, 74859, 80163, 46739, 60940, 110421, 109627, 27328, -60127, -57727]
31239e7727R1047Q7641J9071j4122J8080L6792j3256n9933o046J05014J26612
31228C33173J1907j19346j46139r1551n4585o6740p8187m3944K9616R9033J12382
31217a4381N2136l1252o4225l6624L601L5968P0934P1509j4739j20447r2231P3726
31205f6025J69948O0684j01498r1560N6395J17337K0462p3430m2453L3284L0612
31194A13756l8453p9965n2767J3872P0633P2684R670o0455n9867Q902O1235L7699
31182I6944l5685r3503q7806j1237Q1583R7881J5219o4804m6348J8540J6567l8055
31170e0704l0827N2008R1752K4420o9661r6096n4574J2494P2944Q3078K3202k6018
31158C2018L5110J46353J30876m3288j95980j91013j05977o0535l0371M4262R8955
$$ y = [-57727, 33320, 120961, 140032, 125910, 143990, 180782, 167526, 107593, 101547, 206561, 333173, 345080, 225734, 79595, -11956, -66541, -133281, -211468, -255412, -225796, -126763, -14381, 37755, 6503, -57722, -94346, -90745, -54777, 16157, 87666, 72927, -47520, -139751, -66025, 103923, 164607, 63109, -28451, 27944, 145281, 165743, 92313, 49860, 83144, 113756, 75303, -4662, -57429, -43557, 27076, 99760, 109430, 48975, -10892, -1990, 59245, 96944, 61259, -32244, -120050, -131287, -49704, 48177, 63396, -1408, -47756, -29216, -12649, -50704, -81531, -29523, 62229, 86649, 16988, -79108, -133682, -121188, -48244, 34834, 58036, 32018, 67128, 213481, 344357, 301069, 105089, -85924, -191901, -252436, -282807, -238545, -139590]
31147a39590M9343l6342k6959O3805J04660N0097j4669j8081K1570N9998P2217
31136A86049L7225m0639r8271p2641J1765P3077P5150M3739J985m5088p4810n6802
31124D0739M034P3176J17835J02880m11j49535k19410j29960L6275J14138M6879
31113C6640o0923q0444J38P9525O0929m0976j11206o8902K4861M4928k1277n7083
31101a93790O617R2324R9343L8369j9244m8647n8991m4079j4613j0860j8853M0296
31089a32128J59315J86819L7716j32309j16531M1917J13793K2125o9647k8513
31079H2557O7282Q6404L7787P410M159k2283o8048p9669m7698j7379j4301j9915
31067A6306j8609j6957j1474J4195M4346L0488l0400n9159K448P7431L5083j02587
$$ y = [-139590, -90247, -126589, -153548, -89743, 14917, 65014, 50345, 32264, 53834, 113832, 186049, 223274, 182635, 84364, 11723, 23488, 96565, 171715, 215454, 217439, 172351, 97541, 40739, 44773, 117949, 235784, 338664, 338253, 188718, -30692, -160652, -124377, -10239, 36640, -24283, -104727, -104589, -25064, 35865, -5111, -116317, -185219, -160358, -115430, -136707, -193790, -187173, -94849, 4494, 42863, 23619, -25028, -84019, -128098, -142711, -153571, -172424, -132128, 27187, 214006, 251722, 119413, 2882, 44799, 158592, 180717, 111070, 82557, 149839, 236243, 274030, 281440, 285599, 263316, 195268, 115599, 67901, 50522, 36221, 16306, -2303, -19260, -30734, -16539, 27807, 58295, 27895, -31264, -28816, 48615, 83698, -18889]
31055a8889j50549j9711J29226J09027j3070k8040P7118J05494j8731j25949p6798
31044c0872L8588Q5196Q7912J12836R8362k7293j73150k00319j27963o7898k9708
31033b34309M6916J27471J19435L9581q305P7N75k7204m5573m8870m9952j5490
31021i5648O7553J14178N9244r581J5372O3151l781j31212j32078J2663J19396
31010G9257Q3641J859k3028j6700k3568k3210j4152m2339r4229q4634Q053J06044
30998d3006J52011J52112J00955m980q7432o8997k4183p9288j74736j29920M5916
30987a61548J33744M1207o7366n1976J0874J4562m704M800j296k9935J3963J36533
30975C8858J76126M6008j11349j42943r1245n0731L608R3992J21352L6990k9371
$$ y = [-18889, -169438, -189149, -59923, 49104, 36034, 7994, 85112, 190606, 171875, 45926, -30872, 7716, 92912, 180824, 293660, 392022, 364729, 191579, -8740, -136703, -204601, -234309, -187393, -59922, 59513, 99094, 90789, 90866, 91441, 64237, 18664, -30206, -80158, -95648, -28095, 86083, 145327, 135746, 151118, 214269, 210488, 79276, -52802, -40139, 79257, 162898, 164757, 141729, 125029, 101461, 78251, 64099, 21760, -72469, -157103, -149050, -43006, 109005, 261117, 362072, 357092, 269660, 200663, 176480, 97192, -77544, -207464, -161548, -27804, 13403, -53963, -105939, -95065, -80503, -85207, -80407, -81703, -111638, -97675, 38858, 214984, 260992, 149643, 6700, -84545, -135276, -131668, -37676, 83676, 120666, 91295]
30964I1295J7493O3084L01n5222K1994J09566L7613r9975j01469k839J5750k9752
30952F7839J5727J14245P9345o7623j03569J4649Q2439J1632l9139J5050K5934
30941B16529r4262j80064q4108P1355R8407K8505O452L6021K2147l0115m0843
30930E0024j5952k0224l4580J0832Q9519J02323L7284j6294j4192p498l3579n4969
30918I2694l6633p619q398k9616l6923j9403J3070M8167O1637K1669o2711j20888
30906h4954r1428l214O0399P2310P3747O9392L280j10690j37975j1385J14345
30895d6173N2820j18334j47303J0270J24656O2128j8866L1780Q9685q253j47366
30884a14956j09224N7259J12565J5529l7794M1668J12240O2819k8115o0264m9603
$$ y = [91295, 108788, 171872, 172173, 116951, 138945, 248511, 286124, 186149, 84680, 81841, 97591, 67839, 83566, 197811, 277156, 209533, 105964, 120613, 203052, 214684, 175545, 190595, 216529, 122267, -57797, -141905, -70550, 27857, 56362, 62814, 98835, 120982, 90867, 50024, 34072, 13848, -20732, -9900, 79619, 181942, 219226, 202932, 188740, 181242, 147663, 92694, 56061, 48442, 40044, 10428, -26495, -45898, -32828, 15339, 76976, 98645, 35934, -84954, -176382, -179596, -119197, -46887, 26860, 96252, 99532, -11158, -149133, -160518, -46173, 6647, -111687, -258990, -248720, -124064, -61936, -80802, -49022, 40663, 32410, -114956, -224180, -166921, -54356, -38827, -76621, -34953, 77287, 140106, 111991, 51727, 2124]
30873B124l2797J404K8910n783n8884k3136O9355O5140m2105p0547M2318J12702
30861H8701J6007r5122m9313N5801L5125o2917n5264N1718Q4187N543l6816K5431
30849F3081Q3438N4295o13j8700l8619q2905p4707K8717J21634Q2782l7721p8151
30837A02531R315R8158P0102k8430o7620k0353J4501k8219q2117n7122J8523M2030
30825G1299j0278o1188n6921k3410J1220N8542J06011R9492L4548j1240J2477
30814B30552N6583O1209M5424M5810L3884k7042r5470j05893p2826n9470o7950
30803D4811m1757L1522R0769P9022J764r0620j41284j20130n5382j5883k7971
30792b45139l5473J6806Q9995R8151L2136k4610r171M1012M1892k7779r2994o4592
$$ y = [2124, -30673, -29269, -359, -6142, -65026, -88162, -18807, 46333, 4228, -66319, -24001, 88701, 104708, 9586, -39727, 16074, 51199, -11718, -66982, -15264, 68923, 74466, 37650, 63081, 146519, 200814, 200201, 181501, 142882, 59977, -14730, 13987, 135621, 218403, 180682, 102531, 111846, 210004, 280106, 251676, 184056, 163703, 178204, 149985, 67868, 10746, 29269, 71299, 61021, -167, -57088, -80498, -69278, -10736, 95275, 194767, 229315, 218075, 230552, 287135, 348344, 393768, 439578, 473462, 446420, 350950, 245057, 172231, 112761, 44811, 3054, 34576, 125345, 204367, 206131, 115511, -25773, -145903, -201285, -217168, -245139, -280612, -263806, -173811, -75660, -43524, -68134, -77305, -36293, 5599, -22180, -115174, -179766]
30780a79766M7059J24014P4162m9044j11519o8811R53L3727N3264P6740M9383
30769E0162n2782j33429q5747N1299J38847J17180N1668Q212k7780q4984j28753
30758i6107j01816j7255L9959K0407j3715L0873J26944J34724M279j17784q0554
30747g0045M3692O5437l0430p5657l570N2855K312n6043k2129L8264L9705L7198
30735B1589R7279J44227R1817R166j0313l1953j46100k51423j83164P618J16602
30724a34655Q7278M0543L2781J604n2855m8574L1j1608p1144n1975M7985Q1493
30712g9096J1311k2268M1545P9359K5472j401O7861J02804M955j03717r1832l9666
30700d673o0474o7376N7405J96110J52005j4285o6715L0308Q1515P891l8674L2397
$$ y = [-179766, -132707, -8693, 65469, 16425, -95094, -163905, -162952, -129225, -75961, 779, 50162, -2620, -136049, -221796, -170497, -31650, 85530, 137198, 145410, 117630, 32646, -96107, -197923, -215178, -175219, -154812, -168527, -137654, -10710, 124014, 128293, 10509, -70045, -26353, 39084, 8654, -67003, -70573, -17718, -15406, -71449, -93578, -55314, -15609, 21589, 118868, 263095, 354912, 364078, 353765, 321812, 175712, -75711, -258875, -251257, -134655, -47377, -6834, 25947, 27551, -25304, -73878, -73847, -85455, -156599, -208574, -160589, -79096, -67785, -90053, -48508, 30851, 56323, 54922, 122783, 225587, 230542, 126825, 34993, -4673, -65147, -132523, -75118, 120992, 272997, 258712, 191997, 222305, 303820, 311711, 273037, 305434]
30688C05434Q1945j9566j68011j82965o6796L0752K9246k2528n5507m5622M073
30677a09545O5072Q3826M2873J863K0887O6674O1054Q129n152N1861Q9977K2808
30665D00327r9471j48609r0462j9565q983q912N0322J22906J08379J5790m2154
30654B79568k3144j1036o0455r5352l8445M4848L5531n4870r7780l1054O6901
30643A4712R4443M0647l6331q3995q4512n0434j2423R902K5385L9765K6227l3511
30631e0125r4948q7703l337R8406J66653J93736J73020Q2057o4839j85143j87766
30620D0011o4863Q6698J45379Q2469l452r48O6499O6756m5219j39118q4559N4747
30608B04400J06059K9265m7199l2258O165l3965j33664j83148j18579J4371J06757
$$ y = [305434, 387379, 367813, 199802, 16837, -49959, -19207, 10039, -12489, -67996, -113618, -109545, -44473, 39353, 82226, 84089, 104976, 171650, 232704, 240833, 235681, 287542, 377519, 400327, 300856, 152247, 61785, 42220, 33237, 24325, 74647, 197553, 305932, 321722, 279568, 256424, 245388, 184933, 89581, 51136, 95984, 131515, 76645, -21135, -52189, 14712, 109155, 149802, 113471, 29476, -55036, -105470, -117893, -107991, -82606, -42841, -16614, -50125, -145073, -232776, -236113, -137707, 28946, 222682, 395702, 477759, 412920, 227777, 40011, -24852, 61846, 207225, 289694, 286242, 285294, 351793, 418549, 373330, 234212, 149653, 204400, 310459, 339724, 292525, 260267, 266432, 232467, 98803, -84345, -202924, -188553, -81796]
30597h1796Q3438j4533n3890L6646J58744J63802N4125l8390n8783p7155j16233
30586E5975r2003J0953O2992q332q0295k9481O2022N2129j9637k4608N789n5249
30574e9745j59224j21284N6614J46656M6271o1018o072J12267J23126N3874K1746
30563A53211R56q8170j57563n5627J45989K00814L8612j35175j37882k9727L4458
30552c0104K0257j1150k5036j5129L0737Q5152P3478j7932r4634q0164k0085M733
30540g9877l094J503J3446P326M270K8126M2755J0466l2661l4930j3939o370J2263
30527e0716O8307J03998N4872k9977n5890l4152m5232q0557n7469J8432N0232
30516e8152K0396K0439P9942J07916N3147j3594l9671p6352j41765j32857R731
$$ y = [-81796, 1642, -12891, -66781, -30135, 128609, 292411, 346536, 308146, 249363, 172208, 55975, -36028, -25075, 37917, 29585, -50710, -80191, -18169, 33960, 14323, -10285, -4496, -59745, -218969, -340253, -283639, -136983, -90712, -151730, -157802, -45535, 77591, 131465, 153211, 154167, 65997, -91566, -147193, -1204, 199610, 238222, 103047, -34835, -64562, -30104, -9847, -20997, -46033, -61162, -30425, 54727, 128205, 110273, 15639, -64525, -84610, -79877, -82971, -81468, -68022, -60696, -56426, -28300, 14455, 24921, -7740, -42670, -56609, -62979, -50716, 17591, 121589, 176461, 146484, 90594, 56442, 11210, -69347, -126816, -108384, -58152, -37756, -17317, 62625, 170541, 223688, 210094, 170423, 94071, -47694, -180551, -170820]
30505a70820J59295J62125N8670L164K1056K718q3152j28467o3680L1376M7267
30494C9552j1309n4872k7251M7172R9848P8089n474p6190p4037j7739L5965O8970
30482A02724Q7761O5358k2367j12864j03062O69O4826K818j04447j18698k2920
30471a60202P5700R2545M8156P082p361j3298j7726j222M0911O8193L3968m6902
30459A19844j01376q4225l1590n241j3134j9682r045N432J7056K6882K4525J0878
30447e9676J7660N2904N7384j0904p4996k3611J04170J38362J7023j12705j02044
30436C567l427L4689o747k5599J0231J8797m1728r4550o0189L3515J03844J16138
30424H8541R1004N2380J0414k7207n3455n8407k7174L0255N6898Q131o6832o8125
$$ y = [-170820, -11525, 150600, 209270, 212434, 233490, 236208, 153056, 24589, -39091, -7715, 39552, 28243, -26629, -53880, -6708, 93140, 171229, 165755, 89565, 15528, -2211, 33754, 102724, 190485, 255843, 233476, 120612, 17550, 18219, 83045, 85863, -18584, -137282, -160202, -84502, 8043, 56199, 63281, 55920, 42622, 24896, 23674, 64585, 132778, 166746, 119844, 18468, -65757, -97347, -102588, -115722, -135404, -144449, -139017, -121961, -95079, -70554, -59676, -42016, 10888, 68272, 57368, -17628, -41239, 62931, 201293, 218316, 105611, 3567, 140, 34829, 28082, 2483, 12714, 31511, -10217, -104767, -164956, -131441, -27597, 88541, 179545, 231925, 242339, 215132, 161677, 103270, 76096, 106351, 163249, 171380, 104548, 36423]
30412C6423J4039P3237L5887l5441m3713L01J3289k5028n5370l8769M047M4358
30400B3260O6109M3350k8862q5803n6862J8982L2021k9452n3589J2355O4485N344
30388A1338q9760p8393L7618J24650J09202L9682l0809j00953j45867j03617J7140
30377b09769J09220J00772M1781N116k1948p8300j26275r6685k964P1789Q6429
30366a20834O9042M2904r36m9508n3005Q654Q5925J12144P1846K677m7738n3944
30354F7227k1117K2917M9122M4576R748m5087q8416p4942N312R5483J20794O7565
30342B53182j0510n7653n7952j9426M1857R1058Q4472J4675p1641j19146j16366
30331C2550r0957o5698l6494Q356O0336R0044P6663L5805Q689J7291L7052K3041
$$ y = [36423, 50462, 123699, 159586, 124145, 80432, 80733, 94022, 68994, 13624, -25145, -21098, 23260, 89369, 132719, 103857, 18054, -38808, -19826, 12195, -17257, -70846, -58491, 5994, 11338, -78422, -156815, -119197, 5453, 114655, 154337, 123528, 22575, -123292, -226909, -209769, -100549, 223, 42004, 47120, 25172, -53128, -179403, -276088, -279052, -207263, -120834, -51792, -8888, -9824, -59332, -112337, -103683, -17758, 94386, 166232, 168909, 121171, 67227, 46110, 69027, 118149, 162725, 172473, 127386, 38970, -35972, -30660, 64823, 185617, 253182, 242672, 185019, 127067, 107641, 149498, 240556, 325028, 339703, 268062, 148916, 32550, -58407, -124105, -160599, -152243, -91907, -1863, 74800, 110605, 119294, 136585, 173637, 196678]
30319A96678l9076j12211j35002p4188L4698J01222O1853m2451r9563n4755K5059
30308a37736M3437j597l1290m456L4658L0682j0099m0071l0162R750M7557N1444
30296c7883J3650l8045o6906o6651n5017l3670J0880O3834Q3974O6527N8412P8490
30284G7595O9806j0984r1129n5681P2132J20784n960j72505j72609q119J11474
30273f5196N7404n5424n8043K9040N9203J832k7463K7086P3632L6938j7194l326
30261E8489L5715N941p6824j12424o8283l508L9124O6015O7053K0602k7915L824
30249G809R7987J27354L1254q5370r4160j5075L3182N797l3602l0456o067q93
30237C7760j8293m1852n8735n0548n837M3736M6742J1692J0820O8580J00484K6125
$$ y = [196678, 157602, 45391, -89611, -163799, -129101, -27879, 33974, -8477, -108040, -162795, -137736, -94299, -95896, -127186, -131642, -96984, -66302, -76401, -116472, -146634, -136884, -89327, -37883, -24233, -62278, -129184, -195835, -250852, -284522, -273642, -209808, -125834, -59307, -895, 77595, 147401, 136417, 45288, -10393, 61739, 182523, 176563, 4058, -168551, -176670, -65196, -7792, -63216, -121259, -92219, -33016, -31184, -58647, -31561, 42071, 79009, 61815, 58489, 94204, 100145, 23321, -89103, -157386, -160894, -121770, -55755, 11298, 31900, 3985, 7809, 105796, 233150, 264404, 179034, 84874, 69799, 102981, 108778, 75176, 44720, 38653, 37760, 19467, -22385, -81120, -131668, -137505, -93769, -47027, -35335, -24515, 44065, 144549, 170674]
30225A70674r4211j20998k7775N7928L0970n5942q2284j8496O7674J10827Q5529
30214A23896q011j15959j29875r275J21692J05774l2358j17046o6882J9424M4044
30203f4576L8202N3361N4454O776l6319k5603p434l2162n5249k4574J4686L580
30191g4858j9326M158L8545L0094J6290L8657L2224n3009j04943j911J51344J43894
30179B01159j5630j08456m2971L6807J7671k2889O69L1821O557k2017r90J6598
30167I8329j3871l3529R75K5720J06N523R3026J46570M1836j40758k08948j15952
30155a00973O214M1487J612m4758n7222l0748J9744P0637J03496R6952K2866r3435
30143C5872j37256l2042J13326J23489K2721N235J09191J34026k7490j92960j71960
$$ y = [170674, 76463, -44535, -72310, -14382, 16588, -39354, -121638, -140134, -72460, 38367, 123896, 115885, -74, -129949, -139224, -17532, 88242, 55884, -61162, -128044, -108620, -64576, -26374, 26987, 81441, 88217, 51898, 26295, 18861, -13301, -68550, -93124, -78438, -74858, -94184, -90026, -51481, -21387, -5097, 33560, 65784, 12775, -92168, -94079, 57265, 201159, 185529, 77073, 34102, 70909, 88580, 65691, 66360, 98181, 104738, 82721, 81731, 98329, 84458, 50929, 51904, 77624, 77730, 83253, 176279, 322849, 364685, 223927, 14979, -100973, -94759, -53272, -51660, -96418, -153640, -184388, -164644, -94007, 9489, 106441, 129307, 35872, -101384, -133426, -20100, 103389, 126110, 131345, 240536, 374562, 347072, 154112, -17848]
30132a7848m8082J040q499L1647Q2446N2546J2618O7602J11972k1440k32922k54841
30120b23761n5626J25487J48804J12391R7108M5875l9992m1649M6129N6302p0064
30109B01004j60635r1338J5305J5234k2142K3649Q3761K0155j17022j48285l1947
30098b12261R2692J09424M1412k8989n3329k9084R144J2732k2906m2924p316N3392
30086g8013Q5078P3137L6795M099M243L4220L4859l4245j08599r5842k3847K09
30074f7906l2609l4041L647k942l8216K3095J73903K17934O0773j22573j44973
30063C6092o9388n6819r5737o7534K2040O6561N1347N1847P9075P1697J2959n9296
30051D2844j18906j35039n9180P6299J39063Q2704L8523R6717J34889L4051p9400
$$ y = [-17848, -65930, -64890, -73389, -41742, 40704, 93250, 105868, 173470, 285442, 264002, 31080, -223761, -279387, -153900, -5096, 107295, 204403, 250278, 210286, 168637, 214766, 271068, 201004, 40369, -50969, -35664, -20430, -42572, -18923, 64838, 84993, -32029, -180314, -212261, -119569, -10145, 31267, 2278, -51051, -80135, -70991, -58259, -81165, -124089, -131405, -78013, 7065, 80202, 116997, 121096, 125339, 159559, 194418, 160173, 51574, -44268, -68115, -67906, -100515, -134556, -130909, -133851, -172067, -148972, 24931, 242865, 303638, 181065, 36092, -33296, -90115, -185852, -253386, -231346, -164785, -113438, -61591, 17484, 89181, 102140, 42844, -76062, -211101, -270281, -193982, -54919, 27785, 66308, 163025, 297914, 331965, 252565]
30040B52565l3006P2239J5634j47613j53247K5774J19586j852j36467j00001N948
30029h0440K4244M351N0818R6118K7042r1148j11525m0682j789k2255k0990K4626
30017a41630M4433L805m6470n5116k4962J9399N9858Q3192Q8927Q6109O5981J5206
30005A98732l2984k4144K0473J2554o1414r6693k6305O6518O8171p064o2967o3778
29993h901m2894j9679L973L102l1624m8666o104M7887M2507l516j8618P505L4182
29980d0846O1472J10326J31440M9674r1790j44729n2638N8563M4704o9590j37281
29969h0695q4448J1662L7218j9275o6395k7647O6902J16048O4477l4359p8748
29958i5260k9125N2983P2172j16r3004j11641m6408J7919J6680j1049L930M4407
$$ y = [252565, 219559, 291798, 307432, 159819, 6572, 32346, 151932, 150080, 13613, -86388, -80440, -56196, -51845, -1027, 95091, 122133, 30985, -80540, -121222, -123011, -145266, -166256, -141630, -97197, -93392, -139862, -194978, -219940, -200541, -140683, -57491, 31436, 117545, 183526, 198732, 165748, 141604, 162077, 174631, 113217, 16524, -9781, 56737, 124908, 117844, 54877, -8901, -51795, -71474, -67501, -64399, -96023, -144689, -150793, -102906, -60399, -63915, -82533, -75028, -40846, 20626, 130952, 262392, 312066, 220276, 75547, 22909, 81472, 126176, 56586, -80695, -165143, -153481, -116263, -135538, -201933, -229580, -162678, -46630, 17847, -16512, -95260, -124385, -71402, 770, 654, -92350, -203991, -250399, -232480, -215800, -226849, -222919, -178512]
29946a78512L9775l986l466O1923J06763P3638J9401J1557J9911j3366n9675m8936
29934B5027P712K7304k1979p5734n7594L1193J08900Q6313l8008j50646j34882
29923a92394j6558O6492N5841M0664R0127J24542M5783q7238j30793n6009L7444
29912b2099P7052P6268N3677K155n6006p2411m2834r555K857k295k5078m6922
29900f5191j2625Q8318J61285J18289J3251l4859j6353j3903m6851o4721p0535
29889E6105j03293j11609j0091J31571J34912j5433j24086o9080M0487O9992M7973
29878D7448M2279J3094p3272j24303o5253J4360R816j4214M7712J30882J04382
29867A32931P315j7553K6690J3586o3496q2964l0238k7788r7833j02998J0508
$$ y = [-178512, -138737, -142723, -146189, -84266, 22497, 96135, 115536, 127093, 147004, 133638, 73963, 25027, 32739, 60043, 38064, -37670, -95264, -64071, 44829, 131142, 93134, -57512, -192394, -208952, -142460, -86619, -45955, 44172, 168714, 214497, 127259, -3534, -59543, -22099, 54953, 131221, 184898, 187053, 131047, 58636, 15802, 6247, 9104, 6809, -18269, -65191, -77816, 10502, 171787, 290076, 303327, 268468, 252115, 238212, 191361, 126640, 56105, -47188, -158797, -168888, -37317, 97595, 82162, -41924, -111004, -70517, -525, 47448, 89727, 102821, 29549, -94754, -160007, -145647, -135831, -150045, -102333, 28549, 132931, 140246, 122693, 149383, 162969, 99473, 16509, -13729, -41517, -139350, -242348, -231840]
29856b31840J02486O5140q943J760N4013M7213N090P508K7973j4319r2574r9185
29844a35678j1514Q1553J06584O7259o016q1758j12999p6031j7759J163m507K0997
29832a68706P0561Q1014L4315k1334m6699m0555m317M9545O5789O584o3311m5934
29820h3048L3260M7879k8223o5698J5662J06020O9160m4540p6877j590N4081J8229
29808D4315l0210o169N3830O7853L2126O49n931o327q113r281k6184o7678r9913
29795f1033q5111l9206m561J6453M7629P4762N9530J4046o960K863r684n4290
29783d5562n8596J9170J02843R1878K626n6038k8979L1346N2699K4193j6071k5693
29771I3816J5614Q1803J00073K0524j05830j62250r3402L6519J19614J02909R670
$$ y = [-231840, -129354, -64214, -73157, -71397, -17384, 29829, 34919, 42427, 70400, 56081, -36493, -135678, -147192, -65639, 40945, 108204, 102188, 20430, -92569, -168600, -186359, -185196, -189703, -168706, -98145, -17131, 17184, -4150, -50849, -91404, -95721, -46176, 19613, 26197, -37114, -83048, -49788, -1909, -30132, -95830, -80168, 25852, 95012, 50472, -26405, -27995, 26086, 44315, 14105, 7936, 61766, 129619, 161745, 162394, 156463, 150136, 142023, 132742, 106558, 38880, -61033, -146144, -185350, -189911, -173458, -125829, -51067, 8463, 22509, 15549, 18412, 8728, -45562, -104158, -84988, 17855, 109733, 112359, 56321, 27342, 58688, 111387, 135580, 119509, 93816, 109430, 191233, 291306, 311830, 206000, 43750, -49652, -13133, 106481, 209390, 219060]
29760B19060r0774j21457n1236O6262J35705J13168K9855o6434j38710j35673
29750d0234k5372J15640J33814j5236j76762j73078k5700Q6345O5023p299j4036
29739g6895M0653O6999K5381k8878k6519K6172N6119J8375m0945m5820j133J4069
29727B7578k5912m5214J1881Q1644P4697J3578j2694P242R910j6692k0727j653
29715A03638k3142q5146r2892l514R0696R0788K6754p467N827J1882j2134l3984
29703G1306l0041r978J3319L0789K3366j7448o0580n9058r42P8396J23799R6469
29691B59397R392o9646q6268o9357q0322r7371l6965Q7449J34936L1941r6500
29680a3314q8865K7720Q9023L0720m6146l9380L1090P8607M9278m5027j30482
$$ y = [219060, 128286, 6829, -44407, 21855, 157560, 270728, 300583, 234149, 95439, -40234, -65606, 50034, 183848, 168612, -8150, -181228, -206928, -120583, -55560, -62859, -76895, -36242, 30757, 56138, 27260, 741, 26913, 83032, 101407, 60462, 14642, 13509, 27578, 1666, -43548, -31667, 49977, 124674, 138252, 125558, 132800, 142710, 126018, 105291, 103638, 80496, -4650, -97542, -101056, -10360, 80428, 107182, 99715, 105542, 117424, 105290, 71306, 41265, 31287, 44606, 75395, 98761, 81313, 20733, -38325, -39267, 39129, 162928, 259397, 268789, 199143, 112875, 43518, -36804, -134175, -171140, -83691, 51245, 83186, -13314, -102179, -74459, 14564, 45284, -862, -40242, -9152, 69455, 118733, 73706, -56776]
29669e6776j12628K0628J49667J50607N6669O023M1026O4205L299q7375j22887
29658A12458r3428l6760J5187K8570j6094o8818n0402K4951N6859J8341O72N0286
29646D1822Q0431K4967l5230j0058L5371q671r4907q6296J0661M4172m4955j34326
29634a77019j07040j324Q1313J11477J08689O8294j0580p9251r2218o9718n2806
29623b20183l3302J3369N7226M3549j6423m8088j5314L2617L7990J7080K6118
29612a05361O5270O9494R275m8187k6968L6209L3882m3100o9958K5187J22986
29601F8729O5001j01449j62289k8510J40841J61518N8590j4127q240q862n5281
29590A15921o5440K3433J34331J41562L5721p3913j07477r5526r6363r6099m6456
$$ y = [-56776, -169404, -148776, 891, 151498, 208167, 214190, 255216, 319421, 322720, 235345, 112458, 19030, -17730, -2543, 26027, 9933, -58885, -109287, -84336, -27477, -9136, -8464, 41822, 122253, 147220, 111990, 101932, 137303, 128632, 33725, -52571, -41910, 2262, -42693, -177019, -284059, -285383, -204070, -92593, 16096, 84390, 73810, -5441, -97659, -167377, -220183, -253485, -240116, -182890, -139341, -155764, -203852, -219166, -186549, -148559, -131479, -105361, -40091, 29403, 38678, -9509, -36477, -268, 33614, -9486, -79444, -54257, 68729, 133730, 32281, -130008, -158518, -17677, 143841, 202431, 188304, 180064, 171202, 115921, 50481, 73914, 208245, 349807, 385528, 311615, 204138, 108612, 12249, -83850, -130306]
29579a30306L0057N0593j717l7985M161N4352J3856p7938q8447M293P2121L4638
29567g2322j9940J4219Q7579Q2928J0688j3627L7669O7375K1248l0943k4105O3
29555A60832j6364m2366k2986J6062J6737l550J4076N2659L2969n3757j14617
29544C9695p9478J3106Q3010J00773P7611J8995n9671j05983p6795l450L3172
29533D0985l154o3371p2668j2560O2635Q3254L6206k0696k3415K1948M7221J2755
29521A09140l6027k6581M0215Q0360K7611p6173j17583m5020N8781P2084m563
29510H2244m0018M4819J48597J18633k8552j20356o5744L0468L4810l2024n6426
29499A16451n893M9540N2091Q193n4227j07688j16923p1681j7354j920j2400j2886
$$ y = [-130306, -100249, -49656, -51373, -89358, -85197, -30845, -16989, -94927, -183374, -179081, -106960, -72322, -92262, -78043, 9536, 92464, 103152, 89525, 127194, 194569, 215817, 184874, 160769, 160832, 144468, 102102, 79116, 95178, 111915, 108365, 122441, 175100, 208069, 154312, 39695, -39783, -26677, 56333, 157106, 234717, 253712, 194041, 88058, 11263, 7813, 40985, 37831, -25540, -98208, -110768, -48133, 35121, 71327, 50631, 27216, 49164, 96385, 109140, 73113, 46532, 86747, 167107, 194718, 118545, 962, -44058, 14723, 86807, 82244, 42226, 87045, 235642, 354275, 325723, 205367, 139623, 170091, 204901, 172877, 116451, 110558, 160098, 212189, 220382, 166155, 58467, -58456, -130137, -147491, -149411, -161811, -174697]
29487a74697j1009k4801k2551K6698P6513O2628Q780j8347k4778n0822n2354M0113
29475a64627J57412J45975M105r6736o6131n944q566j8672J0677r37r0474j21052
29463b54970P016J46827J05830m2225o8536M5216R1949j2958j04576m4855P5747
29452e5535J05988M7110m931j2871N826M4915Q0428N0199n4210j37105j15405
29441d5591l0948K2804L1740M3495O2483M5281j4605o4471n7896m498M5507M7474
29429H0775K690l9581l8040j2672r416k3191j1322K0142J5039l4433o2134k8353
29417a40496K3504M3178L9109L2349J4358q130K952M1098L7580k3419n0525J7964
$$ y = [-174697, -185706, -210507, -233058, -206360, -129847, -67219, -58439, -76786, -101564, -152386, -204740, -164627, -7215, 138760, 142865, 46129, -20002, -25946, -34512, -53184, -42507, -43444, -133918, -254970, -247954, -101127, 4703, -37522, -106058, -60842, 31107, 18149, -86427, -131282, -55535, 50453, 97563, 92632, 79761, 85587, 130502, 210930, 261129, 206919, 69814, -45591, -76539, -53735, -21995, 21500, 83983, 129264, 114659, 50188, -7708, -12206, 33301, 80775, 83465, 43884, 5844, -6828, -16244, -39435, -50757, -30615, -15576, -50009, -112143, -140496, -116992, -73814, -34705, -2356, 12002, 3872, 6824, 47922, 85502, 62083, 11558, 29522]
$$ [...]
##END NTUPLES=NMR SPECTRUM
##END=
