##TITLE=31Pdec_LY-Dixlofos.P.1
 CDCl3, 24 sc
 28.10.2020
##JCAMPDX= 6.0         $$ Bruker NMR JCAMP-DX V2.0
##DATA TYPE= NMR SPECTRUM
##DATA CLASS= NTUPLES
##ORIGIN= UXNMR, Bruker Analytische Messtechnik GmbH
##OWNER= root
$$ XWIN-NMR		Version 3.5
$$ Wed Oct 28 12:45:36 2020 Russian Standard Time (UT+4h)  she@DPX200
##.OBSERVE FREQUENCY= 81.013821
##.OBSERVE NUCLEUS= ^31P
##.ACQUISITION MODE= SIMULTANEOUS
##.ACQUISITION SCHEME= undefined
##.AVERAGES= 24
##.DIGITISER RES= 17
##SPECTROMETER/DATA SYSTEM= spect
##.PULSE SEQUENCE= zgpg30
##.SOLVENT NAME= CDCl3
##.SHIFT REFERENCE= (INTERNAL, CDCl3, 0, 182.463)
##AUDIT TRAIL= $$ (NUMBER, WHEN, WHO, WHERE, WHAT)
$$ ##TITLE= Audit trail, XWIN-NMR		Version 3.5
$$ ##JCAMPDX= 5.01
$$ ##ORIGIN= Bruker BioSpin GmbH
$$ ##OWNER= she
$$ F:/spectra/data/she/nmr/P31/1/pdata/1/auditp.txt
$$ ##AUDIT TRAIL=  $$ (NUMBER, WHEN, WHO, WHERE, WHAT)
(   1,<2020-10-28 12:44:02.31 +0400>,<she>,<DPX200>,
      <created by zg, POWCHK disabled, PULCHK disabled
       configuration hash MD5:
       00 E9 B6 7A A2 85 ED C7 34 08 36 98 17 FE 4E 26
       data hash MD5: 32K
       95 90 61 D4 7C 70 31 FA CF A2 93 EF 25 3D 4C B5>)
(   2,<2020-10-28 12:44:05.89 +0400>,<she>,<DPX200>,
      <Start of raw data processing
       efp BC_mod = 2 LB = 1 FT_mod = 6 PKNL = 1 PHC0 = -2373.635 PHC1 = 60.6007 SI = 64K 
       data hash MD5: 64K
       23 51 C5 7A F8 05 74 02 0C 50 1B 01 79 C9 BB CB>)
(   3,<2020-10-28 12:44:46.20 +0400>,<she>,<DPX200>,
      <pk PHC0 = 20.11814 PHC1 = -45.19992 
       data hash MD5: 64K
       92 45 6C 71 D7 14 AF 24 28 AC 4C 4E F4 11 78 38>)
(   4,<2020-10-28 12:44:50.73 +0400>,<she>,<DPX200>,
      <abs ABSG = 5 
       data hash MD5: 64K
       96 AF 49 F0 EF 91 FB 4D FF CB 97 CD CA 18 FA 9E>)
$$ ##END=
$$ 
$$ hash MD5
$$ A2 08 35 E5 DE D1 FC 31 56 4A EF C2 D9 45 61 55
##$RELAX= 
##$RELAX= 
##$RELAX= 
##$RELAX= 
##$RELAX= 
##$RELAX= 
##$RELAX= 
##$RELAX= 
$$ Bruker specific parameters
$$ --------------------------
##$DU= <F:/spectra>
##$EXPNO= 1
##$NAME= <P31>
##$PROCNO= 1
##$TYPE= <nmr>
##$USER= <she>
##$AMP= (0..31)
100 100 100 100 100 100 100 100 100 100 100 100 100 100 100 100 100 100 
100 100 100 100 100 100 100 100 100 100 100 100 100 100 
##$AQSEQ= 0
##$AQ_mod= 1
##$AUNM= <au_zg>
##$AUTOPOS= <>
##$BF1= 81.014009
##$BF2= 200.13
##$BF3= 200.13
##$BF4= 200.13
##$BF5= 200.13
##$BF6= 200.13
##$BF7= 200.13
##$BF8= 200.13
##$BYTORDA= 1
##$CFDGTYP= 0
##$CFRGTYP= 5
##$CHEMSTR= <none>
##$CNST= (0..31)
1 1 145 1 1 1 1 1 1 1 1 1 1 1 1 1 1 1 1 1 1 1 1 1 1 1 1 1 1 1 1 1 
##$CPDPRG= <waltz16>
##$CPDPRG1= <>
##$CPDPRG2= <waltz16>
##$CPDPRG3= <>
##$CPDPRG4= <mlev>
##$CPDPRG5= <mlev>
##$CPDPRG6= <mlev>
##$CPDPRG7= <mlev>
##$CPDPRG8= <mlev>
##$CPDPRGB= <>
##$CPDPRGT= <>
##$D= (0..31)
0 1 0 0 0 0 0 0 0 0 0 0.03 2e-05 3e-06 0 0 0 0 0 0 0 0 0 0 0 0 0 0 0 0 
0 0 
##$DATE= 1603874641
##$DBL= (0..7)
120 120 120 11 120 120 24 19 
##$DBP= (0..7)
150 150 150 150 150 150 150 150 
##$DBP07= 0
##$DBPNAM0= <>
##$DBPNAM1= <>
$$ [...]
##$SUBNAM3= <"">
##$SUBNAM4= <"">
##$SUBNAM5= <"">
##$SUBNAM6= <"">
##$SUBNAM7= <"">
##$SUBNAM8= <"">
##$SUBNAM9= <"">
##$SW= 369.568048894756
##$SWIBOX= (0..15)
0 1 3 0 0 0 0 0 0 0 0 0 0 0 0 0 
##$SW_h= 29940.119760479
##$TD= 32768
##$TD0= 1
##$TE= 0
##$TE2= 300
##$TE3= 300
##$TEG= 300
##$TL= (0..7)
0 120 53 12 22 120 120 120 
##$TP= (0..7)
150 150 150 150 150 150 150 150 
##$TP07= 0
##$TPNAME0= <>
##$TPNAME1= <>
##$TPNAME2= <>
##$TPNAME3= <>
##$TPNAME4= <>
##$TPNAME5= <>
##$TPNAME6= <>
##$TPNAME7= <>
##$TPOAL= (0..7)
0.5 0.5 0.5 0.5 0.5 0.5 0.5 0.5 
##$TPOFFS= (0..7)
0 0 0 0 0 0 0 0 
##$TUNHIN= 0
##$TUNHOUT= 0
##$TUNXOUT= 0
##$USERA1= <user>
##$USERA2= <user>
##$USERA3= <user>
##$USERA4= <user>
##$USERA5= <user>
##$V9= 5
##$VALIST= <valist>
##$VCLIST= <CCCCCCCCCCCCCCC>
##$VD= 0
##$VDLIST= <DDDDDDDDDDDDDDD>
##$VPLIST= <PPPPPPPPPPPPPPP>
##$VTLIST= <TTTTTTTTTTTTTTT>
##$WBST= 1024
##$WBSW= 4
##$XGAIN= (0..3)
0 0 0 0 
##$XL= 0
##$YL= 0
##$YMAX_a= 36915
##$YMIN_a= -44487
##$ZGOPTNS= <>
##$ZL1= 120
##$ZL2= 120
##$ZL3= 120
##$ZL4= 120
##$ABSF1= 182.463
##$ABSF2= -187.1042
##$ABSG= 5
##$ABSL= 3
##$ALPHA= 0
##$AQORDER= 0
##$ASSFAC= 0
##$ASSFACI= 0
##$ASSFACX= 0
##$ASSWID= 0
##$AUNMP= <proc_1d>
##$AZFE= 0.1
##$AZFW= 0.5
##$BCFW= 0
##$BC_mod= 2
##$BYTORDP= 0
##$COROFFS= 0
##$CY= -3
##$DATMOD= 1
##$DC= 0
##$DFILT= <>
##$DTYPP= 0
##$F1P= 0
##$F2P= 0
##$FCOR= 1
##$FTSIZE= 65536
##$FT_mod= 6
##$GAMMA= 0
##$GB= 0
##$INTBC= 1
##$INTSCL= 5.30512e-09
##$ISEN= 30
##$LB= 1
##$LEV0= 0
##$LPBIN= 0
##$MAXI= 10000
##$MC2= 0
##$MEAN= 0
##$ME_mod= 0
##$MI= 50
##$NCOEF= 0
##$NC_proc= -3
##$NLEV= 6
##$NOISF1= 182.463
##$NOISF2= 159.3651
##$NSP= 0
##$NTH_PI= 0
##$NZP= 0
##$OFFSET= 182.463
##$PC= 4
##$PHC0= -2353.517
##$PHC1= 15.40078
##$PH_mod= 1
##$PKNL= yes
##$PPARMOD= 0
##$PSCAL= 0
##$PSIGN= 0
##$REVERSE= no
##$SF= 81.014009
##$SI= 65536
##$SIGF1= 159.3651
##$SIGF2= -187.1042
##$SINO= 113.3802
##$SIOLD= 16384
##$SREGLST= <1H.CDCl3>
##$SSB= 0
##$STSI= 65536
##$STSR= 0
##$SW_p= 29940.119760479
##$SYMM= 0
##$S_DEV= 0
##$TDeff= 32768
##$TDoff= 0
##$TI= <>
##$TILT= no
##$TM1= 0
##$TM2= 0
##$TOPLEV= 0
##$USERP1= <user>
##$USERP2= <user>
##$USERP3= <user>
##$USERP4= <user>
##$USERP5= <user>
##$WDW= 1
##$XDIM= 65536
##$YMAX_p= 365241658
##$YMIN_p= -1161898
$$ End of Bruker specific parameters
$$ ---------------------------------
##NTUPLES= NMR SPECTRUM
##VAR_NAME=  FREQUENCY,     SPECTRUM/REAL,   SPECTRUM/IMAG
##SYMBOL=    X,             R,               I
##VAR_TYPE=  INDEPENDENT,   DEPENDENT,       DEPENDENT
##VAR_FORM=  AFFN,          ASDF,            ASDF
##VAR_DIM=   65536,         65536,           65536
##UNITS=     HZ,            ARBITRARY UNITS, ARBITRARY UNITS
##FACTOR=    0.456856943014862, 1,           1
##FIRST=     14782.0589164895, 0,            0
##LAST=      -15158.0608439895, 0,           0
##MIN=       -15158.0608439895, -1161898,    0
##MAX=       14782.0589164895, 365241658,    0
$$ Real data points
##PAGE= N=1
##DATA TABLE= (X++(R..R)), XYDATA
$$ [...]
36939b7134J84788N059k17073k48634n0016J57549J61597K8047k1593N2639Q3679
$$ -27134 157654 162713 -54360 -302994 -353010 -195461 -33864 -5817 -27410 25229 108908
36928A08908R740j6546Q3104J33347k0489k22974k03909K5831J87300J19707l6032
$$ 108908 118648 102102 185206 318553 298064 75090 -128819 -102988 84312 204019 167987
36917A67987o9079L4523J21787P8838o3317j90437k15017j23302M6708K27696
$$ 167987 98908 133431 255218 334056 270739 80302 -134715 -258017 -211309 16387
36907A6387L21884K48234M8062j13520j34981j16272k02222l35043l07597n3438
$$ 16387 338271 586505 634567 521047 386066 269794 67572 -267471 -575068 -628506
36897f28506K58083M21429L61207J15135j91579l59849k77974q1438J0687J563
$$ -628506 -370423 51006 412213 527348 335769 -24080 -302054 -383492 -372805 -371242
36887c71242N6983J68436J51828P945k8818J03993J55194k4493k17420j84373
$$ -371242 -314259 -145823 6005 13950 -14868 89125 244319 219826 2406 -181967
36877a81967j5413P8578R1045J11675J06455L3122k0482k4870j18134l08478l23128
$$ -181967 -197380 -118802 -27757 83918 190373 223495 203013 178143 60009 -248469 -571597
36866e71597k7593K61775K14986M28k0433J01380M5088j77731k42818p5233P3118
$$ -571597 -599190 -337415 -122429 -122001 -142434 -41054 4034 -173697 -416515 -491748 -418630
36855d18630J03541J79465L15336K89909O1076j23739j37902j31979j75244j14948
$$ -418630 -315089 -135624 179712 469621 530697 406958 269056 137077 -38167 -153115
36845a53115O7570J30149j5992j08998K5304J52367J3190k29525k30603K4978
$$ -153115 -85545 44604 28612 -80386 -55082 97285 110475 -119050 -349653 -324675
36835c24675K36240K14704N6686o0808o7465m851L5626J715m6362k0607L1156
$$ -324675 -88435 126269 182955 122147 54682 49831 85457 87172 40810 20203 51359
36824E1359j4441j18860j00330N4267J16251l9545k26703k24037p2172N9625J27312
$$ 51359 36918 -81942 -182272 -128005 -11754 -51299 -278002 -502039 -574211 -514586 -387274
36813c87274J62449J26413K457q7372l6757O9942R4795O0424P1097J11596Q4745
$$ -387274 -224825 -98412 -95955 -183327 -220084 -150142 -55347 5077 76174 187770 272515
36802B72515j7942j20214j73546j58336n7681O7865Q5995j6658p0591K8740J47397
$$ 272515 254573 134359 -39187 -197523 -255204 -187339 -101344 -118002 -188593 -159853 -12456
36791a2456J31488M8675K9822J8124r4428k01035j22241N3938O3585j08950j84986
$$ -12456 119032 167707 197529 215653 121225 -79810 -202051 -148113 -84528 -193478 -378464
36780c78464k1794J75453J80725O5512L7133J13520J29936m658j96729k87310
$$ -378464 -400258 -224805 -44080 21432 58565 172085 302021 297363 100634 -186676
36770a86676j98911P050J61604J20938p0182j89662q2392J39020K21022Q8454
$$ -186676 -385587 -378537 -216933 -95995 -166177 -355839 -438231 -299211 -78189 10265
36760A0265n9166j3827J57135J92624j1387k47290k51951l7008J38864R6836p5192
$$ 10265 -48901 -62728 94407 287031 275644 28354 -223597 -260605 -121741 -24905 -100097
36749a00097j76486j32480k7487L5651M2979N2658J04754J53603J08708l6973
$$ -100097 -276583 -409063 -436550 -400899 -357920 -305262 -200508 -46905 61803 24830
36739B4830j63680j66100r2670n8001n7613Q767J42382K12096J40529K426r4679
$$ 24830 -138850 -304950 -397620 -455621 -513234 -504467 -362085 -149989 -9460 -7034 -101713
36728a01713j16043o2897M2013J00017J0185j52194j79873k3305J22793J11325
$$ -101713 -217756 -280653 -238640 -138623 -128438 -280632 -460505 -483810 -361017 -249692
36718b49692M5770N6454N0496j08145k93185k44310L5516K53261K25648R5885
$$ -249692 -203922 -147468 -96972 -205117 -498302 -742612 -707096 -453835 -228187 -132302
36708a32302P7106J56360J75272Q7168r482m4271n0902p1435r3017j10851j60765
$$ -132302 -55196 101164 276436 363604 354122 309851 258949 187514 94497 -16354 -177119
36697a77119k24140j80331L1074K40190J97369p7900k68183j72502J5690R938
$$ -177119 -401259 -581590 -550516 -310326 -112957 -190857 -459040 -631542 -615852 -605914
36687f05914j30500j09840J17549K56602J14546j20188j60509R052J85483K32238
$$ -605914 -736414 -846254 -728705 -472103 -357557 -477745 -638254 -629202 -443719 -211481
36677b11481J67918O2407k5252n3099k7863K981K6904P4556J35465J48484Q8332
$$ -211481 -43563 18844 -6408 -59507 -87370 -84389 -57485 17071 152536 301020 389352
36666C89352k6958j95432l70039l78574j07355K38179L05791Q0157p5324L9742
$$ 389352 362394 166962 -203077 -581651 -689006 -450827 -145036 -64879 -140203 -100461
36656a00461J74948O6931j16937n4519K06158L17085J33711j38793k71280k42781
$$ -100461 74487 141418 24481 -30038 176120 493205 626916 488123 216843 -25938
36646b5938j49030p0234m1461k6318N6853J88813K14198O7419q4386p5477Q359
$$ -25938 -174968 -245202 -286663 -312981 -256128 -67315 146883 214302 129916 54439 62798
36635F2798r98o0914j9683Q9961J08730L3935q314k1535j01472j71089m5612K15550
$$ 62798 61800 886 -18797 71164 179894 213829 205515 183980 82508 -88581 -134193 81357
36623H1357L08135J07874j53600k30868j58174r0826n7050q058L8006M2164K9601
$$ 81357 389492 497366 343766 112898 -45276 -136102 -193152 -201210 -163204 -121040 -91439
36612i1439J9905l5870j54828k39475j82915m370J74885K44090J72078L0538m2673
$$ -91439 -71534 -107404 -262232 -501707 -684622 -688992 -514107 -270017 -97939 -67401 -110074
36601a10074J8115J04680O3260q3158j57371p6904N0070J01701Q2185M1334j7670
$$ -110074 -91959 12721 75981 -7177 -164548 -241452 -191382 -89681 -7496 33838 16168
36590A6168q4480r9345l5608N0597J02302J19584J00292J2584j21721j97091j39625
$$ 16168 -68312 -167657 -203265 -152668 -50366 69218 169510 182094 60373 -136718 -276343
36579b76343K654J28391J85861J70848Q7860k9855j07485r7403m4571l6996r0295
$$ -276343 -273689 -145298 40563 211411 299271 269416 161931 64528 19957 -17039 -107334
36568a07334j16762l4908J01856J38921J9901j04711o0043R8057J47721K4217
$$ -107334 -224096 -259004 -157148 -18227 1674 -103037 -163080 -65023 82698 106915
36558A06915q9166m7448N3711O6039J6725O303J6683j3179l0458L6697J11324
$$ 106915 17749 -29699 24012 90051 106776 113079 129762 116583 86125 122822 234146
36547B34146O7285o6536j56848j57159j05869j2745J01755J37726M4911o0390
$$ 234146 301431 234895 78047 -79112 -184981 -197726 -95971 41755 86666 26276
36537B6276n8383r191k1882o4241p3110j05982j81113j36532J00472K76117J48369
$$ 26276 -32107 -41298 -63180 -127421 -200531 -306513 -487626 -624158 -523686 -247569 -99200
36526i9200r2071r1836J00408J35788n0921j84770j46265q9778n8535P9319K64525
$$ -99200 -191271 -283107 -182699 -46911 -97832 -282602 -428867 -518645 -577180 -497861 -233336
36515b33336K55758P9694L4726J55360J32785j06229k27468p7499M8106l6247
$$ -233336 22422 102116 136842 292202 424987 318758 91290 13791 61897 25650
36505B5650p1901J11718K11389j1073k35603r0565K04758K05806k9278j01437
$$ 25650 -46251 65467 276856 265783 30180 -60385 144373 350179 320901 219464
36495B19464L6438P4782p3209j78553j38557p8356l3156P6221J65517O0635j50304
$$ 219464 255902 330684 257475 78922 -59635 -137991 -171147 -94926 70591 131226 -19078
36484a9078j92533m3657L9053m9719j29451o9511M3943J25949K01148K43598J62032
$$ -19078 -211611 -255268 -216215 -265934 -395385 -464896 -420953 -295004 -93856 149742 311774
36473C11774m958j03895j05338j15376j46543j01478J6678J00381J30035J52642
$$ 311774 306816 202921 97583 -17793 -164336 -265814 -249136 -148755 -18720 133922
36463A33922J18561j2315p7027P3262K36184J10091j55878j04943K89213N00490
$$ 133922 252483 240168 163141 236403 472587 582678 426800 321857 611070 1111560
36453A111560K20331j95931k91784j26170k6935n6343p3204q9453k01946l13418
$$ 1111560 1331891 1135960 844176 718006 691071 634728 561524 472071 270125 -43293
36443d3293k46428m7824Q8053J17325J26287J04036j2716j35000j13984k668J1047
$$ -43293 -289721 -337545 -249492 -132167 -5880 98156 85440 -49560 -163544 -166212 -155165
36432a55165q3003r9581L5463J73910J84929J25428J02151J02034M4665p2062
$$ -155165 -238168 -337749 -302286 -128376 56553 181981 284132 386166 430831 358769
36422C58769j47165q5984O8976J27565m9542l19119l54354o0816K52456K60608
$$ 358769 211604 125620 194596 322161 272619 -46500 -400854 -461670 -209214 51394
36412E1394L9830j02979r1077r7129j66330j39222J9028J20785Q4843P7552J79302
$$ 51394 91224 -11755 -102832 -199961 -366291 -505513 -486485 -365700 -280857 -203305 -24003
36401b4003J85746l9608k49428j36422J82996L22904J80701J0780l1197p5865
$$ -24003 161743 122135 -127293 -263715 -80719 242185 422886 433666 402469 326604
36391C26604k07255k66094j38424J9724L7449j388M2621P6959n0863k16749j49895
$$ 326604 119349 -146745 -285169 -265445 -227996 -229384 -186763 -109804 -160667 -377416 -527311
36380e27311J35806L18678K10476j5699j04401k3652R4299J49385J11907l493
$$ -527311 -391505 -72827 137649 121950 17549 -6103 88196 237581 349488 345995
36370C45995j11036j08741k7848j4120j02842j47712m8356R5958J57817J60603
$$ 345995 234959 126218 98370 84250 -18592 -166304 -214660 -118702 39115 199718
36360A99718J60169R1066r8078k61730k09180P155J38895O6335q4897j56595j34993
$$ 199718 359887 450953 352875 91145 -118035 -110880 28015 94350 9453 -147142 -282135
36349b82135q1951j9905N1152J03379J09447Q6134P6714J00491J18543N0030j32073
$$ -282135 -364086 -383991 -332839 -229460 -120013 -33879 42835 143326 261869 311899 179826
36338A79826l03998k69886m061K51916K29983n6672l28602l42327j09532J59616
$$ 179826 -124172 -394058 -398119 -146203 83780 27108 -301494 -643821 -753353 -593737
36328e93737K60372J55678o219m4217N9833J56566J37068O2393L6711M9186K9327
$$ -593737 -333365 -177687 -183906 -228123 -168290 -11724 125344 187737 224448 273634 302961
36317C02961k1567n6727p7620r8956p6726K4633J38782J66257R4832k2693j43628
$$ 302961 281394 224667 147047 48091 -28635 -4002 134780 301037 395869 373176 229548
36306B29548k13196j65231m4514j4320j14562j44219L9887K40627J78172o5277
$$ 229548 16352 -148879 -193393 -207713 -322275 -466494 -426607 -185980 -7808 -73085
36296g3085j51871o522R6835J4924l5851J16039K57666J10957j96392k75809l0757
$$ -73085 -224956 -231478 -134643 -119719 -155570 -39531 218135 329092 132700 -143109 -173866
36285a73866K10059J51486r3802k05438r4800K0889l9984j67406j31309Q2805
$$ -173866 36193 187679 93877 -111561 -206361 -185472 -225456 -392862 -524171 -441366
36275d41366K54683K39258J42491J22915J51186Q7641q6274k49549l08771k59793
$$ -441366 -186683 52575 195066 317981 469167 556808 470534 220985 -87786 -347579
36265c47579j17303Q8660K57591K79268J61536J5516p8419j16148j10478p4142
$$ -347579 -464882 -376222 -118631 160637 322173 337689 259270 143122 32644 -41498
36255d1498l9440j7926K5223Q9169R7453K8996J512R8917K00204J37942l9109
$$ -41498 -80938 -98864 -73641 15528 112981 141977 143489 242406 442610 580552 541443
36244E41443j38182j11582q5551j20224j30120n4868N3721J27345J28272K1096
$$ 541443 403261 291679 206128 85904 -44216 -99084 -45363 81982 210254 231350
36234B31350j54754k27024q4937J10293J16158k8051p2171L1904P6784j1805m6939
$$ 231350 76596 -150428 -235365 -125072 -8914 -36965 -109136 -77232 -448 -12253 -59192
36223e9192N9452J11524l1117j91058j53556L802Q0195P3969J02979J39994P4174
$$ -59192 260 111784 80667 -110391 -263947 -260145 -179950 -105981 -3002 136992 211166
36212B11166m6074o6091J7819O1438J6175k1965j2544l7342j23190j54600m6842
$$ 211166 165092 99001 116820 178258 194433 172468 159924 122582 -608 -155208 -202050
36201b02050R9073J16083j635q8672l0979Q2388Q6348k5921r0886p641J20426
$$ -202050 -102977 13106 11471 -77201 -108180 -25792 60556 34635 -56251 -63892 56534
36190E6534J39921N7163k562J1764L2114n193q0242j21508o8774N1557R0545p1591
$$ 56534 196455 253618 251056 262820 294934 289741 209499 87991 19217 70774 161319 89728
36178H9728k90747k54578P1156L02149J44750j57471j73279Q4151K30033J14068
$$ 89728 -201019 -455597 -384441 -82292 62458 -95013 -268292 -184141 45892 159960
36168A59960m1919q6223j08373j25796k559K13234K46391L5964j21088l1161J14401
$$ 159960 118041 31818 -76555 -202351 -204910 8324 254715 290679 169591 138430 252831
36157B52831R9758J2408N48n885r7052j60945r4068o656j473J8233J05548R2378
$$ 252831 352589 364997 365545 359660 262608 101663 7595 939 -534 17699 123247 215625
36145B15625r6291k10237n0950J54144Q6155j52712k19860p7920J5112k5190k2633
$$ 215625 119334 -90903 -141853 12291 98446 -54266 -274126 -352046 -336934 -362124 -384757
36134c84757R4093J71218J11817J4097j9341q250j427j7425p8689j66456j71955
$$ -384757 -290664 -119446 -7629 6468 -12873 -21123 -22550 -39975 -118664 -285120 -457075
36123d57075k7704J58710K29228J70529O9604k9219r5022n4324Q8060J83736J36409
$$ -457075 -484779 -326069 -96841 73688 143292 114073 19051 -35273 52787 236523 372932
36112C72932L8127j6658q3036j83037j79071k6120O6807l5017j21550K3201K24585
$$ 372932 411059 394401 311365 128328 -50743 -76863 -10056 -45073 -166623 -143422 81163
36101H1163J88472j6807j11637q0885j07973j59143n3228J30157J37531p42k0595
$$ 81163 269635 252828 141191 60306 -47667 -206810 -260038 -129881 7650 6908 -13687
36090a3687Q2847M7257j47092k01559j5043J42054Q8808j7560k9429l5216q1447
$$ -13687 69160 116417 -30675 -232234 -247277 -105223 -16415 -33975 -63404 -98620 -180067
36079a80067k3663J57845K18934L6906j53930j26082L213J9033m1196j7760Q1407
$$ -180067 -203730 -45885 173049 209955 56025 -70057 -66844 -47811 -89007 -106767 -25360
36068b5360J43113J51393J37958O6549o8283j56118j26950o5627n4953m8857p795
$$ -25360 117753 269146 407104 473653 405370 249252 122302 56675 1722 -47135 -54930
36057e4930J990m6484o7385l9108o5365j48923j23762M4447J27245m433j18461
$$ -54930 -52940 -99424 -166809 -205917 -271282 -420205 -543967 -499520 -372275 -376708 -495169
36046d95169K6287K61641K51301K6400n6088J34162L05436J75715j37638k92270
$$ -495169 -468882 -207241 44060 70460 14372 148534 453970 629685 492047 199777
36036A99777j53988P5201J25768l0549j70885j01471J09372K33182J73150M7331
$$ 199777 45789 120990 246758 216209 45324 -56147 53225 286407 459557 506888
36026E06888j3294j9119l7353p3279r7886j03586p9830j0461P1928J08598J04080
$$ 506888 493594 474475 437122 363843 265957 162371 82541 72080 144008 252606 356686
36015C56686R9710O4661n9096k04213k24835j13330o600M5432J26500K25076J78252
$$ 356686 456396 521057 461961 257748 32913 -80417 -87017 -41585 84915 309991 488243
36004D88243n2442k50019k30130r8830o6688j34221j28780K3863K10362K75812
$$ 488243 435801 185782 -44348 -143178 -209866 -344087 -472867 -449004 -238642 37170
35994C7170J69269j9499j24578o3559N5288P3713J3931K3899J05436R9905k5393
$$ 37170 206439 186940 62362 -1197 54091 127804 141735 165634 271070 370975 345582
35983C45582j03888n4419p951m6852n3747M0779R3486Q465n8455L1271J23356
$$ 345582 241694 187275 179324 132472 78725 119504 212990 221455 163000 194271 317627
35972C17627J5513j78991j89512r514J16010P4712j386j978J7740n267k5957J1722
$$ 317627 333140 154149 -35363 -44877 71133 145845 144459 142481 160221 154954 128997 140719
35960A40719Q5847J40381J32214L4417j23705k30683j86158j2724J71798K56513
$$ 140719 226566 366947 499161 533578 409873 179190 -6968 -19692 152106 408619
35950D08619J82561k5801k16901k03468J2055J98605J74912K5843n9909n1672
$$ 408619 591180 565379 348478 145010 157065 355670 530582 556425 496516 444844
35940D44844m1635n1993m2584m6446j30966k47973k62189j25221P5923K23680
$$ 444844 403209 351216 308632 262186 131220 -116753 -378942 -504163 -428240 -204560
35930b04560K45596J31277m0165j34469j02870l8891l2363m7202k3827n729m9228
$$ -204560 41036 172313 132148 -2321 -105191 -144082 -176445 -223647 -247474 -253203 -302431
35919c02431q6535j2285J35732K01997J06133o7889j60250p7241J08677J89887
$$ -302431 -388966 -401251 -265519 -63522 42611 -25278 -185528 -262769 -154092 35795
35909C5795M6725j54792j37110Q5701J82177k0936k57268j98032O9541J83060
$$ 35795 82520 -72272 -209382 -123681 58496 37560 -219708 -417740 -348199 -165139
35899a65139J9971j79291j73353J0037J80186J96988N4153j34115k11836j22098
$$ -165139 -145168 -324459 -497812 -487775 -307589 -110601 -56448 -190563 -402399 -524497
35889e24497L7859J45790J82794J81704J35819M0613n1678r5476r3655k8202J32271
$$ -524497 -486638 -340848 -158054 23650 159469 200082 148404 52928 -40727 -68929 63342
35878F3342L00355L01867J24808l6560q8106j76283l69611m33676j70553J99453
$$ 63342 363697 665564 790372 753812 665706 489423 119812 -313864 -484417 -284964
35868b84964K92575R0815q0585m7458L6383P891p5971q5292r01J06294J53499
$$ -284964 7611 98426 17841 -29617 6766 14657 -61314 -146606 -147507 -41213 112286
35857A12286R0672l1974p5957L360O4574m932r4729o1833Q081m5140j44436q9463
$$ 112286 202958 170984 95027 98387 162961 158029 63300 1467 9548 -35592 -180028 -269491
35845b69491P6977J12124k1885r2945J4236J27536R8136L0949O7049J36213Q8340
$$ -269491 -192514 -80390 -102275 -195220 -180984 -53448 44688 75637 142686 278899 367239
35834C67239o1935j71568j66917q8216J833N6824L7845n0583j31953j21006j8247
$$ 367239 305304 133736 -33181 -121397 -119564 -62740 -24895 -75478 -207431 -328437 -346684
35823c46684P9195O6253o1549j85790j75271k4682J45503K19711J71868M5204
$$ -346684 -267489 -201236 -262785 -448575 -623846 -648528 -503025 -283314 -111446 -66242
35813f6242p1090p0821N3591J48296Q2703m1639m3064K8206k0241j45111j04526
$$ -66242 -137332 -208153 -154562 -6266 76437 34798 -8266 19940 -301 -145412 -249938
35802b49938Q8041J25274n8914j23001J02059K76802J06033j51598j19015P8551
$$ -249938 -161897 -36623 -95537 -218538 -116479 160323 266356 114758 -4257 74294
35792G4294Q3798n7903l3327J40770J62479n949j12260q4873q0131j02211k1053
$$ 74294 158092 100189 66862 207632 370111 364162 251902 167029 86898 -15313 -36366
35781c6366O2929o9538k89383k35111P7270K36352R1113n3013J038N8751k1300
$$ -36366 26563 -42975 -332358 -567469 -490199 -253847 -162734 -215747 -214709 -155958 -177258
35770a77258n3127Q5960J88889R0649l4566K309Q2148K8063p9939q3846k3171
$$ -177258 -230385 -144425 44464 135113 100547 102856 185004 213067 133128 49282 26111
35759B6111p692k471N7422R8788L4606p5965j24039q4868K0664J51342J91999
$$ 26111 18419 15948 73370 172158 206764 130799 6760 -78108 -57444 93898 285897
35748B85897N6676j27543j45823j3158O9033N6841P0278P5964o6889k26002r5874
$$ 285897 342573 215030 69207 56049 125082 181923 252201 328165 261276 35274 -60600
35737f0600K36818L01446j5713k31022k9259K13662N5656k82130k93635J380J50914
$$ -60600 176218 477664 461951 230929 201670 415332 470988 188858 -104777 -103397 47517
35726D7517J4397r9977p502R6693K3250j16624j20814K6790J90465K45858J46025
$$ 47517 61914 -38063 -45565 51128 74378 -42246 -163060 -136270 54195 300053 446078
35715D46078o3205k45208k63297j09175P8312J28181r802j94151k15979n2024
$$ 446078 382873 137665 -125632 -234807 -156495 -28314 -38116 -232267 -448246 -500270
35705e00270Q9814P5984O1052K07633L43100J96992j13072k01765m368J46808
$$ -500270 -410456 -334472 -273420 -65787 277313 474305 361233 159468 155100 301908
35695C01908P5305j5063L0012O3660k0216o3624L3806R4963j8750j54569j33620
$$ 301908 377213 362150 392162 455822 435606 371982 405788 500751 482001 327432 193812
35684A93812j7416N8814P4512K0699j21921k10735o4735J65957J38857r2874j03106
$$ 193812 176396 235210 309722 330421 208500 -2235 -66970 98987 237844 144970 41864
35673D1864J64952K32819r8228l51002j54316J37046O9269j63996j42484M0171
$$ 41864 206816 439635 341407 -9595 -163911 -26865 42404 -121592 -264076 -223905
35663b23905M4610n3978J6699J27179j5337k42772j61467J33911J87323o2209
$$ -223905 -179295 -233273 -216574 -89395 -104732 -347504 -508971 -375060 -187737 -249946
35653b49946k24068j17280M2997J07304J47561J49461P612j63362j35662J6803
$$ -249946 -474014 -591294 -548297 -440993 -293432 -143971 -136359 -299721 -435383 -418580
35643d18580J4665j34974j51163L0623J85741K10816K10648J80362q51k43115
$$ -418580 -403915 -538889 -690052 -659429 -473688 -262872 -52224 128138 127287 -115828
35633a15828k91966j30335M083J0038Q418N3623P7493Q7391J16059N3687j47982
$$ -115828 -407794 -538129 -534046 -524008 -515590 -461967 -384474 -297083 -181024 -127337 -275319
35622b75319k32041J9262L28491K55214j17419l06396j69305j7200j8463j1730
$$ -275319 -507360 -488098 -159607 95607 -21812 -328208 -497513 -514713 -533176 -544906
35612e44906O3481N6592j5645M4933J95452J75784J182l9449P9227P9259o6856
$$ -544906 -481425 -424833 -440478 -395545 -200093 -24309 -23127 -62576 16651 95910 29054
35601B9054o7864J09085J34558p2578j71689k0328O2505j15237k64028j17218
$$ 29054 -38810 70275 204833 132255 -39434 -59762 2743 -112494 -376522 -493740
35591d93740J47404K55376K09754Q8144j33305l34608k48424P0178J95902j0565
$$ -493740 -346336 -90960 118794 206938 73633 -260975 -509399 -439221 -243319 -253884
35581b53884j50396M1292K46653J29551r9601q7123Q0175J19972N9734P3393Q7736
$$ -253884 -404280 -362988 -116335 13216 -86385 -173508 -93333 26639 86373 159766 247502
35570B47502l7297j69891j31674m2858q0786j18737K4495J91999J34556l9147
$$ 247502 210205 40314 -91360 -134218 -215004 -333741 -309246 -117247 17309 -21838
35560b1838n1575O3248O3299m4781m8721N4743P1489o046J3415J48592J84935
$$ -21838 -73413 -10165 53134 8353 -40368 14375 85864 79818 93233 241825 426760
35549D26760K6088j54166j66701k4925J26071J59384M3666j21898j78044q8587
$$ 426760 452848 298682 131981 107056 233127 392511 436177 314279 136235 47648
35539D7648J7039M5226N5424R5440Q4141j7728q1877r824Q3056L6632j14508k08086
$$ 47648 64687 109913 165337 260777 344918 327190 245313 235489 318545 355177 240669 32583
35527C2583j62361j6027J32344J55708L676j73704j67455l836J02565R9503J33253
$$ 32583 -129778 -145805 -13461 142247 145923 -27781 -195236 -199072 -96507 2996 136249
35516A36249K05856J29042r0573j74744k3418J10247O2707J3269R1274J09749
$$ 136249 342105 471147 380574 205830 182412 292659 355366 368635 459909 569658
35506E69658m9137j52303k9058P7964p5857k85391k35628k6871L4793m7408m7210
$$ 569658 520521 368218 339160 417124 341267 55876 -179752 -206623 -171830 -219238 -266448
35495b66448N8650J16702R9520N9624n3626k28442k41898M204K15604J15864j02257
$$ -266448 -207798 -91096 8424 68048 14422 -214020 -455918 -451714 -236110 -120246 -222503
35484b22503j07578J9996r370j54972j63833n7533k9120k814K06636M16742K92635
$$ -222503 -330081 -310085 -319455 -474427 -638260 -695793 -724913 -727727 -521091 -104349 188286
35473A88286k8647q2676J60006K39548j8050k31939j32880K0403n8419k02218
$$ 188286 159639 76963 236969 476517 458467 226528 93648 114051 55632 -146586
35463a46586j22921R5724J64976M6729n1186j9669N4975R0967J18544J68880J67516
$$ -146586 -269507 -173783 -8807 37922 -13264 -32933 22042 113009 231553 400433 567949
35452E67949J2950k36553l36403j36385J49115J60259r2538k10283j0554J79606
$$ 567949 580899 344346 7943 -128442 20673 180932 88394 -121889 -132443 47163
35442D7163N5210j76345j65833P509M3665l0973J5115J15277K0638j69276j03434
$$ 47163 102373 -73972 -239805 -232296 -188631 -219604 -204489 -89212 -68574 -237850 -341284
35431c41284K01230L32123J32394p7959l8948J05978J42485R3471L5650p3812
$$ -341284 -140054 192069 324463 246504 207556 313534 456019 549490 585140 511328
35421E11328k20260k44692r0281P3744R1050j675j04657j80999k03631j52174
$$ 511328 291068 46376 -43905 29839 120889 119214 14557 -166442 -370073 -522247
35411e22247q5254n5762R282J58494K34309R2146r2347m4002J56946J90536K3533
$$ -522247 -607501 -663263 -653981 -495487 -261178 -169032 -261379 -305381 -148435 42101 65634
35400F5634o6071O930J3432j40582k32356j12299O0036J04495N9294J6699j9095
$$ 65634 -437 6493 19925 -120657 -353013 -465312 -405276 -300781 -241487 -224788 -243883
35389b43883j8894P3732J64754Q8786q4857j03534O1854J54566L9143j21543j66253
$$ -243883 -262777 -189045 -24291 64495 -20362 -123896 -62042 92524 131667 10124 -156129
35378a56129j29394p1243Q525M0132n0982j27059q39J78889Q1254k28526k91940
$$ -156129 -285523 -356766 -348241 -308109 -359091 -486150 -486989 -308100 -226846 -455372 -747312
35367g47312M6343L68461K97954P556j16349l815J40951J67200N7432j26111k32028
$$ -747312 -700969 -332508 -34554 -26998 -143347 -147162 -6211 160989 218421 92310 -139718
35356a39718j41810K2492K9174r2119q5881R1245J92741J04529O979L0400Q1308
$$ -139718 -281528 -259036 -229862 -321981 -407862 -316617 -123876 -19347 -12368 18032 99340
35345I9340R5741J30158J27881m7856k76125k52341K2588K15928J86927J13025
$$ 99340 195081 325239 453120 405264 129139 -123202 -100614 115314 302241 415266
35335D15266M6994j51986l62027k35437J54413K83722M978j93853k1310J46017
$$ 415266 462260 310274 -51753 -287190 -132777 150945 155923 -37930 -59240 86777
35325H6777k3368k33389j31164P7100O2805l9181L6267J79414J85167J37460J04531
$$ 86777 63409 -169980 -301144 -224044 -161239 -200420 -164153 15261 200428 337888 442419
35314D42419j02391m45933m43998P6280N19836L69840j6118n8975J09049N4578
$$ 442419 340028 -105905 -549903 -473623 46213 416053 399935 340960 450009 504587
35304E04587j03516l0956N4757k04387m77533k13848L23618L99204m955k41954
$$ 504587 401071 370115 424872 220485 -257048 -470896 -147278 251926 246971 5017
35294E017j12298j5406o6275K5429K07655J13490j40814o5549K62854K70618n5146
$$ 5017 -107281 -122687 -188962 -163533 44122 157612 16798 -48751 214103 484721 429575
35283D29575j14312K08703L65027J93059J46493L01936K01479r6500M6598N85409
$$ 429575 315263 523966 888993 1082052 1228545 1530481 1731960 1635460 1682058 2267467
35273B267467P21397M57510P74722J734553K158185K137462L785626P572471R665937
$$ 2267467 2988864 3446374 4221096 5955649 8113834 10251296 14036922 21609393 31275330
35264C1275330N853261k402009q714779q983347n395244k512683j818243j730667
$$ 31275330 37128591 34726582 26011803 17028456 11633212 9120529 7302286 5571619
35256E571619j136392n74628n39937o17057m55652l00202l11531k70870j31957
$$ 5571619 4435227 3860599 3320662 2703605 2247953 1947751 1636220 1365350 1233393
35247A233393j36297k55081j64720J15499J73392q2470k40036q2798P4640k5849
$$ 1233393 1097096 842015 677295 792794 966186 883716 643680 560882 635522 609673
35237F09673j60375p2490P1848R775j60955j84983p2324p715j6166O45L4260K4271
$$ 609673 449298 376808 448656 458431 297476 112493 40169 32454 16288 16933 51193 75464
35225G5464K3459Q7868J19756K9237o7516k4545P5432O1654l0374m0030K6598
$$ 75464 98923 186791 306547 335784 268268 243723 319155 380809 350435 310405 337003
35214C37003K6198n7927j09878r2547n0795L7437J83949K27177J1483k99385l64538
$$ 337003 363201 305274 195396 102849 52054 89491 273440 500617 512100 212715 -151823
35203a51823j29886J14125J60061J02238Q3925R2408Q5660Q8013P6639j6321j27407
$$ -151823 -281709 -167584 -7523 94715 178640 271048 356708 444721 521360 505039 377632
35192C77632j08087K713P6j31312j59349J620J28491O2179l8333K567P9878L0414
$$ 377632 269545 272258 272334 141022 -18327 -16707 111784 173963 135630 138197 218075 248489
35180B48489o7149n2902K4541J2526p8406j18608o9467J8632J15638J79835J33451
$$ 248489 181340 128438 152979 165505 87099 -31509 -100976 -82344 33294 213129 346580
35169C46580m682q9591n8072j4213j6642K3032J20390J23680j9754j33483j02821
$$ 346580 341898 252307 194235 180022 163380 186412 306802 430482 410728 277245 174424
35158A74424n1839o5406j2053J49536J82745m3515k62500k03208j6115K3216j9164
$$ 174424 122585 57179 45126 194662 377407 333892 71392 -131816 -147931 -124715 -143879
35147a43879N8998J53555M3589j44888j06255J21816K27181J37807N5818L5960
$$ -143879 -84881 68674 112263 -32625 -138880 -17064 210117 347924 403742 439702
35137D39702n6254j89706j71128j1403P2758K7447n408k468n7521r5648L7240
$$ 439702 383448 193742 22614 11211 83969 111416 106008 103540 46019 -49629 -12389
35126a2389K16942J64844o7985j43281J3117J14088J6840q9382q2961q8612j48147
$$ -12389 204553 369397 301412 158131 171248 285336 302176 212794 129833 41221 -106926
35115a06926j07074M5453J03936L7026N9266J81308J17014j72617k83575J2392
$$ -106926 -214000 -168547 -64611 -27585 31681 212989 330003 157386 -126189 -113797
35105a13797L54052L27104P1381k2243N6450K5076j48793k11931p4176N9140J9996
$$ -113797 240255 567359 638740 616497 672947 698023 549230 337299 263123 322263 342259
35094C42259j14305j82706j34875l7166P075n2018j34507r5928P2934J93952J21299
$$ 342259 227954 45248 -89627 -126793 -119718 -171736 -306243 -402171 -329237 -135285 -13986
35083a3986o8167j76625j09130N7280J66239J19286j7066n7684O6630J82847J15436
$$ -13986 -82153 -258778 -367908 -310628 -144389 -25103 -42169 -99853 -33223 149624 265060
35072B65060l2566l6307Q4183J05626k5029j35915j45351j40497j24404K500J60727
$$ 265060 232494 196187 280370 385996 360967 225052 79701 -60796 -185200 -182700 -21973
35061b1973J21187r6444j83482j7939J46459J13040L3746P7732J23305J8665j17384
$$ -21973 99214 2770 -180712 -198651 -52192 60848 94594 172326 295631 314296 196912
35050A96912j10617k9044k3691o2919m9850k3933l4795K292J18601J50459J799
$$ 196912 86295 57251 33560 -29359 -79209 -103142 -137937 -135645 -17044 133415 135214
35039A35214j44209j06087l829k4869q0451Q582J40532Q1949j06026j32788N4353
$$ 135214 -8995 -115082 -118911 -143780 -224231 -215649 -75117 6832 -99194 -231982 -177629
35028a77629J88504J03396m8808q1747l6284l0690l1542N7467J73097J40137n2481
$$ -177629 10875 114271 65463 -16284 -52568 -83258 -114800 -57333 115764 255901 203420
35017B03420j75955n8865J35965J03766j47051k57434l0937K49479K22673l0562
$$ 203420 27465 -31400 104565 208331 61280 -196154 -227091 22388 245061 214499
35007B14499j57282p8997j6400l9837J0652J37724J12745j08245k43495j08313
$$ 214499 57217 -21780 -38180 -78017 -67365 70359 183104 74859 -168636 -276949
34997b76949J13273J71360P1303m6702j14183r3165N0513K19243K32829Q4152
$$ -276949 -163676 7684 78987 32285 -81898 -175063 -124550 94693 327522 411674
34987D11674n7930j25998j83738j81825n689K17478K25691P0549N3827J72986
$$ 411674 353744 227746 44008 -137817 -143506 73972 299663 370212 424039 597025
34977E97025J04116j72015k66591p8315j7948k65658l83236n0536L46549L30310
$$ 597025 701141 529126 262535 184220 166272 -99386 -482622 -533158 -186609 143701
34967A43701O4746l4685m768q9484j53494M7396K78895J38337k21716k85231J0698
$$ 143701 208447 173762 168994 79510 -73984 -26588 252307 390644 168928 -116303 -105605
34956a05605K19616J07873q5465j18710k8047Q2895J54547Q1065j48177k67572
$$ -105605 114011 221884 136419 17709 -10338 72557 227104 308169 159992 -107580
34946a07580m4085L01816L47536P5220j43302j12733R346O6072O6840J5219r6720
$$ -107580 -151665 150151 497687 572907 429605 316872 326218 392290 459130 474349 377629
34935C77629j44578k6769Q9373j5711k24388k34733l0469J35651J57502J35980
$$ 377629 233051 206282 295655 279944 55556 -179177 -209646 -73995 83507 219487
34925B19487R4006j9476r7838M708J68747J51139k5326j39760j48912j66627j65023
$$ 219487 313493 294017 196179 200887 369634 520773 495447 355687 206775 40148 -124875
34914a24875m8512O5795J928j31766j11869K10O460j2491J43490L40288K79869
$$ -124875 -173387 -107592 -105664 -237430 -349299 -349089 -342629 -355120 -211630 128658 408527
34903D08527L6117n5790K3914K003j44271j72077o8673m9850q4181N3577K63864
$$ 408527 444644 388854 412768 414771 270500 98423 29750 -20100 -104281 -50704 213160
34892B13160K12718m1532q9162J12384J59154o5873j95652o9065m661j67027k48612
$$ 213160 425878 384346 295184 407568 566722 500849 305197 236132 231471 64444 -184168
34881a84168n8615J16027M8435l0483R1963J91299K2299k33544k83610j54988
$$ -184168 -242783 -126756 -78321 -108804 -16841 174458 196757 -36787 -320397 -475385
34871d75385q631J50923K98435K49392j5803j95336j00963M9335J8149q8309r4293
$$ -475385 -484016 -333093 -34658 214734 198931 3595 -97368 -48033 -29884 -118193 -212486
34860b12486p0625j12782j10079M750P6910M3483J00977L05032L53228O7702k43021
$$ -212486 -283111 -395893 -505972 -501222 -424312 -380829 -279852 25180 378408 446110 203089
34849B03089k39369n6537n84l2031N2882J67944Q7380j05930j22689O2855J85535
$$ 203089 -36280 -92817 -93401 -125432 -72550 95394 182774 76844 -45845 17010 202545
34838B02545R6900o7871j19604k7063Q7273P2147p4994j49467l411J72225Q8809
$$ 202545 299445 231574 111970 84907 172180 244327 169333 19866 16455 188680 277489
34827B77489j50015j64999P3243J79969J1171j12153j6292R154k07770l27574
$$ 277489 127474 -37525 35718 215687 226858 114705 98413 107567 -100203 -427777
34817d27777o7815K71585K79981O3511l7124k6516r6917j72218p0672R8347J24812
$$ -427777 -495592 -224007 55974 119485 82361 55845 -41072 -213290 -283962 -185615 -60803
34806f0803Q1539J27730J49656q883j77971j21658M7299R9423R7875J72744J50179
$$ -60803 20736 148466 298122 289239 111268 -10390 36909 136332 234207 406951 557130
34795E57130j31181l78595k30026J19570K03657K6603k7674J03608J28205o178
$$ 557130 425949 47354 -182672 -63102 140555 167158 139484 243092 371297 365119
34785C65119n6232l908p6911k30832j59044J17966K05073j8662k06562j40033
$$ 365119 308887 304979 228068 -2764 -161808 -43842 161231 142569 -63993 -204026
34775b04026l9379r8264j51421l4340J04699R4246K7022L0588K8968m6108n6236
$$ -204026 -243405 -341669 -493090 -527430 -422731 -328485 -301463 -270875 -241907 -288015 -344251
34764c44251J01501K56305J95330j1715j20716m5614Q3162J26271P0836j0954
$$ -344251 -242750 13555 208885 197170 76454 30840 114002 240273 311109 300155
34754C00155n7570p4886j06720j42426j13405k3715J8404j7479l5J38095K30797
$$ 300155 242585 167699 60979 -81447 -194852 -218567 -200163 -217642 -217677 -79582 151215
34743A51215J09005j23931k40980k00315j05714J3442J53044J90736N2304q2867
$$ 151215 260220 136289 -104691 -305006 -410720 -397278 -244234 -53498 -1194 -84061
34733h4061j2869J48507J50539K6947K0231J53409K16040J46233Q7632P1534j7824
$$ -84061 -96930 51577 202116 229063 249294 402703 618743 764976 852608 924142 906318
34722I06318j42506j16923L7397P7408m6605r0479O0943J87682J08347j7369M3751
$$ 906318 763812 646889 684286 761694 715089 624610 685553 873235 981582 964213 1007964
34711A007964K38298L37490K69777J60281J15379J06134L7829j31786l24694l94180
$$ 1007964 1246262 1583752 1853529 2013810 2129189 2235323 2273152 2141366 1816672 1422492
34701A422492k89051j26368l1893J5441P3101P0333p6976k60980k89128j62446
$$ 1422492 1133441 1007073 975180 990621 1063722 1134055 1057079 796099 506971 344525
34691C44525n8504n7029o7216k5055J1289j6131p9124j12859o5576O9565K01417
$$ 344525 286021 228992 161776 136721 148010 131879 52755 -60104 -125680 -56115 145302
34680A45302J98700P6299L966M3921N0518n0090r7575L881N7241j04256k78125
$$ 145302 344002 420301 424267 468188 518706 468616 371041 374922 432163 327907 49782
34669D9782j86315O0162J28860j9915j26915o3608N7575J47670K09093J82710
$$ 49782 -136533 -76371 52489 32574 -94341 -157949 -100374 47296 256389 439099
34659D39099J4864j61106j70687p1619m2729r0938j12652j19622j37256l7302
$$ 439099 453963 292857 122170 50551 7822 -83116 -195768 -315390 -452646 -489948
34649d89948K21433L63615J67985j07978q2794J31295J27467j06758k09892q7916
$$ -489948 -268515 95100 263085 155107 72313 203608 331075 224317 14425 -73491
34639g3491r197o8059p0619J5214J423p7963K6999K55986K31952r3851k88932
$$ -73491 -82688 -150747 -221366 -206152 -204729 -282692 -255693 293 232245 138394 -150538
34628a50538j03152J73894K12093P7248l0743q8451j00622K127J36527P5406j62038
$$ -150538 -253690 -79796 132297 209545 178802 90351 -10271 -8144 128383 203789 41751
34617D1751k70974j46311l7932p8718n6277J54282L14894K13125l998j06449r8117
$$ 41751 -229223 -375534 -413466 -492184 -548461 -394179 -79285 133840 129842 23393 -74724
34606g4724o7126n717N1470p383j24904q8485Q9600J31994m2951j69900p7894
$$ -74724 -141850 -147567 -96097 -103480 -228384 -316869 -227269 -95275 -138226 -308126 -386020
34595c86020P9867J71744K73458L54627J98161j62265l30703j16142J58944J55681
$$ -386020 -306153 -134409 139049 493676 691837 529572 198869 82727 241671 397352
34585C97352l3256j66519k22604k35183j08321J42450K77084J87035N7173K95
$$ 397352 364096 197577 -25027 -260210 -368531 -226081 51003 238038 295211 295506
34575B95506j00088k13273p6852K78293L94302Q1291k20086j25787R6355L2278
$$ 295506 195418 -17855 -94707 183586 577888 659179 439093 313306 409661 441939
34565D41939j95779k20164n7095K6905r8j8134o6661j76446j59469M9250J36775
$$ 441939 246160 25996 -31099 -4194 -4292 -22426 -89087 -265533 -425002 -375752 -238977
34554b38977r8310l17596j48498J94116K83199J83796K33670L60586K19877j24137
$$ -238977 -337287 -654883 -803381 -609265 -326066 -142270 91400 451986 671863 547726
34544E47726k48157o1936Q0704k3297j82268j98631j08332P649J21315J49879
$$ 547726 299569 237633 318337 295040 112772 -85859 -194191 -186542 -65227 84652
34534H4652L2347j00481p9469L6119P3212K1089l7638j24032k39920k23511m779
$$ 84652 116999 16518 -62951 -26832 46380 67469 29831 -94201 -334121 -557632 -562411
34523e62411J81942J32629J5646O6519J69348R9608m2070l4129M0976l234l8440
$$ -562411 -380469 -247840 -232194 -165675 3673 103281 61211 27082 68058 64824 26384
34512B6384J38553L30564K01908j20958k19657n9801J2944j06579j74150r0377
$$ 26384 164937 495501 697409 576451 356794 296993 309937 203358 29208 -61169
34502f1169j8964m620P1476J49423N2100j08592m4723J74287J75178q7441k34302
$$ -61169 -80133 -84753 -13277 136146 188246 79654 34931 209218 384396 296955 62653
34491F2653q7594P3966K5497p0621k0298Q6115J03833P2538N6818R081p5429j01303
$$ 62653 -24941 49025 74522 3901 -16397 69718 173551 246089 302907 311988 236559 135256
34479A35256o0910n2568o5924L019J02522P0792m9948m9735O9516P6512p6290
$$ 135256 74346 21778 -44146 -41127 61395 132187 82239 32504 102020 178532 102242
34468A02242j60022p3391k903n9531p5802P0935K08028J32455p5043j79515j02931
$$ 102242 -57780 -131171 -134074 -193605 -269407 -198472 9556 142011 66968 -112547 -215478
34457b15478K6866N3966m7079j34410l7611J96190K89548R2109j81539k43762
$$ -215478 -188612 -134646 -181725 -316135 -353746 -157556 131992 224101 42562 -201200
34447b01200j08167M1873J71638L00552K81746L1755j81928q4070J18378L9255
$$ -201200 -309367 -267494 -95856 204696 486442 518197 336269 252199 370577 409832
34437D09832k13754j95272R9629K00557l4550j81638j158J39264r8783m32658
$$ 409832 196078 806 100435 300992 266442 84804 83646 222910 124127 -308531
34427c08531l93120k7127K24336J50979o6991k03679k01643r3518O7369J95780
$$ -308531 -701651 -728778 -504442 -353463 -420454 -624133 -825776 -919294 -851925 -656145
34417f56145K20503J50711N8527J9757O3702J32023J24862M2456l861J2095k6839
$$ -656145 -435642 -284931 -226404 -206647 -142945 -10922 113940 156396 152535 164630 137791
34406A37791j35230j25859O6575J93858P3641p8423j0199J11886J173k06832j73081
$$ 137791 2561 -123298 -56723 137135 210776 132353 122154 234040 235213 28381 -144700
34395a44700L8697P8290o5897q4298N7839Q5056k2177K0872K22309K34934j8277
$$ -144700 -106003 -27713 -93610 -177908 -120069 -35013 -57190 -36318 185991 420925 402648
34384D02648j67766j9389J40369O9674n4172k5056L5404k9734j11253p4926j1720
$$ 402648 234882 215493 355862 425536 371364 346308 381712 351978 240725 165799 154079
34373A54079k9500n2369n192L8782K5652P181j1805o5017n6314R3175J63044r9026
$$ 154079 124579 72210 67018 105800 131452 138633 126828 61811 5497 98672 261716 162690
34361A62690m48350l76713Q3856L45679J75629K5312K20534M16234K24718j23555
$$ 162690 -285660 -662373 -578517 -232838 -57209 -31897 188637 604871 829589 706034
34351G06034j92062k1894M5554n9549j54865j75000j59692o4058J04819J47626
$$ 706034 513972 492078 537632 478083 323218 148218 -11474 -75532 29287 176913
34341A76913l9670k16193j11658J67678L04083J97844L321j34395j75510j27792
$$ 176913 137243 -78950 -190608 -22930 281153 478997 482318 347923 172413 44621
34331D4621n3724l9856o6498l0307O3642J04001Q1174P8131O1994m7037j20203
$$ 44621 -9103 -48959 -115457 -145764 -82122 21879 103053 181184 243178 196141 75938
34320G5938K9543K45932J76554j40562k77634r3455N7208n8921j96692j09720
$$ 75938 105481 351413 527967 387405 109771 16316 73524 14603 -182089 -291809
34310b91809N2927Q5740P4035J35216J59600O4094j2705Q502j0854j11396j05185
$$ -291809 -238882 -153142 -79107 56109 215709 279803 267098 275600 264746 153350 48165
34299D8165M7519R8474m5739j19187M3337K20717K09733J33746J14281K7726j60638
$$ 48165 95684 194158 148419 29232 72569 293286 503019 636765 751046 778772 618134
34288F18134k17339o1123L1721q7328j53795J9996J81337Q5934q2214p8667j5653
$$ 618134 400795 339672 371393 284065 130270 150266 331603 417537 335323 256656 241003
34277B41003o7057j05896J9541J66691J67839J04298M8507j06722l08262k54206
$$ 241003 173946 68050 87591 254282 422121 526419 574926 468204 159942 -94264
34267i4264O6513K04322m3673k35210L490L34771K62244p9996k12157o3206O6374
$$ -94264 -27751 176571 132898 -102312 -98822 235949 498193 418197 206040 142834 209208
34256B09208M9980j1178p8203j42931j05118K7393N9970l8774l3214J26978J64484
$$ 209208 259188 248010 169807 26876 -78242 -50849 9121 -29653 -62867 64111 228595
34245B28595L649n2827P0239J4532k93007l60212J3682K76472M1373k10545K0680
$$ 228595 232244 179417 249656 264188 -28819 -389031 -375349 -98877 -57504 -268049 -247369
34234b47369L50314J96410j99056k45097k0015J5045q5247K6962K17383J40052
$$ -247369 102945 299355 100299 -144798 -164813 -149768 -235015 -208053 9330 149382
34224A49382k8390O5571J86428o8645l84657j76380L11079L08289j95142m31137
$$ 149382 120992 186563 372991 304346 -80311 -256691 54388 362677 167535 -263602
34214b63602j05451K44131K25101Q9593J01420J31342O9521M3758P7998K8291
$$ -263602 -369053 -124922 100179 189772 291192 422534 492055 535813 613811 642102
34204F42102p8621q8237o2284j34217j47391P5067K82149J59594p1693k0887J44716
$$ 642102 563481 475244 412960 278743 131352 206419 488568 648162 576469 555582 700298
34193G00298J0691k67689k05144J23562K04625k0344j46448r0553j12449j50965
$$ 700298 710989 443300 238156 361718 566343 545999 399551 308998 196549 45584
34183D5584N8620K88593Q4323l23965k60547K34796M00058M64l25264j56733J29724
$$ 45584 104204 392797 477120 153155 -107392 127404 527462 527926 202662 45929 175653
34172A75653J33979O677l7768r7192j96947j37014N7158R7223j2466L5558K18693
$$ 175653 309632 316309 278541 181349 -15598 -152612 -95454 1769 -10697 24861 243554
34161B43554J77303p3035j02303J46360K23787k5511k17945j47636p2703j14776
$$ 243554 420857 347822 245519 391879 615666 590155 372210 224574 151871 37095
34151C7095m2997J58692J64743o0208j34110N7638J65798K7022r7566p0034n6355
$$ 37095 -5902 152790 317533 257325 123215 180853 346651 373673 276107 206073 149718
34140A49718o1992Q5118K27741L6686k79761j74408K64956L57305l4590k69576
$$ 149718 87726 172844 400585 437271 157510 -16898 248058 605363 570773 301197
34130C01197l2863J90752L6779j70650j21408m2577j51599k45429j58672l4131
$$ 301197 268334 459086 495865 325215 203807 161230 9631 -235798 -394470 -428601
34120d28601Q6566L22047M63014J36323m11462m79030j4512K78064J09146k0445
$$ -428601 -342035 -19988 443026 579349 167887 -311143 -325655 -47591 61555 41110
34110D1110J54908K14877m4611j90482k0073M6254j59018j74252J65598L18319
$$ 41110 196018 410895 366284 175802 155729 201983 42965 -131287 34311 352630
34100C52630J2622k33825n5718J54436O6056j9551R1788M9161k37409k50003J38841
$$ 352630 365252 131427 75709 230145 296201 276650 368438 417599 180190 -69813 69028
34089F9028K47251k33028n69354j92394L33251L02214p134p805J59018Q8539n9932
$$ 69028 316279 83251 -486103 -678497 -345246 -43032 -50166 -57971 101047 189586 129654
34078A29654N455O3463j03533j62045J10442K59596n1756l41998j22882K39031
$$ 129654 135109 198572 95039 -67006 43436 303032 251276 -90722 -213604 25427
34068B5427K10988N014M2335J20184j07756l71776k59707M7126J76607J89659
$$ 25427 236415 241429 283764 403948 296192 -75584 -335291 -288165 -111558 78101
34058G8101K12488L8298l26059l74208N1965L41257J30145o0441J52797K49100
$$ 78101 290589 328887 2828 -371380 -319415 21842 151987 91546 244343 493443
34048D93443j73633n15674k05584K41337J49778j43893m9071J38185p9827l13106
$$ 493443 319810 -195864 -401448 -160111 -10333 -154226 -203297 -65112 -144939 -458045
34038d58045m928M16076K48987k00952j94934J24493J20685j24617r8114R4908
$$ -458045 -462973 -46897 202090 1138 -193796 -69303 51382 -73235 -171349 -76441
34028g6441M1124n9185J77684M20004J80969j94721j32615Q9030q4699l58521
$$ -76441 -35317 -94502 83182 503186 684155 489434 356819 445849 361150 2629
34018B629j53712K17051J11593j92334k1281L67406K36400k35044k71624Q9000
$$ 2629 -151083 65968 177561 -14773 -36054 331352 567752 332708 61084 150084
34008A50084J54987j01697r7476J92325K60939Q4052M3593O7979j33676k80005
$$ 150084 305071 203374 105898 298223 559162 643214 686807 754786 621110 341105
33998C41105J7313L56849J61926k20761j24916J92971P5350k49471j42229J48996
$$ 341105 358418 715267 877193 656432 531516 724487 799837 550366 408137 557133
33988E57133k6595l75471j65505L16558K30730k38788k24684J96238J95357k16418
$$ 557133 530538 155067 -10438 306120 536850 298062 73378 269616 464973 248555
33978B48555k68773O6495J07414j46270p8268K23709J20957k47769j90516J55356
$$ 248555 -20218 46277 153691 7421 -70847 152862 273819 26050 -164466 -9110
33968i110P8520k68387j43521K81361K01342k40141k02953K11955J78741j88824
$$ -9110 69410 -198977 -342498 -61137 140205 -99936 -302889 -90934 87807 -101017
33958a01017o0639L86478K18637l89704l54691K85280L95641j50682k89725J77639
$$ -101017 -161656 224822 443459 53755 -300936 -15656 379985 229303 -60422 117217
33948A17217K62179k37281l35867K07858M09404o7385l19830M4553K53829n9464
$$ 117217 379396 142115 -193752 14106 423510 356125 36295 80848 334677 275213
33938B75213k36459J6800J41742o951R3793L68538J55223l49926k70200K32753
$$ 275213 38754 55554 197296 190345 284138 652676 807899 457973 187773 420526
33928D20526J46516m21357l39140L78425N01221j27425l18426J82408K91326j98451
$$ 420526 567042 145685 -193455 184970 686191 558766 240340 422748 714074 515623
33918E15623k12683L70425L49972m19369n85449J57769M28217k31494m72334K85286
$$ 515623 302940 673365 1023337 603968 18519 176288 604505 373011 -99323 185963
33908A85963P47686J90881k73525Q1292L14516j67845m43757O503K71563r4233
$$ 185963 933649 1124530 851005 932297 1246813 1078968 635211 641714 913277 819044
33898H19044j96728K52976K41858m18494m95352K59900M50826l16564n88635J64022
$$ 819044 622316 875292 1117150 698656 203304 463204 914030 597466 8831 172853
33888A72853N05904j63652m33176L16280O48589r7821m75356K07165M91717l05638
$$ 172853 678757 515105 81929 398209 1046798 948977 473621 680786 1172503 866865
33878H66865o49875J91667O18423j73168n38040L81451Q46747j49549q59871j08414
$$ 866865 216990 408657 1027080 853912 315872 697323 1544070 1394521 534650 426236
33868D26236M99073j84628n94296L20011Q57076q2792o96642K16850Q19077j48191
$$ 426236 925309 740681 146385 466396 1323472 1240680 544038 760888 1579965 1431774
33858A431774p87906K10638Q60120k27622r55588J88430J017985j24846r91932
$$ 1431774 643868 854506 1714626 1487004 531416 719846 1737831 1612985 621053
33849F21053K12196J175735m6273j095962J05977J155645j17790j177149L03516
$$ 621053 833249 2008984 1962711 866749 972726 2128371 2010581 833432 1136948
33840A136948J618615J75898j239936K10648J687878J55550j407268L04161K155178
$$ 1136948 2755563 2931461 1691525 1902173 3590051 3745601 2338333 2642494 4797672
33831D797672M80357j507702J94851K322097O38869j350809R02702L492273J342759
$$ 4797672 5278029 3770327 3965178 6287275 6926144 5575335 6478037 9970310 11313069
33822A1313069j169840J803508N472964L111943M4730M117165R363760O718302
$$ 11313069 10143229 11946737 17419701 20531644 20576374 24693539 34057299 40775601
33814D0775601L606199J1472644K1205329J8734160J9907790N2249222R6605999
$$ 40775601 44381800 55854444 77059773 95793933 115701723 167950945 264556944
33807B64556944R0180264J0504450p9552300j03710552o3671179k2220201j4491395
$$ 264556944 354737208 365241658 285689358 181978806 118307627 96087426 81596031
33800H1596031j9543615j3351670m239624n712520r942153n918237P545j491161
$$ 81596031 62052416 48700746 44461122 38748602 28806449 22888212 22895757 21404596
33792B1404596n184203k911775J036387m82783l743588k219740R85132k9372k610822
$$ 21404596 16220393 13308618 14345005 13862222 10118634 7898894 8884026 8854654 6243832
33783F243832j385725J313878M66735j975379j349637P99945L30162j381816o44753
$$ 6243832 4858107 6171985 6638720 4663341 3313704 4113649 4443811 3061995 2417242
33774B417242J119144L89247j464073r75283P36897M34984r44936m84197Q60342
$$ 2417242 3536386 3925633 2461560 1486277 2223174 2658158 1713222 1229025 2089367
33765B089367L36651j055745n83981Q39776N32417p33459m09316P95113M26233
$$ 2089367 2426018 1370273 786292 1626068 2158485 1425026 1015710 1810823 2237056
33756B237056q59635o53514N14890L51916p06033n01825N74844M71737m92863
$$ 2237056 1377421 723907 1238797 1590713 884680 382855 957699 1429436 936573
33747I36573m24080L75335J89607n76114k77130N61097K44397o65826l88581N75318
$$ 936573 512493 887828 1077435 501321 224191 785288 1029685 363859 -24722 550596
33737E50596L91938n63624m88373L62473K99921m47634k87455N05036L25144n68549
$$ 550596 942534 378910 -109463 253010 552931 105297 -182158 322878 648022 79473
33727G9473n30991L06875L84956k47730k00493L93960J92224n70231m49407L84406
$$ 79473 -451518 -144643 240313 -7417 -207910 186050 378274 -191957 -641364 -256958
33717b56958M58642j88121k06747L67951K92010l20927k43275L47074K01875m35961
$$ -256958 201684 13563 -193184 174767 466777 145850 -97425 249649 451524 15563
33707A5563k29900N61340M47811m45129n62139J79627L40647k36321k38139M39646
$$ 15563 -214337 347003 794814 349685 -212454 -32827 307820 71499 -166640 273006
33697B73006M57609l43539o26716j10069K8817m24864l26736M56140O52044j5286
$$ 273006 730615 387076 -239640 -349709 -320892 -745756 -1072492 -616352 35692 20406
33687B0406l10103J80046L93860m9751j99110K19877K30566m03842o18449m8697
$$ 20406 -289697 -109651 284209 234458 35348 255225 485791 81949 -536500 -585197
33677e85197L12506J3903j40750J88429K48714j81404k87247J42952K62906j67224
$$ -585197 -272691 -258788 -399538 -211109 37605 -143799 -431046 -288094 -25188 -192412
33667a92412l19104O3296K11419p7240n6971L74642L80780j43381k95415P7012
$$ -192412 -511516 -448220 -236801 -314041 -371012 3630 384410 241029 -54386 22626
33657B2626P5815m22551m31298K33602N14935O8362j56200J95779K43586k97668
$$ 22626 98441 -324110 -755408 -521806 -6871 61491 -94709 101070 344656 46988
33647D6988m76740M8805L20997p9882k82441Q6969J65656l33519l99438L26155
$$ 46988 -429752 -380947 -59950 -139832 -422273 -335304 -169648 -503167 -902605 -576450
33637e76450O85919N9773m79539j07919L59653J40553j02911K66750N34420N5707
$$ -576450 109469 169242 -310297 -418216 -58563 81990 -20921 245829 780249 835956
33627H35956m18039j34189K59402j0072m06837k09801J01122j35148m37349j39329
$$ 835956 417917 283728 543130 533058 126221 -83580 17542 -117606 -554955 -694284
33617f94284L21918K75398L2175J09397J82027j10692k74483O0296K54714j73993
$$ -694284 -372366 -96968 -64793 44604 226631 115939 -158544 -98248 156466 -17527
33607a7527n15700j01239M43177L26033l0217O1509K15276j45110m99730j59761
$$ -17527 -533227 -634466 -191289 134744 104527 166036 381312 236202 -263528 -423289
33597d23289L60073K32642j94417j36454J45797k8720l34279m9829M72762L63921
$$ -423289 -63216 169426 -24991 -161445 -15648 -44368 -378647 -428476 44286 408207
33587D08207j96625l32920j6794N6861j67416j30412J81630K65708R7772N1593
$$ 408207 211582 -121338 -138132 -81271 -248687 -379099 -197469 68239 166011 217604
33577B17604N8058j62243l18481l16L98945K21640k88172l71437k6081J24596
$$ 217604 275662 113419 -205062 -205378 193567 415207 127035 -244402 -270483 -145887
33567a45887j7399k2155J22661M8246j67990j22641J17076J69962R2162J73551
$$ -145887 -163286 -185441 -62780 -14534 -182524 -305165 -188089 -18127 74035 247586
33557B47586K48226J8820k34790j03238J31535j0392k57156o4128L06399J92610
$$ 247586 495812 514632 279842 176604 308139 297747 40591 -23537 282862 475472
33547D75472k60370l35877J4885J86184K2827p2724k3079j15336k54301r2625
$$ 475472 215102 -120775 -105890 80294 103121 30397 7318 -108018 -362319 -454944
33537d54944J86316J04386k00362j81955J14458J60198o2489q7784J00901Q5075
$$ -454944 -268628 -164242 -364604 -546559 -432101 -271903 -334392 -422176 -321275 -236200
33527b36200j02598k1787K78159L05275N4799K493J69793Q8541k63655l69897
$$ -236200 -338798 -360585 -82426 222849 277648 280141 449934 538475 274820 -95077
33517i5077r8469J01279K0967n4481P801J8161j3787J12222K49044O9445k55804
$$ -95077 -193546 -92267 -71300 -125781 -117980 -99819 -113606 -1384 247660 317105 61301
33506F1301k52347L9461J57097L9595J3136O3724q4613k74662j24410J77991J42522
$$ 61301 -191046 -151585 5512 45107 58243 121967 37354 -237308 -361718 -183727 -41205
33495d1205q3177L8643L65422K58398k16208l36304n747J06215j77852k56577
$$ -41205 -124382 -85739 279683 538081 321873 -14431 -20178 86037 -91815 -348392
33485c48392O5616K01390r6156k71661j4769K00580N0668p3479J04721K01106
$$ -348392 -282776 -81386 -177542 -449203 -463972 -263392 -212724 -286203 -181482 19624
33475A9624n7371k80557j23186J36587J69809J11408J13875J5753j89489j83168
$$ 19624 -37747 -318304 -441490 -304903 -135094 -23686 90189 105942 -83547 -266715
33465b66715N7415J12229j12895j63517J11879K28664n1972k57730n1258J81479
$$ -266715 -209300 -97071 -209966 -373483 -261604 -32940 -84912 -342642 -393900 -212421
33455b12421O9684r3779L9065K32711J73039N6487J44607K26341L9596k08756
$$ -212421 -142737 -236516 -197451 35260 208299 264786 409393 635734 675330 466574
33445D66574k22255j19137j29109j58353m4803R6206J10649O6871L7955k9768
$$ 466574 244319 125182 -3927 -162280 -207083 -110877 -228 66643 104598 74830
33435G4830p6438L1146J28231p0722l60399k36892K08845L23631k3026k01473
$$ 74830 -1608 29538 157769 87047 -273352 -510244 -301399 22232 -794 -202267
33425b02267P3844K67490L2717j64482N9992K89536Q1337k40832j98118M1915
$$ -202267 -128423 139067 171784 7302 67294 356830 438167 197335 -783 41132
33415D1132Q3409j5700l9023p4276j70390o2674K76422L75671L2084k62265j46031
$$ 41132 124541 108841 69818 -4458 -174848 -237522 38900 414571 446655 184390 38359
33404C8359J8174r1399j12588K40864M83198J63860k67842k01645J05799P1175
$$ 38359 56533 -34866 -147454 93410 576608 740468 472626 270981 376780 447955
33394D47955j69994j27488Q0163J1566k08475j48663P7805M6313j58528j44060
$$ 447955 277961 150473 230636 242202 33727 -114936 -37131 9182 -149346 -293406
33384b93406J9080o173j03606N1104K62795J15868k02340j61885J82408K90015
$$ -293406 -274326 -280499 -384105 -333001 -70206 45662 -156678 -318563 -136155 153860
33374A53860N0764j23607m3049R1437J78068K62212K11405p7579l07951j83269
$$ 153860 204624 81017 37968 129405 307473 569685 781090 703511 395560 212291
33364B12291M4849Q018j00409O4085K44186J3526l32797j88299K72802L27586
$$ 212291 257140 265158 164749 228834 473020 486546 153749 -34550 238252 565838
33354E65838q3532l01065q5973R1811k0049r6251M5644J25979j2486j53143j79612
$$ 565838 482306 181241 95268 187079 167030 70779 116423 242402 229916 76773 -102839
33343a02839k13402k07863J0285K69604K20132l8038j01756J5606k5756j60152
$$ -102839 -316241 -524104 -513819 -244215 -24083 -62121 -163877 -148271 -174027 -334179
33333c34179j9795K72115K14238j48034k34968N8707K04250J0801r0028Q2576
$$ -334179 -353974 -81859 132379 -15655 -250623 -191916 12334 23135 -66893 15683
33323A5683J37842q4758j92398p060R9080o2921j59441l1562m039j76849j42490
$$ 15683 153525 68767 -123631 -130691 -31611 -94532 -253973 -285535 -289574 -466423 -608913
33312f08913K23461M08431J11878k27101j80899K9388Q2050J10269K50696K43468
$$ -608913 -385452 22979 134857 -92244 -273143 -243755 -161705 -51436 199260 442728
33302D42728l3823k02300l3071R9394r3746k47119q566K78130J72642p2875Q750
$$ 442728 408905 206605 173534 272928 179182 -67937 -76503 201627 374269 301394 310144
33291C10144K42226J33466k41006l59521j01248J48870J46148J3721j08258j93717
$$ 310144 552370 685836 444830 85309 -15939 132931 279079 292800 184542 -9175
33281i175j66645J6981J79770J21706p3588j80467j50884o8317M6669J60351J43661
$$ -9175 -175820 -158839 20931 142637 69049 -111418 -262302 -330619 -283950 -123599 20062
33270B0062j4591j06860j4119J04909J06153Q0040R8059L5667j46074k42359j39595
$$ 20062 5471 -101389 -115508 -10599 95554 175594 273653 309320 163246 -79113 -218708
33259b18708p531L1749Q5289J53891K4025k65650k92661R7591M35987K96805p4133
$$ -218708 -226239 -194490 -109201 44690 68715 -196935 -489596 -392005 43982 340787 266654
33248B66654k01099q0097j503K230O5910J07921r948j39615o9714Q7820R3378
$$ 266654 65555 -14542 -16045 -13815 52095 160016 150068 10453 -59261 28559 121937
33237A21937k1710p7135o6693n9996j335J10621R0693j09900k28255j11158R214
$$ 121937 100227 23092 -43601 -103597 -104932 5689 96382 -13518 -241773 -352931 -343717
33226c43717n0834q6282O8339J68404J4884j14684N5257K66194J72057l6228M97
$$ -343717 -394551 -480833 -412494 -244090 -229206 -343890 -288633 -22439 149618 113390 113887
33215A13887J36213J0532k45128k15804O0399J74374N1441k865J04647J52639
$$ 113887 250100 260632 15504 -200300 -139901 34473 85914 83049 187696 340335
33205C40335O4696m898j8779p4196j28188q3330m6267j30395j55641N1861K44300
$$ 340335 405031 400133 381354 307158 178970 95640 49373 -81022 -236663 -184802 59498
33194E9498R5563k08083k20680M5877J70144J1008j47460j08172K8720J42124
$$ 59498 155061 -53022 -273702 -227825 -57681 -46673 -194133 -302305 -273585 -131461
33184a31461J86059P1488j83454k95164p3260K16269K28524P6287N9677R7982
$$ -131461 54598 126086 -57368 -352532 -425792 -209523 19001 95288 154965 252947
33174B52947n6390k53147j65921Q6114J24642j7849j2429J09891M8200j20006
$$ 252947 196557 -56590 -222511 -136397 -11755 -29604 -42033 67858 116058 -3948
33164c948m3999J98907J85857p4402j35022P6469J32311j05585k47735r5870L4208
$$ -3948 -47947 150960 336817 262415 127393 203862 336173 230588 -17147 -113017 -78809
33153g8809p9166k03287j27099P417N8558J09909J70998R8319m7595j7701J41366
$$ -78809 -157975 -361262 -488361 -480944 -422386 -312477 -141479 -43160 -90755 -108456 32910
33142C2910R6660j66136k52776j6189K03119J58970L5187K3718L4618J450K5382
$$ 32910 129570 -36566 -289342 -305531 -102412 56558 91745 115463 150081 151531 176913
33131A76913N7939j02873l54191l09157N9193K88120J33339p9818l6920J01476
$$ 176913 234852 131979 -222212 -531369 -472176 -184056 -50717 -130535 -167455 -65979
33121f5979P2962o3758j35891j35785q7549L8692J35681K5211j84007j79515L8207
$$ -65979 6983 -56775 -192666 -328451 -416000 -377308 -241627 -216416 -400423 -579938 -541731
33110e41731J33405l454j15557o8597j2740Q018J16259K13359N7539k13812k03254
$$ -541731 -408326 -411780 -527337 -595934 -608674 -600656 -484397 -271038 -213499 -427311 -630565
33099f30565N0120J09954n5969n493L22629M25353J18094j38541o3825J9751j03078
$$ -630565 -580445 -470491 -526460 -531953 -209324 216029 334123 195582 131757 151508 48430
33088D8430j34630P4173J68106j7694j03423R1890J61429r8179k33653L0316K28210
$$ 48430 -86200 -12027 156079 138385 34962 126852 288281 190102 -43551 -13235 214975
33077B14975j1621k72553j15170J31088K4826j59901J85K39189J04135j78936
$$ 214975 203354 -69199 -184369 -53281 -28455 -188356 -188171 51018 155153 -23783
33067b3783j22149J41144J55985j6272n804J19372L9296j41150r1884R0857Q0663
$$ -23783 -145932 -4788 151197 134925 129121 248493 287789 146639 54755 145612 226275
33056B26275n0199j5088R8704L0308r3134L603J61737M3554k33377k96841j60088
$$ 226275 176076 160988 259692 290000 196866 200469 362206 405760 172383 -124458 -284546
33045b84546j03356j14261O322J73301J75151J01729J28866J22352o0142j71199
$$ -284546 -387902 -502163 -495841 -322540 -147389 -45660 83206 205558 145416 -25783
33035b5783O129J70276o266k41376j17779J43196O1791k35648k49532J7596J33135
$$ -25783 -19654 150622 144356 -97020 -214799 -71603 -9812 -245460 -494992 -477396 -344261
33024c44261J8729k1830O5090O0691k5448j3352K0291q5883j58112K4612K42653
$$ -344261 -325532 -347362 -282272 -221581 -247029 -260381 -240090 -325973 -484085 -459473 -216820
33013b16820J79185l675J0923R1483k9002j63810l0467J46133O0088k1608K31678
$$ -216820 -37635 -41310 -30387 61096 32094 -131716 -162183 -16050 44038 22430 254108
33002B54108M46721J22600l90233m00386n0300n948k36415j54114J96256J90037
$$ 254108 700829 823429 433196 32810 -17490 -23438 -259853 -413967 -217711 -27674
32992b7674j77828k32574J68744L93947J51005j08912q8808n8192j64138j54248
$$ -27674 -205502 -438076 -269332 124615 275620 166708 77900 19708 -144430 -298678
32982b98678P768J3168j31072m7530K59102L25190M7625j33393j3039J01679K3216
$$ -298678 -290910 -277742 -408814 -456344 -197242 127948 175573 42180 29141 130820 154036
32971A54036o1817p2336j50023k43568j65137l4098p1124q4297J76227L69145
$$ 154036 92219 19883 -130140 -373708 -538845 -572943 -644067 -728364 -552137 -182992
32961a82992N5318l93273k85402J88080K44264j46925k79042O617J66075P1334
$$ -182992 -127674 -520947 -806349 -618269 -374005 -520930 -799972 -793355 -627280 -555946
32951e55946J49548L61662J95196k29927k15304K20351K80858j90898m33500j39192
$$ -555946 -406398 -44736 150460 -79467 -294771 -74420 206438 15540 -417960 -557152
32941e57152R4789k5094k5017K49450K59272j25288k77029L6167K44641Q9071
$$ -557152 -462363 -487457 -512474 -263024 -3752 -129040 -406069 -369902 -125261 -36190
32931c6190L3392K14768J25912k84553l65207P18J10473k12203k43923K24455
$$ -36190 -2798 211970 337882 53329 -311878 -311160 -200687 -412890 -656813 -432358
32921d32358M10415K55k33785J21195L64352L8678k38657j9425J47708j24501
$$ -432358 -21943 -21688 -255473 -134278 230074 268752 30095 10670 158378 33877
32911C3877k87837P221J93853n8120j70176J42243K36413j54960k86297J60192
$$ 33877 -253960 -246739 -52886 -111006 -281182 -138939 97474 -57486 -343783 -183591
32901a83591L49272j45599m46983K2641M43619J36262j96774J13257M03998R060
$$ -183591 165681 20082 -426901 -404260 39359 175621 -21153 92104 496102 505162
32891E05162m17615j63308J95960j6671k57074P2458L36002r7122m86972q968
$$ 505162 87547 -75761 120199 103528 -153546 -81088 254914 157792 -329180 -338148
32881c38148O77801N68352O096j44994l7994j98730l17093o153J96806j49391
$$ -338148 339653 908005 914101 769107 731113 532383 215290 209137 405943 256552
32871B56552l84067K3482L51479l2995m18793j17584K02300j05971l19730J87985
$$ 256552 -127515 -104033 247446 214451 -204342 -321926 -119626 -225597 -545327 -357342
32861c57342N55540M0414m36419J6401N17905J03012l76814Q4077O10377Q9601
$$ -357342 198198 238612 -197807 -181406 336499 439511 62697 146774 757151 846752
32851H46752o22097k52819N23623M27930p0563J31199O61201P47075Q89570J375542
$$ 846752 224655 -28164 495459 923389 852826 984025 1645226 2392301 3281871 4657413
32841D657413Q83528j114093k468082j461600J55096N7178p86668l07670O68133
$$ 4657413 5540941 4426848 1958766 497166 652262 709440 -77228 -384898 283235
32832B83235K16353p53508k31913Q57601L77731p70631l04403R23593M57273r56109
$$ 283235 499588 -253920 -485833 371768 749499 -21132 -325535 598058 1055331 99222
32822I9222o81549P56774O92122n46173m08809P53705M09571r77340p05183P79912
$$ 99222 -582327 174447 866569 320396 -88413 665292 1074863 97523 -607660 172252
32812A72252O23745q02072n83776Q77095N64609r95320n20350J387004J042775
$$ 172252 795997 -6075 -589851 287244 851853 -143467 -663817 723187 1765962
32803A765962j031647p61783J509347J386200r51092p81945J848269J829287r25465
$$ 1765962 734315 -27468 1481879 2868079 1916987 1135042 2983311 4812598 3887133
32794C887133q08604K457654K713333m75598k01507M133680M580606M33958J487396
$$ 3887133 3078529 5536183 8249516 7773918 7572411 11706091 16286697 16720655 18208051
32785A8208051R099442J1079016N776412J2132679L7964757N5059658L1328882
$$ 18208051 27307493 38386509 44162921 56295600 94260357 149320015 180648897
32778A80648897k0720440n4437750m6608523j9927926n517254p131888j0655512
$$ 180648897 159928457 105490707 58882184 38954258 33437004 26305116 15649604
32771A5649604q337271j107482Q744276J5363087J0452174l818499j2730714q192671
$$ 15649604 7312333 6204851 14949127 30312214 40764388 36945889 24215175 16022504
32763A6022504o4510M7224m248333l541740O57798P55850k394971k218693Q64466
$$ 16022504 15957994 16005218 11756885 8215145 8872943 9628793 7233822 5015129 5879595
32754E879595J027261j607745j792855O04989Q86007j203578j389545O58601R86690
$$ 5879595 6906856 5299111 3506256 4111245 4997252 3793674 2404129 3062730 4049420
32745D049420q58717j274512K75472O09202o67640o20374Q93401Q52929q79091
$$ 4049420 3190703 1916191 2191663 2800865 2133225 1512851 2406252 3259181 2380090
32736B380090j139903M76366Q96168n37096r84794L31551Q08739l79336q41209
$$ 2380090 1240187 1716553 2612721 2075625 1090831 1422382 2231121 1851785 1010576
32727A010576K43210O52045l91343p58904L12354P46661k77187p83617J17832
$$ 1010576 1253786 1905831 1514488 755584 1067938 1814599 1537412 753795 871627
32718H71627O22168j52112n59948J95373N37361k68946o67222P1824M35716k87958
$$ 871627 1493795 1341683 781735 977108 1514469 1245523 578301 650125 1085841 797883
32708G97883o05151J99864O23346j32853o24457M1413N75192Q0919l11115J98545
$$ 797883 192732 392596 1015942 883089 258632 300045 875237 956156 645041 843586
32698H43586N35898l2510m60792m9901K08463k91606n11988J45778N94396J30851
$$ 843586 1379484 1346974 886182 836281 1044744 753138 241150 386928 981324 1112175
32688A112175k75610O0405K95746j00399k52501K66403M65261r8131l67687J35896
$$ 1112175 836565 896970 1192716 1092317 839816 1106219 1571480 1473349 1105662 1241558
32678A241558L23592l00420n74080P2087M13480k60060p31120j19954M80210R9971
$$ 1241558 1565150 1264730 690650 762737 1176217 916157 185037 65083 545293 645264
32668F45264l44693N7818M46063n2697n51933r2726N15832K42537k76342p4447
$$ 645264 300571 358389 804452 751755 199822 107096 622928 865465 589123 514676
32658E14676L19225N3530l59003j53624J39065j59547m06492J02483N98792J77412
$$ 514676 833901 887431 528428 374804 513869 354322 -52170 50313 649105 826517
32648H26517m66329k66717L05360K13234k34066r9145L88141L58529q1805k46506
$$ 826517 360188 93471 398831 612065 377999 278854 666995 1025524 943719 697213
32638F97213k09779l81399m30108N2368N06954K87481j35272n9612J51141j06323
$$ 697213 487434 106035 -324073 -271705 235249 522730 387458 327846 478987 372664
32628C72664l93594q0060L40145J26961k86034j14685K83725J33953k53383j20419
$$ 372664 -20930 -100990 239155 366116 80082 -34603 249122 383075 129692 9273
32618I273K52794J32450k02832j6841M04535K59845k52568l19811P453O4913j06934
$$ 9273 262067 394517 191685 174844 579379 839224 586656 266845 274298 339211 232277
32607B32277m073J87657k7716l26734r4382L30722K19177j70459r1864K37920
$$ 232277 228204 415861 388145 61411 -32971 297751 516928 346469 254605 492525
32597D92525O8368l81803k85678K17781K56939j66268k36247J29364J99181j41503
$$ 492525 560893 179090 -106588 111193 368132 201864 -34383 94981 294162 152659
32587A52659k31500O2881J57668p3411j28894N6186J9169k12405j27710K05591
$$ 152659 -78841 -15960 141708 68297 -60597 -4411 14758 -197647 -325357 -119766
32577a19766J86787j73298k42183O1161J70538l771M2873L21746K54069j90305
$$ -119766 67021 -106277 -348460 -287299 -116761 -120532 -77659 244087 498156 307851
32567C07851l34581J7044K49449L7872j70225m3848J25601P8428j6347l7700j00309
$$ 307851 -26730 -9686 239763 277635 107410 63562 189163 267591 251244 213544 113235
32556A13235j37720L7383K19116M5359k78183k32630R4829J49521r1274j17626
$$ 113235 -24485 12898 232014 277373 -810 -233440 -138611 10910 -80364 -197990
32546a97990J38807K18397L7630j1091R8199j7005k83338j82052K57911L78957
$$ -197990 -59183 159214 196844 185753 283952 266947 -16391 -198443 59468 438425
32536D38425k0484l67216k66875J4125J85747K90288K81017k133l15024k09662
$$ 438425 417941 50725 -216150 -202025 -16278 274010 555027 552894 237870 28208
32526B8208J65703K26377m7310r5940J74567K29754p9421k43424m2864R5539o1229
$$ 28208 193911 420288 372978 277038 451605 681359 601938 358514 315650 411189 349960
32515C49960j77882p6645n1455j91021j44512J66814L23490J47066k3830r963
$$ 349960 172078 95433 43978 -147043 -291555 -124741 198749 345815 321985 312022
32505C12022m8381j84712j27949R9616R9039j35309j35349J63570K49699m3064
$$ 312022 263641 78929 -49020 50596 149635 14326 -121023 42547 292246 249182
32495B49182k37117q8581L0045r4847j44366K6383P7827r8281j10282J56970K52611
$$ 249182 12065 -76516 -46471 -141318 -285684 -259301 -181474 -279755 -390037 -233067 19544
32484A9544o088j61120N3008K40523J02750n2172L0214P4154j15941k30391o4851
$$ 19544 13456 -147664 -94656 145867 248617 196445 226659 300813 184872 -45519 -110370
32473a10370P6830l515j3027K02199K79096Q649k34348j53906k1943r2601j32734
$$ -110370 -33540 -37055 -50082 152117 431213 439862 205514 51608 29665 -62936 -195670
32462a95670M1270J53459K2197n4705J13916K17979M8663q6669L2262J06207q5973
$$ -195670 -154400 -941 21256 -33449 80467 298446 347109 260440 292702 398909 312936
32451C12936k37937j00838M9768l3446j10205K5832J24864J575q3045L3527P0794
$$ 312936 74999 -25839 23929 -9517 -119722 -93890 30974 32549 -50496 -16969 53825
32440E3825r4398j01710J98183L67476J47593o2003L3861P8629j92675l68106
$$ 53825 -40573 -142283 55900 423376 570969 508966 542827 621456 428781 60675
32430F0675j12925J71632P8822p9481N2156J43236j37163l48792j6141M30569
$$ 60675 -52250 119382 198204 118723 170879 314115 176952 -171840 -187981 242588
32420B42588L14652j65554l39125j68047q6150r9785P8407K91361J79415p8007
$$ 242588 557240 391686 52561 -115486 -201636 -301421 -223014 68347 247762 169755
32410A69755n6357J13113J3956k22716j56647R8495P1277j64147j10073K16459
$$ 169755 113398 226511 240467 17751 -138896 -40401 30876 -133271 -243344 -26885
32400b6885K83586k3703k35913j14556N6749P4643Q1850J35479O8939j12597j75991
$$ -26885 256701 232998 -2915 -117471 -60722 13921 95771 231250 300189 187592 11601
32389A1601p0570J6914K9160P0803J08412K1073j08917j18726p6478j17851j30645
$$ 11601 -58969 -42055 -12895 57908 166320 187393 78476 -40250 -116728 -234579 -365224
32378c65224K0152J48396M1892j09314k3642J53525J18933k2071K8943J85130
$$ -365224 -345072 -196676 -154784 -264098 -287740 -134215 -15282 -37353 -8410 176720
32368A76720J48076j9732l9746L0484n9048k09097j37005M9178J1196j94098k09317
$$ 176720 324796 305064 265318 295802 236754 27657 -109348 -60170 -48974 -243072 -452389
32357d52389j228J51630J92738K65089K68939J1430k96151k67624N255R5728m0568
$$ -452389 -453617 -301987 -109249 155840 424779 436209 140058 -127566 -122311 -26583 -67151
32346f7151p2624N1227O2080m7118j188J88073K05717Q603j18770q7249o4754
$$ -67151 -139775 -88548 -26468 -73586 -74774 113299 319016 327619 208849 121600 56846
32335E6846m6115J05783K39668R7109j45050j05157R8445K1058k78838k96609
$$ 56846 10731 116514 356182 453291 308241 203084 301529 322587 43749 -252860
32325b52860K0265J81273M3169K0378K41189K70804n6473k69090p6033J24582
$$ -252860 -232595 -51322 -8153 12225 253414 524218 467745 198655 122622 247204
32315B47204k8025k32399j04407J40290J08402p4835l1020J92862K24885j1983
$$ 247204 219179 -13220 -117627 22663 131065 56230 25210 218072 442957 430974
32305D30974k19436j93715l6020Q3853J24579J22122R2336J6500j02917j70456
$$ 430974 211538 17823 -18197 65656 190235 312357 404693 421193 318276 147820
32295A47820o3033J50922J96384m0901k92032k73793r9873l7619m9261N9147K05831
$$ 147820 84787 235709 432093 391192 99160 -174633 -274506 -312125 -361386 -302239 -96408
32284i6408J76077N9582R1234J74007M9501j57025r8784J47657J70186o0203j49487
$$ -96408 79669 139251 230485 404492 453993 296968 198184 345841 516027 455824 306337
32273C06337N135O4536r7679j89217r0255o6026j99836j77108J25022L49497K30414
$$ 306337 311472 376008 278329 89112 -1143 -67169 -267005 -444113 -319091 30406 260820
32262B60820k605n2432K6586P8510J20992J43086M330k50530l32399j46917N9776
$$ 260820 258215 205783 232369 310879 431871 574957 579287 328757 -3642 -150559 -90783
32251i0783J34500K04657K97977K10848p0524k48137j94664j31678j55068m8113
$$ -90783 43717 248374 546351 757199 686675 438538 243874 112196 -42872 -90985
32241i0985K25127L23094Q7897j48655j06364K2065j2804r1245l3317M3195k085
$$ -90985 134142 457236 545133 396478 290114 312179 299375 208130 174813 218008 215923
32230B15923l6327O1897J38064O1828k0873L185k3930j99826l13937j93636Q964
$$ 215923 179596 241493 379557 441385 420512 423697 399767 199941 -113996 -307632 -298668
32219b98668J12996J69941K07320P2549k13262l08981m7968K50931K44933K6569
$$ -298668 -185672 -15731 191589 264138 50876 -258105 -306073 -55142 189791 216360
32209B16360j33563j77539j42634J1969K06100J97663j9435j21066K1854J11520
$$ 216360 82797 -94742 -237376 -225407 -19307 178356 158921 37855 59709 171229
32199A71229m6515k04699j38538j5442J160O6084K38197K20011j01454l12007
$$ 171229 124714 -79985 -218523 -233965 -232805 -166721 71476 291487 190033 -121974
32189a21974j02082J95145J61026l8125m3212M1769n3082j67703j2392K26315
$$ -121974 -224056 -28911 132115 93990 50778 92547 39465 -128238 -140630 85685
32179H5685J84348j5483j880J46497O4836j80461j75991Q9693J68951j12994l94924
$$ 85685 270033 254550 252670 399167 464003 283542 107551 197244 366195 253201 -141723
32168a41723l43491o3294J51496J59478J4064r8171J3782K78274L45278N9695
$$ -141723 -485214 -548508 -397012 -237534 -223470 -321641 -307859 -29585 315693 375388
32158C75388k44895k06099L8713J25585M0984K4552Q3636L6443r5899j54225j76596
$$ 375388 130493 -75606 -36893 88692 129676 154228 237864 274307 178408 24183 -152413
32147a52413k72752k99842p6094K15407K66935J64460K13884L61809K79193l7648
$$ -152413 -425165 -725007 -801101 -585694 -318759 -154299 59585 421394 700587 662939
32137F62939k44811k20020j79236k03664j17727R1795J73045M3261m9200P0008
$$ 662939 418128 198108 18872 -184792 -302519 -210724 -37679 5582 -43618 26390
32127B6390K42767K46677P2274j53526l07069k86540q9711J11047J46049O9262
$$ 26390 269157 515834 588108 434582 127513 -159027 -248738 -137691 8358 77620
32117G7620L5291M8065L1161K5796Q3878R4794k6767j24071m2493P2700K7063
$$ 77620 112911 160976 192137 217933 301811 396605 369838 245767 203274 275974 303037
32106C03037n1814N3870K17064J60330m9128j17693l4423l2350j21092j00945
$$ 303037 251223 305093 522157 682487 633359 515666 481243 448893 327801 226856
32096B26856L806k9300j77033j85467l3557L9313j4934Q130J41789J75329N8619
$$ 226856 230662 201362 24329 -161138 -194695 -155382 -170316 -162186 -20397 154932 213551
32085B13551j5950J316o2559k21122k45781o9460P2793K1263r3536j10769l7214
$$ 213551 197601 198917 136358 -84764 -330545 -400005 -327212 -305949 -399485 -510254 -547468
32074e47468Q7114K52951L54180K54079K3482j21325j21971q7419m9260K5794
$$ -547468 -460354 -207403 146777 400856 424338 303013 181042 93623 44363 70157
32064G0157N3782l3541o6640J06659K52974N2299l22572l98595j38129K9388o3625
$$ 70157 123939 90398 23758 130417 383391 435690 113118 -285477 -423606 -394218 -457843
32053d57843j01222R2667K30407P1354j79505k27904j02684Q418N2404N9533L8554
$$ -457843 -559065 -466398 -235991 -164637 -344142 -572046 -674730 -666312 -613908 -554375 -515821
32042e15821M5915J34516J85370N3516j14855m0667K04652K54149K4003j63776
$$ -515821 -469906 -335390 -150020 -96504 -211359 -252026 -47374 206775 230778 67002
32032F7002j06792L5962J15663J92001K48905J27206j23438k21682j11859m6534
$$ 67002 -39790 -3828 111835 303836 552741 679947 556509 334827 222968 176434
32022A76434j02192n3619J35361J74576j4455j08370M1754J31644k3434j27802
$$ 176434 74242 20623 155984 330560 316105 207735 249489 381133 357699 229897
32012B29897L9919J78505j2823k70370j95065P7223J25404o9899j69509n6380
$$ 229897 269816 448321 435498 165128 -29937 47286 172690 102791 -66718 -123098
32002a23098O9066R0002Q4184P6307K252j00765j24188p9468n5731m0893L3537
$$ -123098 -54032 35970 120154 196461 198713 97948 -26240 -105708 -161439 -202332 -168795
31991a68795J33700J68262J25359M5999m6610j01132n2841L4074N574j18134j22423
$$ -168795 -35095 133167 258526 304525 257915 156783 103942 138016 143590 25456 -96967
31980i6967N1113J61946K6360j98484k57698j41427j5246L4867L6472M0168R9704
$$ -96967 -45854 116092 142452 -56032 -313730 -455157 -470403 -435536 -399064 -358896 -259192
31969b59192K12222K36899N4062j82885k00688k6929M5991m7351n0076J35160
$$ -259192 -46970 189929 243991 61106 -139582 -166511 -120520 -167871 -217947 -82787
31959h2787K59333J66774L7548J5805j8907j12262p1392J18463J24995j84409
$$ -82787 176546 343320 380868 396673 377766 265504 194112 312575 437570 253161
31949B53161m19358k39335J06919J97399P1494L4692J01783P1832m2759p8203
$$ 253161 -166197 -405532 -298613 -101214 -29720 4972 106755 178587 135828 57625
31939E7625n8601j04062j41774m5312Q5834J00389P9839J37534J32146p3810k68549
$$ 57625 -976 -105038 -246812 -292124 -206290 -105901 -26062 111472 243618 169808 -98741
31928i8741j86670K3656L3179j14672j08230P7520J67124Q1172K9311J00547J34612
$$ -98741 -285411 -261755 -228576 -343248 -451478 -373958 -206834 -125662 -96351 4196 138808
31917A38808L7495r3269j85505k50253k19785j3332K29609K63412J01385p2O0063
$$ 138808 176303 83034 -102471 -352724 -572509 -585841 -356232 -92820 8565 8493 68556
31906F8556J14202N1074r979M4143J23820Q7626n1771j65863j73429j10202p1728
$$ 68556 182758 233832 223853 267996 391816 479442 427671 261808 88379 -21823 -93551
31895i3551r2987q5997L5676J74108J34668o0871j35837N9606L03623K86780O238
$$ -93551 -186538 -272535 -236859 -62751 71917 11046 -124791 -65185 238438 525218 531456
31884E31456k64579k96115q9015J57294K03066J4671j43291l4929J73766J43126
$$ 531456 266877 -29238 -118253 39041 242107 256778 113487 78558 252324 395450
31874C95450q5091j50916l725K0281j46263j22351K06366L55831N080m14516l65398
$$ 395450 310359 159443 155718 175999 29736 -92615 113751 469582 474662 60146 -305252
31863c05252j8632J03223m1612r7353J9134Q3117M2938M4329Q7038P5726Q5592
$$ -305252 -323884 -220661 -262273 -359626 -340492 -257375 -214437 -170108 -83070 -7344 78248
31852G8248K01309K55776R5196r3704q8565k6131j05985j79123o6333J7590j44184
$$ 78248 279557 535333 630529 536825 448260 422129 316144 137021 70688 88278 -55906
31841e5906k64892j2437L15806K20471j39149k10088J5717P3388q5681o4914J47808
$$ -55906 -320798 -333235 -17429 203042 63893 -146195 -130478 -57090 -142771 -207685 -59877
31830e9877J23382j70367k56305j6089Q6063j36365k33609P6256L99195L28653
$$ -59877 63505 -106862 -363167 -379256 -293193 -429558 -663167 -586911 -187716 140937
31820A40937O4102j8903M2412J4190j00077j73880k03135j83535l4040J66557
$$ 140937 205039 186136 228548 242738 142661 -31219 -234354 -417889 -451929 -285372
31810b85372J80892J0048n2710Q7442J56875k336j67622j47102p6243r2340p2632
$$ -285372 -104480 -94432 -147142 -59700 97175 94839 -72783 -219885 -296128 -388468 -461100
31799d61100P7514K02859J83520J45386J93751K21419J46573N7198j7067j74792
$$ -461100 -383586 -180727 2793 148179 341930 563349 709922 767120 750053 575261
31789E75261l63227l50959j04693J23564J85957J84452J60725K5570j28572p2331
$$ 575261 212034 -138925 -243618 -120054 65903 250355 411080 436650 308078 235747
31779B35747J08922O6056j99621k73347k9321J37949l852j54915o8606K9231o2158
$$ 235747 344669 410725 211104 -62243 -91564 46385 42533 -112382 -180988 -151757 -213915
31768b13915j14295N1215J52783n2369k78827j75351Q4573J31543J0400Q929J29233
$$ -213915 -328210 -276995 -124212 -176581 -455408 -630759 -546186 -414643 -404243 -395314 -266081
31757b66081J57814O5252k9109j05249j56059p2074J22413J79858K7170o0052
$$ -266081 -108267 -43015 -72124 -177373 -333432 -405506 -283093 -103235 -76065 -136117
31747a36117O0554J18704n3633j45204R2545L25447J46444k25774k84591j9662
$$ -136117 -75563 43141 -10492 -155696 -63151 262296 408740 182966 -101625 -121287
31737a21287J61998J11919L2786K4993k57m3608l7031m0733j04630r3461N3323
$$ -121287 40711 152630 185416 210409 210152 166544 129513 88780 -15850 -109311 -55988
31726e5988J15121l8309j50927k0013Q9651r2323k95053j41279J67244J85365
$$ -55988 59133 20824 -130103 -150116 -60465 -152788 -447841 -589120 -421876 -236511
31716b36511J889M5277K86184K99200L1470j41976r8873p9722j25130k9799J18092
$$ -236511 -234622 -189345 96839 396039 427509 285533 186660 106938 -18192 -47991 70101
31705G0101o183k90377k20880K51878N17235K17518k16589k51690K1594J91084
$$ 70101 63918 -226459 -447339 -195461 321774 539292 322703 71013 92607 283691
31695B83691J42983K4673r1082j71822j07475Q3184J42244p7552l43321l46030
$$ 283691 426674 451347 360265 188443 80968 164152 306396 228844 -114477 -460507
31685d60507j02565J37757K20069J42860m0991k04925j74514O2282K82742K90805
$$ -460507 -563072 -425315 -205246 -62386 -103377 -308302 -482816 -420534 -137792 153013
31675A53013J38793l039o3880o5781l3172o074l1943p1908k6451R4794J54317
$$ 153013 291806 288767 224887 159106 125934 119860 87917 16009 -10442 84352 238669
31664B38669Q6314j4974n5789o1814q1831r2089n8183l356K9101K1358j4856k8919
$$ 238669 324983 310009 254220 192406 110575 18486 -39697 -43053 -13952 7406 -7450 -36369
31652c6369K9971J03271M4923j49235k56293j19076R9099J40650K2144m1988J0195
$$ -36369 -6398 96873 141796 -7439 -263732 -382808 -283709 -143059 -120915 -162903 -152708
31641a52708N6260M4949M2131N9011N1334M6470P3764M5228q5761j57511l7331
$$ -152708 -96448 -51499 -9368 49643 100977 147447 221211 266439 180678 23167 -14164
31630a4164J01085L1435j19878p2548J03017Q4676j39087k35864q4892N6815K4620
$$ -14164 86921 118356 -1522 -74070 28947 113623 -25464 -261328 -346220 -289405 -264785
31619b64785j8784N8044J30084R9517P4766J10903P7128n9747j12324J706Q7801
$$ -264785 -283569 -225525 -95441 4076 78842 189745 266873 207126 94802 96508 184309
31608A84309J783j10277p9087K0898N4620N6125R0150Q2580k6594j29985j17491
$$ 184309 186092 75815 -3272 17626 72246 128371 218521 301101 274507 144522 27031
31597B7031m3715K265L3554N1700k4016j79517k34169r2925Q5272J11782J6850
$$ 27031 -16684 -14419 19135 70835 46819 -132698 -366867 -459792 -374520 -262738 -245888
31586b45888n6895o7878m9955k676O2308P2904O660m7692k7438N471j8272n5712
$$ -245888 -302783 -370661 -420616 -423292 -360984 -288080 -281420 -329112 -356550 -351079 -369351 -425063
31574d25063k1518R5589K23473K52826J14485j02455j78215m1520P8264k9371
$$ -425063 -446581 -350992 -127519 125307 239792 137337 -40878 -82398 -4134 -33505
31564c3505j99607j26907J33348K34387P5650r3143j17796j06475r5163N1127
$$ -33505 -233112 -360019 -226671 7716 83366 -9777 -127573 -234048 -329211 -278084
31554b78084K85308L19038Q3212j15448q0093m697o4734j02975J1397P1397r1051
$$ -278084 7224 326262 409474 294026 213933 209236 144502 41527 52924 124321 33270
31543C3270k33586q5951J54954J26214r4017j20001J00683K18267N7019j32184
$$ 33270 -200316 -286267 -131313 -5099 -99116 -219117 -118434 99833 156852 24668
31533B4668r0049Q5922J42049L3879o6750l4805O4854Q8728N526o8081l5064L7724
$$ 24668 -65381 20541 162590 196469 129719 94914 159768 248496 254022 185941 150877 188601
31521A88601K3865o1309r3327m8636k2001l2588J0032J17532J75773J28000M2142
$$ 188601 212466 151157 57830 9194 -12807 -45395 -35363 82169 257942 385942 428084
31510D28084l4847j19223j68393j05823J1548M7588J6583M1980R2220J6345j51145
$$ 428084 393237 274014 105621 -202 11346 58934 75517 117497 209717 226062 74917
31499G4917k08418j27578o9970m4817R2707K68701K25038P026l0303J61029J78128
$$ 74917 -133501 -261079 -331049 -375866 -283159 -14458 210580 217606 187303 348332 526460
31488E26460j47178m06441k59344L5518J02101M4722J37023K65733J58653q8078
$$ 526460 379282 -27159 -286503 -250985 -148884 -104162 32861 298594 457247 369169
31478C69169j67723o2532J4208L301k9286j14352k32263j67971J33727L19831
$$ 369169 201446 138914 153122 156423 127137 12785 -219478 -387449 -253722 66109
31468F6109J24700j52865j05885J16144J05172q3647q6347O4305J1199k26387
$$ 66109 190809 37944 -67941 48203 153375 69728 -16619 47686 58885 -167502
31458a67502k47935K5709K34453K15107J86833K14715N8822k84259m26303j94396
$$ -167502 -415437 -389728 -155275 59832 246665 461380 520202 235943 -190360 -384756
31448c84756P5254Q4986j0178J5723O7084L416m0607P6107J88846Q5277j40035
$$ -384756 -309502 -224516 -234694 -218971 -151887 -148471 -189078 -112971 75875 161152 21117
31437B1117k54110k19611j27734J1252J75825K12060N1854r8341l4036J11712
$$ 21117 -232993 -452604 -580338 -569086 -393261 -181201 -129347 -227688 -261724 -150012
31427a50012P0702j17372j54641L5651J64263N158k45190k18130J11496L68606
$$ -150012 -79310 -196682 -351323 -315672 -151409 -146251 -391441 -609571 -498075 -129469
31417a29469K71963j21q6361M5018J07802j4405j06148l2389J3501j20923k20914
$$ -129469 142494 142373 56012 101030 208832 194427 88279 55890 69391 -51532 -272446
31406b72446m6088K24753K40518K0067j14986n3167K5016K3075K8567N8395L9966
$$ -272446 -318534 -93781 146737 166804 51818 -1349 23667 46742 75309 133704 173670
31395A73670K9716J23703J85061J7683k21539j88949O7526J40079p5789k20566
$$ 173670 203386 327089 512150 529833 308294 119345 186871 326950 251161 30595
31385C0595r7745J5013j07253k40345j24962R4832J59696J11170J03916P6626
$$ 30595 -67150 -52137 -159390 -399735 -524697 -429865 -270169 -158999 -55083 21543
31375B1543n7309j24065N4043K87422K50396k8225k20950j72844k8995O3795J17315
$$ 21543 -35766 -159831 -105788 181634 432030 403805 182855 10011 -18984 44811 162126
31364A62126J64282J69948J04462k0232j64521k32124j20347R8668J74901k210
$$ 162126 326408 496356 600818 580586 416065 183941 63594 162262 337163 334953
31354C34953k12679j95617k865J28124J37358J43639J53291L1307k15434l51359
$$ 334953 122274 -73343 -76208 51916 189274 332913 486204 517511 302077 -49282
31344d9282k02766R5568K41415J00293j64428k87813j90618k9380M2013O4694
$$ -49282 -252048 -156480 84935 185228 20800 -267013 -457631 -487011 -444998 -380304
31334c80304J38087J92707Q9854r3678j19500M7215J72540J25027N6255R0922
$$ -380304 -242217 -49510 40344 -53334 -172834 -125619 46921 171948 228203 319125
31324C19125R6697n2014k09085j82626m3345K9916N1350J18533J44432o750k08649
$$ 319125 415822 363808 154723 -27903 -71248 -41332 10018 128551 272983 266233 57584
31313E7584k07266k8428N3552m2276r7944J1181J14411N7936l6427P91R5196O9791
$$ 57584 -149682 -178110 -124558 -166834 -264778 -253597 -139186 -81250 -117677 -116886 -21690 48101
31301D8101n1662r6826l4341k881n8083q1542J0668J26285J47339R8374N5184
$$ 48101 -3561 -100387 -134728 -137609 -195692 -277234 -266566 -140281 7058 105432 160616
31290A60616j2810j59067k78535j96686M9511K04626J34722M390P802Q4247O4159
$$ 160616 147806 -11261 -289796 -486482 -436971 -232345 -97623 -93233 -85431 -1184 62975
31279F2975k7245k2181R1496J36318J3745j66478k48968j87039k3013J54166K23499
$$ 62975 35730 13549 105045 241363 255108 88630 -160338 -347377 -370390 -216224 7275
31268G275J33280j894k3169N8484R3792K3562o8190j18987j48434j48189o8581
$$ 7275 140555 138661 115492 173976 267768 291330 223140 104153 -44281 -192470 -261051
31257b61051O0753J30564Q8964k7910j69541k50199j34133J68159L66428K04989
$$ -261051 -200298 -69734 19230 -8680 -178221 -428420 -562553 -394394 -27966 177023
31247A77023j32922k23594K074J85675J07278k8742k079O6654j7466j62617j46906
$$ 177023 44101 -179493 -177419 8256 115534 86792 84713 151367 133901 -28716 -175622
31236a75622L2931J89242K03392R0999q0997k06012j79138l7852N6617N3937P1674
$$ -175622 -142691 46551 249943 340942 259945 53933 -125205 -163057 -106440 -52503 19171
31225A9171J46370J37776k648q9458P412J31251Q6388n5029j00252n1883o2656
$$ 19171 165541 303317 300669 211211 218623 349874 436262 381233 280981 229098 166442
31214A66442j61573k16205j30096M7425J74773J28667o1860j82437p2317J11338
$$ 166442 4869 -211336 -341432 -294007 -119234 9433 -52427 -234864 -307181 -195843
31204a95843P8148j40389k03770P268J98299J34748j8311k6946M6323M7593K7403
$$ -195843 -117695 -258084 -461854 -454586 -256287 -121539 -139850 -166796 -120473 -72880 -45477
31193d5477O9865P3704k7033n9757Q8288J98723N2458j79671j94649j6688J18735
$$ -45477 24388 98092 71059 11302 99590 298313 350771 171100 -23549 -40237 78498
31182G8498J55761J65060Q3724j35988k80031j46303P4327O7595q7996p9985P6082
$$ 78498 234259 399319 483043 347055 67024 -79279 -4952 62643 -25353 -105338 -29256
31171b9256P9885r9788j68789k4668R2194L1107o1231n3544j9266j8617J8225
$$ -29256 50629 -49159 -217948 -242616 -150422 -119315 -180546 -234090 -253356 -271973 -253748
31160b53748J00938J23014O4049K7982M8233O2787O9447Q6006J3584k00521l45865
$$ -253748 -152810 -29796 34253 62235 110468 173255 242702 328708 342292 141771 -204094
31149b04094k09567K5852J4377j82019j77101R4658K77957J97344Q6273R5458
$$ -204094 -413661 -387809 -373432 -555451 -732552 -637894 -359937 -162593 -76320 19138
31139A9138M2609j53490k30747l6890J53328O5539j44145j77580m1750P7932J47991
$$ 19138 61747 -91743 -322490 -359380 -206052 -140513 -284658 -462238 -503988 -426056 -278065
31128b78065K05584J65109o169j09149N639J46710N9240j55166j99217m9600M7516
$$ -278065 -72481 92628 86459 -22690 -17051 129659 188899 33733 -165484 -215084 -167568
31117a67568k952l2276P0924J88553J91185J35350J43134J94749J43952p4052
$$ -167568 -170520 -202796 -131872 56681 247866 383216 526350 721099 865051 790999
31107G90999l06266l13684p1817J41100P2998j51425j97479r754J16599K466j48150
$$ 790999 484733 171049 99232 240332 313330 161905 -35574 -45328 71271 73737 -74413
31096g4413q4450J21691K32558J92291J09416K1684j08093k34943k59313j80758
$$ -74413 -158863 -37172 195386 387677 497093 518777 410684 175741 -83572 -264330
31086b64330q9224l6509j5191j2951k338N7593J36080J34297M6715O907Q0385
$$ -264330 -353554 -390063 -405254 -418205 -420543 -362950 -226870 -92573 -45858 -38951 41434
31075D1434J34989L8358j29410k02645j73575j51812j52976r7831J1342P9208
$$ 41434 176423 214781 85371 -117274 -290849 -442661 -595637 -693468 -682126 -602918
31065f02918Q8343J36347K58624L26401K03809m1785j77503p7837J04722J22704
$$ -602918 -514575 -378228 -119604 206797 410606 368821 191318 113481 218203 340907
31055C40907l8553j47613p3727K3709k8964j25171o7899P2812O4652q2163j14236
$$ 340907 302354 154741 81014 104723 75759 -49412 -117311 -44499 20153 -62010 -176246
31044a76246M6992J76405J00641p8134j98108k33039j79394M249K26949K69565
$$ -176246 -129254 47151 147792 69658 -128450 -361489 -540883 -536634 -309685 -40120
31034d0120R6278n2192j0095Q6883O9266j678j2754k3392j05516j51158o1014
$$ -40120 56158 3966 -6129 80754 150020 148342 135588 112196 6680 -144478 -205492
31023b05492M1368J1034n0756L0050J80707J86246L5666p4346m1243M4112P8399
$$ -205492 -164124 -153090 -203846 -173796 6911 193157 228823 154477 113234 157346 235745
31012B35745N4699O925k1940J1826P4150N3686n8807j03597J625P6202p6125l31755
$$ 235745 290444 297369 275429 287255 361405 415091 356284 252687 254312 330514 254389 -77366
31000g7366l77282j36061J39403K07295R9380J1024N1620J53559J76118P7282
$$ -77366 -454648 -590709 -451306 -244011 -144631 -133607 -81987 71572 247690 324972
30990C24972k5502j2464M8348l082j31327j09356J15255K67985J14257j91382
$$ 324972 299470 287006 335354 332272 200945 91589 206844 474829 589086 397704
30980C97704l13107j72803J1964N3882k0122p8222m0068O4996J27249Q2193K0401
$$ 397704 84597 -88206 -76242 -22360 -42482 -120704 -160772 -95776 31473 113666 134067
30969A34067O8765J65535J31576j8845q1724l3120r1650k83848k90753L6323L32068
$$ 134067 202832 368367 499943 481098 399374 366254 274604 -9244 -299997 -263674 68394
30958F8394K19802j04126j74594M4427J84147Q0678o1232q0348m5538j5006M4681
$$ 68394 288196 184070 9476 53903 238050 318728 257496 177148 131610 116604 161285
30947A61285O6808o7631k48064k10027M6962K15401J35052K740J4101P1160J2286
$$ 161285 228093 160462 -87602 -297629 -250667 -35266 99786 102526 116627 187787 200073
30936B00073r1406p4100L3388N4720m7306j06635R749K04823K53565Q1967j29333
$$ 200073 108667 34567 67955 122675 75369 -31266 -21517 183306 436871 518838 389505
30925C89505j74768q6299l7022l8512M5325J77193J28241j18198k49407r4202
$$ 389505 214737 128438 91416 52904 98229 275422 403663 285465 36058 -58144
30915e8144Q2971Q018j60248j22186P3908J85293J99454K23261J50799j24367
$$ -58144 24827 32845 -127403 -249589 -175681 9612 209066 432327 583126 458759
30905D58759l34268j58429J92360K25852o1886k03959l8244J03195M2851J4852
$$ 458759 124491 -33938 158422 384274 322388 118429 80185 183380 226231 241083
30895B41083J23675J10429j07868j87768N4613K69923J24327j81011k89969k27370
$$ 241083 364758 475187 367319 179551 234164 504087 628414 447403 157434 -69936
30885f9936j86892j17150P6566J98012N2955j42244o8741J52739J59176m0366
$$ -69936 -256828 -373978 -297412 -99400 -46445 -188689 -257430 -104691 54485 14119
30875A4119r3222R9474K41260J34031n7234j27600j19780j59332k20148j92258
$$ 14119 -79103 20371 261631 395662 338428 210828 91048 -68284 -288432 -480690
30865d80690n9392Q6626J43454P8914l3688p3728j4996M1430K7416R139N0538
$$ -480690 -540082 -453456 -310002 -231088 -264776 -338504 -353500 -312070 -284654 -275515 -224977
30854b24977Q9389O2256M0523J02003J64100R7130p1541k07283k44739j83450
$$ -224977 -135588 -73332 -32809 69194 233294 330424 258883 51600 -193139 -376589
30844c76589r166K20931L17336J76496j6911j4317J24823J14571j16327l00949
$$ -376589 -385755 -164824 152512 329008 312097 297780 422603 537174 420847 119898
30834A19898k04939P3720K66658K61160J64638J15811J13769L2875j95594m23764
$$ 119898 -85041 -11321 255337 516497 681135 796946 910715 943590 747996 324232
30824C24232l94206o8657K52844K66386L7143j22049q5242k1126o8893j31787
$$ 324232 -69974 -138631 114213 380599 417742 295693 210451 189325 120432 -11355
30814a1355p8510K9716M6844l5882j08705j13153o8205K3739J63730K65309K13778
$$ -11355 -89865 -60149 -13305 -49187 -157892 -271045 -339250 -315511 -151781 113528 327306
30803C27306M3216o8401l6284J6029l1376q5367O06J36651Q8052j39143k47333
$$ 327306 370522 302121 265837 281866 250490 165123 165729 302380 390432 251289 3956
30792C956p5412J48598J49278Q058k015J45370K20828J11374n4821j48649j73024
$$ 3956 -71456 77142 226420 234478 232463 377833 598661 710035 655214 506565 333541
30781C33541j40773l5555P3793P5293J506o435O3878Q8528M1371J5201r50j12188
$$ 333541 192768 157213 231006 306299 307805 301370 365248 453776 495147 510348 509398 397210
30769C97210k52463k12180n166R0086k5612r5595M7429J63433p214k82699k82654
$$ 397210 144747 -67433 -72599 17487 -8125 -103720 -56291 107142 99928 -182771 -465425
30758d65425J4176K63434K37706M6333j05627j48072j12411l5509N3220J25082
$$ -465425 -451249 -187815 49891 96224 -9403 -157475 -269886 -305395 -252175 -127093
30748a27093J50838J01424L391k5156Q3876J86773Q8533j34612k09162q9583j9584
$$ -127093 23745 125169 128560 103404 187280 374053 462586 327974 118812 29229 9645
30737I645r3695r9050N5983J24599k7262j17169P6766K68895J11698j86902j80673
$$ 9645 -84050 -183100 -127117 -2518 -29780 -146949 -70183 198712 310410 123508 -57165
30726e7165P0736J14880j18094k09112L7317K87600K27752j1921j64059j97414
$$ -57165 13571 128451 10357 -198755 -161438 126162 353914 341993 177934 -19480
30716a9480j81544q0947R8014J90042J04147j2244j1154L2955J448m1674J2414
$$ -19480 -201024 -281971 -183957 6085 110232 97988 86834 119789 121237 79563 91977
$$ [...]
##END NTUPLES=NMR SPECTRUM
##END=
