##TITLE=31Pdec_LY-Dixlofos.1
 CDcl3, 24 sc
 22.10.2020
##JCAMPDX= 6.0         $$ Bruker NMR JCAMP-DX V2.0
##DATA TYPE= NMR SPECTRUM
##DATA CLASS= NTUPLES
##ORIGIN= UXNMR, Bruker Analytische Messtechnik GmbH
##OWNER= root
$$ XWIN-NMR		Version 3.5
$$ Thu Oct 22 12:14:07 2020 Russian Standard Time (UT+4h)  she@DPX200
##.OBSERVE FREQUENCY= 81.013821
##.OBSERVE NUCLEUS= ^31P
##.ACQUISITION MODE= SIMULTANEOUS
##.ACQUISITION SCHEME= undefined
##.AVERAGES= 24
##.DIGITISER RES= 17
##SPECTROMETER/DATA SYSTEM= spect
##.PULSE SEQUENCE= zgpg30
##.SOLVENT NAME= CDCl3
##.SHIFT REFERENCE= (INTERNAL, CDCl3, 0, 182.463)
##AUDIT TRAIL= $$ (NUMBER, WHEN, WHO, WHERE, WHAT)
$$ ##TITLE= Audit trail, XWIN-NMR		Version 3.5
$$ ##JCAMPDX= 5.01
$$ ##ORIGIN= Bruker BioSpin GmbH
$$ ##OWNER= she
$$ F:/spectra/data/she/nmr/P31/1/pdata/1/auditp.txt
$$ ##AUDIT TRAIL=  $$ (NUMBER, WHEN, WHO, WHERE, WHAT)
(   1,<2020-10-22 12:12:46.53 +0400>,<she>,<DPX200>,
      <created by zg, POWCHK disabled, PULCHK disabled
       configuration hash MD5:
       00 E9 B6 7A A2 85 ED C7 34 08 36 98 17 FE 4E 26
       data hash MD5: 32K
       29 46 9B DA CE BD 09 14 33 C3 20 A1 64 D5 EB E9>)
(   2,<2020-10-22 12:12:48.67 +0400>,<she>,<DPX200>,
      <Start of raw data processing
       efp BC_mod = 2 LB = 1 FT_mod = 6 PKNL = 1 PHC0 = -2342.253 PHC1 = -50.7994 SI = 64K 
       data hash MD5: 64K
       28 93 9C 15 F8 DD 57 04 AA 23 1D 87 6F 1A 12 CA>)
(   3,<2020-10-22 12:13:09.31 +0400>,<she>,<DPX200>,
      <pk PHC0 = -56.38058 PHC1 = 161.2001 
       data hash MD5: 64K
       74 7D 92 16 C7 E0 49 01 00 80 98 3A F3 5D EE 51>)
(   4,<2020-10-22 12:13:13.31 +0400>,<she>,<DPX200>,
      <abs ABSG = 5 
       data hash MD5: 64K
       83 86 C0 16 E0 CC 42 7C F8 1B AB BF 78 E4 B5 CF>)
$$ ##END=
$$ 
$$ hash MD5
$$ 97 E4 B8 BA 62 30 05 91 CB 2B 03 C8 F6 32 E9 9D
##$RELAX= 
##$RELAX= 
##$RELAX= 
##$RELAX= 
##$RELAX= 
##$RELAX= 
##$RELAX= 
##$RELAX= 
$$ Bruker specific parameters
$$ --------------------------
##$DU= <F:/spectra>
##$EXPNO= 1
##$NAME= <P31>
##$PROCNO= 1
##$TYPE= <nmr>
##$USER= <she>
##$AMP= (0..31)
100 100 100 100 100 100 100 100 100 100 100 100 100 100 100 100 100 100 
100 100 100 100 100 100 100 100 100 100 100 100 100 100 
##$AQSEQ= 0
##$AQ_mod= 1
##$AUNM= <au_zg>
##$AUTOPOS= <>
##$BF1= 81.014009
##$BF2= 200.13
##$BF3= 200.13
##$BF4= 200.13
##$BF5= 200.13
##$BF6= 200.13
##$BF7= 200.13
##$BF8= 200.13
##$BYTORDA= 1
##$CFDGTYP= 0
##$CFRGTYP= 5
##$CHEMSTR= <none>
##$CNST= (0..31)
1 1 145 1 1 1 1 1 1 1 1 1 1 1 1 1 1 1 1 1 1 1 1 1 1 1 1 1 1 1 1 1 
##$CPDPRG= <waltz16>
##$CPDPRG1= <>
##$CPDPRG2= <waltz16>
##$CPDPRG3= <>
##$CPDPRG4= <mlev>
##$CPDPRG5= <mlev>
##$CPDPRG6= <mlev>
##$CPDPRG7= <mlev>
##$CPDPRG8= <mlev>
##$CPDPRGB= <>
##$CPDPRGT= <>
##$D= (0..31)
0 1 0 0 0 0 0 0 0 0 0 0.03 2e-05 3e-06 0 0 0 0 0 0 0 0 0 0 0 0 0 0 0 0 
0 0 
##$DATE= 1603354365
##$DBL= (0..7)
120 120 120 11 120 120 24 19 
##$DBP= (0..7)
150 150 150 150 150 150 150 150 
##$DBP07= 0
##$DBPNAM0= <>
##$DBPNAM1= <>
$$ [...]
##$SUBNAM3= <"">
##$SUBNAM4= <"">
##$SUBNAM5= <"">
##$SUBNAM6= <"">
##$SUBNAM7= <"">
##$SUBNAM8= <"">
##$SUBNAM9= <"">
##$SW= 369.568048894756
##$SWIBOX= (0..15)
0 1 3 0 0 0 0 0 0 0 0 0 0 0 0 0 
##$SW_h= 29940.119760479
##$TD= 32768
##$TD0= 1
##$TE= 0
##$TE2= 300
##$TE3= 300
##$TEG= 300
##$TL= (0..7)
0 120 53 12 22 120 120 120 
##$TP= (0..7)
150 150 150 150 150 150 150 150 
##$TP07= 0
##$TPNAME0= <>
##$TPNAME1= <>
##$TPNAME2= <>
##$TPNAME3= <>
##$TPNAME4= <>
##$TPNAME5= <>
##$TPNAME6= <>
##$TPNAME7= <>
##$TPOAL= (0..7)
0.5 0.5 0.5 0.5 0.5 0.5 0.5 0.5 
##$TPOFFS= (0..7)
0 0 0 0 0 0 0 0 
##$TUNHIN= 0
##$TUNHOUT= 0
##$TUNXOUT= 0
##$USERA1= <user>
##$USERA2= <user>
##$USERA3= <user>
##$USERA4= <user>
##$USERA5= <user>
##$V9= 5
##$VALIST= <valist>
##$VCLIST= <CCCCCCCCCCCCCCC>
##$VD= 0
##$VDLIST= <DDDDDDDDDDDDDDD>
##$VPLIST= <PPPPPPPPPPPPPPP>
##$VTLIST= <TTTTTTTTTTTTTTT>
##$WBST= 1024
##$WBSW= 4
##$XGAIN= (0..3)
0 0 0 0 
##$XL= 0
##$YL= 0
##$YMAX_a= 43561
##$YMIN_a= -83291
##$ZGOPTNS= <>
##$ZL1= 120
##$ZL2= 120
##$ZL3= 120
##$ZL4= 120
##$ABSF1= 182.463
##$ABSF2= -187.1042
##$ABSG= 5
##$ABSL= 3
##$ALPHA= 0
##$AQORDER= 0
##$ASSFAC= 0
##$ASSFACI= 0
##$ASSFACX= 0
##$ASSWID= 0
##$AUNMP= <proc_1d>
##$AZFE= 0.1
##$AZFW= 0.5
##$BCFW= 0
##$BC_mod= 2
##$BYTORDP= 0
##$COROFFS= 0
##$CY= -3
##$DATMOD= 1
##$DC= 0
##$DFILT= <>
##$DTYPP= 0
##$F1P= 0
##$F2P= 0
##$FCOR= 1
##$FTSIZE= 65536
##$FT_mod= 6
##$GAMMA= 0
##$GB= 0
##$INTBC= 1
##$INTSCL= 5.30512e-09
##$ISEN= 30
##$LB= 1
##$LEV0= 0
##$LPBIN= 0
##$MAXI= 10000
##$MC2= 0
##$MEAN= 0
##$ME_mod= 0
##$MI= 50
##$NCOEF= 0
##$NC_proc= -2
##$NLEV= 6
##$NOISF1= 182.463
##$NOISF2= 159.3651
##$NSP= 0
##$NTH_PI= 0
##$NZP= 0
##$OFFSET= 182.463
##$PC= 4
##$PHC0= -2398.634
##$PHC1= 110.4007
##$PH_mod= 1
##$PKNL= yes
##$PPARMOD= 0
##$PSCAL= 0
##$PSIGN= 0
##$REVERSE= no
##$SF= 81.014009
##$SI= 65536
##$SIGF1= 159.3651
##$SIGF2= -187.1042
##$SINO= 113.3802
##$SIOLD= 16384
##$SREGLST= <1H.CDCl3>
##$SSB= 0
##$STSI= 65536
##$STSR= 0
##$SW_p= 29940.119760479
##$SYMM= 0
##$S_DEV= 0
##$TDeff= 32768
##$TDoff= 0
##$TI= <>
##$TILT= no
##$TM1= 0
##$TM2= 0
##$TOPLEV= 0
##$USERP1= <user>
##$USERP2= <user>
##$USERP3= <user>
##$USERP4= <user>
##$USERP5= <user>
##$WDW= 1
##$XDIM= 65536
##$YMAX_p= 360177636
##$YMIN_p= -540943
$$ End of Bruker specific parameters
$$ ---------------------------------
##NTUPLES= NMR SPECTRUM
##VAR_NAME=  FREQUENCY,     SPECTRUM/REAL,   SPECTRUM/IMAG
##SYMBOL=    X,             R,               I
##VAR_TYPE=  INDEPENDENT,   DEPENDENT,       DEPENDENT
##VAR_FORM=  AFFN,          ASDF,            ASDF
##VAR_DIM=   65536,         65536,           65536
##UNITS=     HZ,            ARBITRARY UNITS, ARBITRARY UNITS
##FACTOR=    0.456856943014862, 1,           1
##FIRST=     14782.0589164895, 0,            0
##LAST=      -15158.0608439895, 0,           0
##MIN=       -15158.0608439895, -540943,     0
##MAX=       14782.0589164895, 360177636,    0
$$ Real data points
##PAGE= N=1
##DATA TABLE= (X++(R..R)), XYDATA
$$ [...]
##PAGE= N=2
##DATA TABLE= (X++(I..I)), XYDATA
$$ plain form
35753 446736 515173 540709 536733 537088 531213 519410 564456 695264 805460 760852 596336 493230
35741 493230 545648 657062 707061 715819 767482 846897 854938 762397 659550 639838 690922
35730 690922 724685 687690 621545 616575 708579 829161 876020 828423 762003 745695 765596
35719 765596 768088 733722 675904 606400 547784 549664 634354 736000 751154 661026 559703
35708 559703 540621 587704 609591 566145 521238 552213 632047 648003 550549 435282 426428
35697 426428 509171 554598 510292 473005 529539 610505 587317 467235 391671 447047 569930
35686 569930 661516 713448 767024 804442 758951 626144 498909 464220 503487 533700 526681
35675 526681 535700 598560 670451 689519 667222 659117 671558 662978 629850 620752 654628 691434
$$ packed form
35753D46736O8437K5536l976L55n875j1803M5046J30808J10196m4608j64516j03106
35741D93230N2418J11414M9999Q758N1663P9415Q041r2541j02847j9712N1084
35730F90922L3763l6995o6145m970R2004J20582M6859m7597o6420j6308J9901
35719G65596K492l4366n7818o9504n8616J880Q4690J01646J5154r0128j01323
35708E59703j9082M7083K1887m3446m4907L0975P9834J5956r7454j15267q854
35697D26428Q2743M5427m4306l7287N6534Q0966k3188j20082p5564N5376J22883
35686E69930R1586N1932N3576L7418m5491j32807j27235l4689L9267L0213p019
35675E26681R019O2860P1891J9068k2297q105J2441q580l3128r098L3876L6806
$$ plain form
35663 691434 704358 717409 742331 740640 689350 631530 616835 635849 653893 664299 665919 635251
35651 635251 568406 507394 480375 464401 450922 482963 565400 610000 558878 501729 559622
35640 559622 692751 746943 675135 586832 571958 600762 626840 668779 731962 747252 663669
35629 663669 541174 485128 527967 621498 703827 729964 678023 575733 496587 491332 540464
35618 540464 594695 633258 661970 687723 718478 756444 771944 724212 634726 597132 672566
35607 672566 802553 867920 820817 725777 679449 717457 797031 849944 846271 809850 776724
35596 776724 756901 749860 770591 822840 862980 839540 767400 715631 716800 734561 730773 717870
35584 717870 724769 746884 751023 708609 618789 521438 479373 513085 564128 567689 547915 580330
$$ packed form
35663F91434J2924J3051K4922j691n1290n7820j4695J9014J8044J0406J620l0668
35651F35251o6845o1012k7019j5974j3479L2041Q2437M4600n1122n7149N7893
35640E59622J33129N4192p1808q8303j4874K8804K6078M1939O3183J5290q3583
35629F63669j22495n6046M2839R3531Q2329K6137n1941j02290p9146n255M9132
35618E40464N4231L8563K8712K5753L0755L7966J5500m7732q9486l7594P5434
35607F72566J29987O5367m7103r5040m6328L8008P9574N2913l673l6421l3126
35596G76724j9823p041K0731N2249M0140k3440p2140n1769J169J7761l788j2903
35584G17870O899K2115M139m2414q9820r7351m2065L3712N1043L561j9774L2415
$$ plain form
35572 580330 663815 704296 644810 545736 503597 540258 603173 634047 609332 545648 487352
35561 487352 467631 480218 513344 588524 716312 840072 895120 902560 917674 906077 788477
35550 788477 611521 537632 623011 733101 741933 696089 698249 738238 746414 730481 743826 773186
35538 773186 764394 722833 697161 693176 679353 645886 596884 529794 480740 525628 663893 770701
35526 770701 749157 660341 613289 610379 614798 677792 839144 968191 897008 693882 608654
35515 608654 722420 837023 772112 605790 529262 594407 709096 783549 777449 676087 521690
35504 521690 422078 443330 526090 572112 574007 593328 646574 686561 681218 648697 618186 601803
35492 601803 602505 614515 618955 605716 594710 614717 667501 728492 774732 799252 805716 800419
$$ packed form
35572E80330Q3485M0481n9486r9074m2139L6661O2915L0874k4715o3684n8296
35561D87352j9721J2587L3126P5180J27788J23760N5048P440J5114j1597j17600
35550G88477j76956p3889Q5379J10090Q832m5844K160L9989Q176j5933J3345K9360
35538G73186q792m1561k5672l985j3823l3467m9002o7090m9054M4888J38265J06808
35526G70701k1544q8816m7052k910M419O2994J61352J29047p1183k03126q5228
35515F08654J13766J14603o4911j66322p6528O5145J14689P4453o100j01362j54397
35504E21690r9612K1252Q2760M6022J895J9321N3246L9987n343l2521l0511j6383
35492F01803P02J2010M440j3239j1006K0007N2784O0991M6240K4520O464n297
$$ plain form
35480 800419 789241 783293 806099 875021 962554 1003556 969614 910833 887262 886119 856359 802357
35468 802357 781994 822490 899499 993106 1099277 1185453 1201672 1145446 1057893 953498 819591
35457 819591 689908 642035 698633 793963 858987 882834 880071 863200 857468 870937 844387 719759
35445 719759 568195 538015 642797 726053 699091 683980 815321 1011319 1083033 1000917 901910
35434 901910 867526 849235 814545 816830 875062 903059 829980 716933 683822 760684 866130
35423 866130 910111 875845 809926 763309 751877 771245 834818 960443 1103555 1152403 1045071
35412 1045071 867877 776662 826705 933271 990663 968554 894757 815252 784873 828497 888174
35401 888174 874370 797093 773554 860816 954876 928263 810545 738458 756862 774894 725766
$$ packed form
35480H00419j1178n948K2806O8922Q7533M1002l3942n8781k3571j143k9760n4002
35468H02357k0363M0496P7009R3607J06171Q6176J6219n6226q7553j04395j33907
35457H19591j29683m7873N6598R5330O5024K3847k763j6871n732J3469k6550j24628
35445G19759j51564l0180J04782Q3256k6962j5111J31341J95998P1714q2116r9007
35434I01910l4384j8291l4690K285N8232K7997p3079j13047l3111P6862J05446
35423H66130M3981l4266o5919m6617j1432J9368O3573J25625J43112M8848j07332
35412A045071j77194r1215N0043J06566N7392k2109p3797p9505l0379M3624N9677
35401H88174j3804p7277k3539Q7262R4060k6613j17718p2087J8404J8032m9128
$$ plain form
35390 725766 669028 691418 780065 852082 863999 835799 797897 770510 778059 831194 900011 946670
35378 946670 976108 1013812 1048433 1051389 1046283 1092138 1187780 1261471 1279332 1292855 1336098 1346096
35366 1346096 1256742 1123693 1069232 1119745 1178775 1163612 1095037 1032906 986596 928694 863388
35355 863388 842521 915383 1070527 1226080 1292620 1262623 1219220 1233300 1277777 1278620 1221265
35344 1221265 1154794 1113846 1101549 1138786 1254213 1412310 1518389 1522327 1469035 1425434 1405172
35333 1405172 1389259 1376130 1378344 1396176 1418172 1433118 1436104 1438186 1457799 1478764 1446487 1350985
35321 1350985 1277824 1306159 1385551 1405470 1369732 1389925 1499282 1594704 1598912 1565864 1572263
35310 1572263 1609212 1644365 1692967 1755516 1777757 1750199 1756526 1839118 1911228 1902255 1893670 1985133
$$ packed form
35390G25766n6738K2390Q8647P2017J1917k8200l7902k7387P549N3135O8817M6659
35378I46670K9438L7704L4621K956n106M5855R5642P3691J7861J3523M3243R998
35366A346096q9354j33049n4461N0513N9030j5163o8575o2131m6310n7902o5306
35355H63388k0867P2862J55144J55553O6540k9997m3403J4080M4477Q43n7355
35344A221265o6471m0948j2297L7237J15427J58097J06079L938n3292m3601k0262
35333A405172j5913j3129K214J7832K1996J4946K986K082J9613K0965l2277r5502
35321A350985p3161K8335P9392J9919l5738K0193J09357R5422M208l3048O399
35310A572263L6949L5153M8602O2549K2241k7558O327Q2592P2110q973q585R1463
$$ plain form
35298 1985133 2110873 2140833 2103712 2140162 2264115 2349613 2360882 2415915 2573959 2723193
35288 2723193 2764845 2779316 2901253 3115976 3289381 3352517 3363547 3411749 3535156 3720781
35278 3720781 3927000 4108406 4256683 4409684 4594371 4778370 4900859 4917126 4763417 4296619
35268 4296619 3346236 1883808 141043 -1476185 -2632857 -3253603 -3486678 -3509463 -3403070
35259 -3403070 -3201669 -2978427 -2813811 -2710112 -2605922 -2469679 -2325534 -2195824 -2079556
35250 -2079556 -1989660 -1948364 -1930737 -1869582 -1739031 -1585854 -1455673 -1335075 -1196672 -1061700
35240 -1061700 -979970 -966640 -982833 -965996 -874108 -726674 -607768 -593432 -663101 -715598 -684161
35229 -684161 -599520 -527985 -492715 -479654 -477268 -476233 -463705 -450384 -469263 -512877 -510799 -419563
$$ packed form
35298A985133J25740K9960l7121L6450J23953Q5498J1269N5033J58044J49234
35288B723193M1652J4471J21937K14723J73405O3136J1030M8202J23407J85625
35278C720781K06219J81406J48277J53001J84687J83999J22489J6267j53709m66798
35268D296619r50383j462428j742765j617228j156672o20746k33075k2785J06393
35259c403070K01401K23242J64616J03699J04190J36243J44145J29710J16268
35250b079556Q9896M1296J7627O1155J30551J53177J30181J20598J38403J34972
35240a061700Q1730J3330j6193J6837R1888J47434J18906J4336o9669n2497L1437
35229f84161Q4641P1535L5270J3061K386J035J2528J3321j8879m3614K078R1236
$$ plain form
35217 -419563 -303166 -259110 -278579 -253613 -133411 -1886 36111 -11849 -59849 -69768 -72622
35206 -72622 -80782 -62144 -20432 -23480 -101045 -172922 -147573 -52761 12730 32145 75636 150887
35194 150887 163814 75156 -5638 32848 131940 136727 8801 -130667 -163965 -99461 -19944
35183 -19944 23174 37419 52141 78247 92426 63897 6005 -25295 -5152 27615 46301 95016
35171 95016 214400 353970 433173 455740 480332 505849 483386 429004 418509 463225 493569
35160 493569 482291 477983 486481 432239 297560 201210 254638 407562 519025 531957 497230
35149 497230 463518 430052 397342 391276 425773 482272 529633 541653 509294 461149 451330 495517
35137 495517 535914 502166 397687 301453 292595 386139 523402 608543 576283 447629 311618
$$ packed form
35217d19563J16397M4056j9469K4966J20202J31525L7997m7960m8000r919k854
35206g2622q160J8638M1712l048p7565p1877K5349R4812O5491J9415M3491P5251
35194A50887J2927q8658q0794L8486R9092M787j27926j39468l3298O4504P9517
35183a9944M3118J4245J4722K6106J4179k8529n7892l1300K0143L2767J8686M8715
35171I5016J19384J39570P9203K2567K4592K5517k2463n4382j0495M4716L0344
35160D93569j1278m308Q498n4242j34679r6350N3428J52924J11463J2932l4727
35149D97230l3712l3466l2710o066L4497N6499M7361J2020l2359m8145r819M4187
35137D95517M0397l3748j04479r6234q858R3544J37263Q5141l2260j28654j36011
$$ plain form
35126 311618 246237 269671 355956 455527 499797 442075 317813 220104 192796 192415 176769 173265
35114 173265 219419 289591 337211 371818 433827 517738 580936 615203 649707 683507 672070
35103 672070 599160 521544 513380 583299 670258 715528 714132 686261 626978 526270 430426 417854
35091 417854 487071 537005 513137 503325 600494 733186 760126 696297 685679 747028 728122
35080 728122 570202 438877 477523 577974 547060 393936 283634 274195 276870 248691 252233
35069 252233 314999 380309 426035 499465 595361 622442 547477 467965 474369 525455 533176 501898
35057 501898 501705 547818 587639 590785 585416 604192 642065 677704 706904 740727 781142 808438
35045 808438 797572 747460 682720 619305 548515 475036 446748 504937 609339 655735 584481
$$ packed form
35126C11618o5381K3434Q6285R9571M4270n7722j24262r7709k7308l81j5646l504
35114A73265M6154P0172M7620L4607O2009Q3911O3198L4267L4504L3800j1437
35103F72070p2910p7616q164O9919Q6959M5270j396k7871n9283j00708r5844j2572
35091D17854O9217M9934k3868r812R7169J32692K6940o3829j0618O1349j8906
35080G28122j57920j31325L8646J00451l0914j53124j10302r439K675k8179L542
35069B52233O2766O5310M5726P3430R5896K7081p4965p9512O404N1086P721l1278
35057E01898j93M6113L9821L146n369J8776L7873L5639K9200L3823M0415K7296
35045H08438j0866n0112o4740o3415p0790p3479k8288N8189J04402M6396p1254
$$ plain form
35034 584481 450540 373690 425236 558849 645534 593250 447253 352398 397723 523899 606930
35023 606930 596441 531174 455635 386036 344081 357352 416997 481225 526546 558213 573697
35012 573697 558819 519639 479222 447321 430164 452945 520330 571403 543164 475868 478406 575023
35000 575023 662872 651534 574382 519418 512450 523749 539630 559202 548722 471635 364741
34989 364741 326495 407525 541895 607049 542270 401054 296581 304606 414906 559714 668982
34978 668982 699647 645799 550552 491710 518079 596182 642475 607859 514098 421811 392914
34967 392914 468159 630767 787271 835290 774684 715414 747250 830644 852555 774824 684990
34956 684990 689677 785691 862595 826352 691905 544258 441868 394746 413422 514600 667606
$$ packed form
35034E84481j33941p6850N1546J33613Q6685n2284j45997r4855M5325J26176Q3031
35023F06930j0489o5267p5539o9599m1955J3271N9645O4228M5321L1667J5484
35012E73697j4878l9180m0417l1901j7157K2781O7385N1073k8239o7296K538R6617
35000E75023Q7849j1338p7152n4964o968J1299J5881J9572j0480p7087j06894
34989C64741l8246Q1030J34370O5154o4779j41216j04473Q025J10300J44808J09268
34978F68982L0665n3848r5247n8842K6369P8103M6293l4616r3761r2287k8897
34967C92914P5245J62608J56504M8019o0606n9270L1836Q3394K1911p7731q9834
34956F84990M687R6014P6904l6243j34447j47647j02390m7122J8676J01178J53006
$$ plain form
34945 667606 795231 856126 876278 872037 808033 683256 591705 611717 677139 659355 561552
34934 561552 522259 608036 706510 681125 559422 492928 561805 689578 755517 741224 735243
34923 735243 808251 921220 976751 936224 845841 759503 694181 664602 687606 725214 702759
34912 702759 630633 625443 741069 860940 852140 752478 688216 670493 619270 552395 583984
34901 583984 726595 850191 873057 857945 875728 901391 897551 881576 852871 770805 667878
34890 667878 663178 781053 871807 815550 706072 714207 844685 954873 965968 931665 918665
34879 918665 928468 937281 929702 888651 812497 740256 715760 739401 785536 833222 847124 782054
34867 782054 657325 572638 590055 652483 681868 696093 746887 802629 800147 773906 813857
$$ packed form
34945F67606J27625O0895K0152m241o4004j24777r1551K0012O5422j7784r7803
34934E61552l9293Q5777R8474k5385j21703o6494O8877J27773O5939j4293n981
34923G35243P3008J12969N5531m0527r0383q6338o5322k9579K3004L7608k2455
34912G02759p2126n190J15626J19871q800r9662o4262j7723n1223o6875L1589
34901E83984J42611J23596K2866j5112J7783K5663l840j5975k8705q2066j02927
34890F67878m700J17875R0754n6257j09478Q135J30478J10188J1095l4303j3000
34879I18665R803Q813p579m1051p6154p2241k4496K3641M6135M7686J3902o5070
34867G82054j24729q4687J7417O2428K9385J4225N0794N5742k482k6241L9951
$$ plain form
34856 813857 905034 927234 832525 719023 687395 706398 680501 602335 570720 657607 799394
34845 799394 852802 759210 615642 547438 548809 525021 468395 473613 559842 614721 580723 562560
34833 562560 642128 707939 616591 437302 367059 449379 544354 557424 535595 537102 560777
34822 560777 619950 741299 867819 901324 865102 883549 973462 1009622 942289 885567 914749
34811 914749 933682 849738 744010 740718 814997 860455 857942 843390 785567 645404 511234
34800 511234 526455 691815 858637 913874 870156 783627 689219 620909 602075 606169 600174
34789 600174 617140 705407 824726 889690 902657 933082 970209 927171 813515 765643 848330
34778 848330 950697 960106 928716 963454 1039854 1048691 971207 883885 822988 767604 740273 795416
$$ packed form
34856H13857R1177K2200r4709j13502l1628J9003k5897p8166l1615Q6887J41787
34845G99394N3408r3592j43568o8204J371k3788n6626N218Q6229N4879l3998j8163
34833E62560P9568O5811r1348j79289p0243Q2320R4975J3070k1829J507K3675
34822E60777N9173J21349J26520L3505l6222J8447Q9913L6160o7333n6722K9182
34811I14749J8933q3944j05728l292P4279M5458k513j4552n7823j40163j34170
34800E11234J5221J65360J66822N5237m3718q6529r4408o8310j8834M094n995
34789F00174J6966Q8267J19319O4964J2967L0425L7127m3038j13656m7872Q2687
34778H48330J02367R409l1390L4738P6400Q837p7484q7322o0897n5384k7331N5143
$$ plain form
34766 795416 897580 934270 883219 855375 922574 1007408 1014062 974357 968287 969137 884001 721354
34754 721354 609645 642421 783977 935283 1023939 1022653 949438 869347 842712 858886 866516
34743 866516 861861 880621 907542 882749 812471 776752 793012 774360 682953 624322 700016 849465
34731 849465 945714 980797 1028504 1069844 1008932 862233 781339 844379 948955 973038 934240
34720 934240 911076 899555 853092 807061 848017 972387 1073568 1080740 1033414 996105 965486
34709 965486 903582 821276 778009 806573 873778 923822 941776 959877 1005543 1060535 1086388
34698 1086388 1084578 1105236 1178277 1250858 1224702 1065538 854720 710561 664415 638886 555296
34687 555296 437248 382136 441829 565230 662810 694332 675954 632110 575297 520999 486662
$$ packed form
34766G95416J02164L6690n1051k7844O7199Q4834O654l9705o070Q50q5136j62647
34754G21354j11709L2776J41556J51306Q8656j286p3215q0091k6635J6174P630
34743H66516m655J8760K6921k4793p0278l5719J6260j8652r1407n8631P5694J49449
34731H49465R6249L5083M7707M1340o0912j46699q0894O3040J04576K4083l8798
34720I34240k3164j1521m6463m6031M0956J24370J01181P172m7326l7309l0619
34709I65486o1904q2306m3267K8564O7205N0044J7954J8101M5666N4992K5853
34698A086388j810K0658P3041P2581k6156j59164k10818j44159m6146k5529q3590
34687E55296j18048n5112N9693J23401R7580L1522j8378m3844n6813n4298l4337
$$ plain form
34676 486662 471624 462333 462771 497489 573815 659783 717718 749290 783436 819471 813911 747485
34664 747485 679640 688044 757509 790421 748387 712931 751525 792776 731025 611533 584239
34653 584239 674306 735629 674799 590965 611050 695154 719810 680777 683829 765448 841761 833645
34641 833645 748894 639899 562591 575131 691367 827006 870868 822737 788147 825542 878258
34630 878258 882480 864140 883127 939274 986042 1003065 1008491 1014826 1006954 964694 896048 845421
34618 845421 856972 920985 979630 1003923 1029543 1082336 1112524 1065115 984927 972008 1037969
34607 1037969 1082816 1027565 907911 816861 800817 829667 839067 797859 753083 786891 901624
34596 901624 990758 971796 895121 852281 839218 813600 829180 965380 1143088 1176488 1034709
$$ packed form
34676D86662j5038r291M38L4718P6326Q5968N7935L1572L4146L6035n560o6426
34664G47485o7845Q404O9465L2912m2034l5456L8594M1251o1751j19492k7294
34653E84239R0067O1323o0830q3834K0085Q4104K4656l9033L052Q1619P6313q116
34641H33645q4751j08995p7308J2540J16236J35639M3862m8131l4590L7395N2716
34630H78258M222j8340J8987N6147M6768J7023N426O335p872m2260o8646n0627
34618H45421J1551O4013N8645K4293K5620N2793L0188m7409q0188j2919O5961
34607A037969M4847n5251j19654r1050j6044K8850R400m1208m4776L3808J14733
34596I01624Q9134j8962p6675m2840j3063k5618J5580J36200J77708L3400j41779
$$ plain form
34585 1034709 896688 893459 944378 928628 878865 886774 922285 886969 790372 740152 775806
34574 775806 825396 833734 842160 911039 1018834 1076862 1031719 931570 876495 902871 949258
34563 949258 959792 970010 1027643 1078467 1034612 931265 890791 931847 953105 929726 968818
34552 968818 1102421 1177490 1066822 876467 811494 907266 1017894 1025440 949229 873844 860000
34541 860000 912241 973455 975155 931021 929624 999097 1056648 1041892 1007418 1009036 1007403 969344
34529 969344 966850 1061528 1175973 1203137 1169566 1163335 1171234 1127127 1061925 1056912 1091809 1085078
34517 1085078 1046940 1045352 1057117 1009611 940713 950217 1010216 998876 917091 886878 924297 912329
34505 912329 838560 855148 1020180 1163567 1123545 968178 862808 843966 850306 871486 930294
$$ packed form
34585A034709j38021l229N0919j5750m9763P909L5511l5316r6597n0220L5654
34574G75806M9590Q338Q426O8879J07795N8028m5143j00149n5075K6376M6387
34563I49258J0534J0218N7633N0824m3855j03347m0474M1056K1258k3379L9092
34552I68818J33603P5069j10668j90355o4973R5772J10628P546p6211p5385j3844
34541H60000N2241O1214J700m4134j397O9473N7551j4756l4474J618j633l8059
34529I69344k494R4678J14445K7164l3571o231P899m4107o5202n013L4897o731
34517A085078l8138j588J1765m7506o8898R504N9999j1340q1785l0213L7419j1968
34505I12329p3769J6588J65032J43387m0022j55367j05370j8842O340K1180N8808
$$ plain form
34494 930294 987840 990443 965230 970458 993448 982951 940897 906952 894917 908335 964819 1039560
34482 1039560 1048546 963916 881940 891652 940723 931283 888889 914598 1006169 1059465 1041265 1032312
34470 1032312 1077547 1108400 1057929 962161 895051 874450 885383 933162 1009074 1049304 1000970
34459 1000970 908399 864902 881052 867485 770101 667772 690440 863831 1077571 1199564
34449 1199564 1187266 1092646 1000888 974683 1021504 1094840 1148287 1193422 1272100 1369232 1405521
34438 1405521 1338721 1220500 1122669 1062321 1038777 1077220 1167835 1218038 1153401 1032842 975434
34427 975434 997258 1013882 988832 974799 999097 1007710 954460 871422 821014 833749 904841 993129
34415 993129 1021699 950841 854278 844899 917917 953187 887378 793922 768152 821436 918133 1028434
$$ packed form
34494I30294N7546K603k5213N228K2990j0497m2054l3945j2035J3418N6484P4741
34482A039560Q986q4630q1976R712M9071r440m2394K5709R1571N3296j8200q953
34470A032312M5235L0853n0471r5768o7110k0601J0933M7779P5912M0230m8334
34459A000970r2571m3497J6150j3567r7384j02329K2668J73391K13740J21993
34449A199564j2298r4620r1758k6205M6821P3336N3447M5135P8678R7132L6289
34438A405521o6800j18221r7831o0348k3544L8443R0615N0203o4637j20559n7408
34427I75434K1824J6624k5050j4033K4298Q613n3250q3038n0408J2735P1092Q8288
34415I93129K8570p0858r6563r379P3018L5270o5809r3456k5770N3284R6697J10301
$$ plain form
34403 1028434 1108071 1110681 1060634 1037093 1057479 1063572 1045225 1065312 1122522 1118125 1026159 966042
34391 966042 1013498 1068643 1034058 1001488 1098360 1238688 1220899 1040066 913761 985886 1169955
34380 1169955 1318809 1396064 1419264 1369258 1251285 1157831 1173317 1262232 1326354 1337639 1344748
34369 1344748 1369091 1366262 1303080 1225580 1217064 1295990 1380855 1376133 1287401 1221117 1257828 1356788
34357 1356788 1412388 1377780 1297450 1239295 1236034 1279363 1327517 1324180 1251481 1163226 1128018 1141515
34345 1141515 1136511 1084529 1042595 1075890 1161676 1200858 1124990 978173 882164 914588 1031407
34334 1031407 1127974 1163950 1184906 1218592 1216224 1140153 1056750 1068248 1168071 1235162 1183520
34323 1183520 1063897 995270 1033353 1132953 1216313 1249424 1255023 1270799 1306039 1337915 1339266
$$ packed form
34403A028434P9637K610n0047k3541K0386O093j8347K0087N7210m397r1966o0117
34391I66042M7456N5145l4585l2570R6872J40328j7789j80833j26305P2125J84069
34380A169955J48854P7255K3200n0006j17973r3454J5486Q8915O4122J1285P109
34369A344748K4343k829o3182p7500q516P8926Q4865m722q8732o6284L6711R8960
34357A356788N5600l4608q0330n8155l261M3329M8154l337p2699q8255l5208J3497
34345A141515n004n1982m1934L3295Q5786L9182p5868j46817r6009L2424J16819
34334A031407R6567L5976K0956L3686k368p6071q3403J1498R9823O7091n1642
34323A183520j19623o8627L8083R9600Q3360L3111N599J5776L5240L1876J351
$$ plain form
34312 1339266 1301071 1239306 1198720 1235893 1359803 1488018 1507529 1397711 1254853 1175378
34302 1175378 1159107 1158196 1169857 1219147 1276864 1267862 1171379 1061258 1023978 1068355 1137332 1184128
34290 1184128 1207908 1224760 1237943 1249066 1271411 1303159 1305914 1255574 1207416 1243175 1335559
34279 1335559 1348636 1229372 1117759 1170179 1332283 1411470 1347687 1276067 1315922 1431787
34269 1431787 1531133 1571044 1525653 1376752 1200204 1143269 1240204 1356168 1385442 1384293 1415705
34258 1415705 1397725 1250672 1091517 1104529 1266822 1371770 1313825 1200113 1169431 1231988
34248 1231988 1315345 1362726 1353794 1307362 1284071 1323416 1379151 1382826 1353722 1362250 1401632 1398075
34236 1398075 1348284 1339862 1414065 1504529 1542826 1539140 1523789 1489647 1437890 1413786 1444774 1487835
$$ packed form
34312A339266l8195o1765m0586L7173J23910J28215J9511j09818j42858p9475
34302A175378j6271r11J1661M9290N7717r002r6483j10121l7280M4377O8977M6796
34290A184128K3780J6852J3183J1123K2345L1748K755n0340m8158L5759R2384
34279A335559J3077j19264j11613N2420J62104P9187o3783p1620L9855J15865
34269A431787R9346L9911m5391j48901j76548n6935R6935J15964K9274j149L1412
34258A415705j7980j47053j59155J3012J62293J04948n7945j13712l0682O2557
34248A231988Q3357M7381q932m6432k3291L9345N5735L675k9104Q528L9382l557
34236A398075m9791q422P4203R0464L8297l686j5351l4142n1757k4104L0988M3061
$$ plain form
34224 1487835 1482881 1428873 1376208 1367443 1406652 1469620 1533316 1602674 1693246 1771991 1755449 1613864
34212 1613864 1442906 1367874 1398916 1447936 1464754 1471939 1476442 1447945 1404965 1428451 1542355
34201 1542355 1648532 1636578 1517775 1400367 1356597 1359906 1347244 1303417 1263287 1246613 1229852
34190 1229852 1203375 1217057 1311305 1426941 1468591 1453603 1490313 1587693 1616682 1521581 1435071
34179 1435071 1479876 1576741 1582345 1514331 1481067 1470368 1389799 1267507 1223652 1260338 1264010
34168 1264010 1218300 1233141 1340655 1436677 1464172 1490323 1550735 1574605 1530819 1505070 1555269
34157 1555269 1613538 1605249 1553622 1499728 1430808 1357776 1355383 1448154 1549096 1580288 1567581
34146 1567581 1559427 1548106 1532025 1559554 1644011 1718178 1725871 1675481 1573855 1422287 1313754
$$ packed form
34224A487835m954n4008n2665q765L9209O2968O3696O9358R0572P8745j6542j41585
34212A613864j70958p5032L1042M9020J6818P185M503k8497m2980K3486J13904
34201A542355J06177j1954j18803j17408m3770L309j2662m3827m0130j6674j6761
34190A229852k6477J3682R4248J15636M1650j4988L6710R7380K8989r5101q6510
34179A435071M4805R6865N604o8014l3264j0699q0569j22292m3855L6686L672
34168A264010m5710J4841J07514R6022K7495K6151O0412K3870m3786k5749N0199
34157A555269N8269q289n1627n3894o8920p3032k393R2771J00942L1192j2707
34146A567581q154j1321j6081K7529Q4457P4167P693n0390j01626j51568j08533
$$ plain form
34135 1313754 1388779 1624476 1808707 1810042 1733962 1715464 1711822 1636862 1557577 1581537 1650449
34124 1650449 1630523 1542164 1518296 1573452 1592247 1538410 1510386 1569500 1651111 1681370 1673076
34113 1673076 1667856 1668959 1669446 1684960 1725669 1773475 1804276 1810305 1800709 1794479 1799164 1792386 1755197
34100 1755197 1717117 1711171 1695107 1609087 1511797 1531565 1650925 1690032 1577926 1486698 1579290
34089 1579290 1762442 1840080 1797980 1762712 1763412 1726009 1659244 1656845 1721307 1752060 1719524 1706431
34077 1706431 1760763 1837920 1906764 1992108 2087477 2130821 2091721 1999445 1880997 1757135 1689431
34066 1689431 1728350 1814974 1836838 1785314 1755761 1784023 1788418 1700153 1565403 1488320 1529328
34055 1529328 1664221 1794182 1818969 1757970 1753512 1879973 2017313 2022605 1952705 1963521 2044161
$$ packed form
34135A313754P5025K35697J84231J335p6080j8498l642p4960p9285K3960O8912
34124A650449j9926q8359k3868N5156J8795n3837k8024N9114Q1611L0259q294
34113A673076n220J103M87J5514M0709M7806L0801O029r596o230M685o778l7189
34100A755197l8080n946j6064q6020r7290J9768J19360L9107j12106r1228R2592
34089A579290J83152P7638m2100l5268P00l7403o6765k399O4462L0753l2536j3093
34077A706431N4332P7157O8844Q5344R5369M3344l9100r2276j18448j23862o7704
34066A689431L8919Q6624K1864n1524k9553K8262M395q8265j34750p7083M1008
34055A529328J34893J29961K4787o0999m458J26461J37340N292o9900J0816Q0640
$$ plain form
34044 2044161 2042888 1942560 1901788 1987687 2067302 2038706 1992887 2044329 2146408 2187140 2151563
34033 2151563 2081205 1976869 1853217 1797744 1854846 1920594 1872536 1755061 1720101 1813062 1926669
34022 1926669 1959324 1923985 1888643 1883066 1891260 1894831 1899106 1925604 1980362 2031132 2035943 1998269
34010 1998269 1966981 1974723 2004859 2024779 2020813 1996868 1972228 1981547 2040049 2109680 2138705 2130138
33998 2130138 2128822 2151216 2177692 2199706 2214022 2186488 2098971 2025438 2070097 2214935 2316675
33987 2316675 2287219 2202402 2193472 2291910 2419911 2487328 2468442 2419852 2433834 2532795 2614254
33976 2614254 2559118 2391132 2258624 2255624 2336535 2413894 2456506 2472288 2475035 2494462 2548802
33965 2548802 2589404 2547162 2449731 2409250 2468764 2542529 2539494 2471861 2413459 2420571 2513170 2659986
$$ packed form
34044B044161j273j00328m0772Q5899P9615k8596m5819N1442J02079M0732l5577
34033B151563p0358j04336j23652n5473N7102O5748m8058j17475l4960R2961J13607
34022A926669L2655l5339l5342n577Q194L571M275K6498N4758N0770M811l7674
34010A998269l1288P742L0136J9920l966k3945k4640R319N8502O9631K9025q567
33998B130138j316K2394K6476K2014J4316k7534q7517p3533M4659J44838J01740
33987B316675k9456q4817q930R8438J28001O7417j8886m8590J3982R8961Q1459
33976B614254n5136j67986j32508l000Q0911P7359M2612J5782K747J9427N4340
33965B548802M0602m2242r7431m0481N9514P3765l035o7633n8402P112R2599J46816
$$ plain form
33953 2659986 2767809 2765485 2707196 2705118 2762398 2785263 2761317 2782185 2860891 2883944 2807010
33942 2807010 2746237 2787902 2848005 2827330 2778652 2796240 2845843 2837133 2784477 2771492 2822004
33931 2822004 2913580 3044968 3181257 3212946 3092708 2942759 2903917 2948608 2969397 2972015 3027662
33920 3027662 3102715 3112217 3101104 3188097 3344282 3411872 3352537 3297624 3322107 3345067 3308815
33909 3308815 3288794 3343044 3397661 3380966 3350899 3383258 3435275 3432330 3405021 3421073 3449485
33898 3449485 3420475 3372512 3401513 3483146 3488010 3388950 3318010 3369823 3471597 3528060 3588080
33887 3588080 3745584 3941209 4011218 3925330 3832451 3836976 3864311 3820866 3768034 3821806 3959145
33876 3959145 4056937 4082248 4112746 4186852 4264988 4338870 4445059 4551631 4568492 4511941 4524377
$$ packed form
33953B659986J07823k324n8289k078N7280K2865k3946K0868P8706K3053p6934
33942B807010o0773M1665O0103k0675m8678J7588M9603q710n2656j2985N0512
33931B822004R1576J31388J36289L1689j20238j49949l8842M4691K0789K618N5647
33920C027662P5053R502j1113Q6993J56185O7590n9335n4913K4483K2960l6252
33909C308815k0021N4250N4617j6695l0067L2359N2017k945k7309J6052K8412
33898C449485k9010m7963K9001Q1633M864r9060p0940N1813J01774N6463O0020
33887C588080J57504J95625P0009q5888r2879M525K7335m3445n2832N3772J37339
33876C959145R7792K5311L0498P4106P8136P3882J06189J06572J6861n6551J2436
$$ plain form
33865 4524377 4664249 4801157 4806926 4739215 4728135 4774309 4787115 4761191 4780706 4873444 4979306
33854 4979306 5060796 5147393 5264683 5399384 5542312 5700029 5858686 5994358 6122773 6285134
33844 6285134 6478038 6642991 6734805 6768282 6792871 6844898 6925854 7015493 7112846 7262307 7509222
33833 7509222 7824332 8112593 8314059 8462898 8637178 8886746 9210501 9557272 9854992
33824 9854992 10098645 10394815 10836977 11353086 11789565 12142968 12567630 13132666 13734673
33815 13734673 14309450 14958732 15764208 16629082 17432670 18213547 19065377 19967360 20850962
33806 20850962 21711846 22499390 22989998 22884943 21868781 19416506 14824752 7889313 -412792
33797 -412792 -8250421 -14112726 -17600134 -19191318 -19582877 -19330733 -18793618 -18126366 -17349301
$$ packed form
33865D524377J39872J36908N769o7711j1080M6174J2806k5924J9515R2738J05862
33854D979306Q1490Q6597J17290J34701J42928J57717J58657J35672J28415J62361
33844F285134J92904J64953R1814L3477K4589N2027Q0956Q9639R7353J49461K46915
33833G509222L15110K88261K01466J48839J74280K49568L23755L46771K97720
33824I854992K43653K96170M42162N16109M36479L53403M24662N65036O02007
33815A3734673N74777O49282Q05476Q64874Q03588P80877Q51830R01983Q83602
33806B0850962Q60884P87544M90608j05055j016162k452275m591754o935439q302105
33797d12792p837629n862305l487408j591184l91559K52144N37115O67252P77065
$$ plain form
33788 -17349301 -16504234 -15687739 -14935854 -14215312 -13549003 -12998611 -12503526 -11916861 -11242564
33779 -11242564 -10645020 -10166034 -9647199 -9030752 -8513799 -8246885 -8071945 -7754474 -7326954
33770 -7326954 -6990146 -6782460 -6569315 -6297526 -6043968 -5832897 -5601310 -5354786 -5186220
33761 -5186220 -5109371 -5015744 -4834926 -4621300 -4446194 -4308238 -4189171 -4104753 -4051818 -3976389
33751 -3976389 -3842084 -3681070 -3543149 -3435320 -3336675 -3236414 -3136891 -3049103 -2996417 -2992595
33741 -2992595 -3009100 -2994383 -2931202 -2847503 -2770357 -2700007 -2630426 -2562582 -2490863 -2404644 -2311951
33730 -2311951 -2239953 -2204845 -2196161 -2191543 -2171983 -2125615 -2054802 -1980260 -1924096 -1887808 -1853924 -1802635
33718 -1802635 -1720400 -1607954 -1495532 -1434417 -1447459 -1492593 -1499843 -1446781 -1376313 -1334348 -1313556
$$ packed form
33788a7349301Q45067Q16495P51885P20542O66309N50392M95085N86665O74297
33779a1242564N97544M78986N18835O16447N16953K66914J74940L17471M27520
33770g326954L36808K07686K13145K71789K53558K11071K31587K46524J68566
33761e186220P6849R3627J80818K13626J75106J37956J19067Q4418N2935P5429
33751c976389J34305J61014J37921J07829R8645J00261R9523Q7788N2686L822
33741b992595j6505J4717O3181Q3699P7146P0350O9581O7844P1719Q6219R2693
33730b311951P1998L5108Q684M618J9560M6368P0813P4542N6164L6288L3884N1289
33718a802635Q2235J12446J12422O1115j3042m5134p250N3062P0468M1965K0792
$$ plain form
33707 -1313556 -1278880 -1233997 -1227276 -1279880 -1336270 -1316546 -1206950 -1067393 -956297 -887081 -858841
33696 -858841 -878337 -928659 -957586 -927171 -846577 -740144 -627888 -559563 -604526 -754032 -882715
33685 -882715 -873828 -753043 -638704 -591490 -581358 -577845 -594300 -643641 -711025 -772004 -796702
33674 -796702 -754907 -664180 -603193 -616352 -633661 -555544 -393847 -254533 -201427 -215199 -265631
33663 -265631 -334155 -375752 -353640 -313844 -335590 -403007 -417847 -351214 -288413 -295871 -327224 -300856
33651 -300856 -211136 -130165 -136109 -244559 -373651 -397984 -289747 -170442 -151943 -176742 -119743
33640 -119743 -867 44236 -15003 -69137 -63009 -64474 -103513 -101434 -26027 23749 -27095 -104137
33628 -104137 -99283 -19110 58254 90874 72893 10438 -44420 -22274 49040 54973 -28358 -79393
$$ packed form
33707a313556L4676M4883O721n2604n6390J9724J09596J39557J11096O9216K8240
33696h58841j9496n0322k8927L0415Q0594J06433J12256O8325m4963j49506j28683
33685h82715Q887J20785J14339M7214J0132L513j6455m9341o7384o0979k4698
33674g96702M1795R0727O0987j3159j7309P8117J61697J39314N3106j3772n0432
33663b65631o8524m1597K2112L9796k1746o7417j4840O6633O2801p458l1353K6368
33651c00856Q9720Q0971n944j08450j29092k4333J08237J19305J8499k4799N6999
33640a19743J18876M5103n9239n4134O128j465l9039K079P5407M9776n0844p7042
33628a04137M854Q0173P7364L2620j7981o2455n4858K2146P1314N933q3331n1035
$$ plain form
33616 -79393 -21044 54663 43564 -2100 23999 104245 146496 143041 155840 191377 209148 224352
33604 224352 292018 401136 475473 476006 434232 392881 370661 374304 398282 422649 438584 453061
33592 453061 453220 409368 332054 275532 265481 276869 293996 327174 364861 388838 435667 540389
33580 540389 620759 554411 391618 330225 425249 495739 412382 306020 352499 494283 543898
33569 543898 463580 372542 342178 341554 344100 349876 332262 280172 261260 337664 453894 504813
33557 504813 476252 431558 409137 420663 491962 610538 686693 657186 574347 517138 487275
33546 487275 469794 499654 572047 590867 520335 483562 585007 742588 833329 886856 968832
33535 968832 993489 861555 694394 697675 840399 900108 805431 705779 697654 705746 670378
$$ packed form
33616g9393N8349P5707j1099m5664K6099Q0246M2251l455J2799L5537J7771J5204
33604B24352O7666J09118P4337N33m1774m1351k2220L643K3978K4367J5935J4477
33592D53061J59m3852p7314n6522j0051J1388J7127L3178L7687K3977M6829J04722
33580E40389Q0370o6348j62793o1393R5024P0490q3357j06362M6479J41784M9615
33569E43898q0318r1038l0364o24K546N776j7614n2090j8912P6404J16230N0919
33557E04813k8561m4694k2421J1526P1299J18576P6155k9507q2839n7209k9863
33546D87275j7481K9860P2393J8820p0532l6773J01445J57581R0741N3527Q1976
33535I68832K4657j31934j67161L281J42724N9709r4677r9652q125Q092l5368
$$ plain form
33524 670378 650960 690190 746979 811771 929249 1063710 1099736 1025841 967614 986617 993569
33513 993569 924012 860982 901226 1007946 1077573 1076639 1049519 1042837 1057377 1041069 943563 824731
33501 824731 848691 1073898 1316314 1359717 1246843 1192862 1249906 1261690 1151221 1035775
33491 1035775 1006655 994076 930593 877109 894765 938435 969774 1044354 1190902 1317656 1333398
33480 1333398 1270923 1214472 1191373 1197469 1236100 1268117 1214384 1072873 952819 938791 999152
33469 999152 1068614 1129934 1171844 1163151 1117613 1094456 1094193 1051155 968162 948079 1037798 1148258
33457 1148258 1192564 1201943 1233754 1258163 1219295 1141076 1098361 1128896 1219549 1329955 1399322
33446 1399322 1385649 1320517 1272428 1257385 1252884 1278344 1361076 1438977 1419191 1329456 1280812
$$ packed form
33524F70378j9418L9230N6789O4792J17478J34461L6026p3895n8227J9003O952
33513I93569o9557o3030M0244J06720O9627r34k7120o682J4540j6308r7506j18832
33501H24731K3960K25207K42416M3403j12874n3981N7044J1784j10469j15446
33491A035775k9120j2579o3483n3484J7656M3670L1339P4580J46548J26754J5742
33480A333398o2475n6451k3099O096L8631L2017n3733j41511j20054j4028O0361
33469I99152O9462O1320M1910q693m5538k3157k63m3038q2993k0083Q9719J10460
33457A148258M4306R379L1811K4409l8868p8219m2715L0535R0653J10406O9367
33446A399322j3673o5132m8089j5043m501K5460Q2732P7901j9786q9735m8644
$$ plain form
33435 1280812 1282106 1239790 1149628 1121241 1182412 1232677 1238886 1296053 1423294 1482975 1404735
33424 1404735 1320623 1353529 1420915 1388658 1293507 1261922 1303840 1334393 1331033 1334818 1346827 1341100
33412 1341100 1341125 1384326 1444840 1472213 1470538 1473014 1480039 1479561 1481525 1481738 1443155 1358937 1282549
33399 1282549 1259263 1281572 1332742 1405024 1458035 1442113 1384483 1369687 1421253 1490414 1559187
33388 1559187 1642658 1691531 1628531 1496455 1431592 1471655 1531091 1575679 1656267 1752056 1766705
33377 1766705 1717207 1734674 1829789 1857812 1773241 1705041 1707831 1669050 1560630 1544287 1695298
33366 1695298 1846518 1853336 1797698 1777752 1722264 1593798 1552956 1707754 1894787 1927933 1884086
33355 1884086 1922571 2002737 2017996 2035560 2144639 2223487 2130504 1991523 2018818 2165398 2243940
$$ packed form
33435A280812J294m2316r0162k8387O1171N0265O209N7167J27241N9681p8240
33424A404735q4112L2906O7386l2257r5151l1585M1918L0553l360L785J2009n727
33412A341100K5M3201O0514K7373j675K476P025m78J964K13l8583q4218p6388
33399A282549k3286K2309N1170P2282N3011j5922n7630j4796N1566O9161O8773
33388A559187Q3471M8873o3000j32076o4863M0063N9436M4588Q0588R5789J4649
33377A766705m9498J7467R5115K8023q4571o8200K790l8781j08420j6343J51011
33366A695298J51220O818n5638j9946n5488j28466m0842J54798J87033L3146m3847
33355A884086L8485Q0166J5259J7564J09079P8848r2983j38981K7295J46580P8542
$$ plain form
33344 2243940 2275900 2413753 2601009 2634735 2526851 2488060 2555959 2531384 2302353 1966576
33334 1966576 1614020 1246031 939696 839575 929349 1026028 1047244 1086916 1195505 1290426
33324 1290426 1325680 1357438 1399852 1397554 1374742 1427987 1534714 1550558 1439679 1335640 1331886
33313 1331886 1378114 1424049 1498391 1595369 1637315 1602161 1555612 1524832 1473674 1422200 1446837
33302 1446837 1540197 1612877 1650146 1718965 1806477 1812956 1733674 1690405 1742730 1811305 1824104
33291 1824104 1800295 1756613 1670348 1575126 1563527 1651001 1745234 1776222 1755691 1704070 1630842
33280 1630842 1585349 1611123 1657748 1653869 1644316 1725217 1870819 1966326 1986380 1996201 2008669 1994529
33268 1994529 1995525 2060073 2108306 2041671 1940272 1950188 2021348 1988338 1880775 1895594 2058873
$$ packed form
33344B243940L1960J37853J87256L3726j07884l8791O7899k4575k29031l35777
33334A966576l52556l67989l06335j00121Q9774R6679K1216L9672J08589R4921
33324A290426L5254L1758M2414k298k2812N3245J06727J5844j10879j04039l754
33313A331886M6228M5935P4342R6978M1946l5154m6549l0780n1158n1474K4637
33302A446837R3360P2680L7269O8819Q7512O479p9282m3269N2325O8575J2799
33291A824104k3809m3682q6265r5222j1599Q7474R4233L0988k0531n1621p3228
33280A630842m5493K5774M6625l879r553Q0901J45602R5507K0054R821J2468j4140
33268A994529R96O4548M8233o6635j01399R916P1160l3010j07563J4819J63279
$$ plain form
33257 2058873 2180393 2176580 2175910 2245462 2268918 2181788 2093108 2075295 2046098 1958988 1912813 1973168
33245 1973168 2066411 2136045 2220763 2299997 2261145 2114898 2047934 2151025 2271618 2247968 2127457
33234 2127457 2045389 2037327 2070945 2126373 2163648 2143127 2130144 2227984 2375233 2398664 2304508
33223 2304508 2292247 2415015 2474221 2357854 2236325 2274578 2374122 2374473 2316723 2321625 2368212
33212 2368212 2378691 2390954 2472527 2569364 2590716 2551486 2510523 2468051 2426187 2437934 2500915
33201 2500915 2523102 2479824 2470455 2537100 2578918 2536533 2499019 2525885 2529153 2447446 2377822 2415761
33189 2415761 2515334 2617448 2755536 2920037 2984994 2894279 2764673 2691411 2619438 2517916
33179 2517916 2491848 2586798 2671401 2659400 2662849 2772743 2875457 2852151 2778438 2756626 2733105
$$ packed form
33257B058873J21520l813o70O9552K3456q7130q8680j7813k9197q7110m6175O0355
33245A973168R3243O9634Q4718P9234l8852j46247o6964J03091J20593k3650j20511
33234B127457q2068q062L3618N5428L7275k0521j2983R7840J47249K3431r4156
33223B304508j2261J22768N9206j16367j21529L8253R9544L51n7750M902M6587
33212B368212J0479J2263Q1573R6837K1352l9230m0963m2472m1864J1747O2981
33201B500915K2187m3278r369O6645M1818m2385l7514K6866L268q1707o9624L7939
33189B415761R9573J02114J38088J64501O4957r0715j29606p3262p1973j01522
33179B517916k6068R4950Q4603j2001L449J09894J02714k3306p3713k1812k3521
$$ plain form
33168 2733105 2659569 2647489 2766890 2872875 2839165 2787067 2860991 2950371 2883588 2747826 2748710
33157 2748710 2866021 2915667 2871499 2867248 2929236 2945059 2875361 2798041 2760505 2751488 2788844
33146 2788844 2891911 3005453 3070072 3111007 3157935 3163851 3101410 3033794 2998201 2948397 2896581
33135 2896581 2940418 3048588 3028129 2841412 2729846 2849351 3014190 3009928 2928405 2948085
33125 2948085 3006157 2970787 2937135 3040174 3143017 3041479 2846905 2834239 3007692 3136158
33115 3136158 3140201 3135425 3159450 3157610 3185276 3333890 3501230 3509344 3402644 3364919 3399392
33104 3399392 3360258 3242151 3166353 3138888 3093060 3100765 3252120 3395713 3313814 3107964 3083410
33093 3083410 3270586 3389825 3303161 3187774 3221849 3377792 3568001 3743087 3814181 3713924
$$ packed form
33168B733105p3536j2080J19401J05985l3710n2098P3924Q9380o6783j35762Q84
33157B748710J17311M9646m4168m251O1988J5823o9698p7320l7536r017L7356
33146B788844J03067J13542O4619M0935M6928N916o2441o7616l5593m9804n1816
33135B896581M3837J08170k0459j86717j11566J19505J64839m262q1523J9680
33125B948085N8072l5370l3652J03039J02843j01538j94574j2666J73453J28466
33115C136158M043m776K4025j840K7666J48614J67340Q114j06700l7725L4473
33104C399392l9134j18107p5798k7465m5828P705J51355J43593q1899k05850k4554
33093C083410J87176J19239q6664j15387L4075J55943J90209J75086P1094j00257
$$ plain form
33083 3713924 3557070 3526654 3606723 3637741 3596750 3590495 3624619 3632944 3674294 3824231 3937229
33072 3937229 3824276 3613800 3603213 3783520 3861411 3746394 3652594 3691681 3730501 3713017
33062 3713017 3768865 3909904 3947866 3826330 3743537 3836442 4003110 4123875 4203067 4222889
33052 4222889 4121005 3981897 3989022 4124468 4176804 4094900 4055777 4132856 4192961 4182931 4212074
33041 4212074 4276613 4219571 4061014 4050565 4268401 4475376 4495665 4460247 4522465 4605217 4593619
33030 4593619 4537271 4505960 4462656 4414367 4473074 4638358 4727912 4645500 4523280 4497768 4540652
33019 4540652 4595461 4677004 4757681 4759229 4719091 4756536 4837211 4806738 4686798 4672057 4794063
33008 4794063 4870985 4839557 4840497 4916121 4931427 4864856 4862342 4929683 4903229 4808270 4888579 5165193
$$ packed form
33083C713924j56854l0416Q0069L1018m0991o255L4124Q325M1350J49937J12998
33072C937229j12953k10476j0587J80307P7891j15017r3800L9087L8820j7484
33062C713017N5848J41039L7962j21536q2793R2905J66668J20765P9192J9822
33052D222889j01884j39108P125J35446N2336q1904l9123P7079O0105j0030K9143
33041D212074O4539n7042j58557j0449K17836K06975K0289l5418O2218Q2752j1598
33030D593619n6348l1311m3304m8289N8707J65284Q9554q2412j22220k5512M2884
33019D540652N4809Q1543Q0677J548m0138L7445Q0675l0473j19940j4741J22006
33008D794063P6922l1428R40P5624J5306o6571k514O7341k6454r4959Q0309K76614
$$ plain form
32996 5165193 5331383 5236656 5120729 5192744 5321560 5341703 5342673 5435781 5522946 5513755 5513423 5600112
32984 5600112 5665343 5650154 5681947 5807001 5851733 5726490 5611463 5666186 5796252 5865053
32974 5865053 5896633 5932476 5935842 5953701 6105562 6310938 6323501 6132423 6008346 6058402 6093625
32963 6093625 6039494 6077971 6246444 6315803 6234427 6263105 6476786 6578238 6434506 6346396
32953 6346396 6517208 6696789 6653328 6570820 6653692 6746765 6690069 6661310 6815900 6958704
32943 6958704 6919022 6882907 7011842 7113588 7044260 7039298 7264421 7440042 7325727 7182938
32933 7182938 7311733 7511149 7478332 7380226 7512765 7716046 7670507 7506546 7577998 7842316
32923 7842316 7980071 7952235 7962058 8029865 8051254 8112768 8330575 8543034 8552052 8484150 8549218
$$ packed form
32996E165193J66190r4727j15927P2015J28816K0143R70R3108Q7165r191l32Q6689
32984E600112O5231j5189L1793J25054M4732j25243j15027N4723J30066O8801
32974E865053L1580L5843L366J7859J51861K05376J2563j91078j24077N0056L5223
32963F093625n4131L8477J68473O9359q1376K8678K13681J01452j43732q8110
32953F346396J70812J79581m3461q2508Q2872R3073n6696k8759J54590J42804
32943F958704l9682l6115J28935J01746o9328m962K25123J75621j14315j42789
32933G182938J28795J99416l2817r8106J32539K03281m5539j63961P1452K64318
32923G842316J37755k7836R823O7807K1389O1514K17807K12459R018o7902O5068
$$ plain form
32912 8549218 8665937 8690457 8753979 8983983 9168440 9110026 9030613 9193026 9411237 9392722
32902 9392722 9281480 9380085 9598840 9669065 9655222 9775853 9959258 10040718 10141274 10391145
32892 10391145 10565103 10470603 10392486 10649710 11024361 11154925 11170756 11379352 11651228 11709873
32882 11709873 11721514 11979014 12292802 12326540 12256025 12446679 12736095 12686782 12315603 11954580
32872 11954580 11651375 11325878 11221631 11546742 11960463 12064966 12078246 12360400 12672571
32863 12672571 12650019 12594392 12963461 13466171 13559775 13479447 13817980 14409315 14636652 14577200
32853 14577200 14806707 15290141 15512149 15525523 15824748 16338983 16590480 16689687 17119854 17706585
32843 17706585 17887882 17835593 18190823 18863840 19247882 19403407 19770205 19921322 19026118
$$ packed form
32912H549218J16719K4520O3522K30004J84457n8414p9413J62413K18211j8515
32902I392722j11242R8605K18755P0225j3843J20631J83405Q1460J00556K49871
32892A0391145J73958r4500p8117K57224L74651J30564J5831K08596K71876N8645
32882A1709873J1641K57500L13788L3738p0515J90654K89416m9313l71179l61023
32872A1954580l03205l25497j04247L25111M13721J04503J3280K82154L12171
32863A2672571k2552n5627L69069N02710R3604q0328L38533N91335K27337n9452
32853A4577200K29507M83434K22008J3374K99225N14235K51497R9207M30167N86731
32843A7706585J81297n2289L55230O73017L84042J55525L66798J51117q95204
$$ plain form
32834 19026118 17481349 16633619 16845167 17248580 17451129 17979325 18896270 19503497 19682449
32825 19682449 20108839 20890856 21398539 21639876 22337846 23438298 24067936 24195137 24746445
32816 24746445 25836769 26553512 26777858 27465777 28772698 29716524 30110748 30951987 32428300
32807 32428300 33504033 34006382 35075336 36943004 38406283 39181562 40537233 42820001
32799 42820001 44718146 45856890 47629643 50456708 52873912 54493046 57028278 61023388
32791 61023388 64575731 66908610 70007351 74853989 79508497 83153247 88266318 96026711
32783 96026711 103626827 109558509 117133928 128352465 139083054 146292699 154703192 166257409
32775 166257409 164795824 123449682 33124346 -81239951 -176296307 -220213054 -209738518
$$ packed form
32834A9026118j544769q47730K11548M03413K02549N28196R16945O07227J78952
32825A9682449M26390P82017N07683K41337O97970J100452O29638J27201N51308
32816B4746445J090324P16743K24346O87919J306921R43826L94224Q41239J476313
32807C2428300J075733N02349J068954J867668J463279P75279J355671K282768
32799D2820001J898145J138744J772753K827065K417204J619134K535232L995110
32791F1023388L552343K332879L098741M846638M654508L644750N113071P760393
32783I6026711P600116N931682P575419J1218537J0730589P209645Q410493J1554217
32775A66257409j461585m1346142r0325336j14364297r5056356m3916747J0474536
$$ plain form
32768 -209738518 -167111949 -124123317 -102095528 -99975620 -101909491 -97108837 -88829558
32761 -88829558 -84020894 -81988613 -78064036 -72537581 -69154634 -67844429 -65307641 -61246359
32753 -61246359 -58386485 -57104584 -55049581 -51814353 -49489543 -48524511 -47063535 -44645672
32745 -44645672 -42915829 -42276683 -41176712 -39206293 -37816462 -37406706 -36569649 -34853084
32737 -34853084 -33594349 -33326041 -32849542 -31610685 -30651408 -30432681 -29915073 -28622352 -27574979
32728 -27574979 -27336475 -27034469 -26151252 -25480266 -25455356 -25238086 -24343001 -23579275 -23495389 -23375031
32718 -23375031 -22658579 -21966886 -21828421 -21686905 -21052146 -20440677 -20323525 -20249455 -19815625
32709 -19815625 -19450586 -19465151 -19347788 -18755532 -18227246 -18182011 -18150514 -17707481 -17243918 -17114867
$$ packed form
32768b09738518M2626569M2988632K2027789K119908j933871M800654Q279279
32761h8829558M808664K032281L924577N526455L382947J310205K536788M061282
32753f1246359K859874J281901K055003L235228K324810R65032J460976K417863
32745d4645672J729843O39146J099971J970419J389831M09756Q37057J716565
32737c4853084J258735K68308M76499J238857R59277K18727N17608J292721J047373
32728b7574979K38504L02006Q83217O70986K4910K17270Q95085P63726Q3886J20358
32718b3375031P16452O91693J38465J41516O34759O11469J17152P4070M33830
32709a9815625L65039j4565J17363N92256N28286M5235L1497M43033M63563J29051
$$ plain form
32699 -17114867 -16928757 -16389960 -15963597 -15984107 -15953484 -15455075 -14951396 -14932653 -15041583 -14791381
32689 -14791381 -14431344 -14353812 -14318486 -14007969 -13723183 -13795404 -13893194 -13623651 -13267071 -13222020
32679 -13222020 -13256466 -13001807 -12684134 -12668317 -12735955 -12504239 -12153250 -12073715 -12154906 -12048758
32669 -12048758 -11813634 -11713212 -11680532 -11517444 -11333037 -11299096 -11272194 -11100626 -10977118 -11064960
32659 -11064960 -11131040 -10966697 -10791232 -10813639 -10796047 -10502100 -10179682 -10127566 -10163232 -9996625
32649 -9996625 -9766212 -9726073 -9750839 -9624701 -9485092 -9518086 -9549078 -9389387 -9245653 -9327596
32639 -9327596 -9400074 -9197968 -8938571 -8932132 -9021232 -8913386 -8746934 -8799472 -8927115 -8827420
32629 -8827420 -8601225 -8530823 -8540371 -8395650 -8219710 -8290134 -8504246 -8535439 -8362048 -8196316
$$ packed form
32699a7114867J86110N38797M26363k0510L0623M98409N03679J8743j08930K50202
32689a4791381L60037P7532L5326L10517K84786p2221r7790K69543L56580M5051
32679a3222020l4446K54659L17673J5817o7638K31716L50989P9535q1191J06148
32669a2048758K35124J00422L2680J63088J84407L3941K6902J71568J23508q7842
32659a1064960o6080J64343J75465k2407J7592K93947L22418N2116l5666J66607
32649i996625K30413M0139k4766J26138J39609l2994l0992J59691J43734q1943
32639i327596p2478K02106K59397O439q9100J07846J66452n2538j27643R9695
32629h827420K26195P0402r548J44721J75940p0424k14112l1193J73391J65732
$$ plain form
32619 -8196316 -8062891 -7876421 -7750514 -7807428 -7871551 -7755610 -7634153 -7726149 -7852864 -7748229
32609 -7748229 -7558862 -7570017 -7672771 -7587902 -7394839 -7339866 -7330681 -7137062 -6903086 -6934294
32599 -6934294 -7140727 -7209608 -7168751 -7249437 -7350137 -7200566 -6935663 -6929591 -7140354 -7190164
32589 -7190164 -7040579 -7009760 -7137528 -7115381 -6885771 -6755638 -6831716 -6854804 -6698763 -6560634
32579 -6560634 -6540002 -6471104 -6298616 -6212666 -6277661 -6295488 -6165455 -6047909 -6057364 -6096774 -6088413
32568 -6088413 -6085187 -6083854 -6000901 -5882021 -5870450 -5941848 -5932588 -5830856 -5770178 -5757873 -5698247
32557 -5698247 -5647346 -5731485 -5851276 -5800599 -5646935 -5642837 -5783613 -5819220 -5696137 -5612370 -5630059
32546 -5630059 -5615599 -5578083 -5670496 -5819479 -5760362 -5507304 -5390033 -5531950 -5675122 -5627080
$$ packed form
32619h196316J33425J86470J25907n6914o4123J15941J21457r1996j26715J04635
32609g748229J89367j1155j02754Q4869J93063N4973R185J93619K33976l1208
32599f934294k06433o8881M0857q0686j00700J49571K64903O072k10763m9810
32589g190164J49585L0819j27768K2147K29610J30133p6078k3088J56041J38129
32579f560634K0632O8898J72488Q5950o4995j7827J30033J17546r455l9410Q361
32568f088413L226J333Q2953J18880J1571p1398R260J01732O0678J2305N9626
32557e698247N0901q4139j19791N0677J53664M098j40776l5607J23083Q3767j7689
32546e630059J4460L7516r2413j48983N9117K53058J17271j41917j43172M8042
$$ plain form
32536 -5627080 -5505176 -5419673 -5287073 -5102953 -5050153 -5174625 -5269279 -5227437 -5202025 -5270691
32526 -5270691 -5262457 -5087174 -4937112 -4973545 -5077960 -5092658 -5058821 -5042628 -4966826 -4799497 -4698866
32515 -4698866 -4791040 -4975095 -5088076 -5098805 -5036735 -4913930 -4809578 -4837142 -4944083 -4944249 -4813992
32504 -4813992 -4731989 -4765351 -4772782 -4696106 -4668154 -4722863 -4683805 -4485192 -4334955 -4391791 -4521920
32493 -4521920 -4545746 -4500272 -4487266 -4475519 -4426386 -4419002 -4488141 -4525158 -4485336 -4494245 -4603475
32482 -4603475 -4655214 -4551715 -4442903 -4463131 -4489268 -4364442 -4174704 -4086318 -4070406 -4011880
32472 -4011880 -3956134 -4021784 -4165280 -4238441 -4213404 -4182581 -4198149 -4249185 -4324997 -4378734 -4310639
32461 -4310639 -4105292 -3907222 -3859947 -3950793 -4088982 -4226325 -4322314 -4316440 -4226199 -4153609 -4120923
$$ packed form
32536e627080J21904Q5503J32600J84120N2800j24472r4654M1842K5412o8666
32526e270691Q234J75283J50062l6433j04415j4698L3837J6193P5802J67329J00631
32515d698866r2174j84055j12981j0729O2070J22805J04352k7564j06941j66J30257
32504d813992Q2003l3362p431P6676K7952n4709L9058J98613J50237n6836j30129
32493d521920k3826M5474J3006J1747M9133P384o9139l7017L9822q909j09230
32482d603475n1739J03499J08812k0228k6137J24826J89738Q8386J5912N8526
32472d011880N5746o5650j43496p3161K5037L0823j5568n1036p5812n3737O8095
32461d310639K05347J98070M7275r0846j38189j37343r5989N874R0241P2590L2686
$$ plain form
32450 -4120923 -4039886 -3913683 -3891519 -4015060 -4090347 -3955895 -3725941 -3615083 -3651331 -3713523
32440 -3713523 -3738058 -3737203 -3703921 -3637302 -3596171 -3625718 -3695201 -3765919 -3825108 -3817922 -3688694 -3534366
32428 -3534366 -3541610 -3705660 -3805193 -3739992 -3675994 -3736638 -3781425 -3663637 -3500814 -3481049 -3567003
32417 -3567003 -3608259 -3612703 -3687945 -3813381 -3875256 -3856752 -3820082 -3769356 -3684875 -3621467 -3632451
32406 -3632451 -3667622 -3663278 -3642253 -3619936 -3535513 -3398809 -3364696 -3511427 -3677810 -3683781 -3589100
32395 -3589100 -3563625 -3619412 -3651437 -3639508 -3628907 -3601213 -3533989 -3498652 -3538833 -3551965 -3452619
32384 -3452619 -3339484 -3326721 -3334093 -3243718 -3143710 -3185829 -3298237 -3287883 -3164410 -3113354 -3183852
32373 -3183852 -3246997 -3253001 -3292594 -3384025 -3414248 -3334764 -3237860 -3194722 -3168411 -3125417 -3103769
$$ packed form
32450d120923Q1037J26203K2164j23541p5287J34452K29954J10858l6248o2192
32440c713523k4535Q55L3282O6619M1131k9547o9483p0718n9189P186J29228J54328
32428c534366p244j64050r9533O5201O3998o0644m4787J17788J62823J9765q5954
32417c567003m1256m444p5242j25436o1875J8504L6670N0726Q4481O3408j0984
32406c632451l5171M344K1025K2317Q4423J36704L4113j46731j66383n971R4681
32395c589100K5475n5787l2025J1929J0601K7694O7224L5337m0181j3132R9346
32384c452619J13135J2763p372R0375J00008m2119j12408J0354J23473N1056p0498
32373c183852o3145o004l9593r1431l0223P9484R6904M3138K6311M2994K1648
$$ plain form
32362 -3103769 -3136595 -3209452 -3305206 -3404901 -3459550 -3447207 -3422713 -3423884 -3388130 -3262756 -3120464
32351 -3120464 -3043498 -2978503 -2851180 -2738402 -2753815 -2834122 -2829689 -2757241 -2763746 -2867424 -2935049
32340 -2935049 -2913332 -2893744 -2932752 -2976502 -2982597 -2966489 -2918955 -2826216 -2774287 -2874995 -3072195
32329 -3072195 -3174038 -3105520 -2991788 -2963269 -3007135 -3044857 -3043746 -3015727 -2988541 -2991802 -3008496
32318 -3008496 -2968296 -2863097 -2807911 -2880773 -2972250 -2930583 -2792480 -2711425 -2710050 -2680998 -2600267
32307 -2600267 -2554584 -2568807 -2584632 -2606815 -2694051 -2801471 -2806958 -2704942 -2608423 -2556115 -2492284
32296 -2492284 -2438565 -2488666 -2608505 -2642672 -2567299 -2543710 -2656659 -2782565 -2797720 -2749831 -2733020
32285 -2733020 -2741502 -2740355 -2751856 -2783352 -2782019 -2734389 -2703249 -2709029 -2690844 -2635513 -2615142 -2640759
$$ packed form
32362c103769l2826p2857r5754r9695n4649J2343K4494j171L5754J25374J42292
32351c120464P6966O4995J27323J12778j5413q0307M433P2448o505j03678o7625
32340b935049K1717J9588l9008m3750o095J6108M7534R2739N1929j00708j97200
32329c072195j01843O8518J13732K8519m3866l7722J111K8019K7186l261j6694
32318c008496M0200J05199N5186p2862r1477M1667J38103Q1055J375K9052Q0731
32307b600267M5683j4223j5825k2183q7236j07420n487J02016R6519N2308O3831
32296b492284N3719n0101j19839l4167P5373K3589j12949j25906j5155M7889J6811
32285b733020q482J147j1501l1496J333M7630L1140n780J8185N5331K0371k5617
$$ plain form
32273 -2640759 -2619066 -2523843 -2465900 -2504615 -2528721 -2431978 -2287556 -2233015 -2282851 -2368208 -2471285
32262 -2471285 -2600405 -2702835 -2721058 -2689624 -2677563 -2675552 -2628128 -2540837 -2472671 -2448298 -2447252
32251 -2447252 -2459692 -2496220 -2555216 -2614161 -2637610 -2589671 -2484358 -2423512 -2506799 -2679513 -2751415
32240 -2751415 -2612775 -2366657 -2204009 -2210030 -2335179 -2487344 -2589769 -2595075 -2508441 -2388634
32230 -2388634 -2302538 -2291536 -2369542 -2502414 -2595809 -2572971 -2472068 -2399703 -2387291 -2374902 -2340886
32219 -2340886 -2344015 -2406797 -2459525 -2453509 -2441303 -2478660 -2520325 -2489308 -2398668 -2328410 -2309953 -2302061
32207 -2302061 -2274202 -2258549 -2301255 -2384084 -2421319 -2355486 -2247296 -2220057 -2293399 -2335898 -2238786
32196 -2238786 -2078234 -2020592 -2104093 -2209810 -2232728 -2188319 -2148209 -2149311 -2176352 -2182710 -2138334
$$ packed form
32273b640759K1693R5223N7943l8715k4106R6743J44422N4541m9836q5357j03077
32262b471285j29120j02430j8223L1434J2061K011M7424Q7291O8166K4373J046
32251b447252j2440l6528n8996n8945k3449M7939J05313O0846q3287j72714p1902
32240b751415J38640K46118J62648o021j25149j52165j02425n306Q6634J19807
32230b388634Q6096J1002p8006j32872r3395K2838J00903P2365J2412J2389L4016
32219b340886l129o2782n2728O016J2206l7357m1665L1017R0640P0258J8457P892
32207b302061K7859J5653m2706q2829l7235O5833J08190K7239p3342m2499R7112
32196b238786J60552N7642q3501j05717k2918M4409M0110j102k7041o358M4376
$$ plain form
32185 -2138334 -2094161 -2150267 -2303943 -2402506 -2336437 -2202752 -2159068 -2191490 -2178883 -2126353 -2148692
32174 -2148692 -2242577 -2268151 -2175912 -2078206 -2062217 -2090273 -2119158 -2160165 -2181578 -2114182 -2007828
32163 -2007828 -2021058 -2182536 -2314820 -2282934 -2178121 -2150793 -2185758 -2169962 -2096717 -2068427 -2127567
32152 -2127567 -2189075 -2151478 -2029460 -1958472 -2053348 -2253897 -2364834 -2294747 -2179321 -2182259 -2262994
32141 -2262994 -2275165 -2214476 -2191011 -2206024 -2155593 -2038289 -1961120 -1943059 -1910246 -1882207 -1949196
32130 -1949196 -2060488 -2067897 -1998443 -2031495 -2165230 -2179972 -2010142 -1871986 -1905179 -1961490 -1900057
32119 -1900057 -1830504 -1878060 -1945179 -1914975 -1881992 -1960239 -2046599 -2004484 -1923791 -1967004 -2091890
32108 -2091890 -2151529 -2146755 -2156371 -2132451 -1998814 -1860233 -1879094 -2008028 -2061641 -2000973 -1943311
$$ packed form
32185b138334M4173n6106j53676r8563O6069J33685M3684l2422J2607N2530k2339
32174b148692r3885k5574R2239R7706J5989k8056k8885m1007k1413O7396J06354
32163b007828j3230j61478j32284L1886J04813K7328l4965J5796P3245K8290n9140
32152b127567o1508L7597J22018P0988r4876k00549j10937P0087J15426k938q0735
32141b262994j2171O0689K3465j5013N0431J17304P7169J8061L2813K8039o6989
32130a949196j11292p409O9454l3052j33735j4742J69830J38156l3193n6311O1433
32119a900057O9553m7556o7119L0204L2983p8247q6360M2115Q0693m3213j24886
32108b091890n9639M774r616K3920J33637J38581j8861j28934n3613O0668N7662
$$ plain form
32097 -1943311 -1936742 -1923201 -1893407 -1897113 -1922240 -1918797 -1910348 -1942815 -1971532 -1933600 -1869455 -1840086
32085 -1840086 -1806641 -1736732 -1731039 -1871136 -2032287 -2037709 -1924180 -1861456 -1877716 -1870005 -1832025
32074 -1832025 -1856556 -1937392 -1968597 -1930131 -1899678 -1897365 -1880089 -1859782 -1868762 -1851341 -1754033 -1669686
32062 -1669686 -1716639 -1832855 -1875395 -1858356 -1887505 -1928668 -1877902 -1807896 -1880156 -2034255 -2041427
32051 -2041427 -1880403 -1782678 -1857114 -1939539 -1896780 -1827602 -1845655 -1879511 -1825129 -1731357 -1707680
32040 -1707680 -1772391 -1883013 -1999794 -2054043 -1979778 -1835523 -1768903 -1812447 -1845918 -1800610 -1753661
32029 -1753661 -1769319 -1795085 -1777522 -1746530 -1728197 -1701963 -1687617 -1738712 -1810068 -1778741 -1641679
32018 -1641679 -1541907 -1549933 -1575182 -1549139 -1534492 -1583770 -1646184 -1690560 -1770673 -1890954 -1954926
$$ packed form
32097a943311O569J3541K9794l706k5127L443Q449l2467k8717L7932O4145K9369
32085a840086L3445O9909N693j40097j61151n422J13529O2724j6260P711L7980
32074a832025k4531q0836l1205L8466L0453K313J7276K0307q980J7421R7308Q4347
32062a669686m6953j16216m2540J7039k9149m1163N0766P0006p2260j54099p172
32051b041427J61024R7725p4436q2425M2759O9178j8053l3856N4382R3772K3677
32040a707680o4711j10622j16781n4249P4265J44255O6620m3544l3471M5308M6949
32029a753661j5658k5766J7563L0992J8333K6234J4346n1095p1356L1327J37062
32018a641679R9772q026k5249K6043J4647m9278o2414m4376q0113j20281o3972
$$ plain form
32007 -1954926 -1927682 -1905720 -1945762 -1970075 -1922596 -1865962 -1832738 -1739000 -1556724 -1421928 -1444596
31996 -1444596 -1544309 -1604767 -1663594 -1800899 -1945805 -1956571 -1832314 -1706439 -1668141 -1698319
31986 -1698319 -1745881 -1777777 -1783984 -1794330 -1850835 -1927967 -1946425 -1895483 -1852342 -1846425 -1812531 -1724617
31974 -1724617 -1658584 -1662216 -1679857 -1671920 -1689157 -1754980 -1795231 -1766849 -1739941 -1770100 -1807159 -1812537
31962 -1812537 -1839804 -1906635 -1918472 -1825853 -1730827 -1724703 -1747243 -1726462 -1723692 -1796836 -1846402 -1763875
31950 -1763875 -1630084 -1592796 -1631481 -1621387 -1564435 -1570477 -1644420 -1668099 -1587334 -1469762 -1378592
31939 -1378592 -1317350 -1298589 -1350988 -1452344 -1545517 -1612540 -1657305 -1648452 -1569205 -1490427 -1498387
31928 -1498387 -1574156 -1630199 -1636998 -1629586 -1622219 -1603710 -1588772 -1593515 -1589275 -1552487 -1522157 -1537357
$$ packed form
32007a954926K7244K1962m0042k4313M7479N6634L3224R3738J82276J34796k2668
31996a444596r9713o0458n8827j37305j44906j0766J24257J25875L8298l0178
31986a698319m7562l1896o207j0346n6505p7132j8458N0942M3141N917L3894Q7914
31974a724617O6033l632j7641P937j7237o5823m0251K8382K6908l0159l7059n378
31962a812537k7267o6831j1837R2619R5026O124k2540K0781K770p3144m9566Q2527
31950a763875J33791L7288l8685J0094N6952o042p3943k3679Q0765J17572R1170
31939a378592O1242J8761n2399j01356r3173o7023m4765Q853P9247P8778p960
31928a498387p5769n6043o799P412P367J8509J4938m743M240L6788L0330j5200
$$ plain form
31916 -1537357 -1564126 -1557894 -1545829 -1566454 -1580596 -1531814 -1452945 -1426638 -1472354 -1541527 -1587615
31905 -1587615 -1586296 -1537585 -1494184 -1518376 -1571201 -1543456 -1443621 -1420012 -1516419 -1561607 -1431290
31894 -1431290 -1272972 -1297070 -1458685 -1541666 -1482922 -1417548 -1444608 -1528547 -1610218 -1659708 -1642495
31883 -1642495 -1570879 -1549124 -1630466 -1688097 -1586532 -1421884 -1407637 -1558162 -1676135 -1640137
31873 -1640137 -1521195 -1416371 -1345514 -1324096 -1373100 -1440648 -1459258 -1477751 -1586008 -1725670
31863 -1725670 -1748142 -1652802 -1584313 -1591795 -1584159 -1538068 -1543249 -1602151 -1591569 -1488924 -1442513 -1533266
31851 -1533266 -1643394 -1653944 -1610812 -1597628 -1595023 -1569852 -1566538 -1601672 -1589752 -1481237 -1367625
31840 -1367625 -1346901 -1379731 -1374453 -1328296 -1296634 -1300379 -1338298 -1413501 -1486136 -1485283 -1424508 -1412863
$$ packed form
31916a537357k6769O232J2065k0625j4142M8782P8869K6307m5716o9173m6088
31905a587615J319M8711M3401k4192n2825K7745R9835K3609r6407m5188J30317
31894a431290J58318k4098j61615q2981N8744O5374k7060q3939q1671m9490J7213
31883a642495P1616K1755q1342n7631J01565J64648J4247j50525j17973L5998
31873a640137J18942J04824P0857K1418m9004o7548j8610j8493j08257j39662
31863a725670k2472R5340O8489p482P636M6091n181n8902J0582J02645M6411r0753
31851a533266j10128j0550M3132J3184K605K5171L314l5134J1920J08515J13612
31840a367625K0724l2830N278M6157L1662l745l7919p5203p2635Q53O0775J1645
$$ plain form
31828 -1412863 -1496479 -1588857 -1611282 -1591780 -1568507 -1520050 -1462772 -1485667 -1597261 -1663654 -1601788
31817 -1601788 -1513834 -1517626 -1564978 -1559395 -1538277 -1580121 -1623039 -1553301 -1419911 -1384057 -1475175
31806 -1475175 -1560129 -1557283 -1529906 -1539453 -1539665 -1472854 -1377565 -1337194 -1373314 -1436095 -1470137 -1458197
31794 -1458197 -1414980 -1358714 -1294883 -1231581 -1196105 -1205123 -1225908 -1212674 -1178593 -1174416 -1195932 -1186396
31782 -1186396 -1140812 -1122335 -1151469 -1170117 -1151540 -1151758 -1204149 -1257201 -1272729 -1290430 -1332957 -1349987
31770 -1349987 -1332390 -1371908 -1506930 -1613690 -1575694 -1473166 -1461713 -1530060 -1533980 -1431122 -1323718
31759 -1323718 -1279999 -1264845 -1258983 -1306138 -1406988 -1483878 -1496247 -1498596 -1541911 -1595905 -1608854
31748 -1608854 -1578652 -1528529 -1467747 -1407823 -1372585 -1367368 -1371703 -1370766 -1362189 -1342147 -1328088 -1372741
$$ packed form
31828a412863q3616r2378k2425J9502K3273M8457N7278k2895j11594o6393O1866
31817a601788Q7954l792m7352N583K1118m1844m2918O9738J33390L5854r1118
31806a475175q4954K846K7377r547k12O6811R5289M0371l6120o2781l4042J1940
31794a458197M3217N6266O3831O3302L5476r018k0785J3234L4081M177k1516R536
31782a186396M5584J8477k9134j8648J8577k18n2391n3052j5528j7701m2527j7030
31770a349987J7597l9518j35022j06760L7996J02528J1453o8347l920J02858J07404
31759a323718M3719J5154N862m7155j00850p6890j2369k349m3315n3994j2949
31748a608854L0202N0123O0782N9924L5238N217m335R37Q577K0042J4059m4653
$$ plain form
31736 -1372741 -1490099 -1585486 -1543788 -1387569 -1258371 -1226599 -1214814 -1145675 -1070894 -1082230 -1159281
31725 -1159281 -1191397 -1127650 -1036808 -1021163 -1115179 -1265960 -1379682 -1392041 -1323120 -1260899 -1269223
31714 -1269223 -1320724 -1343226 -1316311 -1282746 -1268994 -1246078 -1192135 -1149639 -1172696 -1236415 -1252627
31703 -1252627 -1180188 -1072849 -1002986 -981870 -979272 -979711 -984255 -990861 -1009467 -1063459 -1138995 -1173578
31691 -1173578 -1141991 -1107345 -1125418 -1150379 -1122152 -1099643 -1187704 -1352178 -1443904 -1417658 -1385995
31680 -1385995 -1415222 -1412432 -1296301 -1153055 -1106735 -1126645 -1097407 -1026995 -1044568 -1196041 -1361442
31669 -1361442 -1407741 -1344351 -1284455 -1297649 -1346416 -1359918 -1333961 -1325097 -1348672 -1341258 -1271003 -1227674
31657 -1227674 -1307551 -1440081 -1455666 -1330915 -1226473 -1240785 -1270940 -1198124 -1078842 -1036858
$$ packed form
31736a372741j17358r5387M1698J56219J29198L1772J1785O9139P4781j1336p7051
31725a159281l2116O3747R0842J5645r4016j50781j13722j2359O8921O2221q324
31714a269223n1501k2502K6915L3565J3752K2916N3943M2496k3057o3719j6212
31703a252627P2439J07339O9863K1116K598m39m544o606j8606n3992p5536l4583
31691a173578L1587L4646j8073k4961K8227K2509q8061j64474r1726K6246L1663
31680a385995k9227K790J16131J43246M6320j9910K9238P0412j7573j51473j65401
31669a361442m6299O3390N9896j3194m8767j3502K5957Q864k3575P414P0255M3329
31657a227674p9877j32530j5585J24751J04442j4312l0155P2816J19282M1984
$$ plain form
31647 -1036858 -1067271 -1077971 -1055696 -1062950 -1114559 -1168846 -1203785 -1206689 -1139427 -1016158 -957820
31636 -957820 -1048045 -1182044 -1192117 -1090910 -1047554 -1134982 -1247847 -1284939 -1273697 -1274240 -1277192
31625 -1277192 -1251223 -1206223 -1161652 -1116715 -1082156 -1080743 -1096141 -1083084 -1043942 -1033396 -1074096
31614 -1074096 -1128753 -1165977 -1192368 -1210752 -1208759 -1198654 -1210229 -1236282 -1237172 -1198010 -1130512 -1034651
31602 -1034651 -922074 -856090 -889873 -980607 -1047332 -1094073 -1178101 -1273276 -1284788 -1206070 -1138456
31591 -1138456 -1130141 -1116176 -1058854 -1029811 -1090306 -1187714 -1237090 -1223088 -1161974 -1049063 -914164
31580 -914164 -849589 -900015 -983842 -1002876 -979785 -1006970 -1097650 -1168722 -1154655 -1074944 -998331
31569 -998331 -985892 -1055328 -1163483 -1239365 -1262006 -1281944 -1340776 -1402030 -1395435 -1306187 -1193596
$$ packed form
31647a036858l0413j0700K2275p254n1609n4287l4939k904O7262J23269N8338
31636i57820r0225j33999j0073J01207M3356q7428j12865l7092J1242n43k952
31625a277192K5969M5000M4571M4937L4559J413j5398J3057L9142J0546m0700
31614a074096n4657l7224k6391j8384J993J0105j1575k6053q90L9162O7498R5861
31602a034651J12577O5984l3783r0734o6725m6741q4028r5175j1512P8718O7614
31591a138456Q315J3965N7322K9043o0495r7408m9376J4002O1114J12911J34899
31580i14164O4575n0426q3827j9034K3091k7185r0680p1072J4067P9711P6613
31569i98331J2439o9436j08155p5882k2641j9938n8832o1254O595Q9248J12591
$$ plain form
31558 -1193596 -1140807 -1196277 -1330516 -1440680 -1441997 -1366495 -1319783 -1330410 -1314965 -1222375 -1131833
31547 -1131833 -1145812 -1244503 -1315064 -1286986 -1178899 -1047135 -949271 -931455 -993180 -1080051 -1150144
31536 -1150144 -1216400 -1284606 -1300843 -1227276 -1128611 -1099075 -1125065 -1109107 -1025109 -955936 -958177
31525 -958177 -979942 -958848 -927842 -955068 -1024471 -1057076 -1040094 -1056826 -1164399 -1300107 -1355680
31514 -1355680 -1313293 -1253060 -1233351 -1223427 -1177079 -1123570 -1135221 -1220469 -1297501 -1284209 -1186263
31503 -1186263 -1082101 -1036165 -1042974 -1055591 -1052041 -1047324 -1034707 -961674 -816574 -709024 -774387
31492 -774387 -984380 -1142625 -1111828 -965836 -861234 -843097 -861212 -901668 -985490 -1077837 -1117959
31481 -1117959 -1124780 -1164614 -1220929 -1204166 -1097976 -995091 -971227 -1010660 -1070273 -1133062 -1184605
$$ packed form
31558a193596N2789n5470j34239j10164j317P5502M6712j0627J5445R2590R0542
31547a131833j3979r8691p0561K8078J08087J31764R7864J7816o1725q6871p0093
31536a150144o6256o8206j6237P3567R8665K9536k5990J5958Q3998O9173k241
31525i58177k1765K1094L1006k7226o9403l2605J6982j6732j07573j35708n5573
31514a355680M2387O0233J9709R924M6348N3509j1651q5248p7032J3292R7946
31503a186263J04162M5936o809j2617L550M717J2617P3033J45100J07550o5363
31492g74387k09993j58245L0797J45992J04602J8137j8115m0456q3822r2347m0122
31481a117959o821l9834n6315J6763J06190J02885K3864l9433n9613o2789n1543
$$ plain form
31470 -1184605 -1214706 -1248794 -1302181 -1315733 -1233413 -1127623 -1122443 -1190570 -1170009 -1012758 -870654
31459 -870654 -876206 -974266 -1047559 -1084241 -1127027 -1161815 -1159857 -1150661 -1161644 -1156440 -1112567 -1085092
31447 -1085092 -1114660 -1149790 -1139415 -1120925 -1134030 -1135834 -1095206 -1079966 -1138961 -1182659 -1109008
31436 -1109008 -978439 -928220 -968983 -1007837 -1029357 -1099300 -1203942 -1235928 -1154677 -1038960 -962966
31425 -962966 -924388 -906026 -908223 -908668 -883415 -875156 -948711 -1075264 -1156346 -1164974 -1158189 -1141487
31413 -1141487 -1040971 -848261 -685104 -662968 -752880 -845028 -874845 -850028 -815760 -834309 -940702
31402 -940702 -1077727 -1128250 -1051663 -938705 -894217 -918486 -949890 -973720 -1023248 -1095772 -1131831
31391 -1131831 -1087849 -995033 -931139 -944785 -1014376 -1077176 -1089132 -1048274 -971796 -880235 -806820
$$ packed form
31470a184605l0101l4088n3387j3552Q2320J05790N180o8127K0561J57251J42104
31459h70654n552r8060p3293l6682m2786l4788J958R196j0983N204M3873K7475
31447a085092k9568l5130J0375J8490j3105j804M0628J5240n8995m3698P3651
31436a109008J30569N0219m0763l8854k1520o9943j04642l1986Q1251J15717P5994
31425i62966L8578J8362k197m45K5253Q259p3555j26553q1082q628O785J6702
31413a141487J00516J92710J63157K2136q9912r2148k9817K4817L4268j8549j06393
31402i40702j37025n0523P6587J12958M4488k4269l1404k3830m9528p2524l6059
31391a131831M3982R2816O3894j3646o9591o2800j1956M0858P6478R1561P3415
$$ plain form
31380 -806820 -784342 -805183 -826281 -826252 -816401 -786351 -705817 -609448 -599334 -705119 -817687 -838735
31368 -838735 -823804 -878590 -976458 -1001437 -935732 -876173 -877173 -898895 -910155 -926349 -939201 -920518
31356 -920518 -902887 -944938 -1012065 -1014582 -972073 -997938 -1095863 -1131410 -1063187 -1036307 -1145565
31345 -1145565 -1256032 -1199282 -1034068 -951971 -998664 -1054590 -1052714 -1048249 -1071320 -1063721 -999734
31334 -999734 -948650 -963538 -997910 -986886 -940079 -900370 -869486 -832794 -814296 -844591 -897053
31323 -897053 -912288 -878564 -842740 -844647 -881473 -934694 -985608 -998173 -941729 -856951 -844357 -938713
31311 -938713 -1040668 -1039342 -965227 -932613 -954511 -934379 -852247 -819229 -884384 -920806 -815606
31300 -815606 -669102 -661620 -788406 -883363 -873174 -845680 -867120 -892434 -886564 -885098 -884447 -813816
$$ packed form
31380h06820K2478k0841k1098K9R851L0050Q0534R6369J0114j05785j12568k1048
31368h38735J4931n4786r7868k4979O5705N9559j000k1722j1260j6194j2852J8683
31356i20518J7631m2051o7127k517M2509k5865r7925l5547O8223K6880j09258
31345a145565j10467N6750J65214Q2097m6693n5926J876M465k3071P599O3987
31334i99734N1084j4888l4372J1024M6807L9709L0884L6692J8498l0295n2462
31323h97053j5235L3724L5824j907l6826n3221n0914j2565N6444Q4778J2594r4356
31311i38713j01955J326P4115L2614k1898K0132Q2132L3018o5155l6422J05200
31300h15606J46504P482j26786r4957J0189K7494k1440k5314N870J466O51P0631
$$ plain form
31288 -813816 -688456 -657930 -799374 -967220 -968285 -817150 -696833 -705445 -760160 -748820 -679210
31277 -679210 -651180 -732310 -881757 -979890 -941609 -814563 -739802 -796469 -919046 -989629 -967763
31266 -967763 -895257 -819196 -762278 -740597 -757422 -787602 -802683 -804927 -818094 -859437 -930488 -1009882
31254 -1009882 -1048866 -1011838 -933053 -891736 -917974 -967123 -994664 -997455 -968286 -885194 -779027
31243 -779027 -735151 -776752 -815350 -779537 -729576 -765410 -867074 -917426 -869115 -808342 -840041
31232 -840041 -960909 -1066653 -1066998 -985010 -934992 -985259 -1061836 -1035973 -894597 -754081 -705404
31221 -705404 -731328 -789090 -871668 -949694 -959825 -912386 -912437 -1001112 -1069815 -1015302 -890787 -811443
31209 -811443 -797328 -810915 -861380 -952271 -1004878 -963539 -906030 -914181 -912105 -795413 -653569
$$ packed form
31288h13816J25360L0526j41444j67846j065J51135J20317q612n4715J1340O9610
31277f79210K8030q1130j49447r8133L8281J27046P4761n6667j22577p0583K1866
31266i67763P2506P6061N6918K1681j6825l0180j5081k244j3167m1343p1051p9394
31254a009882l8984L7028P8785M1317k6238m9149k7541k791K9169Q3092J06167
31243g79027M3876m1601l8598L5813M9961l5834j01664n0352M8311O0773l1699
31232h40041j20868j05744l45Q1988N0018n0267p6577K5863J41376J40516M8677
31221g05404k5924n7762q2578p8026j0131M7439n1q8675o8703N4513J24515P9344
31209h11443J4115j3587n0465r0891n2607M1339N7509q151K076J16692J41844
$$ plain form
31198 -653569 -668516 -826433 -938783 -945476 -975320 -1070520 -1081082 -927770 -770953 -784677 -915389
31187 -915389 -1004801 -1026494 -1049879 -1066274 -1013048 -918534 -877552 -906810 -943887 -969395 -1017073
31176 -1017073 -1071935 -1067741 -999145 -949329 -982858 -1071139 -1139742 -1143431 -1087493 -1014898 -975517 -977233
31164 -977233 -973720 -926393 -857810 -810384 -779161 -731600 -674326 -650975 -683542 -755180 -836033 -888321
31152 -888321 -870172 -784238 -703673 -696104 -735656 -744492 -706517 -676169 -682378 -696613 -704523 -735688
31140 -735688 -795393 -830481 -803297 -753271 -743393 -779215 -819763 -841620 -852140 -854439 -834195 -779034
31128 -779034 -697421 -629653 -640035 -759517 -918864 -986279 -911519 -794502 -762467 -816916 -868451
31117 -868451 -890142 -937941 -1016340 -1034157 -945473 -846856 -854356 -939534 -975126 -909910 -806014
$$ packed form
31198f53569j4947j57917j12350o693k9844r5200j0562J53312J56817j3724j30712
31187i15389q9412k1693k3385j6395N3226R4514M0982k9258l7077k5508m7678
31176a017073n4862M194O8596M9816l3529q8281o8603l689N5938P2595L9381j716
31164i77233L513M7327O8583M7426L1223M7561N7274K3351l2567p1638q0853n2288
31152h88321J8149Q5934Q0565P569l9552q836L7975L0348o209j4235p910l1165
31140g35688n9705l5088K7184N0026R878l5822m0548k1857j0520k299K0244N5161
31128g79034Q1613O7768j0382j19482j59347o7415P4760J17017L2035n4449n1535
31117h68451k1691m7799p8399j7817Q8684R8617p500q5178l5592O5216J03896
$$ plain form
31106 -806014 -718376 -639193 -575972 -583766 -669235 -737871 -704678 -613807 -584323 -663441 -790845
31095 -790845 -889135 -930284 -918870 -869355 -815868 -803560 -846909 -913963 -961325 -970562 -948113 -907680
31083 -907680 -860502 -814253 -777874 -766413 -788828 -826054 -841946 -830690 -830827 -869161 -914100 -920208
31071 -920208 -902768 -921101 -986687 -1034504 -1004211 -914665 -832121 -790343 -774598 -769711 -784224 -822553
31059 -822553 -868394 -913626 -973528 -1041787 -1054805 -953068 -776944 -645743 -625430 -671209 -721605
31048 -721605 -776057 -830122 -815896 -701575 -592370 -613532 -724460 -779585 -758720 -783636 -890181
31037 -890181 -954263 -904784 -844651 -863983 -890095 -853047 -851645 -978732 -1099702 -1020878 -811167
31026 -811167 -723841 -815934 -884398 -815054 -756616 -846184 -966270 -934069 -795291 -751950 -866118
$$ packed form
31106h06014Q7638P9183O3221p794q5469o8636L3193R0871K9484p9118j27404
31095g90845r8290m1149J1414M9515N3487J2308m3349o7054m7362r237K2449M0433
31083i07680M7178M6249L6379J1461k2415l7226j5892J1256j37l8334m4939o108
31071i20208J7440j8333o5586m7817L0293Q9546Q2544M1778J5745M887j4513l8329
31059h22553m5841m5232n9902o8259j3018J01737J76124J31201K0313m5779n0396
31048g21605n4452n4065J4226J14321J09205k1162j10928n5125K0865k4916j06545
31037h90181o4082M9479O0133j9332k6112L7048J402j27087j20970P8824K09711
31026h11167Q7326r2093o8464O9344N8438q9568j20086L2201J38778M3341j14168
$$ plain form
31015 -866118 -997590 -1017105 -949346 -893561 -901085 -956074 -1010720 -1015930 -961586 -901923 -905415 -965877
31003 -965877 -994066 -918527 -777623 -684581 -697834 -752007 -745486 -680785 -663008 -745466 -843326
30992 -843326 -850059 -782315 -734049 -728508 -711870 -677726 -691926 -775996 -856796 -867209 -827678 -794543
30980 -794543 -787743 -803092 -842841 -896738 -928566 -908749 -840018 -750922 -691713 -715465 -814247 -898241
30968 -898241 -898729 -859723 -851059 -836620 -746047 -646444 -688873 -870931 -1007541 -982945 -888499 -849749
30956 -849749 -855635 -838936 -799615 -757928 -698504 -650931 -711243 -884542 -1020117 -1012531 -954185
30945 -954185 -966166 -995448 -933661 -836073 -840011 -927269 -950558 -864878 -761486 -689084 -608474
30934 -608474 -525051 -507047 -554800 -592016 -602056 -637166 -679867 -642650 -538780 -510708 -632714
$$ packed form
31015h66118j31472j9515O7759N5785p524n4989n4646n210N4344N9663l492o0462
31003i65877k8189P5539J40904R3042j3253n4173O521O4701J7777q2458r7860
30992h43326o733O7744M8266N541J6638L4144j4200q4070q0800j0413L9531L3135
30980g94543O800j5349l9749n3897l1828J9817O8731Q9096N9209k3752r8782q3994
30968h98241m88L9006Q664J4439R0573R9603m2429j82058j36610K4596R4446L8750
30956h49749n886J6699L9321M1687N9424M7573o0312j73299j35575P586N8346
30945i54185j1981k9282O1787R7588l938q7258k3289Q5680J03392P2402Q0610
30934f08474Q3423J8004m7753l7216j0040l5110m2701L7217J03870K8072j22006
$$ plain form
30923 -632714 -803054 -887497 -866611 -792080 -699933 -621749 -589367 -574670 -506992 -394142 -341234
30912 -341234 -407731 -532219 -636856 -711347 -753615 -736976 -694476 -725473 -843467 -922186 -878997
30901 -878997 -808117 -826870 -887679 -873297 -800957 -779066 -804957 -767976 -650586 -572347 -599928
30890 -599928 -645132 -612375 -544743 -545068 -618505 -675900 -666635 -643125 -691747 -830231 -976611 -1018682
30878 -1018682 -930184 -809407 -764968 -771098 -702693 -532434 -409414 -472513 -645730 -724263 -648736
30867 -648736 -577072 -649975 -793131 -835645 -751629 -669588 -666707 -675051 -616453 -527750 -493877 -526255
30855 -526255 -574642 -616147 -667728 -734592 -800354 -853010 -880374 -861189 -799885 -744880 -731504
30844 -731504 -734134 -717165 -699451 -716453 -753732 -781443 -823377 -915925 -1018757 -1048541 -995158
$$ packed form
30923f32714j70340q4443K0886P4531R2147P8184L2382J4697O7678J12850N2908
30912c41234o6497j24488j04637p4491m2268J6639M2500l0997j17994p8719M3189
30901h78997P0880j8753o0809J4382P2340K1891k5891L6981J17390P8239k7581
30890e99928m5204L2757O7632l25p3437n7395R265K3510m8622j38484j46380m2071
30878a018682Q8498J20777M4439o130O8405J70259J23020o3099j73217p8533P5527
30867f48736P1664p2903j43156m2514Q4016Q2041K881q344N8598Q8703L3873l2378
30855e26255m8387m1505n1581o6864o5762n2656k7364J9185O1304N5005J3376
30844g31504k630J6969J7714j7002l7279k7711m1934r2548j02832k9784N3383
$$ plain form
30833 -995158 -925338 -872512 -805452 -713710 -640663 -611873 -605709 -615318 -663799 -734276 -766206 -756756
30821 -756756 -784452 -880710 -952826 -904653 -780232 -712394 -759036 -857091 -920531 -922592 -885049
30810 -885049 -837938 -802386 -786433 -785838 -792259 -796819 -790961 -781365 -795928 -845053 -883685 -851609 -750310
30797 -750310 -637023 -544770 -460052 -380891 -335040 -328853 -341489 -386365 -508167 -689554 -830289
30786 -830289 -861697 -824217 -790834 -771965 -741086 -696354 -644477 -575946 -510091 -512607 -607268 -715469
30774 -715469 -746729 -709638 -671110 -648392 -615735 -586173 -604916 -672051 -739315 -776870 -787122
30763 -787122 -766874 -716678 -676673 -690926 -740754 -769236 -762464 -744694 -702533 -594398 -453531
30752 -453531 -405674 -532728 -755454 -900192 -875110 -753369 -683711 -738273 -855899 -923080
$$ packed form
30833i95158O9820N2826O7060R1742P3047K8790O164r609m8481p0477l1930R450
30821g56756k7696r6258p2116M8173J24421O7838m6642r8055o3440k061L7543
30810h85049M7111L5552J5953N95o421m560N858R596j4563m9125l8632L2076J01299
30797g50310J13287R2253Q4718P9161M5851O187j2636m4876j21802j81387j40735
30786h30289l1408L7480L3383J8869L0879M4732N1877O8531O5855k516r4661j08201
30774g15469l1260L7091L8528K2718L2657K9562j8743o7135o7264l7555j0252
30763g87122K0248N0196M0005j4253m9828k8482O772J7770M2161J08135J40867
30752d53531M7857j27054k22726j44738K5082J21741O9658n4562j17626o7181
$$ plain form
30742 -923080 -887852 -786885 -691268 -657997 -708208 -799155 -832772 -759274 -663946 -666169 -733131
30731 -733131 -711090 -573969 -501064 -618193 -788546 -799478 -667505 -591360 -647922 -711478 -674947
30720 -674947 -583078 -509121 -449173 -404419 -442130 -584509 -723475 -738846 -652493 -591933 -632591
30709 -632591 -729930 -783131 -730961 -611501 -544545 -613268 -751185 -806179 -734757 -654572 -664775
30698 -664775 -702364 -654917 -549283 -523780 -636576 -799597 -908817 -957479 -991795 -1016557 -993549
30687 -993549 -911152 -814798 -760912 -756360 -758728 -738689 -721649 -743271 -778510 -760705 -678845 -606896
30675 -606896 -609674 -662421 -703467 -730109 -784348 -858688 -882507 -821386 -743454 -748961 -848922 -946144
30663 -946144 -941876 -840974 -734912 -689240 -676377 -635421 -573872 -568649 -660330 -782564 -824442
$$ packed form
30742i23080L5228J00967R5617L3271n0211r0947l3617P3498R5328k223o6962
30731g33131K2041J37121P2905j17129j70353j0932J31973P6145n6562o3556L6531
30720f74947R1869P3957N9948M4754l7711j42379j38966j5371Q6353O0560m0658
30709f32591r7339n3201N2170J19460O6956o8723j37917n4994P1422Q0185j0203
30698f64775l7589M7447J05634K5503j12796j63021j09220m8662l4316k4762K3008
30687i93549Q2397R6354N3886M552k368K0039J7040k1622l5239J7805Q1860P1949
30675f06896k778n2747m1046k6642n4239p4340k3819O1121P7932n507r9961r7222
30663i46144M268J00902J06062M5672J2863M0956O1549N223r1681j22234m1878
$$ plain form
30652 -824442 -752441 -649169 -629353 -724994 -853682 -899029 -824595 -705642 -645097 -668770 -716639
30641 -716639 -726370 -699465 -681328 -698176 -728373 -731608 -700239 -676963 -709361 -784088 -829646 -802339
30629 -802339 -745242 -728738 -748835 -730482 -636458 -531693 -516580 -615059 -747670 -811828 -781903
30618 -781903 -725837 -714665 -724513 -664688 -515028 -385588 -394334 -519390 -631212 -652622 -623018
30607 -623018 -609890 -625206 -643945 -649314 -637491 -618264 -625012 -684363 -765716 -803236 -779276 -742715
30595 -742715 -731560 -721395 -669061 -572380 -474040 -434843 -495494 -619473 -688290 -623301 -507774
30584 -507774 -500180 -614305 -689047 -617610 -501151 -499972 -618707 -732415 -760726 -714169 -615610
30573 -615610 -489318 -409879 -453598 -591478 -711486 -753000 -746329 -721206 -663299 -577571 -510110
$$ packed form
30652h24442P2001J03272J9816r5641j28688m5347P4434J18953O0545k3673m7869
30641g16639r731K6905J8137j6848l0197l235L1369K3276l2398p4727m5558K7307
30629h02339N7097J6504k0097J8353R4024J04765J5113r8479j32611o4158K9925
30618g81903N6066J1172r848N9825J49660J29440q746j25056j11822k1410K9604
30607f23018J3128j5316j8739n369J1823J9227o748n9351q1353l7520K3960L6561
30595g42715J1155J0165N2334R6681R8340L9197o0651j23979o8817O4989J15527
30584e07774P594j14125p4742P1437J16459J179j18735j13708k8311M6557R8559
30573f15610J26292P9439m3719j37880j20008m1514O671K5123N7907Q5728O7461
$$ plain form
30562 -510110 -473046 -418861 -330871 -277348 -322417 -426044 -488449 -471478 -429505 -432426 -497082
30551 -497082 -589668 -662702 -685422 -659331 -613538 -581190 -579880 -609520 -653639 -680491 -663560 -613516
30539 -613516 -574167 -570673 -573889 -537966 -470345 -437970 -487423 -573883 -600203 -534344 -457363 -465241
30527 -465241 -543850 -589968 -555155 -508540 -530193 -601196 -655992 -700328 -792641 -914967 -953267
30516 -953267 -842252 -661877 -534108 -471815 -403446 -324780 -333016 -479584 -660604 -720667 -638347
30505 -638347 -542892 -550268 -647072 -751271 -818157 -839393 -795286 -687236 -594283 -610311 -714633
30494 -714633 -780597 -738924 -662845 -649621 -683083 -679619 -626416 -593667 -622488 -675260 -706510 -722043
30482 -722043 -745493 -771278 -777070 -752708 -696671 -613406 -535933 -520116 -581202 -653500 -652715 -576282
$$ packed form
30562e10110L7064N4185Q7990N3523m5069j03627o2405J6971M1973k921o4656
30551d97082r2586p3034k2720K6091M5793L2348J310k9640m4119k6852J6931N0044
30539f13516L9349L494l216L5923O7621L2375m9453q6460k6320O5859P6981p878
30527d65241p8609m6118L4813M6615k1653p1003n4796m4336r2313j22326l8300
30516i53267J11015J80375J27769O2293O8369P8666q236j46568j81020o0063Q2320
30505f38347R5455p376r6804j04199o6886k1236M4107J08050R2953j6028j04322
30494g14633o5964M1673P6079J3224l3462L464N3203L2749k8821n2772l1250j5533
30482g22043k3450k5785n792K4362N6037Q3265P7473J5817o1086p2298P85P6433
$$ plain form
30470 -576282 -505461 -500700 -532209 -536509 -507267 -485948 -479296 -445653 -376469 -335475 -376829 -459665
30458 -459665 -492170 -444157 -372781 -346410 -382875 -455444 -519732 -537872 -512272 -492816 -522422
30447 -522422 -590172 -667663 -756342 -845334 -862921 -756974 -605140 -545891 -598603 -652819 -644217
30436 -644217 -624433 -627367 -595997 -507551 -452783 -499413 -574194 -580486 -545995 -543118 -541826 -472644
30424 -472644 -381142 -382112 -487298 -604016 -683775 -746990 -774945 -712664 -589988 -516349 -531186
30413 -531186 -565726 -572131 -582280 -613688 -626787 -613215 -625842 -678150 -706405 -676237 -639486 -640690
30401 -640690 -652591 -649585 -657222 -677308 -652779 -569745 -511739 -541520 -602702 -614408 -596988 -621249
30389 -621249 -686024 -729401 -722904 -680808 -611591 -530271 -486420 -511540 -564381 -587084 -586109 -602618
$$ packed form
30470e76282P0821M761l1509m300K9242K1319O652L3643O9184M0994m1354q2836
30458d59665l2505M8013P1376K6371l6465p2569o4288j8140K5600J9456k9606
30447e22422o7750p7491q8679q8992j7587J05947J51834N9249n2712n4216Q602
30436f44217J9784k934L1370Q8446N4768m6630p4781o292L4491K877J292O9182
30424d72644R1502r70j05186j16718p9759o3215k7955O2281J22676P3639j4837
30413e31186l4540o405j0149l1408j3099J3572j2627n2308k8255L0168L6751j204
30401f40690j1901L006p637k0086K4529Q3034N8006k9781o1182j1706J7420k4261
30389f21249o4775m3377O497M2096O9217Q1320M3851k5120n2841k2703R75j6509
$$ plain form
30377 -602618 -638861 -672878 -707375 -739019 -718403 -615937 -498020 -459536 -499332 -535281 -525845
30366 -525845 -503677 -501287 -515993 -542795 -575844 -582884 -539864 -482898 -467648 -492537 -522704 -563335
30354 -563335 -631815 -683168 -660166 -605171 -613864 -674598 -672076 -575594 -500468 -529179 -587176 -574456
30342 -574456 -518213 -493592 -475939 -396938 -298684 -296405 -395842 -473654 -462710 -446110 -516405 -628816
30330 -628816 -667116 -604930 -529119 -523737 -589086 -667392 -698905 -651700 -539267 -421639 -363172
30319 -363172 -380680 -448222 -541227 -640261 -699213 -668327 -570712 -502462 -515626 -544421 -500781
30308 -500781 -406576 -360686 -396078 -452944 -492632 -544679 -612648 -624835 -540172 -436524 -418834
30297 -418834 -479102 -517496 -476393 -391146 -330817 -348055 -462082 -623881 -718787 -678685 -581135
$$ packed form
30377f02618l6243l4017l4497l1644K0616J02466J17917L8484l9796l5949R436
30366e25845K2168K390j4706k6802l3049p040M3020N6966J5250k4889l0167m0631
30354e63335o8480n1353K3002N4995q693o0734K522R6482P5126k8711n7997J2720
30342e74456N6243K4621J7653P9001R8254K279r9437p7812J0944J6600p0295j12411
30330f28816l8300O2186P5811N382o5349p8306l1513M7205J12433J17628N8467
30319c63172j7508o7542r3005r9034n8952L0886R7615O8250j3164k8795M3640
30308e00781R4205M5890l5392n6866l9688n2047o7969j2187Q4663J03648J7690
30297d18834o0268l8394M1103Q5247O0329j7238j14027j61799r4906M0102R7550
$$ plain form
30286 -581135 -560081 -623257 -644103 -545171 -401700 -334488 -379008 -497480 -643698 -763502 -795674
30275 -795674 -735157 -651828 -596315 -536411 -442070 -377275 -425768 -557488 -654036 -656046 -608267
30264 -608267 -562585 -517437 -468841 -447425 -468321 -493100 -478186 -433274 -408739 -445418 -542372
30253 -542372 -645025 -666653 -566084 -410430 -312422 -298082 -296348 -273010 -290936 -387868 -476424
30242 -476424 -455484 -370429 -356275 -439571 -507030 -483576 -435136 -449342 -501349 -506673 -450749 -393868
30230 -393868 -379697 -404896 -460969 -542631 -615132 -624611 -554165 -444719 -358965 -338875 -381798
30219 -381798 -436462 -445184 -416128 -421550 -486719 -523233 -441571 -304430 -277712 -418733 -597337
30208 -597337 -663627 -626536 -612895 -694265 -815438 -879495 -852717 -776780 -704911 -646631 -582510
$$ packed form
30286e81135K1054o3176k0846R8932J43471O7212m4520j18472j46218j19804l2172
30275g95674O0517Q3329N5513N9904R4341O4795m8493j31720r6548k010M7779
30264f08267M5682M5148M8596K1416k0896k4779J4914M4912K4535l6679r6954
30253e42372j02653k1628J00569J55654R8008J4340J734K3338j7926r6932q8556
30242d76424K0940Q5055J4154q3296o7459K3454M8440j4206n2007n324N5924N6881
30230c93868J4171k5199n6073q1662p2501r479P0446J09446Q5754K0090m2923
30219c81798n4664q722K9056n422o5169l6514Q1662J37141K6718j41021j78604
30208e97337o6290L7091J3641q1370j21173o4057K6778P5937P1869N8280O4121
$$ plain form
30197 -582510 -524841 -527563 -606959 -683183 -655822 -530141 -414461 -392997 -454043 -539446 -597882
30186 -597882 -584390 -485319 -366331 -320976 -343778 -333920 -261340 -237791 -358469 -553715 -680384
30175 -680384 -697291 -662464 -611895 -543282 -486567 -485535 -516215 -510191 -458712 -422960 -445936 -516826
30163 -516826 -607810 -681369 -683976 -607903 -537616 -552336 -604136 -586984 -509176 -484436 -548584 -604307
30151 -604307 -577951 -521917 -513437 -544787 -571949 -597786 -645673 -701562 -730678 -716342 -660467 -588516
30139 -588516 -557919 -600863 -660742 -662566 -637757 -672795 -735265 -692048 -531579 -409673 -406254
30128 -406254 -403469 -318462 -292040 -470790 -722830 -782003 -615438 -439004 -387963 -381356 -336149
30117 -336149 -314802 -382004 -468530 -476325 -418397 -373140 -378131 -432175 -526284 -612673 -614183 -523287
$$ packed form
30197e82510N7669k722p9396p6224K7361J25681J15680K1464o1046q5403n8436
30186e97882J3492R9071J18988M5355k2802R858P2580K3549j20678j95246j26669
30175f80384j6907L4827N0569O8613N6715J032l0680O024N1479L5752k2976p0890
30163e16826r0984p3559k607P6073P0287j4720n1800J7152P7808K4740o4148n5723
30151f04307K6356N6034Q480l1350k7162k5837m7887n5889k9116J4336N5875P1951
30139e88516L0597m2944n9879j824K4809l5038o2470M3217J60469J21906L419
30128d06254K785Q5007K6422j78750k52040n9173J66565J76434N1041O607M5207
30117c36149K1347o7202q6526p795N7928M5257m991n4044r4109q6389j510R0896
$$ plain form
30105 -523287 -430371 -407881 -433766 -468258 -518182 -569780 -555913 -473274 -441931 -542811 -672157
30094 -672157 -682387 -608219 -604277 -686163 -700448 -574044 -435453 -421039 -489297 -520877 -504435
30083 -504435 -509889 -539603 -528999 -475442 -455764 -504522 -564008 -581880 -586892 -628374 -691013 -715052
30071 -715052 -676545 -613575 -583790 -612808 -672091 -700605 -666855 -611605 -601160 -635701 -644536 -587151
30059 -587151 -513436 -491156 -510974 -507946 -456664 -402358 -404604 -478889 -582868 -637977 -586470 -457988
30047 -457988 -360164 -372269 -468021 -568620 -633380 -655599 -615034 -506244 -388029 -327842 -310805
30036 -310805 -279164 -245489 -274332 -355719 -403899 -401148 -433120 -537869 -622900 -597521 -502343
30025 -502343 -435145 -420837 -428815 -450239 -475554 -456481 -380267 -330592 -381301 -474346 -502269 -471719
$$ packed form
30105e23287R2916K2490k5885l4492m9924n1598J3867Q2639L1343j00880j29346
30094f72157j0230P4168L942q1886j4285J26404J38591J4414o8258l1580J6442
30083e04435n454k9714J0604N3557J9678m8758n9486j7872n012m1482o2639k4039
30071g15052L8507O2970K9785k9018n9283k8514L3750N5250J0445l4541q835N7385
30059e87151P3715K2280j9818L028N1282N4306k246p4285j03979n5109N1507J28482
30047d57988R7824j2105r5752j00599o4760k2219M0565J08790J18215O0187J7037
30036c10805L1641L3675k8843q1387m8180K751l1972j04749q5031K5379R5178
30025e02343O7198J4308p978k1424k5315J9073P6214M9675n0709r3045k7923L0550
$$ plain form
30013 -471719 -472933 -514483 -515691 -461997 -436491 -466518 -460349 -356991 -242268 -235920 -326010 -397103
30001 -397103 -388322 -347012 -335169 -350645 -360117 -365215 -395838 -447478 -468734 -435396 -401603 -423535
29989 -423535 -454408 -402886 -304708 -321783 -508969 -692897 -691641 -565258 -503528 -527923 -487864
29978 -487864 -342020 -245020 -299928 -398205 -402307 -348953 -352083 -408856 -435291 -426661 -447396 -494528
29966 -494528 -497374 -450787 -440747 -515063 -608125 -626846 -561917 -485378 -466178 -508696 -563272 -586083
29954 -586083 -580787 -570788 -548137 -491553 -429343 -421977 -465138 -476853 -417284 -357196 -374182 -436712
29942 -436712 -459704 -435872 -435170 -490276 -554956 -581156 -581676 -597723 -635298 -654090 -617242 -547510
29930 -547510 -516649 -559307 -622551 -643572 -644622 -673163 -675848 -556063 -367594 -302420 -421714
$$ packed form
30013d71719j214m1550j208N3694K5506l0027O169J03358J14723O348r0090p1093
30001c97103Q781M1310J1843j5476r472n098l0623n1640k1256L3338L3793k1932
29989d23535l0873N1522R8178j7075j87186j83928J256J26383O1730k4395M0059
29978d87864J45844R7000n4908r8277m102N3354l130n6773k6435Q630k0735m7132
29966d94528k846M6587J0040p4316r3062j8721O4929P6539J9200m2518n4576k2811
29954e86083N296R999K2651N6584O2210P366m3161j1715N9569O0088j6986o2530
29942d36712k2992K3832P02n5106o4680k6200n20j6047l7575j8792L6848O9732
29930e47510L0861m2658o3244k1021j050k8541k685J19785J88469O5174j19294
$$ plain form
29919 -421714 -539806 -478448 -311799 -225883 -240855 -237667 -189358 -181699 -227277 -232661 -161901 -87843
29907 -87843 -64995 -79621 -133323 -241483 -337485 -322901 -239989 -249881 -398326 -544616 -574047
29896 -574047 -537534 -515416 -489618 -441392 -438859 -513843 -566576 -514760 -439691 -458577 -538342 -568559
29884 -568559 -542652 -523848 -495377 -403451 -311259 -344114 -484470 -573507 -532144 -441108 -376009
29873 -376009 -303891 -198276 -132844 -176984 -278654 -328631 -290771 -214246 -165008 -190418 -300220
29862 -300220 -432812 -484815 -424904 -344457 -350925 -441698 -523942 -528420 -460567 -364648 -283469 -242377
29850 -242377 -238856 -253436 -284879 -351422 -442766 -509066 -525742 -528902 -547910 -546522 -488998 -428742
29838 -428742 -451949 -544573 -600982 -578544 -559289 -617584 -699051 -695055 -589411 -459847 -365326
$$ packed form
29919d21714j18092O1358J66649Q5916j4972L188M8309P659m5578n384P0760P4058
29907h7843K2848j4626n3702j08160r6002J4584Q2912r892j48445j46290k9431
29896e74047L6513K2118K5798M8226K533p4984n2733N1816P5069j8886p9765l0217
29884e68559K5907J8804K8471R1926R2192l2855j40356q9037M1363R1036O5099
29873c76009P2118J05615O5432m4140j01670m9977L7860P6525M9238k5410j09802
29862c00220j32592n2003N9911Q0447o468r0773q2244m478O7853R5919Q1179M1092
29850b42377L521j4580l1443o6543r1344o6300j6676l160j9008J388N7524O0256
29838d28742k3207r2624n6409K2438J9255n8295q1467L996J05644J29564R4521
$$ plain form
29827 -365326 -311226 -310933 -388019 -496544 -524043 -424053 -288363 -235427 -274548 -336745 -392857
29816 -392857 -463001 -534675 -558406 -527231 -487085 -459275 -421421 -377385 -373133 -418105 -458285 -457205
29804 -457205 -438051 -414154 -353813 -262525 -222276 -277875 -350309 -349612 -320376 -370991 -487319 -529592
29792 -529592 -420858 -244112 -131415 -131842 -209077 -298013 -334047 -285408 -192100 -137101 -161533
29781 -161533 -240488 -339753 -443915 -525239 -546585 -513515 -473456 -451024 -434366 -429533 -464779
29770 -464779 -529967 -578618 -602573 -631231 -645484 -586549 -479539 -441679 -510532 -567569 -511637
29759 -511637 -409880 -374301 -380018 -339972 -291860 -347620 -480564 -530963 -444381 -351803 -364175
29748 -364175 -427442 -458289 -497689 -613872 -738278 -736262 -613373 -525555 -569084 -660353 -668130
$$ packed form
29827c65326N4100K93p7086j08525k7499R9990J35690N2936l9121o2197n6112
29816c92857p0144p1674k3731L1175M0146K7810L7854M4036M252m4972m0180J080
29804d57205J9154K3897O0341R1288M0249n5599p2434O97K9236n0615j16328m2273
29792e29592J08734J76746J12697m27p7235q8936l6034M8639R3308N4999k4432
29781a61533p8955r9265j04162q1324k1346L3070M0059K2432J6658M833l5246
29770d64779o5188m8651k3955k8658j4253N8935J07010L7860o8853n7037N5932
29759e11637J01757L5579n717M0046M8112n5760j32944n0399Q6582R2578j2372
29748c64175o3267l0847l9400j16183j24406K016J22889Q7818m3529r1269p777
$$ plain form
29737 -668130 -595144 -561162 -630054 -720637 -710830 -591066 -470042 -437222 -472480 -511168 -543448
$$ packed form
29737f68130P2986L3982o8892r0583R807J19764J21024L2820l5258l8688l2280
$$ [...]
##END NTUPLES=NMR SPECTRUM
##END=
