##TITLE=31Pdec_LY-Dixlofos2
 CDCl3, 24 sc
 27.10.2020
##JCAMPDX= 6.0         $$ Bruker NMR JCAMP-DX V2.0
##DATA TYPE= NMR SPECTRUM
##DATA CLASS= NTUPLES
##ORIGIN= UXNMR, Bruker Analytische Messtechnik GmbH
##OWNER= root
$$ XWIN-NMR		Version 3.5
$$ Tue Oct 27 12:28:33 2020 Russian Standard Time (UT+4h)  she@DPX200
##.OBSERVE FREQUENCY= 81.013821
##.OBSERVE NUCLEUS= ^31P
##.ACQUISITION MODE= SIMULTANEOUS
##.ACQUISITION SCHEME= undefined
##.AVERAGES= 24
##.DIGITISER RES= 17
##SPECTROMETER/DATA SYSTEM= spect
##.PULSE SEQUENCE= zgpg30
##.SOLVENT NAME= CDCl3
##.SHIFT REFERENCE= (INTERNAL, CDCl3, 0, 182.463)
##AUDIT TRAIL= $$ (NUMBER, WHEN, WHO, WHERE, WHAT)
$$ ##TITLE= Audit trail, XWIN-NMR		Version 3.5
$$ ##JCAMPDX= 5.01
$$ ##ORIGIN= Bruker BioSpin GmbH
$$ ##OWNER= she
$$ F:/spectra/data/she/nmr/P31/1/pdata/1/auditp.txt
$$ ##AUDIT TRAIL=  $$ (NUMBER, WHEN, WHO, WHERE, WHAT)
(   1,<2020-10-27 12:26:49.82 +0400>,<she>,<DPX200>,
      <created by zg, POWCHK disabled, PULCHK disabled
       configuration hash MD5:
       00 E9 B6 7A A2 85 ED C7 34 08 36 98 17 FE 4E 26
       data hash MD5: 32K
       4E 49 81 28 F6 72 A4 01 67 D9 A7 73 7A CF A6 20>)
(   2,<2020-10-27 12:26:52.18 +0400>,<she>,<DPX200>,
      <Start of raw data processing
       efp BC_mod = 2 LB = 1 FT_mod = 6 PKNL = 1 PHC0 = -2388.402 PHC1 = 39.4007 SI = 64K 
       data hash MD5: 64K
       10 B2 A4 D8 7F 5F FD 39 67 DA A5 99 C3 22 EE 42>)
(   3,<2020-10-27 12:27:17.75 +0400>,<she>,<DPX200>,
      <pk PHC0 = 13.0093 PHC1 = 21.2 
       data hash MD5: 64K
       F1 A3 15 57 D9 07 79 6F 87 65 77 FE 9D 4D C0 90>)
$$ ##END=
$$ 
$$ hash MD5
$$ 43 DD 14 AE 71 51 12 8D C5 6F 49 38 16 8B F3 40
##$RELAX= 
##$RELAX= 
##$RELAX= 
##$RELAX= 
##$RELAX= 
##$RELAX= 
##$RELAX= 
##$RELAX= 
$$ Bruker specific parameters
$$ --------------------------
##$DU= <F:/spectra>
##$EXPNO= 1
##$NAME= <P31>
##$PROCNO= 1
##$TYPE= <nmr>
##$USER= <she>
##$AMP= (0..31)
100 100 100 100 100 100 100 100 100 100 100 100 100 100 100 100 100 100 
100 100 100 100 100 100 100 100 100 100 100 100 100 100 
##$AQSEQ= 0
##$AQ_mod= 1
##$AUNM= <au_zg>
##$AUTOPOS= <>
##$BF1= 81.014009
##$BF2= 200.13
##$BF3= 200.13
##$BF4= 200.13
##$BF5= 200.13
##$BF6= 200.13
##$BF7= 200.13
##$BF8= 200.13
##$BYTORDA= 1
##$CFDGTYP= 0
##$CFRGTYP= 5
##$CHEMSTR= <none>
##$CNST= (0..31)
1 1 145 1 1 1 1 1 1 1 1 1 1 1 1 1 1 1 1 1 1 1 1 1 1 1 1 1 1 1 1 1 
##$CPDPRG= <waltz16>
##$CPDPRG1= <>
##$CPDPRG2= <waltz16>
##$CPDPRG3= <>
##$CPDPRG4= <mlev>
##$CPDPRG5= <mlev>
##$CPDPRG6= <mlev>
##$CPDPRG7= <mlev>
##$CPDPRG8= <mlev>
##$CPDPRGB= <>
##$CPDPRGT= <>
##$D= (0..31)
0 1 0 0 0 0 0 0 0 0 0 0.03 2e-05 3e-06 0 0 0 0 0 0 0 0 0 0 0 0 0 0 0 0 
0 0 
##$DATE= 1603787209
##$DBL= (0..7)
120 120 120 11 120 120 24 19 
##$DBP= (0..7)
150 150 150 150 150 150 150 150 
##$DBP07= 0
##$DBPNAM0= <>
##$DBPNAM1= <>
##$DBPNAM2= <>
##$DBPNAM3= <>
##$DBPNAM4= <>
##$DBPNAM5= <>
##$DBPNAM6= <>
##$DBPNAM7= <>
##$DBPOAL= (0..7)
0.5 0.5 0.5 0.5 0.5 0.5 0.5 0.5 
##$DBPOFFS= (0..7)
$$ [...]
##$SUBNAM2= <"">
##$SUBNAM3= <"">
##$SUBNAM4= <"">
##$SUBNAM5= <"">
##$SUBNAM6= <"">
##$SUBNAM7= <"">
##$SUBNAM8= <"">
##$SUBNAM9= <"">
##$SW= 369.568048894756
##$SWIBOX= (0..15)
0 1 3 0 0 0 0 0 0 0 0 0 0 0 0 0 
##$SW_h= 29940.119760479
##$TD= 32768
##$TD0= 1
##$TE= 0
##$TE2= 300
##$TE3= 300
##$TEG= 300
##$TL= (0..7)
0 120 53 12 22 120 120 120 
##$TP= (0..7)
150 150 150 150 150 150 150 150 
##$TP07= 0
##$TPNAME0= <>
##$TPNAME1= <>
##$TPNAME2= <>
##$TPNAME3= <>
##$TPNAME4= <>
##$TPNAME5= <>
##$TPNAME6= <>
##$TPNAME7= <>
##$TPOAL= (0..7)
0.5 0.5 0.5 0.5 0.5 0.5 0.5 0.5 
##$TPOFFS= (0..7)
0 0 0 0 0 0 0 0 
##$TUNHIN= 0
##$TUNHOUT= 0
##$TUNXOUT= 0
##$USERA1= <user>
##$USERA2= <user>
##$USERA3= <user>
##$USERA4= <user>
##$USERA5= <user>
##$V9= 5
##$VALIST= <valist>
##$VCLIST= <CCCCCCCCCCCCCCC>
##$VD= 0
##$VDLIST= <DDDDDDDDDDDDDDD>
##$VPLIST= <PPPPPPPPPPPPPPP>
##$VTLIST= <TTTTTTTTTTTTTTT>
##$WBST= 1024
##$WBSW= 4
##$XGAIN= (0..3)
0 0 0 0 
##$XL= 0
##$YL= 0
##$YMAX_a= 44404
##$YMIN_a= -64204
##$ZGOPTNS= <>
##$ZL1= 120
##$ZL2= 120
##$ZL3= 120
##$ZL4= 120
##$ABSF1= 0
##$ABSF2= 0
##$ABSG= 0
##$ABSL= 0
##$ALPHA= 0
##$AQORDER= 0
##$ASSFAC= 0
##$ASSFACI= 0
##$ASSFACX= 0
##$ASSWID= 0
##$AUNMP= <proc_1d>
##$AZFE= 0.1
##$AZFW= 0.5
##$BCFW= 0
##$BC_mod= 2
##$BYTORDP= 0
##$COROFFS= 0
##$CY= -3
##$DATMOD= 1
##$DC= 0
##$DFILT= <>
##$DTYPP= 0
##$F1P= 0
##$F2P= 0
##$FCOR= 1
##$FTSIZE= 65536
##$FT_mod= 6
##$GAMMA= 0
##$GB= 0
##$INTBC= 1
##$INTSCL= 5.30512e-09
##$ISEN= 30
##$LB= 1
##$LEV0= 0
##$LPBIN= 0
##$MAXI= 10000
##$MC2= 0
##$MEAN= 0
##$ME_mod= 0
##$MI= 50
##$NCOEF= 0
##$NC_proc= -2
##$NLEV= 6
##$NOISF1= 182.463
##$NOISF2= 159.3651
##$NSP= 0
##$NTH_PI= 0
##$NZP= 0
##$OFFSET= 182.463
##$PC= 4
##$PHC0= -2375.393
##$PHC1= 60.6007
##$PH_mod= 1
##$PKNL= yes
##$PPARMOD= 0
##$PSCAL= 0
##$PSIGN= 0
##$REVERSE= no
##$SF= 81.014009
##$SI= 65536
##$SIGF1= 159.3651
##$SIGF2= -187.1042
##$SINO= 113.3802
##$SIOLD= 16384
##$SREGLST= <1H.CDCl3>
##$SSB= 0
##$STSI= 65536
##$STSR= 0
##$SW_p= 29940.119760479
##$SYMM= 0
##$S_DEV= 0
##$TDeff= 32768
##$TDoff= 0
##$TI= <>
##$TILT= no
##$TM1= 0
##$TM2= 0
##$TOPLEV= 0
##$USERP1= <user>
##$USERP2= <user>
##$USERP3= <user>
##$USERP4= <user>
##$USERP5= <user>
##$WDW= 1
##$XDIM= 65536
##$YMAX_p= 293762352
##$YMIN_p= -618837
$$ End of Bruker specific parameters
$$ ---------------------------------
##NTUPLES= NMR SPECTRUM
##VAR_NAME=  FREQUENCY,     SPECTRUM/REAL,   SPECTRUM/IMAG
##SYMBOL=    X,             R,               I
##VAR_TYPE=  INDEPENDENT,   DEPENDENT,       DEPENDENT
##VAR_FORM=  AFFN,          ASDF,            ASDF
##VAR_DIM=   65536,         65536,           65536
##UNITS=     HZ,            ARBITRARY UNITS, ARBITRARY UNITS
##FACTOR=    0.456856943014862, 1,           1
##FIRST=     14782.0589164895, 0,            0
##LAST=      -15158.0608439895, 0,           0
##MIN=       -15158.0608439895, -618837,     0
##MAX=       14782.0589164895, 293762352,    0
$$ Real data points
##PAGE= N=1
##DATA TABLE= (X++(R..R)), XYDATA
$$ [...]
##PAGE= N=2
##DATA TABLE= (X++(I..I)), XYDATA
$$ plain form
35787 289697 368904 461325 466217 395558 345068 358764 395905 408601 382875 323229 263469 270371
35775 270371 365345 465444 480138 441040 441171 468129 421246 301609 248241 335392 453367
35764 453367 464872 383551 316565 313250 358528 443152 541924 578534 513662 427821 420541 464732
35752 464732 463137 417834 425876 511620 580282 562924 512617 518143 589838 664946 677335 601943
35740 601943 473648 372399 349629 370895 372335 356337 374725 437922 511838 586320 662778
35729 662778 688552 605528 466567 395138 410844 407011 334973 293053 372101 517548 621207
35718 621207 660907 666925 632510 555221 503497 538896 613917 641461 629531 651628 711736 738119
35706 738119 698409 627289 545902 447376 365876 363560 426293 460333 429550 417125 498032 615119
$$ packed form
35787B89697P9207R2421M892p0659n0490J3696L7141J2696k5726n9646n9760O902
35775B70371R4974J00099J4694l9098J31K6958m6883j19637n3368Q7151J17975
35764D53367J1505q1321o6986l315M5278Q4624R8772L6610o4872q5841p280M4191
35752D64732j595m5303Q042Q5744O8662j7358n0307N526P1695P5108J2389p5392
35740F01943j28295j01249k2770K1266J440j5998J8388O3197P3916P4482P6458
35729F62778K5774q3024j38961p1429J5706l833p2038m1920P9048J45447J03659
35718F21207L9700O018l4415p7289n1724L5399P5021K7544j1930K2097O0108K6383
35706G38119l9710p1120q1387r8526q1500k316O2733L4040l0783j2425Q0907J17087
$$ plain form
35694 615119 654412 608457 584406 645247 710587 657500 490631 356943 377658 506034 590309
35683 590309 555267 467319 422977 440354 487296 550714 619579 641590 569597 440735 349035
35672 349035 337595 365748 383841 390932 407412 434185 460505 485626 514878 548332 578102 583861
35660 583861 539868 452521 382534 391988 466944 531993 549995 560636 594560 597881 499921 336648
35648 336648 237324 270848 362836 404915 398917 426054 497762 528179 473345 409979 422396 482728
35636 482728 517742 534422 579791 615881 557954 433148 373200 420968 466547 428230 377365
35625 377365 399074 435164 385891 299075 320045 472256 610581 608056 497911 408071 423263
35614 423263 530645 645554 676095 608522 534674 550657 632183 663907 590391 476731 412452
$$ packed form
35694F15119L9293m5955k4051O0841O5340n3087j66869j33688K0715J28376Q4275
35683E90309l5042q7948m4342J7377M6942O3418O8865K2011p1993j28862r1700
35672C49035j1440K8153J8093P091J6480K6773K6320K5121K9252L3454K9770N759
35660E83861m3993q7347o9987R454P4956O5049J8002J0641L3924L321r7960j63273
35648C36648r9324L3524R1988M2079n998K7137P1708L0417n4834o3366J2417O0332
35636D82728L5014J6680M5369L6090n7927j24806n9948M7768M5579l8317n0865
35625C77365K1709L6090m9273q6816K0970J52211J38325k525j10145q9840J5192
35614D23263J07382J14909L0541o7573p3848J5983Q1526L1724p3516j13660o4279
$$ plain form
35603 412452 417979 463027 516731 550883 543213 508854 489898 491872 477492 449318 477346 588633
35591 588633 680080 627768 469155 380417 445565 538945 508150 404546 413857 572142 689979
35580 689979 614842 449068 397734 481170 540486 491484 413326 373919 328263 250243 224539
35569 224539 311696 426202 451529 395532 332803 271666 193196 158200 244447 407942 524397
35558 524397 551896 549493 554094 543553 509517 469094 418128 364066 372663 470147 535076 432029
35546 432029 240193 186162 330101 485919 504590 471392 531219 660924 736404 723861 681377
35535 681377 643452 619949 652930 759599 854397 831815 705232 577390 500782 457506 452208
35524 452208 518848 629921 693684 670541 625718 636845 697779 740914 720848 655273 605223
$$ packed form
35603D12452N527M5048N3704L4152p670l4359j8956J974j4380k8174K8028J11287
35591E88633R1447n2312j58613q8738O5148R3380l0795j03604R311J58285J17837
35580F89979p5137j65774n1334Q3436N9316m9002p8158l9407m5656p8020k5704
35569B24539Q7157J14506K5327n5997o2729o1137p8470l4996Q6247J63495J16455
35558E24397K7499k403M601j0541l4036m0423n0966n4062Q597R7484O4929j03047
35546D32029j91836n4031J43939J55818J8671l3198N9827J29705P5480j2543m2484
35535F81377l7925k3503L2981J06669R4798k2582j26583j27842p6608m3276n298
35524D52208O6640J11073O3763k3143m4823J1127O0934M3135k0066o5575n0050
$$ plain form
35513 605223 622980 697547 750546 713195 611382 547371 586828 684215 734468 689887 611378
35502 611378 595796 656686 701956 653381 564349 562731 672177 758181 694258 529655 425641
35491 425641 450304 512383 504550 440466 411527 455819 525554 566584 573544 559216 519462 456019
35479 456019 397744 364210 339099 322397 372841 526033 688822 712319 587984 474970 490442
35468 490442 566144 575777 511817 445146 390212 327111 299946 360721 444362 433546 342765 311344
35456 311344 403717 533193 597868 579203 492475 362049 271835 313613 440333 487590 391754
35445 391754 275309 264086 337679 423911 517183 615419 652755 601450 551050 581622 639108
35434 639108 642023 631572 693223 790774 809668 732996 656769 647757 685478 726907 737220 677394
$$ packed form
35513F05223J7757P4567N2999l7351j01813o4011L9457R7387N0253m4581p8509
35502F11378j5582O0890M5270m8575q9032j618J09446Q6004o3923j64603j04014
35491D25641K4663O2079p833o4084k8939M4292O9735M1030O960j4328l9754o3443
35479D56019n8275l3534k5111j6702N0444J53192J62789K3497j24335j13014J5472
35468D90442P5702R633o3960o6671n4934o3101k7165O0775Q3641j0816r0781l1421
35456C11344R2373J29476O4675j8665q6728j30426r0214M1778J26720M7257r5836
35445C91754j16445j1223P3593Q6232R3272R8236L7336n1305n0400L0572N7486
35434F39108K915j0451O1651R7551J8894p6672p6227r012L7721M1429J0313n9826
$$ plain form
35422 677394 552921 458156 485225 603248 705853 751346 766355 740321 632129 484087
35412 484087 417970 484059 593597 634525 593189 532913 504426 510362 526222 529739 520173 515047
35400 515047 525722 549506 585334 624070 622056 540017 424146 382290 450611 552654 619692
35389 619692 664218 693437 660520 576082 556536 657959 762730 752037 694379 719552 795185
35378 795185 802452 766899 813534 920801 929079 808938 721968 765529 833390 800886 698891
35367 698891 623895 598771 599354 614809 616826 566794 506104 534739 649801 721996 695341 688080
35355 688080 809306 985880 1075067 1061617 1036056 1044262 1062155 1071472 1067960 1030208 957299 902969
35343 902969 906207 925432 903288 857404 844780 870218 887136 862961 805116 756425 787161 932033
$$ packed form
35422F77394j24473r4765K7069J18023J02605M5493J5009k6034j08192j48042
35412D84087o6117O6089J09538M0928m1336o0276k8487N936J5860L517r566n126
35400E15047J0675K3784L5828L8736k014q2039j15871m1856O8321J02043O7038
35389F19692M4526K9219l2917q4438j9546J01423J04771j0693n7658K5173P5633
35378G95185P267l5553M6635J07267Q278j20141q6970M3561O7861l2504j01995
35367F98891p4996k5124N83J5455K017n0032o0690K8635J15062P2195k6655p261
35355F88080J21226J76574Q9187j3450k5561Q206J7893R317l512l7752p2909n4330
35343I02969L238J9225k2144m5884j2624K5438J6918k4175n7845m8691L0736J44872
$$ plain form
35331 932033 1107208 1168796 1097943 1040031 1098884 1187104 1169138 1065613 1000451 1007408 1015426
35320 1015426 992071 978724 995431 1021676 1069282 1169177 1276504 1288192 1181515 1057710 1021524
35309 1021524 1079208 1171958 1246820 1275385 1262288 1257083 1304035 1363133 1342866 1239653 1179377
35298 1179377 1266208 1435196 1524282 1478286 1412218 1456841 1602005 1739876 1824564 1912089 2036451
35287 2036451 2129021 2117890 2053415 2054930 2154854 2278395 2374291 2477962 2624704 2780515 2898033
35276 2898033 2981318 3057520 3127698 3159847 3070677 2709473 1961291 919293 -125149 -926765
35266 -926765 -1464034 -1839960 -2104188 -2246814 -2277540 -2210341 -2033742 -1790027 -1614125 -1582398
35256 -1582398 -1584286 -1470980 -1281158 -1174048 -1171013 -1131467 -992662 -863712 -832057 -828292 -764810
$$ packed form
35331I32033J75175O1588p0853n7912N8853Q8220j7966j03525o5162O957Q018
35320A015426k3355j3347J6707K6245M7606R9895J07327J1688j06677j23805l6186
35309A021524N7684R2750P4862K8565j3097n205M6952N9098k0267j03213o0276
35298A179377Q6831J68988Q9086m5996o6068M4623J45164J37871Q4688Q7525J24362
35287B036451R2570j1131o4475J515R9924J23541R5896J03671J46742J55811J17518
35276B898033Q3285P6202P0178L2149q9170l61204p48182j041998j044442q01616
35266i26765n37269l75926k64228j42626l0726O7199J76599K43715J75902L1727
35256a582398j888J13306J89822J07110L035L9546J38805J28950L1655L765O3482
$$ plain form
35245 -764810 -684952 -670635 -687571 -630039 -471481 -283261 -141373 -90375 -159705 -325615 -472088
35234 -472088 -475904 -342504 -198109 -139083 -145363 -155205 -162353 -195551 -238900 -230103 -139339 -10518
35222 -10518 89369 133003 125203 62262 -57809 -190829 -261411 -241533 -181025 -140812 -128600
35211 -128600 -121422 -109095 -75991 19310 182609 320980 313958 160082 -4774 -58359 -16282
35200 -16282 21897 9664 -8077 23807 99098 172069 221006 261351 300172 308564 261547 190478
35188 190478 162182 201211 261082 284275 266213 244819 249082 277478 312226 336967 346657 345889
35176 345889 332455 296533 257847 276958 376120 465310 426711 282660 191027 238667 329387
35165 329387 335885 275052 243372 249068 224682 172041 172632 247456 306948 268886 159752 76807
$$ packed form
35245g64810P9858J4317j6936N7532J58558J88220J41888N0998o9330j65910j46473
35234d72088l816J33400J44395N9026o280r842p148l3198m3349Q797R0764J28821
35222a0518R9887M3634p800o2941j20071j33020p0582J9878O0508M0213J2212
35211a28600P178J2327L3104R5301J63299J38371p022j53876j64856n3585M2077
35200a6282L8179j2233j7741L1884P5291P2971M8937M0345L8821Q392m7017p1069
35188A90478k8296L9029N9871K3193j8062k1394M263K8396L4748K4741R690p68
35176C45889j3434l5922l8686J9111R9162Q9190l8599j44051r1633M7640R0720
35165C29387O498o0833l1680N696k4386n2641N91P4824N9492l8062j09134q2945
$$ plain form
35153 76807 95419 216790 360014 412489 341116 243014 229304 277658 273719 184226 98624
35142 98624 95096 158058 244914 336944 388087 321238 143346 -4909 10430 165275 323945
35131 323945 398593 403425 383775 363074 356437 380064 432250 490379 528746 523753 456310 339272
35119 339272 237138 225044 314925 437612 509752 510809 482657 459902 428216 369362 319347
35108 319347 332181 389282 407022 357104 317016 355875 426537 435099 373690 309970 279613 275138
35096 275138 317286 435531 575324 624278 554558 454728 394873 347539 281208 244067 288788
35085 288788 375495 420203 404083 376675 377446 402996 429349 424806 363503 267658 217699 278068
35073 278068 417897 533340 546124 468601 385389 380263 462225 555312 580305 544207 517219
$$ packed form
35153G6807J8612J21371J43224N2475p1373r8102j3710M8354l939q9493q5602
35142I8624l528O2962Q6856R2030N1143o6849j77892j48255J5339J54845J58670
35131C23945P4648M832j9650k0701o637K3627N2186N8129L8367m993o7443j17038
35119C39272j02134j2094Q9881J22687P2140J057k8152k2755l1686n8854n0015
35108C19347J2834N7101J7740m9918m0088L8859P0662Q562o1409o3720l0357m475
35096B75138M2148J18245J39793M8954o9720r9830n9855m7334o6331l7141M4721
35085B88788Q6707M4708j6120k7408P71K5550K6353m543o1303r5845m9959O0369
35073B78068J39829J15443J2784p7523q3212n126Q1962R3087K4993l6098k6988
$$ plain form
35062 517219 526689 525917 478884 419262 397437 415920 447756 475356 479477 435616 361500 325991
35050 325991 362935 410577 389016 311552 262803 282209 328425 357385 376284 401061 408595 372369
35038 372369 327284 352778 473519 603098 623939 523990 416062 404878 474299 537880 558757
35027 558757 562704 560836 533390 487359 460529 457202 440493 401341 376554 383579 396587 404891
35015 404891 433123 479177 494142 457205 415695 414887 435935 436698 409656 370832 336838 336251 389899
35002 389899 453964 443099 344010 248049 237829 303352 401007 515257 611744 614412 506496
34991 506496 389694 364619 408716 447428 479668 536647 575363 532024 450449 437429 499471
34980 499471 536846 502849 457479 443845 420102 357678 316517 360451 455110 508320 481763
$$ packed form
35062E17219R470p72m7033n9622k1825J8483L1836K7600M121m3861p4116l5509
35050C25991L6944M7642k1561p7464m8749J9406M6216K8960J8899K4777P534l6226
35038C72369m5085K5494J20741J29579K0841r9949j07928j1184O9421O3581K0877
35027E58757L947j868k7446m6031k6830l327j6709l9152k4787P025J3008Q304
35015D04891K8232M6054J4965l6937m1510q08K1048P63k7042l8824l3994n87N3648
35002C89899O4065j0865r9089r5961j0220O5523R7655J14250R6487K668j07916
34991E06496j16802k5075M4097L8712L2240N6979L8716m3339q1575j3020O2042
34980D99471L7375l3997m5370j3634k3743o2424m1161M3934R4659N3210k6557
$$ plain form
34969 481763 422745 404573 458330 548226 607792 615977 622709 667884 704170 662635 575642 546571
34957 546571 589154 592979 488453 357220 310874 330621 318842 268996 278545 391615 524747
34946 524747 585095 591805 626361 707605 778210 795273 774528 747618 730376 738081 773060 780921
34934 780921 687216 518087 417677 478171 606528 647820 600074 593795 672791 728736 682031
34923 682031 597888 556554 521536 433249 346986 359945 448994 496608 459794 411196 414953 452917
34911 452917 485879 512844 549440 599999 661875 717021 726818 683240 649370 685933 747963 729603
34899 729603 615215 506317 478495 491696 483324 476118 523500 592764 588713 492981 407120 424935
34887 424935 508465 541008 484784 425422 446108 516909 555877 556255 580286 642106 677574 642925
$$ packed form
34969D81763n9018j8172N3757Q9896N9566Q185O732M5175L6286m1535q6993k9071
34957E46571M2583L825j04526j31233m6346J9747j1779m9846R549J13070J33132
34946E24747O0348O710L4556Q1244P0605J7063k0745k6910j7242P705L4979P861
34934G80921r3705j69129j00410O0494J28357M1292m7746o279P8996N5945m6705
34923F82031q4143m1334l5018q8287q6263J2959Q9049M7614l6814m8598L757L7964
34911D52917L2962K6965L6596N0559O1876N5146R797m3578l3870L6563O2030j8360
34899G29603j14388j08898k7822J3201q372p206M7382O9264m051r5732q5861J7815
34887D24935Q3530L2543n6224n9362K0686P0801L8968L78K4031O1820L5468l4649
$$ plain form
34875 642925 572747 517566 487655 482332 507239 530197 487771 377817 286003 281796 348740 448851
34863 448851 575205 694663 728654 659346 575622 546539 537164 522515 572269 709933 796227
34852 796227 704944 537638 496804 597503 678422 667178 650523 683205 707492 687219 659798
34841 659798 624779 536054 437689 447727 561187 628959 591062 569341 651309 742126 734263
34830 734263 678855 665781 658092 582794 489708 481768 556757 640381 710965 772105 765777 644075
34818 644075 485880 418098 446759 474633 458744 442126 450473 464602 486939 540548 607747
34807 607747 650623 678092 715633 735489 703859 666248 683941 710904 649845 519637 443569
34796 443569 466742 513738 547308 628575 765175 833515 745326 591601 515893 519800 508499
$$ packed form
34875F42925p0178n5181k9911n323K4907K2958m2426j09954r1814m207O6944J00111
34863D48851J26354J19458L3991o9308q3724k9083r375j4649M9754J37664Q6294
34852G96227r1283j67306m0834J00699Q0919j1244j6655L2682K4287k0273k7421
34841F59798l5019q8725r8365J0038J13460O7772l7897k1721Q1968R0817p863
34830G34263n5408j3074p689p5298r3086p940P4989Q3624P0584O1140o328j21702
34818F44075j58195o7782K8661K7874j5889j6618Q347J4129K2337N3609O7199
34807F07747M2876K7469L7541J9856l1630l7611J7693K6963o1059j30208p6068
34796D43569K3173M6996L3570Q1267J36600O8340q8189j53725p5708L907j1301
$$ plain form
34785 508499 474631 503117 603869 670059 637353 582385 604052 681142 722343 711507 717067
34774 717067 767862 803502 772176 713027 696604 725282 746035 740177 743415 777075 809892 805318
34762 805318 774287 761973 798901 873254 937714 945661 899126 853404 849796 857151 817107 734725
34750 734725 670942 645207 609691 542249 504183 560409 679566 761028 746421 673116 627989
34739 627989 665988 757893 806224 736881 589362 490951 527743 666742 812175 898716 912343
34728 912343 865630 790246 728891 705184 717001 766641 860026 963177 1011172 991391 969801
34717 969801 994989 1023092 988903 909349 852071 830461 803282 767052 770967 826895 873607 863575
34705 863575 831898 830948 831353 751766 586545 444145 428259 520707 624688 691439 738366 756754
$$ packed form
34785E08499l3868K8486J00752O6190l2706n4968K1667P7090M1201j0836N560
34774G17067N0795L5640l1326n9149j6423K8678K0753n858L238L3660L2817m574
34762H05318l1031j2314L6928P4353O4460P947m6535m5722l608P355m0044q2382
34750G34725o3783k5735l5516o7442l8066N6226J19157Q1462j4607p3305m5127
34739F27989L7999R1905M8331o9343j47519r8411L6792J38999J45433Q6541J3627
34728I12343m6713p5384o1355k3707J1817M9640R3385J03151M7995j9781k1590
34717I69801K5188K8103l4189p9554n7278k1610k7179l6230L915N5928M6712j0032
34705H63575l1677r50M05p9587j65221j42400j5886R2448J03981O6751M6927J8388
$$ plain form
34693 756754 694690 560472 453887 434324 434133 382262 341290 410846 546643 612144 593565
34682 593565 618958 743642 852650 826536 694097 565709 509621 544744 660888 787162
34672 787162 825146 769533 716238 708994 680405 600050 561031 630891 726557 747497 737970 790881
34660 790881 868550 861489 777815 733190 771943 822266 821723 779504 719283 657660 633532 669487
34648 669487 714831 713812 710254 784153 898287 921394 814156 687901 653449 700029 753541
34637 753541 778089 783745 789523 808502 834336 835551 796891 752554 733552 707262 631278 542473
34625 542473 514578 540116 537644 476590 415908 411230 455777 521751 590832 633067 621832 584109
34613 584109 579764 623033 676141 715797 744078 740572 680793 610069 621604 736928 871134
$$ packed form
34693G56754o2064j34218j06585j9563j91n1871m0972O9556J35797O5501j8579
34682E93565K5393J24684J09008k6114j32439j28388n6088L5123J16144J26274
34672G87162L7984n5613n3295p244k8589q0355l9019O9860R5666K0940r527N2911
34660G90881P7669p061q3674m4625L8753N0323n43m2219o0221o1623k4128L5955
34648F69487M5344j019l558P3899J14134K3107j07238j26255l4452M6580N3512
34637G53541K4548N656N778J8979K5834J215l8660m4337j9002k6290p5984q8805
34625E42473k7895K5538k472o1054o0682m678M4547O5974O9081M2235j1235l7723
34613E84109m345M3269N3108L9656K8281l506n9779p0724J1535J15324J34206
$$ plain form
34602 871134 942033 957475 965155 965157 915593 807945 704856 688914 768241 850910 850476 802053
34590 802053 803148 844152 811858 696445 653993 768807 885727 820336 630435 509937 495801
34579 495801 476390 439678 494031 644048 757153 785004 822368 895154 879372 711419 517396
34568 517396 443890 493955 604535 746585 866714 869817 759512 676035 701060 743631 713756
34557 713756 680464 738411 832124 849916 805330 788624 804082 786260 729657 683889 657207
34546 657207 627121 610015 628988 653300 654457 674494 753188 840209 869383 865884 884283 894513
34534 894513 834882 733879 672794 664325 671013 705131 799734 911192 962354 959858 961919 958015
34522 958015 899364 826529 831781 894059 887424 776741 676079 670137 695373 661181 592314 574203
$$ packed form
34602H71134P0899J5442P680Km9564j07648j03089j5942P9327Q2669m34m8423
34590H02053J095M1004l2294j15413m2452J14814J16920o5391j89901j20498j4136
34579D95801j9411l6712N4353J50017J13105K7851L7364P2786j5782j67953j94023
34568E17396p3506N0065J10580J42050J20129L103j10305q3477K5025M2571k9875
34557G13756l3292N7947R3713J7792m4586j6706J5458j7822n6603m5768k6682
34546F57207l0086j7106J8973K4312J157K0037P8694Q7021K9174l499J8399J0230
34534H94513n9631j01003o1085q469O688L4118R4603J11458N1162k496K061l904
34522I58015n8651p2835N252O2278o635j10683j00662n942K5236l4192o8867j8111
$$ plain form
34510 574203 621879 675664 689500 671923 667688 727969 859623 980251 977450 850248 739012
34499 739012 763958 877841 940443 906373 861996 882104 931596 939716 907324 882863 867536
34488 867536 816125 729772 677979 703181 762330 804190 851277 943058 1036582 1044477 963101 888382
34476 888382 895972 964932 1025778 1027513 955304 842957 770962 789623 844395 845400 802491 801654
34464 801654 848180 845537 756761 673743 677125 728519 756115 750062 717514 648021 589839 648329
34452 648329 822204 951646 932973 875955 920858 1004460 974004 860133 840826 950736 1017649
34441 1017649 924611 775898 732457 798587 854299 827003 753953 707985 718405 760892 799535
34430 799535 828429 860923 884532 868055 823380 803012 815016 814747 814219 896779 1051605 1106615
$$ packed form
34510E74203M7676N3785J3836j7577m235O0281J31654J20628k801j27202j11236
34499G39012K4946J13883O2602l4070m4377K0108M9492Q120l2392k4461j5327
34488H67536n1411q6353n1793K5202N9149M1860M7087R1781R3524P895q1376p4719
34476H88382P590O8960O0846J735p2209j12347p1995J8661N4772J005m2909q37
34464H01654M6526k643q8776q3018L382N1394K7596o053l2548o9493n8182N8490
34452F48329J73875J29442j8673n7018M4903Q3602l0456j13871j9307J09910O6913
34441A017649r3038j48713m3441O6130N5712k7296p3050m5968J0420M2487L8643
34430G99535K8894L2494K3609j6477m4675k0368J2004k69n28Q2560J54826N5010
$$ plain form
34418 1106615 949303 726556 671705 789143 879160 846938 799718 822137 844025 800010 761585
34407 761585 807403 878548 878450 839903 874267 990980 1076383 1054631 985913 972799 1017658 1022633
34395 1022633 926228 791725 723929 729618 728926 698599 708766 785241 838663 802287 746961 761297
34383 761297 801236 782666 754438 827649 972258 1049030 1035019 1048547 1131066 1176043 1129119
34372 1129119 1096139 1159197 1219807 1146582 988533 912778 973180 1051959 1021596 884118 745732
34361 745732 705370 773169 868231 894922 833593 749750 716155 748295 814487 879719 934535
34350 934535 997796 1081521 1142417 1109916 996238 921463 963486 1037486 1016046 922505 886248
34339 886248 931938 953651 905611 871963 904040 926768 882864 851829 920187 1014961 987075
$$ packed form
34418A106615j57312k22747n4851J17438R0017l2222m7220K2419K1888m4015l8425
34407G61585M5818P1145r8l8547L4364J16713Q5403k1752o8718j3114M4859M975
34395A022633r6405j34503o7796N689o92l0327J0167P6475N3422l6376n5326J4336
34383G61297L9939j8570k8228P3211J44609P6772j4011J3528Q2519M4977m6924
34372A129119l2980O3058O0610p3225j58049p5755O0402P8779l0363j37478j38386
34361G45732m0362O7799R5062K6691o1329q3843l3595L2140O6192O5232N4816
34350I34535O3261Q3725O0896l2501j13678p4775M2023P4000k1440r3541l6257
34339H86248M5690K1713m8040l3648L2077K2728m3904l1035O8358R4774k7886
$$ plain form
34328 987075 828855 700573 729964 860236 932007 879839 800163 813277 899053 931757 872479
34317 872479 832327 897604 989960 995166 951284 980058 1081324 1139928 1114214 1070450 1036830
34306 1036830 978688 932029 998336 1160876 1255360 1188011 1055084 983548 979626 1005021 1074790
34295 1074790 1186334 1257075 1230384 1160557 1109835 1046706 933680 834642 835160 910712 961173
34284 961173 939157 882485 857650 911372 1029073 1117859 1099721 1036325 1064676 1187737 1250725
34273 1250725 1167156 1035047 967380 948120 938278 976559 1061085 1069720 938388 803062 814795
34262 814795 913845 945297 910018 927208 1012613 1073173 1084499 1102450 1118812 1069311 979377
34251 979377 947468 977903 975313 918319 897757 954236 1006768 985339 927304 897347 899299 908812
$$ packed form
34328I87075j58220j28282K9391J30272P1771n2168p9676J3114Q5776L2704n9278
34317H72479m0152O5277R2356N206m3882K8774J01266N8604k5714m3764l3620
34306A036830n8142m6659O6307J62540R4484o7349j32927p1536l922K5395O9769
34295A074790J11544P0741k6691o9827n0722o3129j13026r9038N18P5552N0461
34284I61173k2016n6672k4835N3722J17701Q8786j8138o3396K8351J23061O2988
34273A250725q3569j32109o7667j9260r842L8281Q4526Q635j31332j35326J1733
34262H14795R9050L1452l5279J7190Q5405O0560J1326J7951J6362m9501q9934
34251I79377l1909L0435k590n6994k0562N6479N2532k1429n8035k9957J952R513
$$ plain form
34239 908812 922641 940507 951745 959822 977291 997979 1018060 1063021 1137531 1181533 1148430 1091505
34227 1091505 1086635 1105798 1073012 1018496 1051422 1179275 1279276 1272734 1216609 1189699 1191590
34216 1191590 1197460 1218577 1250959 1237090 1140833 1015835 952682 986316 1078442 1158912 1172101
34205 1172101 1119084 1062562 1057468 1083134 1085078 1066242 1076223 1120621 1152111 1154398 1166346 1212018
34193 1212018 1268285 1312402 1344054 1353301 1326257 1289449 1287256 1308267 1298892 1258612 1248560 1284997
34181 1284997 1299082 1241545 1165571 1155192 1211825 1260940 1249833 1199593 1169191 1195122 1265497
34170 1265497 1338050 1375397 1360119 1288674 1180748 1095431 1091310 1148871 1180620 1150232 1126976
34159 1126976 1174150 1242718 1248210 1205067 1193082 1218276 1208671 1147787 1116248 1175456 1281913
$$ packed form
34239I08812J3829J7866J1238Q077J7469K0688K0081M4961P4510M4002l3103n6925
34227A091505m870J9163l2786n4516L2926J27853J00001o542n6125k6910J891
34216A191590N870K1117L2382j3869r6257j24998o3153L3634R2126Q0470J3189
34205A172101n3017n6522n094K5666J944j8836R981M4398L1490K287J1948M5672
34193A212018N6267M4117L1652R247k7044l6808k193K1011r375m0280j0052L6437
34181A284997J4085n7537p5974j0379N6633M9115j1107n0240l0402K5931P0375
34170A265497P2553L7347j5278p1445j07926q5317m121N7561L1749l0388k3256
34159A126976M7174O8568N492m3143j1985K5194r605o0884l1539N9208J06457
$$ plain form
34148 1281913 1347620 1335448 1273199 1215825 1211388 1268881 1344405 1381740 1368894 1336768 1315306
34137 1315306 1314914 1331621 1343004 1321839 1279981 1266455 1293016 1304730 1263738 1215079 1220587 1273439
34125 1273439 1330334 1379065 1416856 1415140 1370896 1338293 1340805 1316687 1235507 1197037 1300090
34114 1300090 1465587 1519104 1424372 1312983 1294754 1353603 1426035 1472860 1469889 1423938 1397683
34103 1397683 1433541 1470554 1429207 1349446 1332901 1372990 1369498 1300371 1245170 1234365 1209635
34092 1209635 1152802 1128181 1168658 1231063 1286720 1347688 1388233 1357891 1293408 1298365 1384750
34081 1384750 1451482 1446705 1429616 1439089 1428155 1376104 1345727 1372598 1403317 1396509 1384707 1387939
34069 1387939 1368840 1325006 1324495 1392522 1455475 1453493 1424715 1428296 1461919 1494749 1505756 1465654
$$ packed form
34148A281913O5707j2172o2249n7374m437N7493P5524L7335j2846l2126k1462
34137A315306l92J6707J1383k1165m1858j3526K6561J1714m0992m8659N508N2852
34125A273439N6895M8731L7791j716m4244l2603K512k4118q1180l8470J03053
34114A300090J65497N3517r4732j11389j8229N8849P2432M6825k971m5951k6255
34103A397683L5858L7013m1347p9761j6545M0089l492o9127n5201j0805k4730
34092A209635n6833k4621M0477O2405N5657O0968M0545l0342o4483M957Q6385
34081A384750O6732m777j7089R473j0934n2051l0377K6871L0719o808j1802L232
34069A387939j9099m3834n11O8027O2953j982k8778L581L3623L2830J1007m0102
$$ plain form
34057 1465654 1366571 1282828 1301909 1386472 1420543 1396839 1417477 1496815 1530848 1497362 1503641
34046 1503641 1574160 1583956 1495841 1467308 1589759 1706510 1660444 1563748 1617629 1778832 1825293
34035 1825293 1692162 1534281 1474156 1471545 1452374 1413314 1371549 1329603 1318956 1388529 1525143
34024 1525143 1648036 1693151 1661966 1601459 1574848 1622090 1708200 1747582 1714464 1677072 1688688
34013 1688688 1718143 1734636 1774108 1854076 1910002 1899599 1887523 1930581 1956841 1871719 1723776
34002 1723776 1644252 1659443 1679260 1652948 1629271 1660415 1727919 1774125 1761389 1708018 1688945
33991 1688945 1761887 1870548 1887376 1787949 1700709 1730973 1825895 1886166 1920692 1993141 2083732
33980 2083732 2106610 2025220 1876881 1727065 1652425 1702592 1824217 1900798 1917125 1981465 2127286
$$ packed form
34057A465654r9083q3743J9081Q4563L4071k3704K0638P9338L4033l3486O279
34046A503641P0519R796q8115k8533J22451J16751m6066r6696N3881J61203M6461
34035A825293j33131j57881o0125k611j9171l9060m1765m1946j0647O9573J36614
34024A525143J22893M5115l1185o0507k6611M7242Q6110L9382l3118l7392J1616
34013A688688K9455J6493L9472P9968N5926j0403j2076M3058K6260q5122j47943
34002A723776p9524J5191J9817k6312k3677L1144O7504M6206j2736n3371j9073
33991A688945P2942J08661J6828r9427q7240L0264R4922O0271L4526P2449R0591
33980B083732K2878q1390j48339j49816p4640N0167J21625P6581J6327O4340J45821
$$ plain form
33969 2127286 2225792 2185822 2100216 2070304 2021324 1849030 1636481 1551808 1615312 1731122 1861617
33958 1861617 1995428 2031621 1900639 1740101 1739886 1852305 1870069 1768018 1739099 1878099
33948 1878099 2051679 2131710 2161156 2218190 2280929 2303503 2293369 2251169 2155445 2058133 2073771
33937 2073771 2219462 2375140 2449928 2481194 2524973 2557806 2542503 2499380 2461524 2434279 2429890
33926 2429890 2466002 2511401 2513305 2484373 2472354 2448884 2343200 2190781 2118644 2159763 2212408
33915 2212408 2217380 2241132 2332672 2430385 2479781 2522832 2591260 2623810 2582908 2553973 2619210
33904 2619210 2707582 2688550 2572872 2507363 2580389 2726093 2832872 2874669 2904524 2960944 3022816
33893 3022816 3053889 3058889 3067905 3079239 3065755 3045325 3082389 3184250 3259152 3237581 3183062
$$ packed form
33969B127286R8506l9970q5606k9912m8980j72294k12549q4673O3504J15810J30495
33958A861617J33811L6193j30982j60538k15J12419J7764j02051k8919J39000
33948A878099J73580Q0031K9446N7034O2739K2574j0134m2200r5724r7312J5638
33937B073771J45691J55678P4788L1266M3779L2833j5303m3123l7856k7245m389
33926B429890L6112M5399J904k8932j2019k3470j05684j52419p2137M1119N2645
33915B212408M972K3752R1540R7713M9396M3051O8428L2550m0902k8935O5237
33904B619210Q8372j9032j15678o5509P3026J45704J06779M1797K9855N6420O1872
33893C022816L1073N000R016J1334j3484k0430L7064J01861P4902k1571n4519
$$ plain form
33882 3183062 3208799 3323182 3435438 3484344 3482900 3458888 3429879 3424231 3460383 3518409 3580363
33871 3580363 3663598 3764408 3826270 3830787 3853001 3942510 4022502 4011191 3971248 4011061 4098186
33860 4098186 4117323 4074261 4087598 4191041 4289725 4317781 4314256 4339123 4423438 4591220 4818813
33849 4818813 4992207 5023273 4987131 5024324 5138123 5222893 5260344 5333179 5460631 5579257
33839 5579257 5685593 5844166 6046659 6208174 6314296 6441589 6632750 6874888 7178075
33830 7178075 7537205 7851127 8039798 8210208 8533824 8989707 9413412 9769139 10169907
33821 10169907 10652828 11156457 11709364 12405189 13184448 13880531 14498744 15208377 16040321
33812 16040321 16845937 17576692 18329832 19068889 19539401 19423861 18226617 15064481 9212073
$$ packed form
33882C183062K5737J14383J12256M8906j444k4012k9009n648L6152N8026O1954
33871C580363Q3235J00810O1862M517K2214Q9509P9992j1311l9943L9813Q7125
33860D098186J9137m3062J3337J03443R8684K8056l525K4867Q4315J67782K27593
33849D818813J73394L1066l6142L7193J13799Q4770L7451P2835J27452J18626
33839E579257J06336J58573K02493J61515J06122J27293J91161K42138L03187
33830G178075L59130L13922J88671J70410L23616M55883M23705L55727M00768
33821A0169907M82921N03629N52907O95825P79259O96083O18213P09633Q31944
33812A6040321Q05616P30755P53140P39057M70512j15540j197244l162136n852408
$$ plain form
33803 9212073 1222870 -6872661 -12930551 -16184038 -17285839 -17263844 -16792808 -16186684 -15537040
33794 -15537040 -14769637 -13828888 -12848225 -12006448 -11303114 -10647464 -10065808 -9628962 -9269970
33785 -9269970 -8869665 -8443122 -8065299 -7703531 -7300493 -6927396 -6673400 -6472379 -6211498
33776 -6211498 -5915961 -5660714 -5413846 -5144976 -4960002 -4924749 -4880473 -4662452 -4391665 -4304525
33766 -4304525 -4382039 -4401497 -4288269 -4156801 -4045871 -3873842 -3646701 -3470687 -3351181 -3193757
33756 -3193757 -3011605 -2927240 -2953509 -2960245 -2876537 -2762387 -2673757 -2606579 -2564170 -2536534 -2444026
33745 -2444026 -2250180 -2079297 -2055257 -2084987 -1993934 -1817546 -1738709 -1776618 -1777853 -1706100 -1693380
33734 -1693380 -1775036 -1805335 -1694413 -1532053 -1417082 -1340774 -1295935 -1333130 -1439245 -1499170
$$ packed form
33803I212073p989203q095531o057890l253487j101801K1995M71036O06124O49644
33794a5537040P67403R40749R80663Q41777P03334O55650N81656M36846L58992
33785i269970M00305M26543L77823L61768M03038L73097K53996K01021K60881
33776f211498K95537K55247K46868K68870J84974L5253M4276K18021K70787Q7140
33766d304525p7514j9458J13228J31468J10930J72029K27141J76014J19506J57424
33756c193757J82152Q4365k6269o736Q3708J14150Q8630O7178M2409K7636R2508
33745b444026J93846J70883K4040k9730R1053J76388P8837l7909j235P1753J2720
33734a693380q1656l0299J10922J62360J14971P6308M4839l7195j06115n9925
$$ plain form
33724 -1499170 -1443627 -1330374 -1242517 -1200818 -1189576 -1179948 -1134231 -1062612 -1027570 -1012458 -889996
33713 -889996 -646192 -500452 -615047 -815535 -838228 -737925 -758777 -886783 -874683 -691513
33703 -691513 -588579 -671173 -744913 -678789 -603562 -626342 -641322 -573671 -548489 -653218 -764670
33692 -764670 -775654 -774948 -833661 -825474 -651561 -459417 -432395 -509071 -511503 -430879 -390696 -418895
33680 -418895 -439397 -427232 -417930 -411943 -392982 -390323 -422716 -440882 -412060 -388289 -406136 -398318
33668 -398318 -294951 -142757 -42483 -29646 -77876 -150392 -199115 -189630 -162173 -180119 -203032
33657 -203032 -131989 1503 44261 -43007 -124970 -122299 -125723 -201589 -264735 -246824 -216465 -217550
33645 -217550 -164606 -31761 32454 -58936 -145579 -57394 105636 141062 77032 106848 256231
$$ packed form
33724a499170N5543J13253Q7857M1699J1242R628M5717P1619L5042J5112J22462
33713h89996K43804J45740j14595k00488k2693J00303k0852j28006J2100J83170
33703f91513J02934q2594p3740O6124P5227k2780j4980O7651K5182j04729j11452
33692g64670j0984P06n8713Q187J73913J92144K7022p6676k432Q0624M0183k8199
33680d18895k0502J2165R302N987J8961K659l2393j8166K8822K3771j7847P818
33668c98318J03367J52194J00274J2837m8230p2516m8723R485K7457j7946k2913
33657b03032P1043J33492M2758q7268q1963K671l424p5866o3146J7911L0359j085
33645b17550N2944J32845O4215r1390q6643Q8185J63030L5426o4030K9816J49383
$$ plain form
33634 256231 346335 278240 155984 102610 109654 107773 74210 31843 10228 25107 58510 73556
33622 73556 74232 104190 160416 182383 164149 181870 252313 269178 163270 30249 2836 77119
33610 77119 161883 226595 302930 399465 500419 596514 657632 646677 608945 645184 734976
33599 734976 711256 498984 254458 158361 188540 220039 234174 283035 342620 357734 365263
33588 365263 428669 507740 527739 521059 565516 631109 620355 523538 415594 336726 284564
33577 284564 280619 336043 392966 400041 400443 451840 516188 526010 499389 490430 488654 465839 454891
33564 454891 483403 501911 475545 462614 501384 519444 470535 447152 517040 565858 474140
33553 474140 344927 356267 467835 489577 393239 337953 403770 504823 569156 616473 647814
$$ packed form
33634B56231R0104o8095j22256n3374P044j881l3563m2367k1615J4879L3403J5046
33622G3556O76K9958N6226K1967j8234J7721P0443J6865j05908j33021k7413P4283
33610G7119Q4764O4712P6335R6535J00954R6095O1118j0955l7732L6239Q9792
33599G34976k3720k12272k44526r6097L0179L1499J4135M8861N9585J5114P529
33588C65263O3406P9071J9999o680M4457O5593j0754r6817j07944p8868n2162
33577B84564l945N5424N6923P075M02N1397O4348R822k6621q959j776k2815j0948
33564D54891K8512J8508k6366j2931L8770J8060m8909k3383O9888M8818r1718
33553D74140j29213J1340J11568K1742r6338n5286O5817J01053O4333M7317L1341
$$ plain form
33542 647814 634820 632038 731466 889996 964157 929358 899032 910522 870821 754408 678506
33531 678506 712156 761071 724223 642949 613068 645974 690152 712971 701068 644538 568802
33520 568802 530550 552580 606157 661542 703545 708825 673146 645640 667632 703352 705641 708003
33508 708003 756312 796919 753493 676709 678643 743161 754921 709944 731923 857840 969006
33497 969006 980244 949289 941406 926752 885146 881950 947076 985776 911793 788507 737116 765206
33485 765206 786663 773088 785662 861970 952210 989405 974141 957955 962930 955938 915535 889045
33473 889045 932898 1008947 1013051 922078 830997 806294 792373 730249 681462 733153 840652
33462 840652 877098 809406 724058 695637 718356 755809 782425 785771 783191 809010 841967 806690
$$ packed form
33542F47814j2994k782R9428J58530P4161l4799l0326J1490l9701j16413p5902
33531F78506L3650M8915l6848q1274k9881L2906M4178K2819j1903n6530p5736
33520E68802l8252K2030N3577N5385M2003N280l5679k7506K1992L5720K289K362
33508G08003M8309M0607m3426p6784J934O4518J1760m4977K1979J25917J11166
33497I69006J1238l0955p883j4654m1606l196O5126L8700p3983j23286n1391K8090
33485G65206K1457j3575J2574P6308R0240L7195j5264j6186M975o992m0403k6490
33473H89045M3853P6049M104r0973r1081k4703j3921o2124m8787N1691J07499
33462H40652L6446o7692q5348k8421K2719L7453K6616L346k580K5819L2957l5277
$$ plain form
33450 806690 709399 691829 853917 1091692 1222062 1210961 1160602 1125086 1074769 1013217 992240
33439 992240 1012329 1019379 1000637 992998 1005409 1013061 1009313 995469 959464 930640 987314 1125522
33427 1125522 1203106 1122964 989525 958356 1012047 1028157 994972 1000908 1066244 1141992 1225495
33416 1225495 1325900 1372379 1313859 1246079 1271018 1300384 1189422 1001469 928601 998861 1082921
33405 1082921 1148551 1267655 1395155 1399539 1320040 1335742 1450533 1465844 1316902 1181908
33395 1181908 1183404 1226154 1224639 1254662 1359854 1421269 1354500 1255975 1227363 1223495 1196271 1220934
33383 1220934 1343686 1454828 1454111 1411100 1424459 1443609 1375072 1266974 1239975 1298746 1341904
33372 1341904 1322198 1293837 1316394 1375692 1393815 1306498 1159944 1104267 1219389 1382754 1415372
$$ packed form
33450H06690r7291j7570J62088K37775J30370j1101n0359l5516n0317o1552k0977
33439I92240K0089P050j8742p639J2411P652l748j3844l6005k8824N6674J38208
33427A125522P7584q0142j33439l1169N3691J6110l3185N936O5336P5748Q3503
33416A225495J00405M6479n8520o7780K4939K9366j10962j87953p2868P0260Q4060
33405A082921O5630J19104J27500M384p9499J5702J14791J5311j48942j34994
33395A181908J496M2750j515L0023J05192O1415o6769r8525k8612l868k7224K4663
33383A220934J22752J11142p17m3011J3359J9150o8537j08098k6999N8771M3158
33372A341904j9706k8361K2557N9298J8123q7317j46554n5677J15122J63365L2618
$$ plain form
33361 1415372 1327279 1287000 1371032 1494269 1577598 1622237 1619112 1554689 1513096 1596429 1735197
33350 1735197 1764523 1697828 1715548 1856943 1951950 1915102 1876313 1933712 1993020 1952688 1843641
33339 1843641 1678414 1369305 932669 591367 519438 620172 684481 645687 572647 538385
33329 538385 595408 762708 955976 1046727 1040995 1061262 1122163 1107032 1010133 988252 1095847
33318 1095847 1185861 1169840 1159802 1238206 1301154 1262033 1210279 1230857 1257604 1241654 1273092
33307 1273092 1392651 1470670 1420558 1353098 1377065 1427715 1430431 1443610 1497862 1494522 1415382
33296 1415382 1424299 1591728 1725709 1660802 1516706 1479082 1515950 1507569 1470452 1454053 1399625
33285 1399625 1298580 1300704 1464632 1601211 1574311 1540500 1654425 1763663 1678409 1536239
$$ packed form
33361A415372q8093m0279Q4032J23237Q3329M4639l125o4423m1593Q3333J38768
33350A735197K9326o6695J7720J41395R5007l6848l8789N7399N9308m0332j09047
33339A843641j65227l09109m36636l41302p1929J00734O4309l8794p3040l4262
33329E38385N7023J67300J93268R0751n732K0267O0901j5131r6899k1881J07595
33318A095847R0014j6021j0038P8404O2948l9121n1754K0578K6747j5950L1438
33307A273092J19559P8019n0112o7460K3967N0650K716J3179N4252l340p9140
33296A415382Q917J67429J33981o4907j44096l7624L6868q381l7117j6399n4428
33285A399625j01045K124J63928J36579k6900l3811J13925J09238q5254j42170
$$ plain form
33275 1536239 1576302 1714925 1685488 1489829 1383281 1478364 1654980 1809998 1931911 1978048
33265 1978048 1918151 1850526 1868564 1888304 1801616 1687300 1661133 1648985 1540351 1429049 1450717
33254 1450717 1519775 1494366 1461389 1566719 1695825 1639523 1467661 1415465 1493388 1536969 1555394
33243 1555394 1683419 1849994 1847884 1700406 1623038 1650198 1636144 1597555 1697514 1887473 1924019
33232 1924019 1776929 1681159 1733555 1765024 1677627 1593553 1587763 1568021 1512957 1555606 1729459
33221 1729459 1874939 1891233 1861235 1853341 1817026 1745354 1732645 1800487 1851014 1842884 1841672 1871316
33209 1871316 1885605 1887449 1906181 1888607 1798564 1761528 1890536 2045940 2023392 1897328 1883875
33198 1883875 1945037 1873492 1715589 1726044 1910058 2005468 1948501 1956008 2082520 2103632 1947137
$$ packed form
33275A536239M0063J38623k9437j95659j06548R5083J76616J55018J21913M6137
33265A978048n9897o7625J8038J9740q6688j14316k6167j2148j08634j11302K1668
33254A450717O9058k5409l2977J05330J29106n6302j71862n2196P7923M3581J8425
33243A555394J28025J66575k110j47478p7368K7160j4054l8589R9959J89959L6546
33232A924019j47090r5770N2396L1469q7397q4074n790j9742n5064M2649J73853
33221A729459J45480J6294k9998p894l6315p1672j2709O7842N0527q130j212K9644
33209A871316J4289J844J8732j7574r0043l7036J29008J55404k2548j26064j3453
33198A883875O1162p1545j57903J0455J84014R5410n6967P507J26512K1112j56495
$$ plain form
33187 1947137 1846257 1922825 1989450 1926372 1897779 2012075 2108265 2082595 2106179 2295142 2460891
33176 2460891 2428444 2339033 2388907 2500023 2501349 2439484 2461026 2542396 2561279 2511974 2463070
33165 2463070 2416681 2363465 2359246 2417455 2447233 2401244 2349379 2326447 2270831 2188173 2183751 2249675
33153 2249675 2232201 2108660 2070732 2210242 2347736 2317567 2210398 2176938 2192363 2182230
33143 2182230 2197962 2293590 2385528 2397108 2402994 2486076 2583552 2604175 2572166 2545582 2518748
33132 2518748 2495217 2524228 2593159 2624885 2627460 2678372 2729951 2640906 2447818 2372629 2492101
33121 2492101 2634967 2678811 2697964 2733031 2681896 2533331 2451448 2505288 2561161 2555272 2608274
33110 2608274 2746016 2786784 2657704 2552958 2612483 2701714 2677767 2619544 2622018 2614247 2557816
$$ packed form
33187A947137j00880P6568O6625o3078k8593J14296R6190k5670K3584J88963J65749
33176B460891l2447q9411M9874J11116J326o1865K1542Q1370J8883m9305m8904
33165B463070m6389n3216m219N8209K9778m5989n1865k2932n5616q2658m422O5924
33153B249675j7474j23541l7928J39510J37494l0169j07169l3460J5425j0133
33143B182230J5732R5628R1938J1580N886Q3082R7476K0623l2009k6584k6834
33132B518748k3531K9011O8931L1726K575N0912N1579q9045j93088p5189J19472
33121B492101J42866M3844J9153L5067n1135j48565q1883N3840N5873n889N3002
33110B608274J37742M0768j29080j04746N9525Q9231k3947n8223K474p771n6431
$$ plain form
33099 2557816 2578084 2721251 2825527 2804032 2801153 2896880 2929918 2807834 2715594 2798632 2905342
33088 2905342 2875467 2827410 2913021 3025170 3002538 2913736 2898295 2923462 2917936 2945632 3041044
33077 3041044 3081031 3013016 2986590 3076343 3126575 3058241 3044886 3171198 3223009 3066063 2924191
33066 2924191 2995997 3095570 2991439 2822769 2838666 2974677 3033093 3052995 3155488 3239214
33056 3239214 3178417 3120415 3240313 3395433 3368642 3262856 3301206 3417798 3406786 3311783
33046 3311783 3307896 3348268 3282760 3190518 3249313 3398961 3457855 3442776 3465170 3464157 3361331
33035 3361331 3315845 3485269 3687605 3652081 3466329 3421380 3537866 3599180 3550844 3527771
33025 3527771 3569051 3608556 3658810 3737369 3732435 3595036 3510298 3627445 3806140 3879709 3934846
$$ packed form
33099B557816K0268J43167J04276k1495k879R5727L3038j22084r2240Q3038J06710
33088B905342k9875m8057Q5611J12149k2632q8802j5441K5167n526K7696R5412
33077C041044L9987o8015k6426Q9753N0232o8334j3355J26312N1811j56946j41872
33066B924191P1806R9573j04131j68670J5897J36011N8416J9902J02493Q3726
33056C239214o0797n8002J19898J55120k6791j05786L8350J16592j1012r5003
33046C311783l887M0372o5508r2242N8795J49648N8894j5079K2394j013j02826
33035C361331m5486J69424K02336l5524j85752m4949J16486O1314m8336k3073
33025C527771M1280L9505N0254P8559m934j37399q4738J17147J78695P3569N5137
$$ plain form
33014 3934846 4055410 4068381 3874439 3740343 3882770 4046814 3918999 3683093 3701784 3898871
33004 3898871 3956127 3903108 3988075 4144044 4115796 3977549 4004493 4147982 4144698 4037387 4085710
32993 4085710 4259991 4317494 4284535 4374047 4523513 4504889 4393505 4436113 4558043 4501099
32983 4501099 4343122 4369374 4534900 4574206 4531517 4643384 4810506 4753316 4587910 4658096
32973 4658096 4886484 4904256 4749892 4798425 5040407 5090104 4906627 4848266 4982730 4998437
32963 4998437 4855931 4877430 5105317 5206056 5113649 5148565 5381531 5488055 5368745 5326959
32953 5326959 5487029 5594587 5529950 5485412 5522589 5480689 5400765 5497501 5660181 5562414 5310594
32942 5310594 5359432 5723445 5928583 5831816 5805953 5991443 6065790 5922941 5890726 6074036
$$ packed form
33014C934846J20564J2971j93942j34096J42427J64044j27815k35906J8691J97087
33004C898871N7256n3019Q4967J55969k8248j38247K6944J43489l284j07311M8323
32993D085710J74281N7503l2959Q9512J49466j8624j11384M2608J21930n6944
32983D501099j57977K6252J65526L9306m2689J11867J67122n7190j65406P0186
32973D658096K28388J7772j54364M8533K41982M9697j83477n8361J34464J5707
32963D998437j42506K1499K27887J00739r2407L4916K32966J06524j19310m1786
32953E326959J60070J07558o4637m4538L7177m1900p9924R6736J62680r7767k51820
32942E310594M8838L64013K05138r6767k5863J85490P4347j42849l2215J83310
$$ plain form
32932 6074036 6151421 6032844 6058758 6328479 6485991 6396596 6384421 6571987 6642425 6493990
32922 6493990 6468645 6682020 6787037 6656537 6634986 6852792 6965704 6843802 6831768 7042738
32912 7042738 7097600 6874458 6807161 7101393 7357740 7330777 7362043 7678897 7953053 7953068 7963321
32901 7963321 8157505 8226718 8034149 7968616 8232156 8439145 8339326 8274956 8500239 8714546
32891 8714546 8697484 8739504 9015852 9205675 9152990 9215849 9541546 9717189 9571735 9566810
32881 9566810 9920937 10120928 9818709 9447164 9408281 9418974 9225879 9193887 9574574 9930417
32871 9930417 9902084 9834010 10046583 10220781 10102748 10071653 10397422 10683606 10651915 10709483
32861 10709483 11131028 11479103 11455432 11496984 11894437 12190448 12115183 12208754 12805425 13326941
$$ packed form
32932F074036P7385j18577K5914K69721J57512q9395j2175J87566P0438j48435
32922F493990k5345K13375J05017j30500k1551K17806J12912j21902j2034K10970
32912G042738N4862k23142o7297K94232K56347k6963L1266L16854K74156J5J0253
32901G963321J94184O9213j92569o5533K63540K06989r9819o4370K25283K14307
32891H714546j7062M2020K76348J89823n2685O2859L25697J75643j45454m925
32881I566810L54127J99991l02219l71545l8883J0693j93095l1992L80687L55843
32871I930417k8333o8074K12573J74198j18033l1095L25769K86184l1691N7568
32861A0709483M21545L48075k3671M1552L97453K96011p5265R3571N96671N21516
$$ plain form
32851 13326941 13330033 13314677 13722759 14105036 14089518 14183573 14769020 15299627 15335700 15314728
32841 15314728 15446956 15036875 13878517 13091616 13468725 14201394 14387326 14523030 15245768
32832 15245768 15918428 15888752 15888599 16673005 17499847 17529646 17497203 18330366 19337241 19522959
32822 19522959 19499523 20249497 21190942 21395300 21536180 22609926 23896120 24286240 24457357
32813 24457357 25543797 26861082 27253524 27474475 28793533 30480750 31234356 31820733 33572244
32804 33572244 35605957 36474815 37201288 39483657 42295271 43733290 44818915 47663546
32796 47663546 51286807 53431128 55124755 58847590 63563797 66702065 69698598 75764999
32788 75764999 83420741 88885797 93760329 102519663 113252874 120449619 126620758 137788209
$$ packed form
32851A3326941L092j5356M08082L82277j5518R4055N85447N30607L6073k0972
32841A5314728J32228m10081j158358p86901L77109P32669J85932J35704P22738
32832A5245768O72660k9676j53P84406Q26842K9799l2443Q33163J006875J85718
32822A9522959k3436P49974R41445K04358J40880J073746J286194L90120J71117
32813B4457357J086440J317285L92442K20951J319058J687217P53606N86377J751511
32804C3572244K033713Q68858P26473K282369K811614J438019J085625K844631
32796D7663546L623261K144321J693627L722835M716207L138268K996533O066401
32788G5764999P655742N465056M874532Q759334J0733211P196745O171139J1167451
$$ plain form
32780 137788209 143283921 115165742 40240471 -55467134 -127147904 -153086905 -147171261
32773 -147171261 -134821129 -128755859 -126954785 -121604669 -106335601 -82505472 -61194600
32766 -61194600 -53299201 -56788206 -59854727 -56681402 -52494615 -52143273 -52487962 -49584066
32758 -49584066 -45753535 -44533106 -44327348 -42164187 -39326070 -38397106 -38254215 -36543730
32750 -36543730 -34244867 -33540848 -33579379 -32291673 -30352626 -29644113 -29582605 -28451204 -26812013
32741 -26812013 -26306926 -26436252 -25632129 -24316229 -23943495 -24100810 -23382218 -22176831 -21869092
32732 -21869092 -22117208 -21538476 -20368596 -19938373 -20132742 -19758569 -18901069 -18631539 -18825587
32723 -18825587 -18442797 -17592207 -17269565 -17386703 -17008077 -16222464 -15921539 -16028415 -15725394
$$ packed form
32780A37788209N495712k8118179p4925271r5707605p1680770k5939001N915644
32773a47171261J2350132O065270J801074N350116J5269068K3830129K1310872
32766f1194600P895399l489005l066521L173325M186787L51342l44689K903896
32758d9584066L830531J220429K05758K163161K838117R28964J42891J710485
32750c6543730K298863P04019l8531J287706J939047P08513O1508J131401J639191
32741b6812013N05087j29326Q04123J315900L72734j57315P18592J205387L07739
32732b1869092k48116N78732J169880M30223j94369L74173Q57500K69530j94048
32723a8825587L82790Q50590L22642j17138L78626P85613L00925j06876L03021
$$ plain form
32714 -15725394 -15127717 -15005452 -15163292 -14793407 -14121958 -14025945 -14316330 -14073582 -13414118
32705 -13414118 -13254620 -13550920 -13426690 -12874572 -12699255 -12898891 -12702616 -12134755 -11979606
32696 -11979606 -12234331 -12120187 -11617579 -11493863 -11783167 -11706384 -11166967 -10900681 -11045561
32687 -11045561 -10953427 -10541259 -10464778 -10789213 -10809216 -10379728 -10153409 -10295776 -10211077 -9771451
32677 -9771451 -9602436 -9881096 -10006221 -9738748 -9566665 -9667610 -9581675 -9189887 -8983053 -9087748
32667 -9087748 -9027161 -8704415 -8629115 -8905644 -8973991 -8628087 -8347870 -8363696 -8325119 -8140428
32657 -8140428 -8194698 -8474482 -8427218 -7974657 -7731000 -7922209 -8024185 -7784541 -7657963 -7866360
32647 -7866360 -7952286 -7676302 -7481787 -7634334 -7725617 -7474016 -7237145 -7289316 -7330715 -7141753
$$ packed form
32714a5725394N97677J22265j57840L69885O71449R6013k90385K42748O59464
32705a3414118J59498k96300J24230N52118J75317j99636J96275N67861J55149
32696a1979606k54725J14144N02608J23716k89304P6783N39417K66286j44880
32687a1045561R2134M12168P6481l24435k0003M29488K26319j42367Q4699M39626
32677i771451J69015k78660j25125K67473J72083j00945Q5935L91788K06834j04695
32667i087748O0587L22746P5300k76529o8347L45904K80217j5826L8577J84691
32657h140428n4270k79784M7264M52561K43657j91209j01976K39644J26578k08397
32647g866360q5926K75984J94515j52547r1283K51601K36871n2171m1399J88962
$$ plain form
32637 -7141753 -7012748 -7109814 -7105935 -6842060 -6675539 -6784772 -6805320 -6542361 -6368558 -6520776
32627 -6520776 -6666801 -6566379 -6504224 -6665438 -6733145 -6517692 -6347084 -6421454 -6415799 -6140655
32617 -6140655 -5956513 -6093421 -6194943 -6002682 -5868644 -6087908 -6317558 -6187654 -5942814
32608 -5942814 -5944119 -6040134 -5959625 -5853159 -5923638 -5965560 -5781214 -5630918 -5772362 -5958757
32598 -5958757 -5879805 -5706812 -5722744 -5797164 -5704706 -5590514 -5641307 -5652430 -5403256 -5131313
32588 -5131313 -5158316 -5345700 -5370760 -5254837 -5191322 -5138138 -4996362 -4910807 -4994146 -5036623 -4872811
32577 -4872811 -4737040 -4866873 -5059597 -5023632 -4873530 -4868289 -4941574 -4901543 -4831170 -4887559 -4954144
32566 -4954144 -4876992 -4796770 -4873693 -4939682 -4796659 -4605003 -4604082 -4697938 -4682931 -4632577 -4692869
$$ packed form
32637g141753J29005r7066L879K63875J66521j09233k0548K62959J73803j52218
32627f520776j46025J00422O2155j61214o7707K15453J70608p4370N655K75144
32617f140655J84142j36908j01522J92261J34038k19264k29650J29904K44840
32608e942814j305r6015Q0509J06466p0479m1922J84346J50296j41444j86395
32598e958757P8952J72993j5932p4420R2458J14192n0793j1123K49174K71943
32588e131313k7003j87384k5060J15923O3515N3184J41776Q5555q3339m2477J63812
32577d872811J35771j29833j92724L5965J50102N241p3285M0031P0373n6389o6585
32566d954144P7152Q0222p6923o5989J43023J91656R21r3856J5007N0354o0292
$$ plain form
32555 -4692869 -4749865 -4661447 -4564523 -4599873 -4600952 -4412852 -4238306 -4296190 -4424388 -4405880 -4389858
32544 -4389858 -4573127 -4754638 -4654224 -4412236 -4319210 -4298540 -4126676 -3934167 -3991507 -4183509
32534 -4183509 -4189755 -4041796 -4028086 -4165531 -4217581 -4138868 -4080931 -4049993 -3953100 -3883866 -3983981
32523 -3983981 -4124889 -4085202 -3925310 -3844420 -3819363 -3741170 -3733503 -3944849 -4189488 -4197151 -4062587
32512 -4062587 -4044236 -4087292 -3980367 -3823050 -3869743 -4036144 -4035111 -3901482 -3906022 -4030107 -4009111
32501 -4009111 -3844161 -3789418 -3856997 -3809181 -3643517 -3622025 -3785779 -3874236 -3774197 -3650064
32491 -3650064 -3591503 -3518355 -3463579 -3560614 -3712864 -3661118 -3426660 -3313184 -3418365 -3514872
32481 -3514872 -3476828 -3455202 -3544545 -3620861 -3611267 -3618685 -3687106 -3716372 -3675298 -3642421 -3604668 -3480274
$$ packed form
32555d692869n6996Q8418R6924l5350j079J88100J74546n7884j28198J8508J6022
32544d389858j83269j81511J00414K41988R3026K0670J71864J92509n7340j92002
32534d183509o246J47959J3710j37445n2050P8713N7937L0938R6893O9234j00115
32523c983981j40908L9687J59892Q0890K5057P8193P667k11346k44639p663J34564
32512d062587J8351m3056J06925J57317m6693j66401J033J33629m540j24085K0996
32501d009111J64950N4743o7579M7816J65664K1492j63754q8457J00039J24133
32491c650064N8561P3148N4776r7035j52250N1746K34458J13476j05181r6507
32481c514872L8044K1626q9343p6316R594p418o8421k9266M1074L2877L7753J24394
$$ plain form
32469 -3480274 -3349082 -3376933 -3510681 -3543611 -3475211 -3488532 -3577699 -3544212 -3380027 -3296316 -3326685
32458 -3326685 -3258596 -3032345 -2866928 -2895102 -2985437 -3018523 -3044280 -3080054 -3041496 -2957819 -2978200
32447 -2978200 -3090643 -3109641 -3006167 -2966117 -3056215 -3120089 -3076777 -3036630 -3049540 -3023290 -2963191
32436 -2963191 -3006476 -3146016 -3203577 -3143443 -3123284 -3176385 -3153175 -3041705 -3016722 -3089950 -3052711
32425 -3052711 -2864822 -2750927 -2793996 -2795979 -2685067 -2683271 -2879703 -3010792 -2905952 -2804709
32415 -2804709 -2945879 -3148335 -3121705 -2946026 -2906182 -3030239 -3113290 -3073009 -2992975 -2906407
32405 -2906407 -2790904 -2705369 -2716008 -2755669 -2740615 -2740374 -2849112 -2977725 -2965926 -2833047 -2733224
32394 -2733224 -2711023 -2676573 -2599123 -2569575 -2661749 -2834200 -2976427 -2996689 -2885226 -2730169
$$ packed form
32469c480274J31192k7851j33748l2930O8400j3321q9167L3487J64185Q3711l0369
32458c326685O8089K26251J65417k8174r0335l3086k5757l5774L8558Q3677k0381
32447b978200j12443j8998J03474M0050r0098o3874M3312M0147j2910K6250O0099
32436b963191m3285j39540n7561O0134K0159n3101K3210J11470K4983p3228L7239
32425c052711J87889J13895m3069j983J10912J796j96432j31089J04840J01243
32415b804709j41170k02456K6630J75679L9844j24057q3051M0281Q0034Q6568
32405b906407J15503Q5535j0639l9661J5054K41j08738j28613J1799J32879R9823
32394b733224K2201L4450P7450K9548r2174j72451j42227k0262J11463J55057
$$ plain form
32384 -2730169 -2637345 -2615363 -2589398 -2525714 -2463954 -2431666 -2422871 -2454369 -2537996 -2613837 -2628448
32373 -2628448 -2645493 -2735643 -2804212 -2715410 -2553973 -2541764 -2698493 -2818134 -2797535 -2743751 -2719637
32362 -2719637 -2639759 -2487996 -2394341 -2411183 -2438530 -2441541 -2502173 -2584928 -2522695 -2336414 -2284319
32351 -2284319 -2452377 -2576070 -2449521 -2248777 -2231789 -2347448 -2385286 -2327049 -2297927 -2307610
32341 -2307610 -2281757 -2254273 -2313020 -2421097 -2469507 -2450935 -2439113 -2454839 -2466389 -2457254 -2409696
32330 -2409696 -2305708 -2203858 -2199183 -2256441 -2231968 -2112937 -2052347 -2101181 -2121597 -2061011 -2072193
32319 -2072193 -2219102 -2303343 -2173684 -1997957 -2012513 -2177555 -2299549 -2339806 -2376075 -2388495
32309 -2388495 -2310915 -2199841 -2153248 -2147455 -2124250 -2135376 -2231492 -2321957 -2320794 -2315519 -2406967 -2496433
$$ packed form
32384b730169R2824K1982K5965O3684O1760L2288Q795l1498q3627p5841j4611
32373b628448j7045r0150o8569Q8802J61437J2209j56729j19641K0599N3784K4114
32362b719637P9878J51763R3655j6842k7347l011o0632q2755O2233J86281N2095
32351b284319j68058j23693J26549K00744J6988j15659l7838N8237K9122r683
32341b307610K5853K7484n8747j08077m8410J8572J1822j5726j1550R135M7558
32330b409696J03988J01850M675n7258K4473J19031O0590m8834k0416O0586j1182
32319b072193j46909q4241J29659J75727j4556j65042j21994m0257l6269j2420
32309b388495P7580J11074M6593N793K3205j1126r6116r0465J163N275r1448q9466
$$ plain form
32297 -2496433 -2429222 -2251595 -2131460 -2112640 -2132823 -2191111 -2302717 -2371191 -2304979 -2196017
32287 -2196017 -2196940 -2281443 -2301822 -2223487 -2134344 -2084015 -2073900 -2135070 -2253553 -2294700 -2169940
32276 -2169940 -2004979 -1976552 -2061661 -2118210 -2124685 -2150050 -2168689 -2113482 -2051564 -2097155 -2193007
32265 -2193007 -2183933 -2075212 -2013769 -2031145 -2008004 -1897776 -1798605 -1783721 -1822647 -1890210 -2005752
32254 -2005752 -2139233 -2205035 -2175517 -2108355 -2061153 -2059851 -2123981 -2232751 -2299298 -2265413 -2179343
32243 -2179343 -2102647 -2010789 -1878892 -1782020 -1795068 -1867475 -1911292 -1934309 -1968938 -1959469 -1855941
32232 -1855941 -1739048 -1711859 -1740800 -1739236 -1730589 -1786162 -1873493 -1908718 -1895951 -1888026 -1882195 -1873029
32220 -1873029 -1917758 -2027234 -2095598 -2061643 -2017559 -2026305 -1980448 -1803655 -1633279 -1608453 -1630327
$$ packed form
32297b496433O7211J77627J20135J8820k0183n8288j11606o8474O6212J08962
32287b196017r23q4503k0379P8335Q9143N0329J0115o1170j18483m1147J24760
32276b169940J64961K8427q5109n6549o475k5365j8639N5207O1918m5591r5852
32265b193007R074J08721O1443j7376K3141J10228R9171J4884l8926o7563j15542
32254b005752j33481o5802K9518O7162M7202J302o4130j08770o6547L3885Q6070
32243b179343P6696R1858J31897R6872j3048p2407m3817k3017l4629R469J03528
32232a855941J16893K7189k8941J564Q647n5573q7331l5225J2767P925N831R166
32220a873029m4729j09476o8364L3955M4084q746M5857J76793J70376K4826k1874
$$ plain form
32209 -1630327 -1550995 -1452459 -1493487 -1613316 -1652790 -1654022 -1759847 -1913012 -1946124 -1892590 -1913248
32198 -1913248 -1980217 -1938393 -1829291 -1835425 -1929832 -1904199 -1744868 -1661794 -1722288 -1767518 -1732260
32187 -1732260 -1743404 -1840174 -1881556 -1803093 -1707198 -1642548 -1550343 -1471879 -1534647 -1682506 -1706670
32176 -1706670 -1605796 -1613780 -1787613 -1882407 -1757003 -1598763 -1592028 -1647411 -1636832 -1637035 -1742344
32165 -1742344 -1857586 -1871956 -1847234 -1858897 -1839142 -1746582 -1699676 -1762894 -1786880 -1653445 -1507888
32154 -1507888 -1543633 -1701799 -1786848 -1755427 -1695620 -1632509 -1550251 -1517616 -1606342 -1750167 -1838351
32143 -1838351 -1877404 -1920384 -1922178 -1819369 -1682925 -1636090 -1666609 -1656176 -1562790 -1462190 -1437249
32132 -1437249 -1508914 -1637161 -1729380 -1705867 -1606772 -1559457 -1602401 -1643694 -1632801 -1640801 -1708840
$$ packed form
32209a630327P9332R8536m1028j19829l9474j232j05825j53165l3112N3534k0658
32198a913248o6969M1824J09102o134r4407K5633J59331Q3074o0494m5230L5258
32187a732260j1144r6770m1382P8463R5895O4650R2205P8464o2768j47859k4164
32176a706670J00874p984j73833r4794J25404J58240O735n5383J0579k03j05309
32165a742344j15242j4370K4722j1663J9755R2560M6906o3218k3986J33435J45557
32154a507888l5745j58166q5049L1421N9807O3111Q2258L2635q8726j43825q8184
32143a838351l9053m2980j794J02809J36444M6835l0519J0433R3386J00600K4941
32132a437249p1665j28247r2219K3513R9095M7315m2944m1293J0893q000o8039
$$ plain form
32121 -1708840 -1759547 -1741391 -1721745 -1746082 -1745909 -1685556 -1655750 -1709945 -1751247 -1702769 -1646207 -1659333
32109 -1659333 -1662358 -1577235 -1500114 -1544268 -1633106 -1629810 -1567636 -1564406 -1597154 -1556222 -1458763 -1418234
32097 -1418234 -1444937 -1453660 -1435322 -1451376 -1482955 -1452299 -1386593 -1406658 -1543108 -1690191 -1751483
32086 -1751483 -1728588 -1669288 -1620889 -1622016 -1656631 -1642946 -1548826 -1472793 -1515465 -1619355 -1646735
32075 -1646735 -1577774 -1514037 -1509191 -1513562 -1485006 -1455913 -1476890 -1555072 -1646324 -1675219 -1600230 -1491516
32063 -1491516 -1477050 -1567718 -1624595 -1561135 -1471701 -1470738 -1515604 -1508639 -1474530 -1492417 -1530836 -1505554
32051 -1505554 -1445121 -1442605 -1482258 -1470452 -1416898 -1431678 -1543087 -1656788 -1707151 -1729043 -1763829
32040 -1763829 -1795994 -1796776 -1749768 -1638478 -1487233 -1393374 -1428052 -1522865 -1545547 -1470149 -1383906
$$ packed form
32121a708840n0707J8156J9646k4337J73O0353K9806n4195m1302M8478N6562j3126
32109a659333l025Q5123P7121m4154q8838L296O2174L230l2748M0932R7459M0529
32097a418234k6703q723J8338j6054l1579L0656O5706k0065j36450j47083o1292
32086a751483K2895N9300M8399j127l4615J3685R4120P6033m2672j03890k7380
32075a646735O8961O3737M846m371K8556K9093k0977p8182r1252k8895P4989J08714
32063a491516J4466r0668n6877O3460Q9434R63m4866O965L4109j7887l8419K5282
32051a505554O0433K516l9653J1806N3554j4780j11409j13701n0363k1892l4786
32040a763829l2165p82M7008J11290J51245R3859l4678r4813k2682P5398Q6243
$$ plain form
32029 -1383906 -1349986 -1359012 -1394142 -1443224 -1460646 -1414091 -1357763 -1368940 -1429102 -1460225 -1456777 -1477979
32017 -1477979 -1522841 -1523048 -1464323 -1414582 -1415786 -1430045 -1408835 -1352143 -1294328 -1281739 -1347506 -1455533
32005 -1455533 -1503617 -1447862 -1383071 -1422314 -1541074 -1631239 -1664577 -1692611 -1715660 -1675453 -1573405
31994 -1573405 -1481411 -1422549 -1340099 -1204849 -1070299 -998982 -996722 -1032986 -1077427 -1115859 -1166114
31983 -1166114 -1254439 -1341284 -1326796 -1193408 -1081355 -1133027 -1309927 -1457870 -1506947 -1500781 -1468623
31972 -1468623 -1393406 -1296090 -1239746 -1245525 -1289720 -1370929 -1492300 -1595963 -1609214 -1543789 -1466173
31961 -1466173 -1395263 -1318910 -1275498 -1309211 -1368803 -1364499 -1308858 -1288743 -1314634 -1317983 -1287220 -1278477
31949 -1278477 -1289287 -1251414 -1166848 -1127695 -1171007 -1224904 -1232921 -1228997 -1249466 -1263978 -1241081 -1208696
$$ packed form
32029a383906L3920r026l5130m9082j7422M6555N6328j1177o0162l1123L448k1202
32017a477979m4862k07N8725M9741j204j4259K1210N6692N7815J2589o5767j08027
32005a455533m8084N5755O4791l9243j18760r0165l3338k8034k3049M0207J02048
31994a573405R1994N8862Q2450J35250J34550P1317K260l6264m4441l8432n0255
31983a166114q8325q6845J4488J33388J12053n1672j76900j47943m9077O166L2158
31972a468623P5217R7316N6344n779m4195q1209j21371j03663j3251O5425P7616
31961a466173P0910P6353M3412l3713n9592M304N5641K0115k5891l349L0763Q743
31949a278477j0810L7873Q4566L9153m3312n3897q017L924k0469j4512K2897L2385
$$ plain form
31937 -1208696 -1205374 -1225687 -1244322 -1252310 -1256195 -1276186 -1335324 -1410251 -1421005 -1323594 -1178295 -1068483
31925 -1068483 -1002935 -970943 -1024431 -1193816 -1375506 -1432779 -1378114 -1330096 -1319969 -1279343 -1200250
31914 -1200250 -1156875 -1163491 -1152457 -1108926 -1095273 -1124095 -1135778 -1121895 -1141923 -1192406 -1188110 -1107403
31902 -1107403 -1036296 -1032727 -1061539 -1095967 -1163832 -1252475 -1286876 -1257094 -1262845 -1369656 -1502819
31891 -1502819 -1538550 -1439998 -1273915 -1150616 -1151850 -1247806 -1294098 -1193124 -1037642 -994468 -1074830
31880 -1074830 -1146257 -1148615 -1146403 -1169113 -1162789 -1122111 -1113181 -1132347 -1095515 -1004457 -967644 -1010886
31868 -1010886 -1026896 -970803 -947176 -1029438 -1140112 -1189630 -1197741 -1200238 -1168866 -1102240 -1068410
31857 -1068410 -1084984 -1085986 -1068610 -1122368 -1242317 -1282602 -1190493 -1113443 -1154860 -1196498 -1112931
$$ packed form
31937a208696L322k0313j8635p988l885j9991n9138p4927j0754R7411J45299J09812
31925a068483O5548L1992n3488j69385j81690n7273N4665M8018J0127M0626P9093
31914a200250M3375o616J1034M3531J3653k8822j1683J3883k0028n0483M296Q0707
31902a107403P1107L569k8812l4428o7865q8643l4401K9782n751j06811j33163
31891a502819l5731R8552J66083J23299j234r5956m6292J00974J55482M3174q0362
31880a074830p1427k358K212k2710O324M0678Q930j9166L6832R1058L6813m3242
31868a010886j6010N6093K3627q2262j10674m9518q111k497L1372O6626L3830
31857a068410j6574j002J7376n3758j19949m0285R2109P7050m1417m1638Q3567
$$ plain form
31846 -1112931 -1004225 -1038167 -1187687 -1308263 -1372333 -1438966 -1473097 -1389262 -1228494 -1117243
31836 -1117243 -1080948 -1050161 -1015963 -1027457 -1064240 -1062064 -1045696 -1089692 -1159057 -1137077 -1018717
31825 -1018717 -937725 -975392 -1059817 -1089845 -1063651 -1046135 -1077077 -1140103 -1177775 -1134236 -1025212
31814 -1025212 -949019 -976162 -1051191 -1064129 -996227 -928991 -926601 -976384 -1036074 -1078376 -1089755
31803 -1089755 -1071609 -1042746 -1017425 -999161 -1007982 -1067136 -1140542 -1145629 -1066929 -994246 -1003413 -1064805
31791 -1064805 -1117857 -1159965 -1198591 -1193449 -1127480 -1069530 -1080978 -1117728 -1110744 -1086379 -1110620 -1161439
31779 -1161439 -1161499 -1111386 -1092607 -1147164 -1232582 -1289488 -1289540 -1226469 -1117733 -1012540 -960675 -976207
31767 -976207 -1035894 -1082232 -1041834 -912678 -824744 -908292 -1093979 -1176270 -1104008 -1048907 -1123210
$$ packed form
31846a112931J08706l3942j49520j20576o4070o6633l4131Q3835J60768J11251
31836a117243L6295L0787L4198j1494l6783K176J6368m3996o9365K1980J18360
31825a018717Q0992l7667q4425l0028K6194J7516l0942o3026l7672M3539J09024
31814a025212P6193k7143p5029j2938O7902O7236K390m9783n9690m2302j1379
31803a089755J8146K8863K5321J8264q821n9154p3406n087P8700P2683r167o1392
31791a064805n3052m2108l8626N142O5969N7950j1448l6750O984K4365k4241n0819
31779a161439o0N0113J8779n4557q5418n6906n2O3071J08736J05193N1865j5532
31767i76207n9687m6338M0398J29156Q7934q3548j85687q2291P2262N5101p4303
$$ plain form
31756 -1123210 -1207296 -1168652 -1079729 -1064078 -1076635 -1021909 -967849 -1035382 -1163671 -1198353 -1152322
31745 -1152322 -1162839 -1225567 -1192516 -1035753 -907628 -908488 -969172 -1000287 -1004892 -1006162 -997957 -1000361
31733 -1000361 -1048740 -1111744 -1129658 -1129453 -1181697 -1258250 -1268619 -1222382 -1206842 -1217439 -1175285 -1106122
31721 -1106122 -1118349 -1192460 -1187463 -1089200 -1051655 -1135772 -1207965 -1176040 -1126719 -1127436 -1089195 -960921
31709 -960921 -877260 -945214 -1035982 -977940 -839341 -817819 -927612 -999696 -952485 -868739 -812298
31698 -812298 -750577 -684206 -694786 -809420 -934888 -980685 -959037 -922875 -891307 -881251 -930454
31687 -930454 -1028929 -1089555 -1049498 -956565 -898278 -887272 -881918 -884415 -932346 -1001226 -1009606 -947369
31675 -947369 -912859 -969546 -1042237 -1036089 -995430 -1029883 -1114955 -1106864 -971184 -852796 -857364 -894719
$$ packed form
31756a123210q4086L8644Q8923J5651j2557N4726N4060o7533j28289l4682M6031
31745a152322j0517o2728L3051J56763J28125q60o0684l1115m605j270Q205k404
31733a000361m8379o3004j7914K05n2244p6553j0369M6237J5540j0597M2154O9163
31721a106122j2227p4111M997R8263L7545q4117p2193L1925M9321p17L8241J28274
31709i60921Q3661o7954r0768N8042J38599K1522j09793p2084M7211Q3746N6441
31698h12298O1721O6371j0580j14634j25468m5797K1648L6162L1568J0056m9203
31687i30454r8475o0626M0057R2933N8287J1006N354k497m7931o8880q380O2237
31675i47369L4510n6687p2691O148M0659l4453q5072Q091J35680J18388m568l7355
$$ plain form
31663 -894719 -840299 -744911 -748430 -849408 -908972 -866603 -815383 -844629 -919496 -956608 -940280
31652 -940280 -920431 -942966 -1011880 -1089712 -1122600 -1089284 -1027263 -993654 -1011232 -1061621 -1099468
31641 -1099468 -1066145 -948632 -844239 -884613 -1052099 -1164430 -1108565 -991500 -968347 -1023120
31631 -1023120 -1044521 -1028889 -1051851 -1097198 -1080063 -1012292 -987331 -1014117 -1014600 -977255 -967046 -990510
31619 -990510 -999283 -1019677 -1117898 -1233026 -1213304 -1039499 -849537 -720092 -598032 -480065
31609 -480065 -466467 -567939 -643422 -623667 -629800 -762202 -924739 -980161 -945444 -906702 -865008
31598 -865008 -803912 -796962 -892754 -979422 -927143 -809659 -818617 -976720 -1092399 -1022649 -856203
31587 -856203 -782226 -855989 -960761 -974314 -911520 -874319 -892904 -890648 -827585 -783456 -816319
$$ packed form
31663h94719N4420R5388l519j00978n9564M2369N1220k9246p4867l7112J6328
31652i40280J9849k2535o8914p7832l2888L3316O2021L3609j7578n0389l7847
31641a099468L3323J17513J04393m0374j67486j12331N5865J17065K3153n4773
31631a023120k1401J5632k2962m5347J7135O7771K4961k6786m83L7345J0209k3464
31619i90510q773k0394r8221j15128J9722J73805J89962J29445J22060J17967
31609d80065J3598j01472p5483J9755o133j32402j62537n5422L4717L8742M1694
31598h65008O1096O950r5792q6668N2279J17484q958j58103j15679O9750J66446
31587h56203P3977p3763j04772j3553O2794L7201j8585K256O3063M4129l2863
$$ plain form
31576 -816319 -829773 -721183 -598623 -663560 -893015 -1044924 -1008937 -937194 -955236 -964668 -864832
31565 -864832 -774724 -851344 -1024004 -1099658 -1042615 -973228 -954280 -945825 -928507 -919302 -894740 -834437
31553 -834437 -812413 -911819 -1066648 -1115094 -1008728 -863264 -803540 -848255 -939670 -1002208 -979516
31542 -979516 -888597 -826060 -857695 -925924 -927971 -849815 -755028 -682185 -631552 -618859 -660976 -728607
31530 -728607 -777444 -802562 -814631 -805868 -786715 -796152 -823876 -800328 -728668 -731086 -870127 -1017790
31518 -1017790 -1021775 -921859 -866936 -885846 -893250 -876137 -908809 -994724 -1048921 -1048631 -1062667 -1107974
31506 -1107974 -1103106 -1004091 -886239 -846522 -893218 -959448 -973394 -907677 -806149 -751989 -767706
31495 -767706 -782840 -750640 -732139 -783915 -836362 -801432 -740891 -781367 -895043 -923814 -820810
$$ packed form
31576h16319j3454J08590J22560o4937k29455j51909L5987P1743j8042r432R9836
31565h64832R0108p6620j72660p5654N7043O9387J8948Q455J7318R205K4562O0303
31553h34437K2024r9406j54829m8446J06366J45464N9724m4715r1415o2538K2692
31542i79516R0919O2537l1635o8229k047P8156R4787P2843N0633J2693m2117o7631
31530g28607m8837k5118j2069Q763J9153r437k7724K3548P1660k418j39041j47663
31518a017790l985R9916N4923j8910p404J7113l2672q5915n4197K90j4036m5307
31506a107974M868R9015J17852L9717m6696o6230j3946O5717J01528N4160j5717
31495g67706j5134L2200J8501n1776n2447L4930O0541m0476j13676k8771J03004
$$ plain form
31484 -820810 -712831 -697439 -720526 -700503 -650787 -622124 -621388 -640976 -689338 -750667 -784743 -794913
31472 -794913 -825273 -872784 -881596 -841596 -807520 -801190 -784582 -752004 -751245 -779883 -762222 -680245
31460 -680245 -631447 -687417 -776144 -788541 -743462 -754357 -859029 -971602 -1012600 -1019454 -1087598
31449 -1087598 -1224954 -1310556 -1221862 -984653 -756791 -663381 -693829 -765550 -819348 -823295 -762006
31438 -762006 -679087 -659632 -706608 -712330 -631932 -593063 -713178 -886859 -913081 -793134 -729353
31427 -729353 -826829 -962487 -984603 -894592 -775547 -667368 -583772 -554532 -577095 -594134 -574559
31416 -574559 -560370 -595046 -662234 -724922 -768862 -785873 -773845 -771374 -832196 -950346 -1065768
31405 -1065768 -1142526 -1174601 -1127213 -968585 -768438 -665068 -705037 -796637 -844343 -846606 -838080
$$ packed form
31484h20810J07979J5392k3087K0023M9716K8663P36j9588m8362o1329l4076j0170
31472g94913l0360m7511q812M0000L4076O330J6608L2578P59k8638J7661Q1977
31460f80245M8798n5970q8727j2397M5079j0895j04672j12573m0998o854o8144
31449a087598j37356q5602Q8694K37209K27862R3410l0448p1721n3798l947O1289
31438g62006Q2919J9455m6976n722Q0398L8869j20115j73681k6222J19947O3781
31427g29353r7476j35658k2116R0011J19045J08179Q3596K9240k2563j7039J9575
31416e74559J4189l4676o7188o2688m3940j7011J2028K471o0822j18150j15422
31405a065768p6758l2075M7388J58628K00147J03370l9969r1600m7706k263Q526
$$ plain form
31394 -838080 -823104 -803349 -799773 -814049 -825049 -836005 -862420 -874278 -827962 -753435 -722151 -731641
31382 -731641 -721269 -699359 -735613 -814610 -826417 -738844 -656455 -660486 -705330 -728142 -748215 -790992
31370 -790992 -815879 -794165 -772954 -791707 -812055 -793901 -766603 -763630 -758729 -726857 -700183 -706020
31358 -706020 -713556 -696931 -692319 -743845 -844903 -964628 -1072915 -1119183 -1062466 -947492 -873499
31347 -873499 -868781 -880239 -893550 -951612 -1034123 -1046209 -967644 -890163 -860561 -814160 -717453 -643712
31335 -643712 -640993 -656338 -661579 -716343 -822917 -860951 -770168 -666122 -662179 -701430 -683972 -639787
31323 -639787 -646240 -684597 -708724 -749584 -820474 -828876 -724903 -630181 -666394 -757014 -759552 -695350
31311 -695350 -675145 -692645 -683395 -701602 -823461 -939082 -873758 -685468 -604703 -678303 -711644
$$ packed form
31394h38080J4976J9755L576j4276j1000j0956k6415j1858M6316P4527L1284r490
31382g31641J0372K1910l6254p8997j1807Q7573Q2389m031m4844k2812k0073m2777
31370g90992k4887K1714K1211j8753k0348J8154K7298K973M901L1872K6674n837
31358g06020p536J6625M612n1526j01058j19725j08287m6268N6717J14974P3993
31347h73499M718j1458j3311n8062q2511j2086P8565P7481K9602M6401R6707P3741
31335f43712K719j5345n241n4764j06574l8034R0783J04046L943l9251J7458M4185
31323f39787o453l8357k4127m0860p0890q402J03973R4722l6213r0620k538O4202
31311f95350K0205j7500R250j8207j21859j15621O5324J88290Q0765p3600l3341
$$ plain form
31300 -711644 -601728 -496692 -542666 -669440 -735707 -732434 -729257 -740776 -758562 -824115 -960057
31289 -960057 -1085037 -1089024 -966656 -817986 -738213 -742181 -778720 -798445 -811476 -860401 -923791
31278 -923791 -907872 -792443 -717156 -816980 -1010657 -1075293 -924988 -702118 -585429 -613381
31268 -613381 -711399 -791946 -799838 -740463 -687003 -697335 -726575 -694469 -621504 -600713 -643344 -664970
31256 -664970 -635326 -628070 -690468 -764106 -777805 -740532 -705178 -705464 -753754 -838894 -908135 -909288
31244 -909288 -858863 -813432 -783744 -744064 -706530 -701497 -701355 -659698 -612851 -636440 -706582 -717600
31232 -717600 -645025 -581189 -595810 -663281 -734103 -773009 -728702 -587137 -457022 -469656 -584259
31221 -584259 -633212 -571876 -522999 -547128 -551413 -487611 -457328 -524886 -592755 -577703 -557448 -612925
$$ packed form
31300g11644J09916J05036m5974j26774o6267L273L177j1519j7786o5553j35942
31289i60057j24980l987J22368J48670P9773l968l6539j9725j3031m8925o3390
31278i23791J5919J15429P5287r9824j93677o4636J50305K22870J16689k7952
31268f13381r8018q0547p892N9375N3460j0332k9240L2106P2965K0791m2631k1626
31256f64970K9644P256o2398p3638j3699L7273L5354k86m8290q5140o9241j153
31244i09288N0425M5431K9688L9680L7534N033J42M1657M6847k3589p0142j1018
31232g17600P2575O3836j4621o7471p0822l8906M4307J41565J30115j2634j14603
31221e84259m8953O1336M8877k4129m285O3802L0283o7558o7869J5052K0255n5477
$$ plain form
31209 -612925 -668147 -634288 -583095 -610979 -644595 -571277 -476536 -539185 -728042 -814282 -696065
31198 -696065 -525234 -475202 -546648 -657714 -776456 -878644 -892455 -792313 -678399 -665772
31188 -665772 -735243 -778398 -761103 -751226 -785430 -801434 -744655 -672750 -678601 -740761 -743035 -652824
31176 -652824 -584065 -630678 -721252 -727405 -657557 -631907 -693780 -765478 -788507 -787290 -777201 -730398
31164 -730398 -669974 -681202 -772547 -830321 -779301 -694850 -681238 -723884 -743109 -718075 -671699
31153 -671699 -599453 -501827 -432106 -428656 -452421 -468805 -527138 -666090 -803085 -830853 -780265
31142 -780265 -767322 -804595 -791493 -692146 -603044 -614432 -695307 -750776 -728927 -647703 -571398
31131 -571398 -574072 -671578 -779684 -793792 -719084 -667180 -714849 -822675 -906432 -928458 -891792
$$ packed form
31209f12925n5222L3859N1193k7884l3616P3318R4741o2649j88857q6240J18217
31198f96065J70831N0032p1446j11066j18742j02188j3811J00142J13914J2627
31188f65772o9471m3155J7295R877l4204j6004N6779P1905n851o2160k274R0211
31176f52824O8759m6613r0574o153O9848K5650o1873p1698k3029J217J0089M6803
31164g30398O0424j1228r1345n7774N1020Q4451J3612m2646j9225K5034M6376
31153f71699P2246R7626O9721L450k3765j6384n8333j38952j36995k7768N0588
31142g80265J2943l7273J3102R9347Q9102j1388q0875n5469K1849Q1224P6305
31131e71398k674r7506j08106j4108P4708N1904m7669j07826q3757k2026L6666
$$ plain form
31120 -891792 -799351 -666592 -549296 -513741 -573453 -671511 -733634 -740993 -745882 -803050 -891859
31109 -891859 -937243 -911417 -869883 -864069 -866418 -826109 -761609 -739434 -777031 -822198 -827993 -802305
31097 -802305 -774961 -749894 -707021 -641331 -590958 -614451 -721823 -838637 -875188 -828523 -770768
31086 -770768 -741655 -720704 -712644 -768230 -879864 -947322 -912138 -844241 -816956 -780518 -667972
31075 -667972 -554615 -569056 -678445 -716166 -631373 -562314 -617291 -716759 -730942 -668286 -626607
31064 -626607 -628851 -620459 -596339 -616113 -685777 -723925 -687316 -654701 -716979 -825857 -837909 -710446
31052 -710446 -570565 -551458 -627369 -673675 -638736 -570183 -502486 -427190 -377582 -427899 -569202
31041 -569202 -686426 -713812 -719026 -762968 -772047 -655036 -477523 -396061 -451427 -544388 -600912
$$ packed form
31120h91792R2441J32759J17296L5555n9712r8058o2123p359m889n7168q8809
31109h91859m5384K5826M1534N814k349M0309O4500K2175l7597m5167n795K5688
31097h02305K7344K5067M2873O5690N0373k3493j07372j16814l6551M6665N7755
31086g70768K9113K0951Q060n5586j11634o7458L5184O7897K7285L6438J12546
31075f67972J13357j4441j09389l7721Q4793O9059n4977r9468j4183O2656M1679
31064f26607k244Q392K4120j9774o9664l8148L6609L2615o2278j08878j2052J27463
31052g10446J39881J9107p5911m6306L4939O8553O7697P5296M9608n0317j41303
31041e69202j17224k7386n214m3942r079J17011J77513Q1462n5366r2961n6524
$$ plain form
31030 -600912 -642006 -681485 -671135 -589760 -501286 -473921 -497844 -522952 -532714 -546122 -582484 -650092
31018 -650092 -736117 -788850 -750540 -635134 -537411 -530557 -581209 -604495 -585657 -597082 -685335
31007 -685335 -788229 -807394 -743283 -696143 -718954 -738871 -679939 -605767 -644869 -793839 -899875
30996 -899875 -853297 -704476 -567425 -501840 -521984 -620337 -729890 -755477 -699190 -664897 -688122
30985 -688122 -675670 -585370 -533063 -607396 -701345 -674592 -581544 -570893 -641788 -686155 -709734
30974 -709734 -800659 -907920 -875653 -711551 -602225 -614771 -595755 -450304 -323576 -379692
30964 -379692 -557923 -691226 -749041 -814615 -900549 -929892 -864533 -743875 -617818 -516882
30954 -516882 -460084 -433636 -397187 -354269 -363091 -435781 -498360 -505467 -517431 -593894 -685887 -715717
$$ packed form
31030f00912m1094l9479J0350Q1375Q8474K7365k3923k5108r762j3408l6362o7608
31018f50092q6025n2733L8310J15406R7723O854n0652k3286J8838j1425q8253
31007f85335j02894j9165O4111M7140k2811j9917N8932P4172l9102j48970j06036
30996h99875M6578J48821J37051O5585k0144r8353j09553k5587N6287L4293k3225
30985f88122J2452R0300N2307p4333r3949K6753R3048J0651p0895m4367k3579
30974g09734r0925j07261L2267J64102J09326j2546J9016J45451J26728n6116
30964c79692j78231j33303n7815o5574q5934k9343O5359J20658J26057J00936
30954e16882N6798K6448L6449M2918q822p2690o2579p107j1964p6463r1993k9830
$$ plain form
30942 -715717 -697537 -690157 -690130 -666262 -646517 -668235 -687144 -646352 -601126 -651888 -765278 -790441
30930 -790441 -673386 -540268 -524642 -607149 -683930 -716188 -734682 -740712 -689247 -575044 -476173
30919 -476173 -479846 -583287 -694568 -732790 -705676 -674353 -665703 -659197 -652189 -679610 -745143 -785404
30907 -785404 -749561 -679785 -655537 -675352 -657897 -568074 -484019 -504713 -623009 -731583 -747484
30896 -747484 -692986 -641697 -619041 -593108 -549325 -520873 -529518 -544983 -538094 -535231 -574366 -637283
30884 -637283 -675812 -678472 -656730 -597357 -501805 -446927 -510581 -637622 -680010 -591110 -484165
30873 -484165 -462804 -489687 -480360 -441293 -435442 -470675 -507164 -542188 -609817 -705883 -768405 -731703
30861 -731703 -576657 -353006 -177038 -167184 -337860 -577431 -755927 -823660 -789938 -670139
$$ packed form
30942g15717J8180P380K7K3868J9745k1718j8909M0792M5226n0762j13390k5163
30930g90441J17055J33118J5626q2507p6781l2258j8494o030N1465J14203R8871
30919d76173l673j03441j11281l8222K7114L1323Q650O506P008k7421o5533m0261
30907g85404L5843O9776K4248j9815J7455Q9823Q4055k0694j18296j08574j5901
30896g47484N4498N1289K2656K5933M3783K8452q645j5465O889K863l9135o2917
30884f37283l8529k660K1742N9373R5552N4878o3654j27041m2388Q8900J06945
30873d84165K1361k6883R327L9067N851l5233l6489l5024o7629r6066o2522L6702
30861g31703J55046K23651J75968R854j70676k39571j78496o7733L3722J19799
$$ plain form
30851 -670139 -506577 -391323 -396477 -495514 -599121 -651377 -655177 -632127 -603605 -593276 -607933
30840 -607933 -625953 -626284 -607497 -566561 -500907 -450308 -480365 -588732 -683370 -698583 -677509 -686997
30828 -686997 -708318 -682173 -616629 -572264 -569825 -587967 -629440 -709812 -787505 -781397 -674071 -548577
30816 -548577 -505320 -563525 -643624 -639364 -532070 -438919 -496990 -681764 -811252 -768981 -642735
30805 -642735 -580335 -593252 -597343 -575755 -578916 -602863 -593900 -561583 -571737 -626945 -659079 -645677
30793 -645677 -634419 -645060 -645776 -638344 -667853 -729701 -763689 -762819 -790397 -859445 -892935 -844925
30781 -844925 -770029 -725123 -687365 -622222 -553185 -508324 -473812 -457498 -516714 -649574 -736737
30770 -736737 -687024 -584893 -587188 -703470 -785585 -733135 -614021 -559007 -606356 -679766 -676063
$$ packed form
30851f70139J63562J15254n154r9037j03607n2256l800K3050K8522J0329j4657
30840f07933j8020l31J8787M0936O5654N0599l0057j08367r4638j5213K1074r488
30828f86997k1321K6145O5544M4365K439j8142m1473q0372p7693O108J07326J25494
30816e48577M3257n8205q0099M260J07294R3151n8071j84774j29488M2271J26246
30805f42735O2400j2917m091K1588l161k3947Q963L2317j0154n5208l2134J3402
30793f45677J1258j0641p16P432k9509o1848l3988Q70k7578o9048l3490M8010
30781h44925P4896M4906L7758O5143O9037M4861L4512J6314n9216j32860q7163
30770g36737M9713J02131k295j16282q2115N2450J19114N5014m7349p3410L703
$$ plain form
30759 -676063 -556923 -389502 -303658 -368788 -503444 -547728 -439426 -279243 -204270 -241701
30749 -241701 -323638 -408267 -522121 -679150 -813801 -832629 -716705 -544532 -415693 -369445
30739 -369445 -376330 -390587 -401165 -432937 -496762 -546203 -513830 -408722 -345143 -429119 -628940
30728 -628940 -805763 -867637 -841515 -794496 -750371 -704434 -659816 -616210 -568744 -539411 -554539
30717 -554539 -573423 -516870 -402846 -364406 -468786 -603193 -625147 -550990 -495278 -492816 -502863
30706 -502863 -535533 -630402 -733582 -742580 -674617 -651428 -703827 -730322 -675850 -610705 -589721
30695 -589721 -574025 -551360 -590569 -692353 -723989 -615943 -503267 -535229 -642948 -654580 -571681
30684 -571681 -551254 -636561 -688828 -616386 -512279 -494653 -532563 -522514 -458042 -424085 -459483
$$ packed form
30759f76063J19140J67421Q5844o5130j34656m4284J08302J60183P4973l7431
30749b41701q1937q4629j13854j57029j34651j8828J15924J72173J28839M6248
30739c69445o885j4257j0578l1772o3825m9441L2373J05108O3579q3976j99821
30728f28940j76823o1874K6122M7019M4125M5937M4618M3606M7466K9333j5128
30717e54539j8884N6553J14024L8440j04380j34407k1954P4157N5712K462j0047
30706e02863l2670r4869j03180q998O7963K3189n2399k6495N4472O5145K0984
30695e89721J5696K2665l9209j01784l1636J08046J12676l1962j07719j1632Q2899
30684e71681K0427q5307n2267P2442J04107J7626l7910J0049O4472L3957l5398
$$ plain form
30673 -459483 -512196 -527649 -517293 -522495 -547345 -553531 -517266 -476248 -502647 -618139 -749382
30662 -749382 -793715 -726874 -618167 -537187 -481074 -411010 -326080 -262943 -236293 -222353 -209185
30651 -209185 -227610 -306789 -417449 -489010 -481593 -419894 -356480 -323989 -326658 -353343 -384657 -403647
30639 -403647 -412181 -424447 -437754 -428404 -386163 -333118 -296991 -284727 -291433 -312728 -339875 -367737
30627 -367737 -409647 -468489 -497738 -455249 -405983 -481493 -689420 -853868 -828094 -690423 -621110
30616 -621110 -644290 -628195 -516519 -410224 -399236 -446464 -486729 -527879 -588173 -622566 -587653
30605 -587653 -522711 -500643 -536017 -588376 -622594 -631734 -632413 -656758 -710235 -732483 -658490 -525880
30593 -525880 -447917 -463815 -498568 -496074 -496302 -533910 -556615 -515667 -459486 -458809 -500978 -534632
$$ packed form
30673d59483n2713j5453J0356n202k4850o186L6265M1018k6399j15492j31243
30662g49382m4333O6841J08707Q0980N6113P0064Q4930O3137K6650J3940J3168
30651b09185j8425p9179j10660p1561P417O1699O3414L2491k669k6685l1314j8990
30639d03647q534j2266j3307R350M2241N3045L6127J2264o706k1295k7147k7862
30627c67737m1910n8842k9249M2489M9266p5510k07927j64448K5774J37671O9313
30616f21110k3180J6095J11676J06295J0988m7228m0265m1150o0294l4393L4913
30605e87653O4942K2068l5374n2359l4218r140o79k4345n3477k2248P3993J32610
30593e25880P7963j5898l4753K494k28l7608k2705M0948N6181O77m2169l3654
$$ plain form
30581 -534632 -562086 -606622 -635295 -597864 -514585 -459739 -484435 -599367 -780418 -936649 -941628
30570 -941628 -777539 -592038 -527577 -550942 -544621 -501560 -502320 -542601 -534541 -477667 -481083 -581874
30558 -581874 -670117 -651621 -580508 -559674 -590413 -599154 -558738 -504531 -458599 -408283 -355715 -335896
30546 -335896 -373420 -447588 -510084 -524556 -483906 -401595 -305974 -248771 -289768 -432782 -586122
30535 -586122 -639353 -586930 -520806 -492505 -461690 -411033 -411466 -497375 -566624 -516652 -415695 -403554
30523 -403554 -457422 -411528 -220199 -50659 -60050 -201994 -328293 -385038 -418302 -453789 -469464
30512 -469464 -459793 -447187 -435680 -408896 -372102 -356015 -378150 -424846 -466636 -475258 -437798 -370980
30500 -370980 -311465 -280840 -271070 -268295 -272515 -288511 -317456 -363169 -427014 -493244 -540655 -570886
$$ packed form
30581e34632k7454m4536k8673L7431Q3279N4846k4696j14932j81051j56231m979
30570i41628J64089J85501O4461k3365O321M3061p60m0281Q060N6874l416j00791
30558e81874q8243J8496P1113K0834l0739q741M0416N4207M5932N0316N2568J9819
30546c35896l7524p4168o2496j4472M0650Q2311R5621N7203m0997j43014j53340
30535e86122n3231N2423O6124K8301L0815N0657m33q5909o9249M9972J00957J2141
30523d03554n3868M5894J91329J69540r391j41944j26299n6745l3264l5487j5675
30512d69464R671J2606J1507K6784L6794J6087k2135m6696m1790q622L7460O6818
30500c70980N9515L0625R770K775m220j5996k8945m5713o3845o6230m7411l0231
$$ plain form
30488 -570886 -602074 -632646 -636801 -601355 -546360 -506198 -506340 -551551 -613281 -636157 -586139 -491612
30476 -491612 -415660 -394267 -419143 -461937 -490227 -484738 -472606 -511860 -601834 -649492 -587147 -487704
30464 -487704 -479640 -565386 -616450 -551477 -429870 -352835 -355057 -417837 -508983 -576109 -571021 -516643
30452 -516643 -490328 -516781 -544728 -549583 -572126 -616850 -606844 -507273 -413072 -427056 -506645 -522391
30440 -522391 -436369 -339378 -327049 -408259 -525522 -606555 -603499 -532245 -467638 -462104 -484467 -475851
30428 -475851 -442166 -444785 -513976 -611845 -670545 -643095 -544086 -465601 -508140 -653901 -755626
30417 -755626 -705663 -569768 -487686 -489541 -498483 -477884 -464692 -463602 -424897 -355006 -345370 -437101
30405 -437101 -534951 -522601 -415228 -335209 -362717 -460383 -531409 -515376 -434484 -365648 -356243
$$ packed form
30488e70886l1188l0572m155L5446N4995M0162j42m5211o1730k2876N0018R4527
30476d91612P5952K1393k4876m2794k8290N489J2132l9254q9974m7658O2345R9443
30464d87704Q064q5746n1064O4973J21607P7035k222o2780r1146o7126N088N4378
30452e16643K6315k6453k7947m855k2543m4724J0006R9571R4201j3984p9589j5746
30440e22391Q6022R6991J2329q1210j17263q1033L056P1254O4607N534k2363Q616
30428d75851L3685k619o9191r7869n8700K7450R9009P8485m2539j45761j01725
30417g55626M9963J35895Q2082j855q942K0599J3192J090L8705O9891R636r1731
30405d37101r7850J2350J07373Q0019k7508r7666p1026J6033Q0892O8836R405
$$ plain form
30394 -356243 -363806 -311051 -209174 -176166 -297076 -505573 -652919 -671815 -622403 -588631 -584483
30383 -584483 -573487 -539057 -509068 -522941 -585760 -651353 -657028 -587720 -496307 -442370 -424716 -404200
30371 -404200 -379809 -391892 -442533 -470460 -441601 -418660 -481861 -602848 -665623 -617664 -537242
30360 -537242 -526002 -586807 -645006 -649065 -603294 -530595 -457013 -418790 -430997 -453330 -438562 -414154
30348 -414154 -455513 -562783 -626686 -557462 -405173 -305825 -335091 -456462 -585920 -655925 -635761
30337 -635761 -555000 -510783 -588392 -750899 -858319 -825933 -716047 -633895 -583444 -493114 -352248
30326 -352248 -233683 -178747 -149455 -126210 -167035 -304095 -444648 -463477 -366360 -278148 -279686
30315 -279686 -337941 -396447 -446307 -484736 -483020 -437347 -395016 -393773 -421191 -456692 -497064 -517303
$$ packed form
30394c56243p563N2755J01877L3008j20910k08497j47346j8896M9412L3772M148
30383e84483J0996L4430K9989j3873o2819o5593n675O9308R1413N3937J7654K0516
30371d04200K4391j2083n0641k7927K8859K2941o3201j20987o2775M7959Q0422
30360e37242J1240o0805n8199m059M5771P2699P3582L8223j2207k2333J4768K4408
30348d14154m1359j07270o3903O9224J52289R9348k9266j21371j29458p0005K0164
30337f35761Q0761M4217p7609j62507j07420L2386J09886Q2152N0451R0330J40866
30326c52248J18565N4936K9292K3245m0825j37060j40553j8829R7117Q8212j538
30315b79686n8255n8506m9860l8429J716M5673M2331J243k7418l5501m0372k0239
$$ plain form
30303 -517303 -475425 -391703 -351099 -380713 -397200 -331328 -231644 -180375 -183267 -220597 -325761
30292 -325761 -508451 -666734 -695762 -636730 -598584 -580017 -508108 -417300 -425239 -529379 -590161
30281 -590161 -547002 -501975 -542575 -619870 -661489 -676953 -681879 -637441 -545130 -495102 -534977 -583972
30269 -583972 -560789 -506935 -495455 -503482 -472931 -424467 -411474 -421041 -414062 -406074 -416447 -396742
30257 -396742 -310396 -232670 -264764 -384628 -483025 -515350 -519171 -512255 -479609 -445221 -453584 -483541
30245 -483541 -471833 -420140 -392256 -404890 -406386 -372067 -342547 -350724 -373626 -374054 -345964 -313558
30233 -313558 -316952 -381312 -465841 -481772 -411989 -363986 -430341 -543416 -565532 -492916 -458161
30222 -458161 -533249 -638424 -667050 -610736 -531695 -483176 -485505 -523089 -542245 -498469 -419098
$$ packed form
30303e17303M1878Q3722M0604k9614j6487O5872R9684N1269k892l7330j05164
30292c25761j82690j58283k9028N9032L8146J8567P1909R0808p939j04140o0782
30281e90161M3159M5027m0600p7295m1619j5464m926M4438R2311N0028l9875m8995
30269e83972K3183N3854J1480q027L0551M8464J2993r567O979P988j0373J9705
30257c96742Q6346P7726l2094j19864r8397l2325l821O916L2646L4388q363k9957
30245d83541J1708N1693K7884j2634j496L4319K9520q177k2902m28K8090L2406
30233c13558l394o4360q4529j5931O9783M8003o6355j13075k2116P2616L4755
30222d58161p5088j05175k8626N6314P9041M8519k329l7584j9156M3776P9371
$$ plain form
30211 -419098 -379888 -417559 -499234 -563451 -556323 -464042 -361010 -374522 -523624 -643335 -572038
30200 -572038 -376416 -269551 -326982 -419441 -430020 -394534 -389070 -407343 -413394 -419412 -446600 -478108
30188 -478108 -498726 -521494 -543000 -532039 -483558 -423980 -358401 -282808 -239030 -264441 -297427
30177 -297427 -247802 -157285 -153694 -236787 -267687 -202754 -162437 -203160 -204375 -89530 10764
30166 10764 -42942 -180318 -255039 -271358 -307244 -321903 -235415 -125443 -141507 -261877 -329960
30155 -329960 -313930 -336423 -439484 -511304 -487622 -455485 -491183 -535625 -507966 -435783 -399598
30144 -399598 -426296 -488495 -540709 -528582 -440610 -365767 -402419 -493897 -474987 -318403 -201711
30133 -201711 -259401 -393868 -430733 -356633 -286975 -280117 -311544 -376445 -484292 -576302 -571943
$$ packed form
30211d19098L9210l7671q1675o4217P128R2281J03032j3512j49102j19711P1297
30200e72038J95622J06865n7431r2459j0579L5486N464j8273o051o018k7188l1508
30188d78108k0618k2768k1506J0961M8481N9578O5579P5593M3778k5411l2986
30177b97427M9625R0517L591q3093l0900O4933M0317m0723j215J14845J00294
30166A0764n3706j37376p4721j6319l5886j4659Q6488J09972j6064j20370o8083
30155c29960J6030k2493j03061p1820K3682L2137l5698m4442K7659P2183L6185
30144c99598k6698o2199n2214J2127Q7972P4843l6652r1478J8910J56584J16692
30133b01711n7690j34467l6865P4100O9658O858l1427o4901j07847r2010M359
$$ plain form
30122 -571943 -494955 -447137 -455074 -446888 -396040 -385669 -488539 -657838 -780635 -788633 -691789
30111 -691789 -561870 -508731 -603496 -778246 -858763 -752743 -563897 -467157 -512306 -610778 -675273
30100 -675273 -690856 -667014 -609864 -552857 -537434 -539771 -485253 -366253 -279528 -302796 -391018
30089 -391018 -446575 -441570 -410657 -369943 -320574 -302057 -353371 -427846 -431977 -357865 -297035 -304001
30077 -304001 -327733 -315491 -308204 -372485 -491250 -588643 -632751 -652284 -669689 -675241 -661834 -635819
30065 -635819 -589458 -502877 -386161 -295310 -291063 -382173 -504582 -559654 -496146 -363744 -264426
30054 -264426 -245656 -272006 -304752 -354367 -425790 -469794 -445679 -394266 -385288 -418314 -443362 -460183
30042 -460183 -515898 -603340 -647770 -620554 -587714 -600113 -604546 -531638 -422563 -382859 -430300
$$ packed form
30122e71943P6988M7818p937Q186N0848J0371j02870j69299j22797p998R6844
30111f91789J29919N3139r4765j74750q0517J06020J88846R6740m5149r8472o4495
30100f75273j5583K3842N7150N7007J5423k337N4518J19000Q6725k3268q8222
30089c91018n5557N005L0913M0714M9369J8517n1314p4475m131P4112O0830o966
30077c04001k3732J2242P287o4281j18765r7393m4108j9533j7405n552J3407K6015
30065f35819M6361Q6581J16716R0851M247r1110j22409n5072O3508J32402R9318
30054b64426J8770k6350l2746m9615p1423m4004K4115N1413Q978l3026k5048j6821
30042d60183n5715q7442m4430K7216L2840j2399m433P2908J09075L9704m7441
$$ plain form
30031 -430300 -479282 -484701 -509352 -604316 -699503 -689213 -582272 -481958 -436809 -402219 -350389
30020 -350389 -318373 -316688 -288400 -219809 -207881 -334057 -531466 -664616 -689816 -646959 -551641
30009 -551641 -415281 -326862 -365697 -445426 -403147 -257622 -210062 -341053 -479754 -462205 -357427
29998 -357427 -311840 -311422 -260667 -194644 -229759 -356056 -448530 -460074 -449918 -438471 -389661 -336406
29986 -336406 -366966 -463501 -499564 -436378 -386192 -428491 -489854 -476639 -418147 -393603 -399120 -372901
29974 -372901 -299204 -219724 -182744 -223384 -339419 -448287 -438193 -314809 -229435 -299994 -468008
29963 -468008 -600067 -663112 -708342 -732620 -668670 -507076 -335932 -243926 -245560 -307992 -392179
29952 -392179 -456034 -470374 -452397 -448310 -470765 -484934 -465229 -433831 -429163 -459750 -501934 -526623
$$ packed form
30031d30300m8982n419k4651r4964r5187J0290J06941J00314M5149L4590N1830
30020c50389L2016J685K8288O8591J1928j26176j97409j33150k5200M2857R5318
30009e51641J36360Q8419l8835p9729M2279J45525M7560j30991j38701J7549J04778
29998c57427M5587M18N0755O6023l5115j26297r2474j1544J0156J1447M8810N3255
29986c36406l0560r6535l6063O3186N0186m2299o1363J3215N8492K4544n517K6219
29974c72901P3697P9480L6980m0640j16035j08868J0094J23384Q5374p0559j68014
29963d68008j32059o3045m5230k4278O3950J61594J71144R2006j634o2432q4187
29952c92179o3855j4340J7977M087k2455j4169J9705L1398M668l0587m2184k4689
$$ plain form
29940 -526623 -519728 -490522 -467338 -474079 -504345 -525691 -515085 -487839 -486403 -534106 -599143 -618880
29928 -618880 -572584 -513201 -501173 -521526 -507182 -439586 -374253 -354111 -351709 -328019 -301806 -317014
29916 -317014 -374765 -443474 -508958 -563839 -569939 -495203 -386813 -345979 -411450 -513994 -566915
29905 -566915 -558011 -521817 -462426 -357827 -228423 -146434 -159632 -237091 -309937 -343212 -346760
29894 -346760 -337699 -327070 -336120 -386530 -464704 -526653 -552965 -571296 -606425 -637999 -637309 -621467
29882 -621467 -630706 -661968 -666248 -615944 -542365 -496241 -493652 -511583 -521981 -519341 -516922 -517733 -498642
29869 -498642 -443221 -384997 -376427 -401534 -372096 -250325 -127833 -122166 -226843 -332630 -376073
29858 -376073 -389159 -408780 -422401 -421043 -431760 -465882 -489643 -472977 -422170 -349966 -266985 -215822
$$ packed form
29940e26623O895K9206K3184o741l0266k1346J0606K7246J436m7703o5037j9737
29928f18880M6296N9383J2028k0353J4344O7596O5333K0142K402K3690K6213j5208
29916c17014n7751o8709o5484n4881o100P4736J08390M0834o5471j02544n2921
29905e66915Q904L6194N9391J04599J29404Q1989j3198p7459p2846l3275l548
29894c46760R061J0629r050n0410p8174o1949k6312j8331l5129l1574O90J5842
29882f21467r239l1262m280N0304P3579M6124K589j7931j0398K640K419q11J9091
29869d98642N5421N8224Q570k5107K9438J21771J22492N667j04677j05787m3443
29858c76073j3086j9621j3621J358j0717l4122k3761J6666N0807P2204Q2981N1163
$$ plain form
29846 -215822 -248188 -342953 -411525 -416038 -416280 -460369 -498497 -462143 -370995 -296810 -266604 -265161
29834 -265161 -291396 -342707 -377111 -362869 -339360 -355847 -375130 -325446 -239322 -241676 -373220
29823 -373220 -510431 -514391 -403889 -318322 -336210 -396250 -405392 -371318 -383910 -478335 -568817
29812 -568817 -550289 -436514 -344420 -344823 -388649 -401368 -390077 -407877 -452351 -462106 -403521 -311042
29800 -311042 -240754 -218323 -230074 -237107 -205874 -152766 -146629 -234667 -376077 -484030 -525055
29789 -525055 -537828 -556723 -562151 -522821 -454420 -408399 -410174 -428544 -415917 -372418 -347130 -361742
29777 -361742 -365002 -309121 -248008 -281765 -400016 -476899 -459970 -460018 -571758 -697109 -670367 -505836
29765 -505836 -381747 -394594 -468093 -513629 -537632 -549546 -499988 -382884 -285659 -254828 -215171
$$ packed form
29846b15822l2366r4765o8572m513k42m4089l8128L6354R1148P4185L0206J443
29834b65161k6235n1311l4404J4242K3509j6487j9283M9684Q6124k354j31544
29823c73220j37211l960J10502Q5567j7888o0040r142L4074j2592r4425r0482
29812e68817J8528J13775R2094m03m3826j2719J1291j7800m4474r755N8585R2479
29800c11042P0288K2431j1751p033L1233N3108O137q8038j41410j07953m1025
29789e25055j2773j8895n428L9330O8401M6021j775j8370J2627M3499K5288j4612
29777c61742l260N5881O1113l3757j18251p6883J6929m8j11740j25351K6742J64531
29765e05836J24089j2847p3499m5536k4003j1914M9558J17104R7225L0831L9657
$$ plain form
29754 -215171 -118065 -65575 -156046 -289827 -294677 -203699 -223429 -411962 -571474 -529979 -376081
29743 -376081 -308225 -369827 -461194 -527605 -588906 -625138 -579344 -473266 -398411 -381079 -364074
29732 -364074 -332680 -342247 -393856 -403001 -342252 -301831 -340384 -381556 -343765 -274483 -253004 -248627
29720 -248627 -198787 -155956 -214490 -336968 -400609 -390168 -393943 -421697 -392988 -320411 -328197 -434028
$$ packed form
29754b15171R7106N2490r0471j33781m850R0978j9730j88533j59512M1495J53898
29743c76081O7856o1602r1367o6411o1301l6232M5794J06078P4855J7332J7005
29732c64074L1394r567n1609r145O0749M0421l8553m1172L7791O9282K1479M377
29720b48627M9840M2831n8534j22478o3641J0441l775k7754K8709P2577p786j05831
$$ [...]
##END NTUPLES=NMR SPECTRUM
##END=
