##TITLE=31Pdec_LY-Dix_30_05
 CD3CN, 24 sc
 31.05.2021
##JCAMPDX= 6.0         $$ Bruker NMR JCAMP-DX V2.0
##DATA TYPE= NMR SPECTRUM
##DATA CLASS= NTUPLES
##ORIGIN= UXNMR, Bruker Analytische Messtechnik GmbH
##OWNER= root
$$ XWIN-NMR		Version 3.5
$$ Mon May 31 12:16:36 2021 Russian Standard Time (UT+4h)  she@DPX200
##.OBSERVE FREQUENCY= 81.013821
##.OBSERVE NUCLEUS= ^31P
##.ACQUISITION MODE= SIMULTANEOUS
##.ACQUISITION SCHEME= undefined
##.AVERAGES= 26
##.DIGITISER RES= 16
##SPECTROMETER/DATA SYSTEM= spect
##.PULSE SEQUENCE= zgpg30
##.SOLVENT NAME= CDCl3
##.SHIFT REFERENCE= (INTERNAL, CDCl3, 0, 248.564)
##AUDIT TRAIL= $$ (NUMBER, WHEN, WHO, WHERE, WHAT)
$$ ##TITLE= Audit trail, XWIN-NMR		Version 3.5
$$ ##JCAMPDX= 5.01
$$ ##ORIGIN= Bruker BioSpin GmbH
$$ ##OWNER= she
$$ F:/spectra/data/she/nmr/P31/1/pdata/1/auditp.txt
$$ ##AUDIT TRAIL=  $$ (NUMBER, WHEN, WHO, WHERE, WHAT)
(   1,<2021-05-31 12:15:17.98 +0400>,<she>,<DPX200>,
      <created by zg, POWCHK disabled, PULCHK disabled
       terminated by command 'halt'
       configuration hash MD5:
       00 E9 B6 7A A2 85 ED C7 34 08 36 98 17 FE 4E 26
       data hash MD5: 32K
       07 63 13 19 BB 3A BE 03 97 B3 2A 9E EF 71 B3 8D>)
(   2,<2021-05-31 12:15:26.45 +0400>,<she>,<DPX200>,
      <Start of raw data processing
       efp BC_mod = 2 LB = 1 FT_mod = 6 PKNL = 1 PHC0 = -6422.81 PHC1 = 131.6012 SI = 64K 
       data hash MD5: 64K
       BB 48 4A C7 AC 30 90 62 03 E9 4A 90 3D 87 36 39>)
(   3,<2021-05-31 12:15:56.87 +0400>,<she>,<DPX200>,
      <pk PHC0 = 184.2148 PHC1 = -62.2 
       data hash MD5: 64K
       E1 9A 01 1A 14 60 4A 2B 65 75 EC 98 48 1C 16 E0>)
(   4,<2021-05-31 12:16:00.07 +0400>,<she>,<DPX200>,
      <abs ABSG = 5 
       data hash MD5: 64K
       0C 7F B8 2F F2 E5 4D 2C 7F 74 8A 8B EB 42 37 60>)
$$ ##END=
$$ 
$$ hash MD5
$$ E3 77 34 70 17 7E 1E 42 4D D7 FA 2E 46 37 1E 99
##$RELAX= 
##$RELAX= 
##$RELAX= 
##$RELAX= 
##$RELAX= 
##$RELAX= 
##$RELAX= 
##$RELAX= 
$$ Bruker specific parameters
$$ --------------------------
##$DU= <F:/spectra>
##$EXPNO= 1
##$NAME= <P31>
##$PROCNO= 1
##$TYPE= <nmr>
##$USER= <she>
##$AMP= (0..31)
100 100 100 100 100 100 100 100 100 100 100 100 100 100 100 100 100 100 
100 100 100 100 100 100 100 100 100 100 100 100 100 100 
##$AQSEQ= 0
##$AQ_mod= 1
##$AUNM= <au_zg>
##$AUTOPOS= <>
##$BF1= 81.014009
##$BF2= 200.13
##$BF3= 200.13
##$BF4= 200.13
##$BF5= 200.13
##$BF6= 200.13
##$BF7= 200.13
##$BF8= 200.13
##$BYTORDA= 1
##$CFDGTYP= 0
##$CFRGTYP= 5
##$CHEMSTR= <none>
##$CNST= (0..31)
1 1 145 1 1 1 1 1 1 1 1 1 1 1 1 1 1 1 1 1 1 1 1 1 1 1 1 1 1 1 1 1 
##$CPDPRG= <waltz16>
##$CPDPRG1= <>
##$CPDPRG2= <waltz16>
##$CPDPRG3= <>
##$CPDPRG4= <mlev>
##$CPDPRG5= <mlev>
##$CPDPRG6= <mlev>
##$CPDPRG7= <mlev>
##$CPDPRG8= <mlev>
##$CPDPRGB= <>
##$CPDPRGT= <>
##$D= (0..31)
0 1 0 0 0 0 0 0 0 0 0 0.03 2e-05 3e-06 0 0 0 0 0 0 0 0 0 0 0 0 0 0 0 0 
0 0 
##$DATE= 1622448917
##$DBL= (0..7)
120 120 120 11 120 120 24 19 
##$DBP= (0..7)
150 150 150 150 150 150 150 150 
##$DBP07= 0
$$ [...]
##$SUBNAM3= <"">
##$SUBNAM4= <"">
##$SUBNAM5= <"">
##$SUBNAM6= <"">
##$SUBNAM7= <"">
##$SUBNAM8= <"">
##$SUBNAM9= <"">
##$SW= 501.771253377433
##$SWIBOX= (0..15)
0 1 3 0 0 0 0 0 0 0 0 0 0 0 0 0 
##$SW_h= 40650.406504065
##$TD= 32768
##$TD0= 1
##$TE= 0
##$TE2= 300
##$TE3= 300
##$TEG= 300
##$TL= (0..7)
0 120 53 12 22 120 120 120 
##$TP= (0..7)
150 150 150 150 150 150 150 150 
##$TP07= 0
##$TPNAME0= <>
##$TPNAME1= <>
##$TPNAME2= <>
##$TPNAME3= <>
##$TPNAME4= <>
##$TPNAME5= <>
##$TPNAME6= <>
##$TPNAME7= <>
##$TPOAL= (0..7)
0.5 0.5 0.5 0.5 0.5 0.5 0.5 0.5 
##$TPOFFS= (0..7)
0 0 0 0 0 0 0 0 
##$TUNHIN= 0
##$TUNHOUT= 0
##$TUNXOUT= 0
##$USERA1= <user>
##$USERA2= <user>
##$USERA3= <user>
##$USERA4= <user>
##$USERA5= <user>
##$V9= 5
##$VALIST= <valist>
##$VCLIST= <CCCCCCCCCCCCCCC>
##$VD= 0
##$VDLIST= <DDDDDDDDDDDDDDD>
##$VPLIST= <PPPPPPPPPPPPPPP>
##$VTLIST= <TTTTTTTTTTTTTTT>
##$WBST= 1024
##$WBSW= 4
##$XGAIN= (0..3)
0 0 0 0 
##$XL= 0
##$YL= 0
##$YMAX_a= 1458
##$YMIN_a= -21998
##$ZGOPTNS= <>
##$ZL1= 120
##$ZL2= 120
##$ZL3= 120
##$ZL4= 120
##$ABSF1= 248.5645
##$ABSF2= -253.2056
##$ABSG= 5
##$ABSL= 3
##$ALPHA= 0
##$AQORDER= 0
##$ASSFAC= 0
##$ASSFACI= 0
##$ASSFACX= 0
##$ASSWID= 0
##$AUNMP= <proc_1d>
##$AZFE= 0.1
##$AZFW= 0.5
##$BCFW= 0
##$BC_mod= 2
##$BYTORDP= 0
##$COROFFS= 0
##$CY= -3
##$DATMOD= 1
##$DC= 0
##$DFILT= <>
##$DTYPP= 0
##$F1P= 0
##$F2P= 0
##$FCOR= 1
##$FTSIZE= 65536
##$FT_mod= 6
##$GAMMA= 0
##$GB= 0
##$INTBC= 1
##$INTSCL= 5.30512e-09
##$ISEN= 30
##$LB= 1
##$LEV0= 0
##$LPBIN= 0
##$MAXI= 10000
##$MC2= 0
##$MEAN= 0
##$ME_mod= 0
##$MI= 50
##$NCOEF= 0
##$NC_proc= -3
##$NLEV= 6
##$NOISF1= 182.463
##$NOISF2= 159.3651
##$NSP= 0
##$NTH_PI= 0
##$NZP= 0
##$OFFSET= 248.5645
##$PC= 4
##$PHC0= -6238.595
##$PHC1= 69.4012
##$PH_mod= 1
##$PKNL= yes
##$PPARMOD= 0
##$PSCAL= 0
##$PSIGN= 0
##$REVERSE= no
##$SF= 81.014009
##$SI= 65536
##$SIGF1= 159.3651
##$SIGF2= -187.1042
##$SINO= 113.3802
##$SIOLD= 16384
##$SREGLST= <1H.CDCl3>
##$SSB= 0
##$STSI= 65536
##$STSR= 0
##$SW_p= 40650.406504065
##$SYMM= 0
##$S_DEV= 0
##$TDeff= 32768
##$TDoff= 0
##$TI= <>
##$TILT= no
##$TM1= 0
##$TM2= 0
##$TOPLEV= 0
##$USERP1= <user>
##$USERP2= <user>
##$USERP3= <user>
##$USERP4= <user>
##$USERP5= <user>
##$WDW= 1
##$XDIM= 65536
##$YMAX_p= 397310726
##$YMIN_p= -1788416
$$ End of Bruker specific parameters
$$ ---------------------------------
##NTUPLES= NMR SPECTRUM
##VAR_NAME=  FREQUENCY,     SPECTRUM/REAL,   SPECTRUM/IMAG
##SYMBOL=    X,             R,               I
##VAR_TYPE=  INDEPENDENT,   DEPENDENT,       DEPENDENT
##VAR_FORM=  AFFN,          ASDF,            ASDF
##VAR_DIM=   65536,         65536,           65536
##UNITS=     HZ,            ARBITRARY UNITS, ARBITRARY UNITS
##FACTOR=    0.620285442955139, 1,           1
##FIRST=     20137.2065510759, 0,            0
##LAST=      -20513.1999529892, 0,           0
##MIN=       -20513.1999529892, -1788416,    0
##MAX=       20137.2065510759, 397310726,    0
$$ Real data points
##PAGE= N=1
##DATA TABLE= (X++(R..R)), XYDATA
$$ [...]
35816a89036r4074j42464K612K57370K94186N6909j31047r9642p4621k08266k70732
$$ -189036 -283110 -425574 -422962 -165592 128594 185503 54456 -45186 -119807 -328073 -598805
35805e98805o8402J78261J75256k172r6180o0084N652R3225K00449K03801O4689
$$ -598805 -667207 -488946 -313690 -315862 -412042 -472126 -466474 -373249 -172800 31001 95690
35794I5690l2195K9126Q4483l558q1250r270M0287q5975j62194N7671L45694L09811
$$ 95690 63495 92621 177104 173546 92296 83026 123313 37338 -124856 -67185 278509 588320
35782E88320L5353o2395O5967O3217j76980l14924j38879J06220J44079N5635
$$ 588320 623673 561278 627245 690462 513482 198558 59679 165899 309978 365613
35772C65613K5071l975j63260l54668l63880j73772L2533J19285R9137L3230l7859
$$ 365613 390684 386709 223449 -131219 -495099 -668871 -636338 -517053 -417916 -384686 -422545
35761d22545p2849l7503M3525R2546O7196K2954M1906R6683P1305k8637j7899
$$ -422545 -495394 -532897 -489372 -396826 -329630 -306676 -264770 -168087 -96782 -125419 -143318
35750a43318J67841K59285J6428k99707k15458K02687L68390O4881k25986j42934
$$ -143318 24523 283808 300236 529 -214929 -12242 356148 421029 195043 52109
35740E2109k6513k46287m74574k40846J98325K60233K6489N1528L37893L38085
$$ 52109 25596 -220691 -695265 -936111 -737786 -477553 -451064 -399536 -61643 276442
35730B76442k6179j90491O1048K30590j845k52848j57231L5258k012j07771m7441
$$ 276442 250263 59772 120820 351410 349565 96717 -60514 -25256 -27268 -135039 -182480
35719a82480J3172r4328j27362J10614L16273J76779o7619n3535P0690k4417k03389
$$ -182480 -169308 -263636 -390998 -280384 35889 212668 145049 91514 162204 137787 -65602
35708f5602j24065J14923J70801R6160J83346L22410J35639l13683n48721m16753
$$ -65602 -189667 -74744 96057 192217 375563 697973 833612 519929 -28792 -445545
35698d45545k37222j76110k8142K66593M04247K06119q0557j60773m7799J06104
$$ -445545 -682767 -858877 -887019 -620426 -216179 -10060 -90617 -251390 -299189 -193085
35688a93085K35012K76306J33123j35812k95388k10340R367J71213J68069K5482
$$ -193085 41927 318233 451356 315544 20156 -190184 -180817 -9604 158465 183947
35678A83947o9385R1298L79526L35003j80208n99466l70285J81972K88888j17024
$$ 183947 114562 205860 585386 920389 740181 140715 -229570 -47598 241290 124266
35668A24266l78297j99674l509o8649p2933K05993M11698K37905k9389l8034N1851
$$ 124266 -254031 -453705 -457214 -525863 -598796 -392803 18895 256800 227411 189377 241228
35657B41228l0320j27318o38J65094R4246p1907p4459k5205j10732j34534J04213
$$ 241228 210908 83590 82952 248046 342292 270385 195926 170721 59989 -74545 29668
35646B9668K82036K0890l60302k58058K00563L05189r2949l57973j32309J27329
$$ 29668 311704 332594 -27708 -285766 -85203 219986 127037 -230936 -363245 -235916
35636b35916r252k27420n9760K97427L18515M492j58835J6413J92795J00005p0057
$$ -235916 -245168 -472588 -532348 -234921 83594 88086 -70749 -54336 138459 238464 168407
35625A68407k3485J69256J96491l7927k96989l31544j49651Q1203K58295L51838
$$ 168407 144922 314178 510669 472742 175753 -155791 -305442 -224239 34056 385894
35615C85894K88762K3146k81230l46873j39407N2300Q402j25162r8180M6574P2641
$$ 385894 674656 697802 416572 69699 -69708 -17408 -9006 -134168 -232348 -185774 -113133
35604a13133m9457j09240j0441J00817J19008J58356L16750M27123K41838j77222
$$ -113133 -162590 -271830 -282271 -181454 -62446 95910 412660 839783 1081621 904399
35594I04399m42358k94458M4024J34184q5802k02067O6302M02220L13491j38346
$$ 904399 462041 167583 211607 345791 259989 57922 124224 526444 839935 701589
35584G01589m19824k91801n3765L6947J06657K39065J94967j14563l02444p4481
$$ 701589 281765 -10036 -63801 -26854 79803 318868 513835 399272 96828 22347
35574B2347K31151J53578j42106j73891L1836M5110j62959j81720P3654K14668
$$ 22347 253498 407076 264970 91079 122915 168025 5066 -176654 -103000 111668
35564A11668J03308Q5194K89773L10216p8420m13668k15030K27883K47737k34421
$$ 111668 214976 300170 589943 900159 821739 408071 193041 420924 668661 434240
35554D34240o19503m43534J06779N09854M60857O2221l40592m46698k20542J21096
$$ 434240 -185263 -628797 -522018 -12164 448693 510914 170322 -276376 -496918 -375822
35544c75822L30850L07286J03688j12656j36824P5439K94926K72539P0209o9983
$$ -375822 -44972 262314 366002 253346 116522 191961 486887 759426 829635 759652
35534G59652j19541k20266k86150o1466L46364M33401J910m92451n61175l07133
$$ 759652 640111 419845 133695 72229 418593 851994 853904 361453 -199722 -506855
35524e06855j20390o3056N8416K22271K02464l0778k44075k44474l9846K27155
$$ -506855 -627245 -690301 -631885 -409614 -207150 -237928 -482003 -726477 -766323 -539168
35514e39168L44194J71539j17348j36059J81732L95218J57773k52876l33185n1585
$$ -539168 -194974 -23435 -140783 -276842 -95110 300108 457881 205005 -128180 -179765
35504a79765K26340L08207K55796O8853k44730l97415j20492L11647L59877K3558
$$ -179765 46575 354782 610578 679431 434701 37286 -83206 228441 588318 611876
35494F11876j62324N724J07849j31744l41983j24515K54539K43901j71030m68150
$$ 611876 449552 455276 563125 431381 89398 -35117 219422 463323 292293 -175857
35484a75857l16438O1968K62350J64213l2296q5523L5466J40976O4411j05416
$$ -175857 -492295 -430327 -167977 -3764 -36060 -121583 -86117 54859 119270 13854
35474A3854j26224O7282K68123K61176M9976k13673l86043l74955j71517R7321
$$ 13854 -112370 -45088 223035 484211 534187 320514 -65529 -440484 -612001 -514680
35464e14680K55576K52831J60868K5763j29435j95104p2796J24301J81509R2582
$$ -514680 -259104 -6273 154595 180358 50923 -144181 -216977 -92676 88833 181415
35454A81415L4415M5168K806o3910L3297K65170L24390P3168k37475l35009k41023
$$ 181415 215830 260998 263804 199894 233191 498361 822751 895919 658444 323435 82412
35443H2412r0591P8173K10779J98509R7643R4677J34487n6892m30071n24268j60597
$$ 82412 -8179 69994 280773 479282 576925 671602 806089 749197 319126 -205142 -365739
35432c65739K16432K03363J1563N583J00820O6318J4651Q1779J6932l29633m94808
$$ -365739 -149307 54056 65619 71202 172022 238340 252991 334770 351702 22069 -472739
35421d72739n4937N42538N59497J14398p6802J04547J63415L7455J36278L55955
$$ -472739 -527676 14862 574359 688757 611955 716502 879917 917372 1053650 1409605
35411A409605J89709n2755N71578J821991J999056L19544j610052j829298o38068
$$ 1409605 1599314 1546559 2118137 3940128 5939184 6258728 4648676 2819378 2181310
35402B181310J26285k09544o49290m70851j69177k54092l78980j48473J48078
$$ 2181310 2307595 2098051 1448761 977910 808733 554641 175661 27188 175266
35393A75266J40464R770K6967L4346j49196k88788j48836N2429K8126p8336R874
$$ 175266 315730 325500 352467 386813 237617 -51171 -200007 -147578 -119452 -197788 -187914
35382a87914J93722J89803J3477j00568r2308o1868q211J11113J81886P8715r2421
$$ -187914 5808 195611 209088 108520 16212 -45656 -53867 57246 239132 317847 225426
35371B25426j49033j22026j39047j27441P6023L67586M17978J02165l33665n78695
$$ 225426 76393 -45633 -184680 -312121 -236098 131488 549466 651631 317966 -260729
35361b60729n48038l23563J222K97407L60816R3596k73005l18208Q2836N19809
$$ -260729 -808767 -1132330 -1131108 -833701 -472885 -379289 -652294 -970502 -887666 -367857
35351c67857M87824L4474k85088j50575J30837J46167k7039o3611K6072j6446
$$ -367857 119967 154441 -130647 -281222 -150385 -4218 -31257 -94868 -68796 -85242
35341h5242j71541j67926J3331J17833R9571J60059K72067J59343j48328k44489
$$ -85242 -256783 -424709 -411378 -293545 -193974 -33915 238152 397495 249167 4678
35331D678K240K15849J42804K2997O9295P2598j35386k93188j79759m1093j10916
$$ 4678 6918 222767 365571 388568 457863 530461 395075 101887 -77872 -118965 -229881
35320b29881j25785J73991M45673K42924j83596k28389J21860L34025K02334J9708
$$ -229881 -355666 -181675 263998 506922 323326 94937 216797 550822 753156 772864
35310G72864p7660k63419m64085l14013J54808L74827O2580l27357k84281M5299
$$ 772864 695204 431785 -32300 -346313 -191505 183322 245902 -81455 -365736 -320437
35300c20437J89730P1016j4042N7937J03125N366q8737k3041J03903N5604j99548
$$ -320437 -130707 -59691 -73733 -15796 87329 92695 3958 -19083 84820 140424 -59124
35289e9124l79813k16522J63411L53274J87666o4905j14803j1699N4188M8267
$$ -59124 -438937 -655459 -492048 -138774 48892 -16013 -130816 -142515 -88327 -40060
35279d0060j3221j87219l70537k42544K35853N71562L82029j3405j07011O237
$$ -40060 -53281 -240500 -611037 -853581 -617728 -46166 335863 322458 215447 221684
35269B21684p2958k42350j04261J93222J15575k88436l85112m663L07234K47488
$$ 221684 148726 -93624 -197885 -4663 110912 -177524 -562636 -567299 -260065 -12577
35259a2577J60658K40758J47095k15948l28276N3122L61433J49363j26630P9901
$$ -12577 148081 388839 535934 319986 -8290 44832 406265 555628 428998 508899
35249E08899M11238K09198l45959n41000k79864r7264j77157j54270J21009L27687
$$ 508899 920137 1129335 783376 242376 -37488 -134752 -311909 -466179 -345170 -17483
35239a7483K63467J09045J1905j00571k11168j60147J1492M9863j06737k34855
$$ -17483 245984 355029 366934 266363 55195 -104952 -93460 -43597 -150334 -385189
35229c85189j73618J8322K31866L59966K65126p768j20329J10741L22986R1570
$$ -385189 -558807 -540485 -308619 51347 316473 308705 188376 299117 622103 713673
35219G13673l63017m66119j73886J8346p4828r5350J53078L63720K77365N8290
$$ 713673 350656 -115463 -289349 -271003 -345831 -441181 -288103 75617 352982 411272
35209D11272q6802j99160k73080j30647J71505K39512r1343m65053n16130l00686
$$ 411272 324470 125310 -147770 -278417 -106912 132600 41257 -423796 -939926 -1240612
35199a240612q732L26964N82576M65301K0915k15823L3737L16844J63134j48685
$$ -1240612 -1249344 -922380 -339804 125497 146412 -69411 -35674 281170 444304 295619
35189B95619r7744J67294J07485k35727k98712K1939J92386l3795k12758m017
$$ 295619 197875 365169 472654 236927 -61785 -39846 152540 118745 -94013 -98030
35179i8030K43076J04827j87641j40329J78467K45876q4643l58533j98105J77234
$$ -98030 145046 249873 62232 -78097 100370 346246 261603 -96930 -295035 -117801
35169a17801K90619L6090k50071k60940o8202M2515k6256p3134Q9864L33221L54258
$$ -117801 172818 208908 -41163 -302103 -370305 -327790 -354046 -427180 -337316 -4095 350163
35158C50163R4419j57867j37519P0847J85430R6903n5338j17743q6236l9983k8959
$$ 350163 444582 286715 149196 220043 405473 502376 447038 329295 243059 203076 174117
35147A74117n2254q0244q6255q9425j35466j97915j67867r819J55513K14210J99827
$$ 174117 121863 41619 -44636 -134061 -269527 -467442 -635309 -645128 -489615 -275405 -75578
35136g5578J50750k0809k99901l60769N7199O12980O35392K8946n19181m49515
$$ -75578 75172 54363 -245538 -606307 -549108 63872 699264 728210 209029 -240486
35126b40486m2887R8008q0579j73655l6239Q7120M9673m0573j13003j68430o4705
$$ -240486 -283373 -185365 -265944 -439599 -475838 -388718 -339045 -379618 -492621 -661051 -725756
35115g25756K91496N65991L10387k99319n65927k45344J19931O5719j34974l4751
$$ -725756 -434260 131731 442118 142799 -423128 -668472 -548541 -482822 -617796 -652547
35105f52547K39299K74774Q2249Q624J31384K02133R7580o1961j77190k23670
$$ -652547 -413248 -138474 -56225 -47601 83783 285916 383496 321535 144345 -79325
35095g9325j17949J59839L85168L27626R4620m2899o3036j20139j71343n4048
$$ -79325 -197274 -37435 347733 675359 769979 727080 664044 543905 372562 318514
35085C18514J13206J8798l05475m22392j01202L21968L86727R1027j77475j65004
$$ 318514 431720 450518 145043 -277349 -378551 -56583 330144 421171 243696 78692
35075G8692J527P5403L0454L2541J19729R3451j49614l39759j58249K36522L63338
$$ 78692 80219 155622 186076 218617 338346 431797 282183 -57576 -215825 20697 384035
35064C84035J15569j04860n3162J6901j09561k00710l9117J37614N9048r8579
$$ 384035 499604 394744 341582 358483 248922 48212 9095 146709 205757 107178
35054A07178q3940l7303j13770n6783K77754L94879j16668o87636m56176L62196
$$ 107178 23238 -14065 -127835 -184618 93136 488015 371347 -316289 -772465 -410269
35044d10269P24707L07430j62575j74190m1570m5046N6205K93040J85408l42164
$$ -410269 314438 621868 459293 285103 243533 198487 254692 547732 733140 390976
35034C90976n70996q5970M73498L90518o3835k33193j48745k19092l24215p0968
$$ 390976 -180020 -265990 207508 598026 534191 300998 152253 -66839 -391054 -462022
35024d62022L43408L53081l5648k67018j27456O1175J13745K01336L41676K51094
$$ -462022 -118614 234467 198819 -68199 -195655 -134480 -20735 180601 522277 773371
35014G73371j47010n05312m93994j56530K39661M50902L57586N9366j67046j99348
$$ 773371 626361 121049 -372945 -529475 -289814 161088 518674 578040 410994 211646
35004B11646k22839l48326l35342k0000K64792J40594j81336k23998p791P8982
$$ 211646 -11193 -359519 -694861 -714861 -450069 -309475 -490811 -714809 -722600 -643618
34994f43618K1105J39129L67942K74341j27884k76536K5045K48149O363l07593
$$ -643618 -622513 -483384 -115442 158899 31015 -245521 -220476 27673 34036 -273557
34984b73557j80596J99041K87224L7501j15737K1734J77148R9969r7691j83066
$$ -273557 -454153 -255112 32112 69613 -46124 -24390 152758 252727 155036 -28030
34974b8030j38544j11142j33892n6617J90097L65838J64335k73988l81854Q0512
$$ -28030 -166574 -277716 -411608 -468225 -278128 87710 252045 -21943 -403797 -323285
34964c23285N64019M08555k06600m92630j66753K33737K35349L6165j5312p323
$$ -323285 240734 649289 442689 -49941 -216694 17043 252392 288557 273245 265922
34954B65922j37273k19920o804K72230J86535k02167l80512j00356L21633M61535
$$ 265922 128649 -91271 -98075 174155 360690 158523 -221989 -322345 -712 460823
34944D60823K49030q9429l09940k95297r2450J14091J61271O9599j7229k6576
$$ 460823 709853 620424 310484 15187 -77263 36828 198099 267698 250469 223893
34934B23893o508k0123q2560j67372j95795p6815J47629K60672R6982k16311l59835
$$ 223893 217385 197262 114702 -52670 -248465 -325280 -177651 83021 180003 -36308 -396143
34923c96143j69517J88098L89759K62844o3899k84084k08655N0615K20861J68028
$$ -396143 -565660 -377562 12197 275041 211142 -72942 -281597 -230982 -10121 157907
34913A57907j2334j68720k31685j79305j4311J75952K54844J81744L8927q1382
$$ 157907 145573 -23147 -254832 -434137 -448448 -272496 -17652 164092 203019 121637
34903A21637j06937M3499L25633M47117J54882l30965m86279j81556J22961M9988
$$ 121637 14700 58199 383832 830949 985831 654866 168587 -12969 109992 159980
34893A59980j74484j47845P2452J38508J0954l7653P1266J26325M1360k855R3803
$$ 159980 -14504 -162349 -89897 48611 59565 21912 93178 219503 260863 258008 351811
34882C51811J68735P5611r2201j77262j74778j57987j21150p458J69721K88655
$$ 351811 520546 596157 503956 326694 151916 -6071 -127221 -134679 35042 323697
34872C23697J87440j74848n63345n90954j47878L87523N51405L24123N2845n6226
$$ 323697 511137 336289 -227056 -818010 -965888 -578365 -26960 297163 350008 293782
34862B93782r1175j30376j06828j6249K1690k1245m6393n1935j33449k18481r8123
$$ 293782 202607 72231 -34597 -50846 -29156 -50401 -96794 -148729 -282178 -500659 -598782
34851e98782J91870L25807J46246j22431k45155k50948j92193J6409L04425L54797
$$ -598782 -406912 -81105 65141 -57290 -302445 -553393 -745586 -729177 -424752 -69955
34841f9955R4110p6430J08370K82891J8095m19209m38712o5501J22898o1723j89789
$$ -69955 24155 -52275 56095 338986 357081 -62128 -500840 -566341 -443443 -505166 -694955
34830f94955n775J77754Q7985n4933J2534J47882J29307N0831N4395M593k11797
$$ -694955 -700730 -522976 -434991 -489924 -477390 -329508 -200201 -149370 -94975 -90382 -302179
34819c02179l55544j84405J07300J81610Q7985J10329K45064K36154L4906j46900
$$ -302179 -657723 -842128 -734828 -553218 -465233 -354904 -109840 126314 161220 14320
34809A4320j82594j13696K7024J78063J65319k3451n7134K54589M96842J82423
$$ 14320 -168274 -281970 -254946 -76883 88436 64985 7851 262440 759282 941705
34799I41705m01422n06288m8668K68253O5365j90205l9142K57643K63829O6250
$$ 941705 540283 33995 -14673 253580 318945 128740 89598 347241 611070 677320
34789F77320m1509j10167k70027l11116n3791J95269R7869j01037J3387K59710
$$ 677320 635811 525644 255617 -55499 -109290 85979 183848 82811 96198 355908
34779C55908J49973k30030l23300l0718J58645L2732j8361K63183N31027L89201
$$ 355908 505881 275851 -47449 -78167 80478 113210 94849 358032 889059 1278260
34769A278260l1008l43814m10600l11929j20332N8781O6657r0068k05953j76420
$$ 1278260 1247252 903438 492838 180909 60577 119358 186015 95947 -110006 -286426
34759b86426r4744M776J79160K88130P7102l16878l82090K3337L74783K24826
$$ -286426 -381170 -376394 -197234 90896 167998 -148880 -530970 -507633 -132850 91976
34749I1976j57844k54178m6888J08518Q7288L4682J520m2598J7429K61509M46416
$$ 91976 -65868 -320046 -366934 -258416 -171128 -136446 -134926 -177524 -160095 101414 547830
34738E47830K77075j16792l22240k02327q510J3486j30026k67042j97162J29814
$$ 547830 824905 708113 385873 183546 175036 188522 58496 -208546 -405708 -275894
34728b75894M14443K36761l06086n47152j63711K66785J15710k91102j95611L45955
$$ -275894 138549 375310 69224 -477928 -641639 -374854 -259144 -550246 -745857 -399902
34718c99902N53525J72822k04811j61282L900l0335q3212L8066J30316J8011j21193
$$ -399902 153623 326445 121634 -39648 -35748 -66083 -149295 -111229 19087 37098 -84095
34707h4095j48545j93873k44128m5767L09933L08524j32355l69043m5562K54574
$$ -84095 -232640 -426513 -670641 -716408 -406475 -97951 -230306 -599349 -644911 -390337
34697c90337k8902m31407j95921M58641O70654K60383j49155k05556j74893k17282
$$ -390337 -419239 -850646 -1046567 -587926 82728 343111 193956 -11600 -186493 -403775
34687d03775j16820J36918J99792K067p1444J56897L44220K01967p7675j92213
$$ -403775 -520595 -383677 -183885 -181818 -253262 -96365 247855 449822 372147 179934
34677A79934j22961L1178K29286L27417J27965k37999l58464j38143M7169k8198
$$ 179934 56973 88151 317437 644854 772819 534820 176356 38213 85382 57184
34667E7184r9888N4782J77487k5989l46868l79406j31189N4937L5738k3860P939
$$ 57184 -42704 12078 189565 163576 -183292 -562698 -693887 -638950 -603212 -627072 -619133
34656f19133P5472R6391O9679L6430M5561J04639J15130j8194j80778j48447M9966
$$ -619133 -543661 -447270 -377591 -341161 -295600 -190961 -75831 -94025 -274803 -423250 -373284
34645c73284J19662m4242j60739M093K60092K76877N3747j33014j26883k2930
$$ -373284 -253622 -297864 -458603 -454510 -194418 82459 136206 3192 -123691 -146621
34635a46621K5005k5843r1042m9570R0114J43517O721j21460j3656J79390J41765
$$ -146621 -121616 -147459 -238501 -288071 -197957 -54440 -47719 -169179 -182835 -3445 138320
34624A38320n1767m2717J48980J11894k04121l20329m4312J56271m9795k70986
$$ 138320 86553 43836 192816 304710 100589 -219740 -264052 -107781 -157576 -428562
34614d28562p7481K46231J99777j01650j99980o6810O471J7604J41587K41230
$$ -428562 -506043 -259812 -60035 -161685 -361665 -428475 -422004 -404400 -262813 -21583
34604b1583J00450o0839P0316K41435J138m26101l80255J57331M79977K22648
$$ -21583 78867 18028 88344 329779 330917 -95184 -475439 -318108 161869 384517
34594C84517j90751l09753k15406j21678j2803Q8465P999j97346k04987L6148
$$ 384517 193766 -115987 -331393 -453071 -465874 -377409 -369410 -566756 -771743 -735595
34584g35595J83253P9191j0065R4165K07664J96394J90117K01070K3096k82932
$$ -735595 -552342 -473151 -483216 -389051 -181387 15007 205124 406194 429290 146358
34574A46358l10514M3684L48442L05989J43099P3691p0374l40561l83030p2235
$$ 146358 -164156 -120472 227970 533959 677058 750749 680375 339814 -43216 -115451
34564a15451J22005j05308l06500l8789L01436J21186l00529k24437L02524N05336
$$ -115451 6554 -98754 -405254 -444043 -142607 -21421 -321950 -546387 -243863 261473
34554B61473J56350r0929J65103M05842P2088m89350n23582J0743L99514J96179
$$ 261473 417823 326894 491997 897839 969927 480577 -43005 -32262 367252 563431
34544E63431k14052k41758O4593J54285j65195m36777k70202M8058L5144j83532
$$ 563431 349379 107621 172214 326499 161304 -275473 -545675 -497617 -462473 -646005
34534f46005r7818K78256L76102L0189k12153P81K52568J06774j56467r5110R8501
$$ -646005 -743823 -465567 -89465 -59276 -271429 -270648 -18080 88694 -67773 -162883 -64382
34523f4382J0562j61765O5452N23048N48878M5691l54279k73919p1115j29704
$$ -64382 -53820 -215585 -150133 372915 921793 967484 613205 339286 268171 138467
34513A38467k61417j41978R9733J19548p0645j29912J04025L87992L65319k2867
$$ 138467 -122950 -264928 -165195 -45647 -116292 -246204 -142179 245813 611132 588265
34503E88265m41633m90401j44356K13797K59490Q4836k1296K2311R6204J41134
$$ 588265 146632 -343769 -488125 -274328 -14838 69998 48702 71013 167217 308351
34493C08351J76678J59969M7855p8757j33000j55313j69263p5123J22803J92371
$$ 308351 485029 644998 692853 614096 481096 325783 156520 81397 204200 396571
34483C96571J4041j73900j35112j661J3401n235O1438K6426k35180l73768o6562
$$ 396571 410612 236712 101600 99939 113340 108105 169543 195969 -39211 -412979 -479541
34472d79541L19743K04404k44828l32644N6676L25799J76363j1211L1454L3759
$$ -479541 -159798 44606 -200222 -532866 -476190 -150391 25972 14761 46215 79974
34462G9974j74594k74742o6597J22285K1172j16658k7777P6154l5356j33751K1071
$$ 79974 -94620 -369362 -435959 -313674 -292502 -409160 -436937 -360783 -396139 -529890 -508819
34451e08819J76145M0927j19959Q7281M50247M34475K8247k71659k30018q8509
$$ -508819 -332674 -291747 -411706 -324425 125822 560297 588544 316885 86867 -1642
34441a642l6602J6646Q7651M67k45789l63206j84565R6410K33703K41229K58993
$$ -1642 -38244 -21598 66053 66520 -179269 -542475 -727040 -630630 -396927 -155698 103295
34430A03295K99159K70150J35008n8617k28910k92816k32544j52461j75485k64843
$$ 103295 402454 672604 807612 748995 520085 227269 -5275 -157736 -333221 -598064
34420e98064k50083n8225J76418K74380K07775Q9132K0491J0745K0989L2507M1472
$$ -598064 -848147 -906372 -729954 -455574 -247799 -158667 -138176 -127431 -106442 -73935 -32463
34409c2463J7444o8529j63013j56761m4446K5483m8308j48442r9938N5427J10852
$$ -32463 -15019 -83548 -246561 -403322 -447768 -422285 -470593 -619035 -718973 -663546 -552694
34398e52694K045j08340p3572O1879J65982J70421Q4235l3924r1058l6793P1843
$$ -552694 -550649 -658989 -732561 -670682 -504700 -334279 -250044 -283968 -375026 -411819 -339976
34387c39976J54289K06744K27765J38512p6236k46791k26037j24415j21107j41315
$$ -339976 -185687 21057 248822 387334 311098 64307 -161730 -286145 -407252 -548567
34377e48567O610K46227L01270J29330k8017l9983k1444m5677l4284J4873j1836
$$ -548567 -541957 -295730 5540 134870 106853 66870 45426 -251 -34535 -19662 -31498
34366c1498r5767p7324N8487J54124J45117P5186j01691l82440m59535p0685M37452
$$ -31498 -127265 -204589 -146102 8022 153139 228325 126634 -255806 -715341 -786026 -348574
34355c48574M53996L6800j37648J35200K78204k5898k56409J4862L22111P4474
$$ -348574 105422 142222 4574 139774 417978 392080 135671 150533 472644 547118
34345E47118m33771n07041j36245J34593J35175J28372J46895j766j81656p4887
$$ 547118 113347 -393694 -529939 -395346 -260171 -131799 15096 13330 -168326 -243213
34335b43213J75271J36053j27305j20226J91155K70249n7791k55535M9667M29266
$$ -243213 -67942 68111 -59194 -179420 11735 281984 224193 -31342 18325 447591
34325D47591K99796k19749n27225l57118m145J42312N702j88022j73818O9248
$$ 447591 747387 527638 413 -356705 -360850 -218538 -212836 -400858 -574676 -505428
34315e05428K73400K07649n001p2036L4035Q2031p046n1523O0176K05733K45392
$$ -505428 -232028 -24379 -29380 -101416 -67381 14650 7604 -43919 16257 221990 467382
34304D67382J66078p237k06631k48916m2756J65093O5706k22932l02845j08720
$$ 467382 633460 626223 419592 170676 127920 293013 358719 135787 -167058 -275778
34294b75778M0854J1659M189P5915K7631j03189J4090L48167L67940j04218m60567
$$ -275778 -234924 -223265 -219076 -143161 -115530 -218719 -204629 143538 511478 407260 -53307
34283e3307j93160K90621L18073Q74o4377J34844O2165l25825l96232J08737N46213
$$ -53307 -246467 44154 362227 363101 298724 433568 495733 169908 -226324 -117587 428626
34272D28626K86688l55790n82028j92307K66651L15571P0011q6181k9962N5682
$$ 428626 715314 359524 -222504 -414811 -148160 167411 237422 151241 121279 176961
34262A76961J0304j00281j06140L2602J75370J74355L4964j24513k09012j87363
$$ 176961 187265 86984 -19156 13446 188816 363171 398135 273622 64610 -122753
34252a22753o4843R5317J71893J09542R996J953O2283Q0437N0518M9445N7597
$$ -122753 -187596 -92279 79614 189156 199152 201105 263388 343825 394343 443788 501385
34241E01385j7357j37463j52181n3698r176p0136o8564P7150J71460M2096j54062
$$ 501385 484028 346565 194384 140686 131510 61374 -7190 69960 241420 283516 129454
34230A29454j61118k1479K5098n2363o7815K0540N3481n339n951O1157N217j73237
$$ 129454 -31664 -53143 -28045 -80408 -148223 -127683 -74202 -79541 -85492 -24335 -19118 -192355
34218a92355j77198Q9350K55217K5081k98504k39387J10363K43157K9752j47756
$$ -192355 -369553 -280203 -24986 95 -298409 -537796 -427433 -184276 -154524 -302280
34208c02280p0856K2745m5619p5301P5297J56355l6171k32779q8374K37526L08235
$$ -302280 -373136 -350391 -396010 -471311 -396014 -239659 -275830 -508609 -596983 -359457 -51222
34197e1222O1541j66386j75632p3136M6356K05542L17431K14586l3111j48678
$$ -51222 10319 -156067 -331699 -404835 -358479 -152937 164494 379080 345969 197291
34187A97291o1523J8516p21K4723R2175m3012l67291m24093J6697M49806K77807
$$ 197291 135768 154284 153563 178286 270461 227449 -139842 -563935 -547238 -97432 180375
34176A80375k62445l98286J6479K84741k6747l91151j49158M36955N57128O0166
$$ 180375 -82070 -480356 -463877 -179136 -205883 -597034 -746192 -309237 247891 308057
34166C08057l65168k35599J09170J53710l8510r7192j3291n4477j82256n4385
$$ 308057 -57111 -292710 -183540 -29830 -68340 -165532 -178823 -233300 -415556 -469941
34156d69941L64547O17056L40999k32017n60630m21251q2779P0957m1337j68016
$$ -469941 -105394 511662 852661 620644 60014 -361237 -444016 -373059 -414396 -582412
34146e82412o8138J65513K24998M2226p4459R1891K77521J11992k63480l50308
$$ -582412 -650550 -485037 -260039 -217813 -292272 -200381 77140 189132 -74348 -424656
34136d24656m2641K08339Q1341j75472j98758m8691l219p5706o6670N5286J30732
$$ -424656 -467297 -258958 -177617 -353089 -551847 -600538 -603757 -679463 -746133 -690847 -560115
34125e60115R7963N6875P2936J00411Q3903J7639o2407q3810j4455M3035j9063
$$ -560115 -462152 -405277 -332341 -231930 -148027 -130388 -192795 -276605 -291060 -248025 -267088
34114b67088p9636P7789L48180L38744l8396l45905k26074R7589K23624J67115
$$ -267088 -346724 -268935 79245 417989 379593 33688 -192386 -94797 128827 295942
34104B95942J66546J63387n0651l29140l19942o4843L4182j35155k43669j01283
$$ 295942 462488 625875 575224 246084 -73858 -138701 -104519 -239674 -483343 -584626
34094e84626N1051r218j25671p1589P6016J12843M9855M5860J25429J63297Q9003
$$ -584626 -533575 -542793 -668464 -740053 -664037 -551194 -501339 -455479 -330050 -166753 -77750
34083g7750l2362r7868o9439M855M8332M3492K7697q903j09217j85118n3317K33325
$$ -77750 -110112 -207980 -277419 -272564 -224232 -180740 -153043 -161946 -271163 -456281 -509598 -276273
34071b76273L11257j358l42153k61415J12518K63366O4093q5691O7453K63975
$$ -276273 34984 33626 -308527 -569942 -457424 -194058 -129965 -215656 -148203 115772
34061A15772J84784q8200k57661j98018Q03J66306J25729j21090k65816j9251
$$ 115772 300556 212356 -45305 -243323 -242520 -76214 49515 -71575 -337391 -356642
34051c56642L74771L31603k27540o28278l07334M21891Q03505N73735R8049k25645
$$ -356642 18129 349732 122192 -506086 -813420 -391529 411976 985711 1083760 858115
34041H58115l06666k10909n2777k0525j91828l22975j16585K87907M09032R0356
$$ 858115 551449 340540 287763 267238 75410 -247565 -364150 -76243 332789 423145
34031D23145k44218j88328O2929L5258k66260l29174P0289M45539K70132k07510
$$ 423145 178927 -9401 53528 88786 -177474 -506648 -436359 9180 279312 71802
34021G1802k86404J36953M07699J44302j60118L0515L68292J60746m71416p36219
$$ 71802 -214602 -77649 330050 474352 314234 344749 713041 873787 402371 -333848
34011c33848l84621L595M4885P1573L39833M70475J67360j33553M3323L47009
$$ -333848 -718469 -714874 -669989 -598416 -258583 211892 379252 245699 289022 636031
34001F36031J33975m40203o08015j42553L74734M39500J59953j49415l36432k73173
$$ 636031 770006 329803 -278212 -420765 -46031 393469 553422 404007 67575 -205598
33991b05598J03873M66502L30880j88616l83617L3963M49700K53052k56129l75446
$$ -205598 -101725 364777 695657 507041 123424 157387 607087 860139 604010 228564
33981B28564n2153J71608O4283p4501o3908j01503k46794j87786K04331N02044
$$ 228564 176411 348019 412302 337801 273893 172390 -74404 -262190 -57859 444185
33971D44185K66393k87804n42376k71949J44301K77302J19509n4698p4867r19
$$ 444185 710578 422774 -119602 -391551 -247250 30052 149561 94863 19996 19077
33961A9077K6318m0114j08696o4630N9226R2343k3031r0272P5405L10290K69072
$$ 19077 45395 5281 -103415 -168045 -108819 -16476 -39507 -129779 -54374 255916 524988
33950E24988n7882k66115r8831J65150J11371k07444l71998k15850m904L1413
$$ 524988 467106 200991 102160 267310 378681 171237 -200761 -416611 -421515 -390102
33940c90102J1616R9635J80709Q2939q3560j08285p0355j93432l54809j63420
$$ -390102 -378486 -278851 -98142 -15203 -98763 -207048 -277403 -470835 -825644 -989064
33930i89064L55264N84040J40421m50070l82289K73805O01186R4886o35516p07593
$$ -989064 -633800 -49760 90661 -359409 -741698 -467893 133293 228179 -407337 -1114930
33920a114930j08815M19522M11217J19583k2258M5741J16380P7256j3873p2430
$$ -1114930 -1223745 -804223 -393006 -273423 -295681 -249940 -133560 -56304 -70177 -142607
33910a42607p1169l7030j8140k2000j828N6585J04129J41025K34022L23234J92319
$$ -142607 -213776 -250806 -268946 -290946 -292774 -236189 -132060 8965 242987 566221 758540
33899G58540j85160m54278l01473P3148K15581M1676j41466j59676j32993j31837
$$ 758540 573380 119102 -182371 -109223 106358 148034 6568 -153108 -286101 -417938
33889d17938o3259O1324J00380O3698Q3350J00921l9428j94449o3065K49628L01356
$$ -417938 -481197 -419873 -319493 -255795 -172445 -71524 -110952 -305401 -368466 -118838 182518
33878A82518K0066j77748r1792q162r7285j21604K5470P8357k5911N5556L66091
$$ 182518 202584 24836 -66956 -75118 -172403 -294007 -268537 -190180 -216091 -160535 205556
33867B05556L90044o9925m07479j40586K93908K93256N0587N3750J55757m7674
$$ 205556 595600 525675 118196 -22390 271518 564774 615361 669111 824868 777194
33857G77194l43547k55609N6877R6744n7670J1757J71761j8365l71876l19108
$$ 777194 433647 178038 234915 331659 273989 285746 457507 439142 67266 -251842
33847b51842M8080J32938n4779M7074M01808L45477j74384m04305p0132J86033
$$ -251842 -203762 -70824 -125603 -78529 323279 668756 494372 90067 19935 205968
33837B05968m282j28256J61724L53239J8286l77766k65864J16215K41987J24862
$$ 205968 201686 73430 235154 588393 606679 228913 -36951 79264 321251 446113
33827D46113K2012j28094l69747l63490L0919L00096L0241l51820k43441J58160
$$ 446113 468125 340031 -29716 -393206 -362287 -62191 -31950 -383770 -627211 -469051
33817d69051K48756L0736j4433J64327J52134j39118l01844q7582K74814M57792
$$ -469051 -220295 -189559 -203992 -39665 112469 -26649 -328493 -416075 -141261 316531
33807C16531L55225L5670l08466m16413k31394k2188r306m7292P2370K28237J90029
$$ 316531 671756 707426 398960 -17453 -248847 -271035 -280341 -327633 -255263 -27026 163003
33796A63003L4180N736J09730J38325m604k29281l81898k97340O0383L93941L13411
$$ 163003 197183 202919 312649 450974 446370 217089 -164809 -462149 -401766 -7825 305586
33785C05586p7892k19212R2412L61387J47743k85167m41289l04645j72921j24932
$$ 305586 227694 8482 100894 462281 610024 324857 -116432 -421077 -593998 -718930
33775g18930o1988P704P0261J98434K86806R3782k13198j02800M06246N42687
$$ -718930 -780918 -773214 -702953 -504519 -217713 -123931 -337129 -439929 -33683 509004
33765E09004k6479n24582k55915K40817J12968l37450j86643M96901P39208K29587
$$ 509004 482525 -42057 -297972 -57155 55813 -281637 -468280 28621 767829 997416
33755I97416l12180l77964k53660k07570m6263K55441L07297L346k20112j11142
$$ 997416 685236 307272 53612 -153958 -200221 55220 362517 365863 145751 34609
33745C4609L7042K063n980J33822J58867m9803j78425k7438J27423K3600j61073
$$ 34609 71651 73714 67734 201556 360423 310620 132195 104757 232180 255780 94707
33734I4707j57047j1248J04149J64989J80248J08903K1679L3478K4545j88744
$$ 94707 -62340 -73588 30561 195550 375798 484701 506380 539858 564403 375659
33724C75659l97884k16147K01456K45656j78886l98121J8253N59847N09064o8430
$$ 375659 -22225 -238372 -36916 208740 29854 -368267 -350014 209833 718897 650467
33714F50467n12105m42087n1154K65130K57258l3972k75855j63853J53202K32140
$$ 650467 138362 -303725 -354879 -89749 167509 133537 -142318 -306171 -152969 79171
33704G9171j2743j87972n9248J28777J53932J70139K89627K64209o2301l71197
$$ 79171 66428 -121544 -180792 -52015 101917 272056 561683 825892 763591 392394
33694C92394l29893j16255q6533j90467j24935J27822K96441K24907j4333k75390
$$ 392394 62501 -53754 -140287 -330754 -455689 -327867 -31426 193481 179148 -96242
33684i6242l76723j74785J75273K62584l6531l17170k09482J07066K66570K84531
$$ -96242 -472965 -647750 -472477 -209893 -246424 -563594 -773076 -666010 -399440 -114909
33674a14909L60774L84821J22608k66022l81873j78664L5462J15584J57075J17721
$$ -114909 245865 630686 753294 487272 105399 -73265 -37803 77781 234856 352577
33664C52577j39244m05354k50839K77000N62064K55782k14970k79130n144J31855
$$ 352577 213333 -192021 -442860 -165860 396204 651986 437016 157886 152742 284597
33654B84597R434p5222P892M1363p8334j23672L4465J25407j01303l92419k94425
$$ 284597 294031 218809 226701 268064 189730 66058 100523 225930 124627 -267792 -562217
33643e62217J65028M84954L88067J27548o729j04113l20086m71711k96647P6768
$$ -562217 -397189 87765 475832 603380 596651 492538 172452 -299259 -595906 -519138
33633e19138K86176K60931K34021K77232K01606l3020j64078k6841J58089Q8891
$$ -519138 -232962 27969 261990 539222 740828 707808 543730 516889 674978 763869
33623G63869j88715l43949j89322R1574J62490o7309l19808k83093j6588J51639
$$ 763869 575154 231205 41883 133457 295947 228638 -91170 -374263 -390851 -239212
33613b39212J27069J58353L32957L25326n8321m08262k31551K58939L94122J5216
$$ -239212 -112143 46210 379167 704493 646172 237910 6359 265298 659420 674636
33603F74636l40560k67877J23P4447l0533o3283M1489J50233J61965Q1790k1537
$$ 674636 334076 66199 66322 140769 110236 46953 88442 238675 400640 482430 460893
33592D60893n9949l5318p6313k13465k23789N0079L46071K93393m446j02541R7254
$$ 460893 400944 365626 289313 75848 -147941 -97862 248209 541602 537156 434615 531869
33581E31869K30803P9784j44990k16272j73238q8109N5243J49987L0037j63730
$$ 531869 762672 842456 697466 481194 307956 219847 275090 425077 455114 291384
33571B91384r9704J71049K21546m4952j96239K7446L06018K83218O1960j10971
$$ 291384 191680 362729 584275 539323 343084 370530 676548 959766 1021726 910755
33561I10755k24307k95998k06194l149L9179q9030m7647K03982K17207j55406
$$ 910755 686448 390450 184256 181107 220286 131256 83609 287591 504798 349392
33551C49392l61268O467M98258M74192K7049k99008l04957j34806J14438K85007
$$ 349392 -11876 -5409 492849 967041 994090 695082 390125 255319 369757 654764
33541F54764J18780j87868K2697P54042R94387K73813k93123L03190J120126Q19986
$$ 654764 773544 585676 608373 1362415 2356802 2630615 2337492 2640682 3760808 4580794
33531D580794M37227K198497N372549N936074J763501l880794o044685m015734
$$ 4580794 5018021 7216518 12589067 18525141 20288642 16407848 10363163 6347429
33523F347429j353014p25311j234485j066739l74192k88866o83798n46415J47889
$$ 6347429 4994415 4269104 3034619 1967880 1593688 1304822 621024 74609 222498
33514B22498M19216n1950m65872k32851K12789K53008K103p1344N9479O5248j24601
$$ 222498 641714 589764 123892 -108959 103830 356838 358941 287597 347076 412324 287723
33503B87723k51677j77300m5317j1430o4901j16909p7181J24450M10447N06219
$$ 287723 36046 -141254 -186571 -198001 -262902 -379811 -456992 -332542 77905 584124
33493E84124K38587j53592k64441q4313k8772l16955o14163m95750m8133K67619
$$ 584124 822711 669119 404678 320365 291593 -25362 -639525 -1135275 -1183408 -915789
33483i15789K45082J33436J97231L34842K68112l3231k87132k36319P1182L61893
$$ -915789 -670707 -537271 -340040 -5198 262914 229683 -57449 -293768 -222586 139307
33473A39307M11842K02991j10708l13736k67786m5944J12757R1342O4671K08820
$$ 139307 551149 754140 643432 329696 61910 15966 128723 220065 284736 493556
33463D93556L31612J02806l46067m59111n5126L23790J75719k13896k34885J06704
$$ 493556 825168 927974 581907 122796 67670 391460 567179 353283 118398 225102
33453B25102K59476J7925k33187j92028k7380K9209K0779K8061j1941p9487j8295
$$ 225102 484578 502503 269316 77288 49908 79117 99896 127957 116016 36529 18234
33442A8234J32294J02229j48135k91447j45630M1256M0889J5159J58750L03762
$$ 18234 150528 252757 104622 -186825 -332455 -291199 -250310 -235151 -76401 227361
33432B27361K09168j9064j26951j18501j48999j93878j25131K4823J35374J95613
$$ 227361 436529 417465 290514 172013 23014 -170864 -295995 -271172 -135798 59815
33422E9815K13884J05519j06777j75059M7776L43574M17189K56669R74k98671
$$ 59815 273699 379218 272441 97382 145158 488732 905921 1162590 1163564 864893
33412H64893n43989n10136k04176l596r2769r7688K80109O19780L64844k17709
$$ 864893 320904 -189232 -393408 -397004 -489773 -587461 -307352 312428 677272 459563
33402D59563l74137l3855J30096j59630l79387j46762J79353K02031J29488K38053
$$ 459563 85426 51571 181667 22037 -357350 -504112 -324759 -122728 6760 244813
33392B44813K61386q5872m08623j50724M32696N39451n456n15326m62471j12876
$$ 244813 506199 420327 11704 -139020 293676 833127 827671 312345 -150126 -263002
33382b63002O8756R3933J81758K43577Q4681j31864p9383J83337K68401M1536
$$ -263002 -194246 -100313 81445 325022 409703 277839 198456 381793 650194 691730
33372F91730k19314k77394k00740q7697J31282M44665N96716M13437R9970l2233
$$ 691730 472416 195022 -5718 -93415 37867 482532 1079248 1492685 1592655 1560422
33362A560422r5o3224k89303m57723l82887j23905J46015L10118L17278J61843
$$ 1560422 1560327 1497103 1207800 750077 367190 243285 389300 699418 1016696 1178539
33352A178539q6386l02997l95427l51750k29212j14982n2987m737N5549N4620
$$ 1178539 1092153 789156 393729 41979 -187233 -302215 -355202 -359939 -304390 -249770
33342b49770l5104m0306J73071L52920J28560l30149l87699J35591O09894M91195
$$ -249770 -284874 -325180 -152109 200811 329371 -778 -388477 -252886 357008 848203
33332H48203Q8972k4320P1318o5625l57025l34164J895J58716l1822k21814j92007
$$ 848203 937175 912855 984173 918548 561523 227359 229254 387970 356148 134334 -57673
33321e7673q0762N8108L08116M55310J56708l55172m18903L0238K79528m8723
$$ -57673 -138435 -80327 227789 683099 839807 484635 65732 95970 375498 326775
33311C26775l99687j95556K79897M01528J17894j69489k70914k63463j59393M4698
$$ 326775 -72912 -268468 11429 412957 530851 361362 90448 -173015 -332408 -287710
33301b87710J89844J62567Q8496Q3590O7757J8768P5244J82933M3930l30500m66649
$$ -287710 -97866 64701 153197 236787 304544 323312 398556 581489 625419 294919 -171730
33290a71730j47055J80208J00255j17736l7629J96442J77200m1953j22942q4429
$$ -171730 -318785 -138577 -38322 -156058 -193687 2755 179955 138002 15060 -69369
33280f9369j75539k95767j41470J64967J74196j60165l66476j43595K57797M46014
$$ -69369 -244908 -540675 -682145 -517178 -342982 -503147 -869623 -1013218 -755421 -309407
33270c09407L48478J48029m5p6935j44314k14617j55697J53894N22060N23015
$$ -309407 39071 187100 187055 110120 -34194 -248811 -404508 -250614 271446 794461
33260G94461L9198m84628n29371q7183M01409N32813K35022k30126m41067j93965
$$ 794461 833659 349031 -180340 -267523 133886 666699 901721 671595 230528 36563
33250C6563K16284L26398J30395L3143J62038J89270n3882k93247l22789k91811
$$ 36563 252847 579245 709640 742783 904821 1094091 1040209 746962 424173 132362
33240A32362k75940r8296J84235J93821q9053j75149Q4423J80916j19899k77431
$$ 132362 -143578 -241874 -57639 136182 47129 -128020 -43597 137319 17420 -260011
33230b60011N4947L27549N3568k62577m846L94852J70972l99700m23106J14040
$$ -260011 -205064 122485 176053 -86524 -91370 303482 474454 74754 -348352 -234312
33220b34312L65161L0493k74503r1037L13964N33634M58324J00922l76504n26255
$$ -234312 130849 161342 -113161 -204198 109766 643400 1101724 1202646 826142 299887
33210B99887j35973K66741J07947k71106j56369K78076K38190k81439m53925n0749
$$ 299887 163914 430655 538602 267496 111127 389203 627393 345954 -107971 -158720
33200a58720J92903j11844l86952j72367J21236N0892q7315J05449L93021L74167
$$ -158720 34183 -77661 -464613 -636980 -515744 -464852 -552167 -446718 -53697 320470
33190C20470J56334M2694j304j11451j64582o5111j5439j42233k21746r2131M8866
$$ 320470 476804 519498 518194 406743 242161 177050 161611 19378 -202368 -294499 -245633
33179b45633N3963J10303K95718K97315m7446l48333k33677M2142L5052j47121
$$ -245633 -191670 -81367 214351 511666 464220 115887 -117790 -75648 -40596 -187717
33169a87717o3716K77383L93558P8452k63919j77351K16336L46179q9902o80026
$$ -187717 -251433 25950 419508 497960 234041 56690 273026 619205 529303 -150723
33159a50723p19535r0403N17727M57543m4673k63425m597K36151J23455n9667
$$ -150723 -870258 -960661 -442934 14609 -30064 -293489 -298086 -61935 61520 1853
33149A853K3728K10183J51712j12191k20018L0L12448L49063K0685l42557l24355
$$ 1853 25581 235764 387476 275285 55267 55297 367745 716808 737493 394936 70581
33138G0581M9831K89546R2139k26924k37759o9637j40508l88490l27063J38536
$$ 70581 120412 409958 502097 275173 37414 -32223 -172731 -561221 -888284 -749748
33128g49748M91775L39972o5791k37147n1920K31420L29131J59395j22792k44385
$$ -749748 -257973 81999 16208 -220939 -272859 -41439 287692 447087 324295 79910
33118G9910r4698J20047J32928m3757j92003j99313j19185k9763O196l2130k5923
$$ 79910 -14788 105259 238187 194430 2427 -196886 -316071 -345834 -339638 -371768 -397691
33107c97691J51938L33470K12931r7994j38085J14194J16170k81001m49178l4090
$$ -397691 -245753 87717 300648 202654 64569 178763 294933 13932 -435246 -469336
33097d69336L42616R9002k92722j47932K07041N4316l78693l14295J86171L69715
$$ -469336 -126720 -27718 -320440 -468372 -261331 -207015 -585708 -900003 -713832 -344117
33087c44117J20742J7788J81408J67099n3964q3743j1723k45175m84154n3996
$$ -344117 -223375 -205587 -24179 142920 88956 5213 -6510 -251685 -735839 -789835
33077g89835P23240P60955l7068n40869j93203K30909P2511k36118j84197l9976
$$ -789835 -66595 694360 657292 116423 -76780 154129 226640 -9478 -193675 -233651
33067b33651q0424K0531L95045M93417L0580m10423l12885K0080J68388K39653
$$ -233651 -314075 -293544 101501 594918 625498 215075 -97810 -77730 90658 330311
33057C30311L12208R3979l38420l51380J40396L17718j74007m91060Q121N98669
$$ 330311 642519 736498 398078 46698 187094 504812 330805 -160255 -152134 446535
33047D46535L61811l13180m36127K3037L15943J73834p7975k78496m35135l18235
$$ 446535 808346 495166 59039 82076 398019 571853 493878 215382 -219753 -537988
33037e37988J49038M38737J18936l39377k17721L14439N00934J77271j24964r1665
$$ -537988 -388950 49787 168723 -170654 -388375 -73936 426998 604269 479305 387640
33027C87640O1289J14108R7578N8104k257k3782j3206q8596j98208j09233J42132
$$ 387640 448929 563037 660615 718719 716462 692680 679474 590878 392670 283437 425569
33016D25569K19425Q0058N0025J19568j21354n63063m53838L26665P74561K23813
$$ 425569 644994 725052 775077 894645 773291 210228 -243610 83055 857616 1081429
33006A081429n49109n25591J3631J38859j59295j66863J79853K46567j15223l38643
$$ 1081429 532320 6729 20360 159219 -76 -166939 12914 259481 144258 -194385
32996a94385j18958J87329K21023N7762p9159r2593j432M6520j01278k64207o7439
$$ -194385 -313343 -126014 95009 152771 73612 -18981 -20413 26107 -75171 -339378 -406817
32985d06817L65633M08627m9297k59429K10192O79076M18355j76496l07444o6277
$$ -406817 -41184 367443 318146 58717 268909 947985 1366340 1189844 882400 816123
32975H16123o8316k81903k23400L2599L2345j29963l0705J60431l9627l94258
$$ 816123 747807 465904 242504 275103 307448 177485 146780 307211 267584 -126674
32965a26674k23691L48001M70157l5216l75373j10872J84241k4469l44107j57935
$$ -126674 -350365 -2364 467793 432577 57204 -53668 130573 106104 -238003 -395938
32955c95938L75248O06281L38985k6734j46162j09211j52061k63203k30829j5886
$$ -395938 -20690 585591 924576 897842 751680 642469 490408 227205 -3624 -19510
32945a9510J15515l7383k57633j95429Q2811J92838N8087L300J66895K83861J78711
$$ -19510 96005 58622 -199011 -394440 -311629 -118791 -60704 -57404 109491 393352 572063
32934E72063J8570p1491j87993k96529j75876J28051K70439J67565R4216J27046
$$ 572063 590633 519142 331149 34620 -141256 -13205 257234 424799 519015 646061
32924F46061M7204j22726j07784K1103p7426k92951j99112N3556q9277m41174
$$ 646061 693265 570539 462755 483858 406432 113481 -85631 -32075 -121352 -562526
32914e62526k00627N64148P67724N2445n46616k57974K91126K97721J6531k9172
$$ -562526 -763153 -199005 568719 621164 74548 -183426 107700 405421 421952 392780
32904C92780l2267k42704k61919J53858M45709J97954j14624m6236N5521j02367
$$ 392780 360513 117809 -144110 9748 455457 653411 538787 492551 548072 445705
32894D45705j28398J33272J19149k87375k80063L74074O43609k0624n92354k29319
$$ 445705 317307 450579 569728 282353 2290 376364 1019973 999349 406995 177676
32884A77676K42092j01160n49031j01065O38210N26471j29861k70208O4724J17007
$$ 177676 419768 318608 -230423 -331488 306722 833193 703332 433124 497848 614855
32874F14855q3891m1155Q9210n118L2535L68166K86698m28274o44402K25826Q80123
$$ 614855 530964 489809 579019 573901 606436 974602 1261300 833026 188624 414450 1294573
32863A294573K88635l07094M77955J507192R16716o41601j096963l76371j00236
$$ 1294573 1583208 1276114 1754069 3261261 4177977 3536376 2439413 2063042 1962806
32854A962806n30048m76652J35182J88895l15294k78929K70182K41563l24448
$$ 1962806 1432758 956106 1091288 1280183 964889 685960 956142 1197705 873257
32845H73257l17557K80253M12621P117n6314J52951j65955o61080k98850N24524
$$ 873257 555700 835953 1248574 1255691 1199377 1352328 1186373 525293 226443 750967
32835G50967N14119j46942j74578L52148K21460m70104m85281J46119K66965p3516
$$ 750967 1265086 1118144 943566 1295714 1517174 1047070 561789 707908 974873 901357
32825I01357J62887P04044L76952m41172l40134M32238M24359k10146j06505N05221
$$ 901357 1064244 1768288 2145240 1704068 1363934 1796172 2220531 2010385 1903880 2409101
32815B409101L05165k59319K38205J072520N08315m21863P42842K975868K585014
$$ 2409101 2714266 2454947 2693152 3765672 4273987 3852124 4594966 7570834 10155848
32806A0155848o92121k895041j977761l50856j49183l02160J81405J64876o42072
$$ 10155848 9463727 6568686 4590925 4240069 4090886 3788726 3970131 4135007 3492935
32797C492935n08146Q27731J185039j5910n29875M62965Q85695k165j40324J032556
$$ 3492935 2984789 3812520 4997559 4981649 4451774 4914739 5800434 5798269 5657945 6690501
32787F690501J305673L27092O79352K631190L151421K059579L073000O301672
$$ 6690501 7996174 8323266 9002618 11633808 14785229 16844808 19917808 26219480
32779B6219480O730868L739442M313037J1424997J7388308J6858068J9423479
$$ 26219480 32950348 36689790 41002827 52427824 69816132 86674200 106097679
32772A06097679L8094351O7812524Q5463126P1832127K8010919k7210193o9173887
$$ 106097679 144192030 212004554 297467680 369299807 397310726 370100533 300926646
32765C00926646q0318793o2123614l5276877k0586414j9296743j8183434j1119840
$$ 300926646 220607853 158484239 123207362 102620948 83324205 65140771 54020931
32758E4020931n217303n913464q088111o097161k798305k783113m129860l048051
$$ 54020931 48803628 42890164 34802053 28704892 25906587 23123474 18993614 15945563
32750A5945563r92453j164373k334640j673133k08830m44489j466636j021037
$$ 15945563 14953110 13788737 11454097 9780964 9572134 9127645 7661009 6639972
32742F639972O0580k82428j276979r80457j8524r8557o32100j61464N77694J44857
$$ 6639972 6700552 6418124 5141145 4160688 4142164 4043607 3411507 3250043 3827737 3972594
32732C972594o95746m81213J37371j42355o19184j00144N48008M2483o99340k64098
$$ 3972594 3276848 2795635 2933006 2790651 2171467 2071323 2619331 2661814 1962474 1698376
32722A698376M77698J2340q49890m27038O88476P02023k37785o19217l37221l39540
$$ 1698376 2176074 2188414 1338524 911486 1599962 2301985 2064200 1444983 1107762 768222
32712G68222l99998K62261R41711M48452n60910n74230J42292J79881l94851l51760
$$ 768222 368224 630485 1572196 2020648 1459738 885508 1027800 1207681 812830 461070
32702D61070K91059M03769p9400k10951N5135m6368l86520j84607L25751K33782
$$ 461070 752129 1155898 1076498 865547 920682 874314 487794 303187 628938 862720
32692H62720l20145m10895k1618J06104l6345Q2540K46553q0432m59077j27581
$$ 862720 542575 131680 110062 216166 179821 262361 508914 428482 -30595 -158176
32682a58176M76794L67318k45463l72356M289J14200o0212O4856L37533J54785
$$ -158176 318618 685936 440473 68117 72406 186606 126394 191250 528783 683568
32672F83568k45907j82291J46029Q9121j24262J17716M49456J24008m64547l55334
$$ 683568 437661 255370 401399 490520 366258 483974 933430 1057438 592891 237557
32662B37557K61702M02801K2618j07739N7006q0403l94099k37506J96891J51817
$$ 237557 499259 902060 924678 816939 873945 793542 399443 161937 358828 510645
32652E10645k58330k70322Q6922J47700l1001J46379N00483L49431j10967r5786
$$ 510645 252315 -18007 68915 216615 185614 331993 832476 1181907 1070940 975154
32642I75154K91828K65578j39559j66465K02767K58572p7594k21274j11016j58990
$$ 975154 1266982 1532560 1393001 1226536 1429303 1687875 1610281 1389007 1277991 1119001
32632A119001k30304N7089L13709j2586l90317p044O07769L64060l88041m12978
$$ 1119001 888697 945786 1259495 1246909 856592 849548 1457317 1821377 1433336 1020358
32622A020358J67074J20827n49111n66709K34162N61027n656l54266K0944J85236
$$ 1020358 1187432 1308259 759148 192439 426601 987628 981972 627706 648650 833886
32612H33886l11435n45178k4396L47181k6058l56798o985L77201J86001p0771
$$ 833886 522451 -22727 -47123 300058 274000 -82798 -89783 287418 473419 402648
32602D02648P3290J02111l16476m80185M8543M76769J34972l13360p9054L60360
$$ 402648 475938 578049 261573 -218612 -170069 306700 441672 128312 49258 409618
32592D09618J93863k88343l27515k9921J8334j33478o9980J14968R7234P937P5027
$$ 409618 603481 315138 -12377 -42298 -23964 -157442 -227422 -112454 -15220 -7283 67744
32581F7744P9107j34632j59396K56337N77685K97426j88477k60138o9683r0817
$$ 67744 146851 12219 -147177 109160 686845 984271 795794 535656 465973 375156
32571C75156k03461l6790K21423J53678j16583k04458j55517j90251j49830J25505
$$ 375156 171695 134905 356328 510006 393423 188965 33448 -156803 -306633 -181128
32561a81128K71476l1865l55434j40691L22120L32121q2039k89424j45904j09634
$$ -181128 90348 58483 -296951 -437642 -115522 216599 134560 -154864 -300768 -410402
32551d10402l02945k67717K03470O49425N92343J59087j70795j52351N2115J33207
$$ -410402 -713347 -981064 -777594 -128169 464174 623261 452466 300115 352230 485437
32541D85437j2558j62059p0584J28051P9175k11710l33035j16681J06936J01100
$$ 485437 472879 310820 240236 368287 447462 235752 -97283 -213964 -107028 -5928
32531e928Q6173K16393J95370j70254m83705l23223O8219J74544j4927j38616
$$ -5928 80245 296638 492008 321754 -161951 -485174 -416955 -242411 -257338 -395954
32521c95954j08174q4914l1690J65017K96667J03876j81485j14726K23746L25496
$$ -395954 -504128 -589042 -620732 -455715 -159048 -55172 -236657 -351383 -127637 197859
32511A97859O6847j33718l0746J08491L2120r3807l9357Q8973N7824j19189k36160
$$ 197859 264706 130988 100242 208733 240853 147046 107689 196662 254486 135297 -100863
32500a00863j70064M5922K85620L64439J65901j63161l00113j42717L6577l0149
$$ -100863 -270927 -225005 60615 425054 590955 427794 127681 -15036 21541 -8608
32490h608k24744k33370r764J94094K22720J69991R4826j11604m08409m46908
$$ -8608 -233352 -466722 -476486 -282392 -59672 110319 205145 93541 -314868 -761776
32480g61776l8449M28694M44149J28076M1142K60273K35523k57731o35096l62041
$$ -761776 -800225 -371531 72618 200694 241836 502109 737632 479901 -155195 -517236
32470e17236K10295L89197J38835n4305l7728o2861j42314r378K76548L04978
$$ -517236 -306941 82256 221091 166786 129058 66197 -76117 -85495 191053 496031
32460D96031m263k42091j77991q1472j76981k39941k0329K81494K84185k3918
$$ 496031 491768 249677 71686 -9786 -186767 -426708 -447037 -165543 118642 94724
32450I4724k67613j46732K25534M29586J87713k63781l87723l5195L15643K28594
$$ 94724 -172889 -319621 -94087 335499 523212 259431 -128292 -163487 152156 380750
32440C80750p5241j33849R559j2289j68745j07584J25326R9952k13877l20012
$$ 380750 305509 171660 181219 168930 185 -107399 17927 117879 -95998 -416010
32430d16010j0979K88988K32425N5291P0007J28075l7137k89349l00577o1123
$$ -416010 -426989 -138001 94424 149715 219722 347797 310660 21311 -279266 -340389
32420c40389J47151J51566K4722q7727j20808j26764j89956k33465k1145M50159
$$ -340389 -193238 -41672 -16950 -104677 -225485 -352249 -542205 -775670 -796815 -346656
32410c46656P24164L99666k35560n10518k68499N866k5506j40359m7465J74264
$$ -346656 377508 777174 541614 31096 -237403 -231537 -257043 -397402 -444867 -270603
32400b70603L16592L41320K59231M2537j88184k01789j4956Q0736m8189k10055
$$ -270603 45989 387309 646540 689077 500893 299104 284148 364884 316695 106640
32390A06640k28490j48145m4995O3236R0298k0177q8431N7310J98567K5966k54384
$$ 106640 -121850 -269995 -314990 -251754 -161456 -181633 -270064 -212754 -14187 11779 -242605
32379b42605j59570K41176L61032M3011j84770j591J97683P846l22655l25364
$$ -242605 -402175 -160999 200033 243044 58274 56683 254366 262212 -60443 -385807
32369c85807j116K90750L35338J76808k4808q2882K7327L2532k61326n16543k77644
$$ -385807 -386923 -96173 239165 415973 391165 308283 335610 368142 106816 -409727 -687371
32358f87371K15012K73860j31970k78168J23632M38524J70260k47778k25207O8384
$$ -687371 -472359 -198499 -330469 -608637 -485005 -46481 123779 -123999 -349206 -280822
32348b80822J35501j6099o0476J9064K9500j0364M450O75n9409k4750R0089M150
$$ -280822 -145321 -161420 -221896 -202832 -173332 -183696 -179246 -178571 -237980 -262730 -172641 -168491
32336a68491k80226l12940O8368L67311K14134k4681P3830K38668M3484k68834
$$ -168491 -448717 -761657 -693289 -325978 -111844 -136525 -62695 175973 219457 -49377
32326d9377j81680K12020L86740K03963m3507j98036k99263k74375p1967Q2905
$$ -49377 -231057 -19037 367703 571666 528159 330123 30860 -243515 -315482 -232577
32316b32577J3008o4259O6147J77610J9443j63493m7550J61935R7638j08189j14962
$$ -232577 -219569 -283828 -217681 -40071 -20628 -184121 -231671 -69736 27902 -80287 -195249
32305a95249k0779r5588j64943O0206L02262J05785k93403k75033J04155J72732
$$ -195249 -216028 -311616 -476559 -416353 -114091 -8306 -301709 -576742 -472587 -299855
32295b99855k29552m91376k24600K04813L54502K91229K38504J57741k7533j70571
$$ -299855 -529407 -1020783 -1245383 -1040570 -686068 -394839 -156335 1406 -26127 -196698
32285a96698j21936M0352J48743J18832m3461k04131j35851J68931L52581J54285
$$ -196698 -318634 -278282 -129539 -10707 -54168 -258299 -394150 -225219 127362 281647
32275B81647j63090k07723o7374p4358j69835m9108K04248K32168P5333R9952
$$ 281647 118557 -89166 -156540 -230898 -400733 -449841 -245593 -13425 61908 161860
32265A61860K58744R4781m09337o40368k47349L28245N06746L04764J08111P1591
$$ 161860 420604 515385 106048 -534320 -781669 -453424 53322 358086 466197 537788
32255E37788O7571m38j02997j78136j67858n6774P8527J60727K11621K34601J25109
$$ 537788 605359 604921 501924 323788 155930 99156 177683 338410 550031 784632 909741
32244I09741j13546k44891j43299m8448j58073k21544L6856L38664K32571j28845
$$ 909741 796195 551304 408005 359557 201484 -20060 16796 355460 588031 459186
32234D59186k04357M2595J17536j40324l22844j76450N3126J50415K34656L44358
$$ 459186 254829 297424 414960 274636 -48208 -224658 -171532 -21117 213539 557897
32224E57897K43121j26424m35738m32295k37206l8831J34685K34646J76435Q2650
$$ 557897 801018 674594 238856 -193439 -430645 -469476 -334791 -100145 76290 158940
32214A58940J43455K14162J1816k98535k74336L2045J17479q4980r4818J74428
$$ 158940 302395 516557 528373 229838 -44498 -12453 105026 20046 -74772 99656
32204I9656J66475k99213n58719j45268M07488L98842L256j66109l9905L9881
$$ 99656 266131 -33082 -591801 -737069 -329581 69261 72517 -93592 -133497 -93616
32194i3616L9817J34683J83076l1902k61524j25295J92066J97370r0078j93679
$$ -93616 -53799 80884 263960 232058 -29466 -154761 37305 234675 144597 -49082
32184d9082P597J22916o9459l16794l44120j74634O7194K90238L35386J06206
$$ -49082 -41485 81431 11972 -304822 -648942 -823576 -756382 -466144 -130758 -24552
32174b4552j65281j34187J49064K93895J54930r126j8444k7211j60974k43455
$$ -24552 -189833 -324020 -174956 118939 273869 264743 246299 219088 58114 -185341
32164a85341r0906J65677K61764J45894k5348j25610j45919j14259n0613J4781
$$ -185341 -276247 -110570 151194 297088 271740 146130 211 -114048 -164661 -149880
32154a49880M7308M1520L3922O5472J05953M8402j36794k73740j62326J02855
$$ -149880 -102572 -61052 -27130 38342 144295 192697 55903 -217837 -380163 -277308
32144b77308J96653J2381j75417j18422O1175J13589M1861P314J7027l0831r0109
$$ -277308 -80655 -68274 -243691 -362113 -300938 -187349 -145488 -138174 -121147 -151978 -242087
32133b42087j6897J62398K54166J61294k2304j66484k18767j80414p3090P7362
$$ -242087 -258984 -96586 157580 318874 296570 130086 -88681 -269095 -342185 -264823
32123b64823K50086L65598K58059j11833m48135m00291p0108J06339M0434J05651
$$ -264823 -14737 350861 608920 497087 48952 -351339 -421447 -315108 -274674 -169023
32113a69023M09330M85771O4521l68669k86939L2414o311l27259l89555j57484
$$ -169023 240307 726078 790599 421930 134991 167405 161094 -166165 -555720 -713204
32103g13204q3002k05171q0276L24095M63752J49197j02072M8325K12008K5534
$$ -713204 -796206 -1001377 -1081653 -757558 -293806 -144609 -246681 -198356 13652 39186
32093C9186j69425O9852M77639M63213N363l79505l82085j52514O1962J39213
$$ 39186 -130239 -60387 417252 880465 885828 506323 124238 -28276 33686 172899
32083A72899M2220j27128j44610K2956J05843l2819j26766J8745J07008j61655
$$ 172899 215119 87991 -56619 -33663 72180 39361 -87405 -68660 38348 -123307
32073a23307m73566l22360J48291L34537J24193J5533K34461L68727Q5608l28652
$$ -123307 -596873 -919233 -770942 -436405 -312212 -296679 -62218 306509 392117 63465
32063F3465m40089k59268n7792O9804J52054J15470p6274k34229j51917J20120
$$ 63465 -376624 -635892 -693684 -623880 -471826 -356356 -432630 -666859 -818776 -698656
32053f98656L72101M59139L16672k7711l24314k46922J45624L61619J19506k31199
$$ -698656 -326555 132584 449256 421545 97231 -149691 -4067 357552 477058 245859
32043B45859k20568O1773J62603l6785k23676j79423j9851Q6487J11812N6408
$$ 245859 25291 87064 249667 212882 -10794 -190217 -210068 -123581 -11769 44639
32033D4639p2042j37030P735K47684L04577J35018j6620l445M3511o835p5664
$$ 44639 -27403 -164433 -156698 90986 395563 530581 513961 510516 554027 547192 471528
32022D71528n8364j5640m9003j32556j76893j44714l4052J30240K35136J48908
$$ 471528 413164 397524 348521 215965 39072 -105642 -139694 -9454 225682 374590
32012C74590q1576k28968j48900N6512J82785J33772l1564j59221j04866J09698
$$ 374590 293014 64046 -84854 -28342 154443 288215 256651 97430 -7436 102262
32002A02262K61739J73139m7447j50432o9367P3894J94737K47047J06863k36025
$$ 102262 364001 537140 489693 339261 269894 343788 538525 785572 892435 656410
31992F56410m56854k49828J40538J91648q8541j61357J32630K82672k857k47627
$$ 656410 199556 -50272 90266 281914 193373 32016 164646 447318 444461 196834
31982A96834j4654K93061P9838m00786m12389O0964K80766o3268l96120j94446
$$ 196834 182180 475241 555079 154293 -258096 -197132 83634 20366 -375754 -570200
31972e70200K54900L81654J51530m5386k8320M9468O2053N6272O4258J3707j30179
$$ -570200 -315300 66354 217884 172498 144178 193646 255699 311971 376229 389936 259757
31961B59757k55894k00596M7837K63705J84910j40430l36186j67068J12900J08481
$$ 259757 3863 -196733 -148896 114809 299719 159289 -176897 -343965 -231065 -122584
31951a22584j31865j93633O9430L28915K84198N1450r2729r1217n2872k5124k333
$$ -122584 -254449 -448082 -378652 -49737 234461 285911 193182 101965 49093 23969 21636
31940B1636j1486l8161J5Q3086M6382j51084k73793j09501J93360K92195J01347
$$ 21636 10150 -28011 -27996 55090 101472 -49612 -323405 -432906 -239546 52649 153996
31929A53996j14603j03947P3168J70715Q8652k5160j5559L3931p3506k90269l04337
$$ 153996 39393 -64554 8614 179329 267981 242821 227262 261193 187687 -102582 -406919
31918d06919l03K73180J51513j82794k35610N7505K36854L4268k33858j90228
$$ -406919 -407222 -134042 17471 -165323 -400933 -343428 -106574 -72306 -306164 -496392
31908d96392M4877J18759J1627j3393J13775J84731P0107j11422j98590j62045
$$ -496392 -451515 -332756 -321129 -334522 -220747 -36016 34091 -77331 -275921 -437966
31898d37966n4265O3655J34936J56899J95913K58670K18264K579k14382j89007
$$ -437966 -492231 -428576 -293640 -136741 59172 317842 536106 538685 324303 135296
31888A35296M4965J88303O7577j38165j37515J01028L08192K26361r7390l64451
$$ 135296 180261 368564 436141 297976 160461 261489 569681 796042 698652 334201
31878C34201l59920j69574j9616O676l2173j30437l02339l75007j08858L83235
$$ 334201 -25719 -195293 -214909 -208233 -240406 -370843 -673182 -1048189 -1157047 -773812
31868g73812O28563L86622r462j37235o4089j19660k79711j96939J92207M94883
$$ -773812 -145249 241373 231911 94676 30587 -89073 -368784 -565723 -373516 121367
31858A21367L83847o527l10972l28231j02134J76571K70493R8594j01261k8021
$$ 121367 505214 498687 187715 -140516 -242650 -66079 204414 303008 201747 173726
31848A73726K20118K20697j33453l95067j84331K33786L15752K64k62200j75022
$$ 173726 393844 614541 481088 86021 -98310 135476 451228 451492 189292 14270
31838A4270O2831J22332l4736k00356j89068K4165K84121L24944K4246l65861
$$ 14270 77101 199433 164697 -35659 -224727 -200562 83559 408503 432749 66888
31828F6888m31369j14778J84889J47767n3943p7952N6320O5895o8959n0592K11134
$$ 66888 -364481 -479259 -294370 -146603 -200546 -278498 -222178 -156283 -225242 -275834 -64700
31817f4700L69327J28945k78699l71039m6482L05053K92652o5714m15262l98798
$$ -64700 304627 433572 154873 -216166 -262648 42405 335057 269343 -145919 -544717
31807e44717M5333N61432O12332N4993n57164n30329Q8447N24470K87492k11388
$$ -544717 -499384 62048 674380 729373 172209 -358120 -269673 254797 542289 330901
31797C30901l25519r3394l1295k22708k08548J86862M92004K88193j56547k82998
$$ 330901 5382 -88012 -119307 -342015 -550563 -363701 128303 416496 259949 -23049
31787b3049J1517L46785L90479J24413k62467m80356k99214J23601K57702j37900
$$ -23049 -11532 335253 725732 850145 587678 107322 -191892 -68291 189411 51511
31777E1511n58550l74687K40336N20522K03838j63930j27387O9221M0391r9702
$$ 51511 -507039 -881726 -641390 -120868 82970 -80960 -208347 -139126 -98735 -198437
31767a98437n3603J07205J52109J43804K23730K07875r9714l89716k07817K58839
$$ -198437 -252040 -144835 7274 151078 374808 582683 482969 93253 -114564 144275
31757A44275L43342j17557n23645l80196P6549L45434L12224J49575o5039k86528
$$ 144275 487617 370060 -153585 -533781 -457232 -111798 200426 350001 284962 -1566
31747a566l24770q9337J55397J08754j03551r7445J92641M02365K31012j83588
$$ -1566 -326336 -415673 -260276 -151522 -255073 -352518 -159877 242488 473500 289912
31737B89912m56050l71734m1754K68104L83538L10919J36638q5280k98080l79226
$$ 289912 -166138 -537872 -579626 -311522 72016 382935 519573 434293 136213 -243013
31727b43013k50990k9004R0435Q7168J01324J67436J65452O2825j6114k2558n5130
$$ -243013 -494003 -523007 -432572 -345404 -244080 -76644 88808 151633 135519 112961 57831
31716E7831j13996l1491K16022L67708K32590k2784j40471j33989j60446j98914
$$ 57831 -56165 -87656 128366 496074 728664 705880 565409 431420 270974 72060
31706G2060j16701N2996J50607J40319J03889N0069n7619j39806q5481L3366L7212
$$ 72060 -44641 8355 158962 299281 403170 453239 395620 255814 170333 203699 240911
31695B40911p9961j36905m7079N5962K1288j11150j61767k1260K13290L13727
$$ 240911 160950 24045 -23034 32928 54216 -56934 -218701 -239961 -26671 287056
31685B87056J68029p0154j72760j44393j69165k62562k23315L422J84981J57139
$$ 287056 455085 384931 212171 67778 -101387 -363949 -587264 -583842 -398861 -241722
31675b41722O5384P8398J07805K1243r4948j12819q5056o1987P2280L16626L67738
$$ -241722 -176338 -97940 9865 31108 -63840 -176659 -261715 -323702 -251422 65204 432942
31664D32942N5322k73569k02145J13141J86598m3066j80504m4214J14074J02467
$$ 432942 488264 214695 12550 125691 312289 269223 88719 44505 158579 261046
31654B61046N6005R2984P8893r7116k78455k36682M4401L57464M41331J95561
$$ 261046 317051 410035 488928 391812 113357 -123325 -78924 278540 719871 915432
31644I15432j57596k50252o3452k1424l36431n56870k05272L86766M77196K9799
$$ 915432 757836 507584 444132 422708 86277 -470593 -675865 -289099 188097 217896
31634B17896k39897K2992L33473K05398j38497k27282m4966R2807L7518j30583
$$ 217896 -22001 991 334464 539862 401365 174083 129117 221924 259442 128859
31624A28859k93782l22575j40887Q5557R1082o4058m7565J73818K40426K6731
$$ 128859 -164923 -487498 -628385 -542828 -451746 -515804 -563369 -389551 -149125 -122394
31614a22394j08257O6743K58519J69284k4734o3408n8172j69409k18388n1952
$$ -122394 -230651 -163908 94611 263895 239161 175753 117581 -51828 -270216 -322168
31604c22168O1910j28291l41596j86591J73175K99114J90662J66653K18157O9984
$$ -322168 -260258 -388549 -730145 -916736 -743561 -444447 -253785 -87132 131025 201009
31594B01009k10144k54112l3772Q7757k0505r3654N978R1449P3247J10711K13540
$$ 201009 -9135 -263247 -297019 -209262 -229767 -323421 -317443 -225994 -152747 -42036 171504
31583A71504J41416j31103k70225j04525R6179Q4642L852K5485j7162k78812m69166
$$ 171504 312920 181817 -88408 -192933 -96754 -12112 -8260 17225 63 -278749 -747915
31572g47915k06701L27575N23530J47581l39186l84215p278L16523K82829M4630
$$ -747915 -954616 -627041 -103511 44070 -295116 -679331 -686609 -370086 -87257 -42627
31562d2627j03386j07204j00901j12016l1791J39890K39275J87736R6522L8105
$$ -42627 -146013 -253217 -354118 -466134 -497925 -358035 -118760 68976 165498 203603
31552B03603o5427j97994j52105J10553K60774P0111j54956m474L46837L67620
$$ 203603 138176 -59818 -211923 -101370 159404 229515 74559 70085 416922 784542
31542G84542J834k66753k03261j05526j67616j45434P4404J31264j81273m31680
$$ 784542 786376 519623 316362 210836 43220 -102214 -27810 103454 -77819 -509499
31532e09499k05994J51807O2154l15962l27604R8481L53795J71295P152J87705
$$ -509499 -715493 -563686 -501532 -817494 -1145098 -1046617 -692822 -521527 -514375 -326670
31522c26670L54108J40360j57472r3645J57370J09166k14119l38527j08359J45358
$$ -326670 27438 167798 10326 -83319 74051 183217 -30902 -369429 -477788 -332430
31512c32430J89989J52612J37578K9964j91497l18040k34044o7617R0371K87115
$$ -332430 -142441 10171 147749 177713 -13784 -331824 -565868 -633485 -543114 -255999
31502b55999M13457J97752k94454n28188j77241L58037M60196J02278k18587j98729
$$ -255999 157458 355210 60756 -467432 -644673 -286636 173560 275838 57251 -141478
31492a41478l774R9786M9398o5007j01195N3631K92476K83598r7625m66709l76703
$$ -141478 -145252 -45466 3932 -61075 -162270 -108639 183837 467435 369810 -96899 -473602
31481d73602M5198K76164J40476m0689k8292N5425R8456J98701L31867K38870
$$ -473602 -428404 -152240 -11764 -52453 -80745 -25320 73136 271837 603704 842574
31471H42574j19203l57886k09854L4309m3262l46698m18776j04834K79007L96393
$$ 842574 723371 365485 155631 189940 146678 -200020 -618796 -723630 -444623 -48230
31461d8230K22402o6808k86763l00487q8649J74763K52731R8171j10773j91175
$$ -48230 174172 107364 -179399 -479886 -568535 -393772 -141041 -42870 -153643 -344818
31451c44818j14660M4895J98973K50484J29781r8102k33529j44749N4875J27965
$$ -344818 -459478 -414583 -215610 34874 164655 66553 -166976 -311725 -256850 -128885
31441a28885J5444r5640n4223M2244M3550K2081J31346K74581K16392J4681k1528
$$ -128885 -113441 -209081 -263304 -221060 -177510 -155429 -24083 250498 466890 481571 460043
31430D60043J16250M3014l55856n95788k84505K21072L15491L3850r4892Q3289
$$ 460043 576293 619307 263451 -332337 -616842 -395770 -80279 -46429 -141321 -58032
31420e8032K07078Q7072m0348j9640k1185j37119j76128l4202J06294J14044J07768
$$ -58032 149046 236118 195770 176130 154945 17826 -158302 -192504 -86210 27834 135602
31409A35602J64743J50307n025j47241j61599j30802j14434l0875J33900K41309
$$ 135602 300345 450652 445627 298386 136787 5985 -108449 -139324 -5424 235885
31399B35885K07095Q2677p8117k02167j21096J71062K90740q2397o05543o26034
$$ 235885 442980 525657 447540 245373 124277 295339 586079 503682 -101861 -727895
31389g27895j04668L57686M18978L22060K70300J34112p4623q4810Q2594P5053
$$ -727895 -832563 -474877 -55899 266161 536461 670573 595950 511140 593734 668787
31379F68787r9197k8954K46694J40231m07767o10933q4381M26084K00907l32267
$$ 668787 569590 540636 787330 927561 519794 -91139 -175520 250564 451471 119204
31369A19204l90972p7392K8965l8471J24397L67209K36299j16134j56323Q4990
$$ 119204 -271768 -349160 -320195 -358666 -234269 132940 369239 253105 96782 181772
31359A81772J23893o5728p3067J04475M4280k75221l85087j32538Q9752K3821
$$ 181772 305665 239937 166870 271345 315625 40404 -344683 -477221 -387469 -363648
31349c63648j19027j07688J2150J50360K95242L72483L08112J77832L4221k07935
$$ -363648 -482675 -590363 -578213 -427853 -132611 239872 547984 725816 760037 552102
31339E52102m41055k95085K12021M24731j6474n00061l67242K7645J3885j67429
$$ 552102 111047 -184038 27983 452714 436240 -63821 -431063 -403418 -389533 -556962
31329e56962J20928N78283L67147l54927n81215j15163J91924j7543j13974J92287
$$ -556962 -436034 142249 509396 154469 -426746 -541909 -349985 -367528 -481502 -289215
31319b89215K94402q7880l02333M2183L39652R6267j94502o146K64480P7021k66875
$$ -289215 5187 -82693 -385026 -342843 -3191 93076 -101426 -107572 156908 233929 -32946
31308c2946k23857L4515N4706m6642P2011K38879J06513j58795j89260n8079j1520
$$ -32946 -256803 -222288 -167582 -214224 -142213 96666 203179 44384 -144876 -202955 -214475
31297b14475N3879K58751K98799m7078l70466k36579N9113R679k09179r9205K28394
$$ -214475 -160596 98155 396954 349876 -20590 -257169 -198056 -188377 -397556 -496761 -268367
31286b68367K62081L84j23554n8695r9253j48203J68997O61196O52508L8046m75185
$$ -268367 -6286 -5902 -129456 -188151 -287404 -435607 -266610 394586 1047094 1085140 609955
31275F09955m04312j10726q4381j92916o5800J98473K02644p6704k41037q0338
$$ 609955 205643 94917 10536 -182380 -248180 -49707 152937 76233 -164804 -245142
31265b45142J20503J7437k66493k92465N2978L49854K25510j08019j92611o935
$$ -245142 -124639 -107202 -373695 -666160 -613182 -263328 -37818 -145837 -338448 -345383
31255c45383J08081R3272K08751M13607L01767j73191m74571k53009J59893L16126
$$ -345383 -237302 -144030 64721 478328 780095 606904 132333 -120676 39217 355343
31245C55343K24953O6768j54894l38024j89869K05567K79663j29994l82519n5862
$$ 355343 580296 647064 492170 154146 -35723 169844 449507 319513 -63006 -118868
31235a18868K76924j3532n01813l98648J25900K86669L1259P298L23771L82230
$$ -118868 158056 144524 -357289 -755937 -630037 -343368 -312109 -304811 18960 401190
31225D01190j2437l23348k20389j4269L4223P7583J59313M9539j93972j96672
$$ 401190 388753 65405 -154984 -169253 -135030 -57447 101866 151405 -42567 -239239
31215b39239N191o9368m27787m32789J13206N01439K23180j81235j4032M33442
$$ -239239 -234048 -303416 -731203 -1163992 -1050786 -549347 -326167 -507402 -521434 -87992
31205h7992L81099j79288n11317k67626J13747J75397K9996K6486K12676L34881
$$ -87992 293107 113819 -397498 -665124 -551377 -375980 -345984 -319498 -106822 228059
31195B28059J96632j14786l16827k33898p760Q1552o039m8811O2081J71065J61670
$$ 228059 424691 309905 -6922 -240820 -248580 -167028 -173067 -221878 -159797 11268 172938
31184A72938J41076J75741J06305j66209m26510m08879j53717J04658K48211K71288
$$ 172938 314014 489755 596060 429851 3341 -405538 -559255 -454597 -206386 64902
31174F4902J40537r4052j89848O185K53336J85379j50475l20787j12392J73687
$$ 64902 205439 111387 -78461 -72276 181060 366439 215964 -104823 -217215 -43528
31164d3528J66382o6227j65909j4761J40174Q9591n4226q2096l940M3030P1350
$$ -43528 122854 56627 -109282 -124043 16131 105722 51496 -30600 -34540 8490 79840
31153G9840J87461L14724K42604k4648k26477k13585j08862l5908L2680O5947
$$ 79840 267301 582025 824629 799981 573504 359919 251057 215149 247829 313776
31143C13776n9773k42993j66993J63902K91358q0k68108j03921J62328o261m32090
$$ 313776 254003 11010 -155983 7919 299277 299197 31089 -72832 89496 83235 -348855
31132c48855m81505n8663L29914M14051L83589K92739m6787m82755n28308j47912
$$ -348855 -830360 -889023 -559109 -145058 238531 531270 484483 1728 -526580 -674492
31122f74492R8346o3618k10695R113K92188K44559O374j08905j34190j72176m1434
$$ -674492 -576146 -639764 -850459 -841346 -549158 -304599 -298225 -407130 -541320 -713496 -754930
31111g54930L16415M76098J23213l11153j99096L21049N30686J68137k95910m07488
$$ -754930 -438515 37583 160796 -150357 -349453 -28404 502282 670419 374509 -32979
31101c2979k32058l8628P5471J13253O0164l2816o7625n6279p2889o5911O2152
$$ -32979 -265037 -303665 -228194 -114941 -54777 -87593 -155218 -211497 -284386 -350297 -288145
31090b88145K19011K12826N9653n0003p3472j29467j86186m7939K66378M27005
$$ -288145 -69134 143692 203345 153342 79870 -49597 -235783 -283722 -17344 409661
31080D09661K35990n9552r7590J05843K19703R0810o7138l8137M6868p4601l19390
$$ 409661 645651 586099 488509 594352 814055 904865 837727 799590 846458 771857 452467
31069D52467k97797P0630K90963n4911o02888o04425J8037N21408L66962j01102
$$ 452467 154670 225300 516263 461352 -141536 -745961 -727924 -206516 160446 59344
31059E9344k62212o2037J27407J43554Q8614j5543j86893k54978q2986J11389
$$ 59344 -202868 -264905 -137498 6056 94670 79127 -107766 -362744 -445730 -334341
31049c34341M6808j45466j42150J7104N2084k924J10301K91229J68679j95346
$$ -334341 -287533 -432999 -575149 -558045 -505961 -508885 -398584 -107355 61324 -134022
31039a34022k87103M1071L15429K15503L7618Q2521J18671j28268l97081k88275
$$ -134022 -421125 -380054 -64625 150878 188496 271017 389688 261420 -135661 -423936
31029d23936Q1914K99373K73364J85329M3923k24875m12737k54599P6025J70564
$$ -423936 -342022 -42649 230715 416044 459967 235092 -177645 -432244 -356219 -185655
31019a85655J5365n3690L0645J3851j10014l6669K28501K52892r0329k98395k52
$$ -185655 -170290 -223980 -193335 -179484 -289498 -326167 -97666 155226 64897 -233498 -233750
31008b33750M00745L04660j67101l45137K3788M66674M66112P8722k47725k44332
$$ -233750 166995 471655 304554 -40583 -16795 449879 915991 994713 746988 502656
30998E02656o7404m8605k65567m05989j61466K78506L87147M1142k32827K466
$$ 502656 435252 386647 121080 -284909 -446375 -167869 219278 260420 27593 30059
30988C0059M26140M23601p376l08924k24863p2608j07002j37752L0706K20605
$$ 30059 456199 879800 872424 563500 338637 266029 159027 21275 51981 272586
30978B72586K07228P7697j4559j55201m23368n91650m11694k7477K19754K61477
$$ 272586 479814 557511 542952 387751 -35617 -627267 -1038961 -1066438 -846684 -585207
30968e85207K61697K39655R5407o1539l350J80805J25954k32266m78000k94018
$$ -585207 -323510 -83855 11552 -49987 -53337 127468 253422 21156 -456844 -750862
30958g50862Q0810K24316J28635J03662K13279J87843o6673k30329m0727K47547
$$ -750862 -670052 -445736 -317101 -213439 -160 187683 121010 -109319 -150046 97501
30948I7501J88550j70327k97654N2893M32993L08060j71321l72414o4366K98286
$$ 97501 286051 115724 -181930 -129037 303956 612016 440695 68281 3915 302201
30938C02201K41504j26390l52135k28617N4617J94190L9583k95254m65034j93595
$$ 302201 543705 417315 65180 -163437 -108820 85370 124953 -170301 -635335 -828930
30928h28930L36622N85538L04800j16902j68533J17706K90871J29531j48718k67405
$$ -828930 -492308 93230 398030 281128 112595 230301 521172 650703 501985 234580
30918B34580j86641k1049R0819K3949k14493l96243k88440M6699L36089M34042
$$ 234580 47939 26890 117709 141658 -72835 -469078 -757518 -710819 -374730 59312
30908E9312L86042K26637l1526k37761k11792l5927J8245j06557j76497m9673
$$ 59312 445354 671991 640465 402704 190912 154985 173230 66673 -109824 -159497
30898a59497J18532J44778O4815M151k232L7939J20464J57733L3428j71242k07220
$$ -159497 -40965 103813 168628 172779 170547 208486 328950 486683 520111 348869 141649
30887A41649j6112J46190P3810r8099j27711k3233K1526o5431j66768j54539j5035
$$ 141649 125537 271727 345537 247438 119727 96494 118020 52589 -114179 -268718 -283753
30876b83753J52576J99760P9249l8560M7821K31411J72839j75537l87038j23307
$$ -283753 -131177 68583 147832 109272 157093 388504 561343 385806 -1232 -124539
30866a24539L43521M76797K02588o2858p1838n1137k44558m71055l77289L1039
$$ -124539 218982 695779 898367 835509 763671 712534 467976 -3079 -380368 -349329
30856c49329L62049L19068J9741k11558k31348j51127r7489n6407R541L5964k6329
$$ -349329 12720 331788 351529 139971 -91377 -242504 -339993 -396400 -386859 -350895 -377224
30845c77224o4917M5186J89075J32777p8850j09166J54644L36315Q2515l50747
$$ -377224 -442141 -396955 -207880 -75103 -153953 -263119 -108475 227840 310355 -40392
30835d0392l98213k1920J81479j54329n86062m64012J41832N43090L81194K7552
$$ -40392 -438605 -460525 -279046 -433375 -1019437 -1483449 -1341617 -798527 -417333 -389781
30825c89781n1783Q4703J16441K7089N4331K36465L63329L19732J71925m3401
$$ -389781 -441564 -356861 -240420 -213331 -159000 77465 440794 760526 932451 889050
30815H89050l06858m30044k32940Q5787J36426n7542p0241K00524L04080k5707
$$ 889050 582192 152148 -80792 4995 141421 83879 13638 214162 518242 492535
30805D92535l84646l24534n2207l4955k32511k49289k7144J53222K10399K70446
$$ 492535 107889 -216645 -268852 -303807 -536318 -785607 -812751 -659529 -449130 -178684
30795a78684K56582K1349j93885j7515L59890L66521l6963k65741n7098J46713
$$ -178684 77898 99247 -94638 -112153 247737 614258 577295 311554 254456 401169
30785D01169q457k43001k19655r5120j01357q1267J20618K49848Q4608j15128
$$ 401169 392712 149711 -69944 -165064 -266421 -347688 -227070 22778 107386 -7742
30775g742p0964o20j48990k04267J78391N92449L73038k89324n22714p3181L39636
$$ -7742 -78706 -79326 -228316 -432583 -254192 338257 711295 421971 -100743 -173924 165712
30764A65712J39499l28387m46165j79287J07083K53390L09470K44024N4647m7171
$$ 165712 305211 -23176 -469341 -648628 -541545 -288155 21315 265339 319986 272815
30754B72815P5930J88691K0052k56259k56348r44J21029n390n5933J34862K32994
$$ 272815 348745 537436 557488 301229 44881 43937 164966 159576 103643 238505 471499
30743D71499n4996m19287l32336J49141M17498J77664j49172p0376K78230L86820
$$ 471499 416503 -2784 -335120 -185979 231519 409183 260011 189635 467865 854685
30733H54685J06850k30219l43054k97049k52990k23076j64240q9948m40J25865
$$ 854685 961535 731316 388262 91213 -161777 -384853 -549093 -639041 -639481 -513616
30723e13616K16980J54792k0414j24666p8267L3960J45674K39077K09264k7034
$$ -513616 -296636 -141844 -162258 -286924 -365191 -331231 -185557 53520 262784 235750
30713B35750k76307k37948K4800J30952k1283r6219R4060K59943J21200j61801
$$ 235750 -40557 -278505 -253705 -122753 -144036 -240255 -146195 113748 234948 73147
30703G3147l18171l60486l47291j32460K81731N05048K97331J1981M3913J75139
$$ 73147 -245024 -605510 -952801 -1085261 -803530 -298482 -1151 10830 54743 229882
30693B29882J0389k57876j73752J30458J38159j24045j37438J47822K07231r1072
$$ 229882 240271 -17605 -191357 -60899 77260 -46785 -184223 -36401 170830 79758
30683G9758k15403Q7504L32177J28912k01228k62042k03342k32259j07897L01106
$$ 79758 -135645 -48141 284036 412948 211720 -50322 -253664 -485923 -593820 -292714
30673b92714M97116P6805m53457l41452K30766M32160Q2749j71375J0070J86178
$$ -292714 204402 281207 -172250 -513702 -282936 149224 231973 60598 70668 256846
30663B56846m4k12890n5456K42766K17736j10137l33155k54968l7848J11812J22566
$$ 256846 256802 43912 -11544 231222 448958 338821 5666 -249302 -287150 -175338 -52772
30652e2772J3867j14255j22471p660O1821o766q9215n9369K4310P7116J49050
$$ -52772 -38905 -153160 -275631 -283291 -221470 -228236 -317451 -376820 -352510 -275394 -126344
30641a26344K66357K90719J25034r7982k22292k97509l89995l47356l4298L30210
$$ -126344 140013 430732 555766 457784 235492 -62017 -452012 -799368 -833666 -503456
30631e03456L91744J51939o2821q1382k5267J1609Q0694J43410N8846j10097j05998
$$ -503456 -111712 40227 -22594 -103976 -129243 -117634 -36940 106470 165316 55219 -50779
30620e0779Q9047J54418o9636k99599k41813j4652J22328J84042K81159K69311
$$ -50779 38268 192686 123050 -176549 -418362 -433014 -310686 -126644 154515 423826
30610D23826j4585l15852k19482J82698L32460m62l73463l12308L5026J67979
$$ 423826 409241 93389 -126093 56605 389065 388603 15140 -297168 -262142 -94163
30600i4163m6626k42340r6823K53596M18862K32733q6946k25961j26922Q21k1162
$$ -94163 -140789 -383129 -479952 -226356 192506 425239 338293 112332 -14590 -13769 -34931
30589c4931j38770j81976p8398J04245K37130J98727k8700k74763l24494k01823
$$ -34931 -173701 -355677 -434075 -329830 -92700 106027 77327 -197436 -521930 -723753
30579g23753j27182j22855N8895M40736N89240K19416k52719k32475J57120K53398
$$ -723753 -850935 -973790 -914895 -474159 115081 334497 81778 -150697 6423 259821
30569B59821j26295m41532k99636J4813J14446R3587J93550K94838J54011j21684
$$ 259821 133526 -308006 -607642 -592829 -478383 -384796 -191246 103592 257603 135919
30559A35919k23775r9763N0403R4005K8980j17350k26981j10334J87125L07550
$$ 135919 -87856 -187619 -137216 -43211 -14231 -131581 -358562 -468896 -281771 25779
30549B5779O5695k11612j34281J68827K65235N3585j87899k70499k33121q4124
$$ 25779 91474 -120138 -254419 -85592 179643 233228 45329 -225170 -458291 -542415
30539e42415K09339M81483M65825J69215j24161k23794j60012M120J91786J98327
$$ -542415 -333076 148407 614232 783447 659286 435492 275480 279600 471386 669713
30529F69713r7564m23295l72080P554K46838J23323r5714j59631j66109k19285
$$ 669713 572149 148854 -223226 -215672 31166 154489 58775 -100856 -266965 -486250
30519d86250j63023Q2745K57109J39280o9162o3940P7525P3785o6295r6609J4249
$$ -486250 -649273 -566528 -309419 -170139 -239301 -303241 -225716 -151931 -218226 -314835 -300586
30508c00586N9733K602L9287K03485K46819M8095j44530p2176J46157K03047L8639
$$ -300586 -240853 -238251 -198964 4521 251340 299435 154905 82729 228886 431933 470572
30497D70572j38265j80077j26882m0744O2048J00974l1082k60711l56116k38520
$$ 470572 332307 152230 25348 -15396 46652 147626 116544 -144167 -500283 -738803
30487g38803q5513k0901Q5231L29389M91446L11525p3193k75360j87782n3263
$$ -738803 -824316 -845217 -759986 -430597 60849 372374 299181 23821 -163961 -217224
30477b17224j7635M0367J74599K25688J49808J54553L01998K96910m6773m05025
$$ -217224 -234859 -194492 -19893 205795 355603 510156 812154 1109064 1062291 657266
30467F57266l65088m6020J04194P956M721K09560K93396M5034k51914k59147r5299
$$ 657266 292178 246158 350352 358308 363029 572589 865985 911019 659105 399958 304659
30456C04659p9491j69669o2893K00851J84155k52214n92689l40534K09574L37069
$$ 304659 225168 55499 -7394 193457 377612 125398 -467291 -807825 -598251 -261182
30446b61182n1761k85462L2244M10820K68201j40171j55752K21757L81691J02906
$$ -261182 -312943 -598405 -566161 -155341 112860 -27311 -183063 38694 420385 523291
30436E23291j83286j76915r2100j01199l1185J42944J07391j74460k38354J07941
$$ 523291 340005 163090 70990 -30209 -61394 81550 188941 14481 -223873 -115932
30426a15932L57221J11462k25922j22952K04831K27602p057j08103j12814k75664
$$ -115932 241289 352751 126829 3877 208708 436310 429253 321150 208336 -67328
30416f7328l72477l0044M39378L87647p8649k37605K4634O1838l29761n13319
$$ -67328 -439805 -469849 -30471 357176 278527 40922 65556 127394 -202367 -715686
30406g15686j36057K38547J02668j61329n815L50019L65441Q8790l2714O8776
$$ -715686 -851743 -613196 -510528 -671857 -677672 -327653 37788 126578 93864 162640
30396A62640J01242r254r4556j31323j89169j54921O2094K19005O4019j88760
$$ 162640 263882 254628 160072 28749 -160420 -315341 -253247 -34242 29777 -158983
30386a58983j51536J12594K23631J36023J53343L21323L17392K0583k68882l21145
$$ -158983 -310519 -197925 25706 161729 315072 636395 953787 974370 705488 384343
30376C84343k87928l38562l37192j23190J61043K91132L11329L83860M21676J84429
$$ 384343 96415 -242147 -579339 -702529 -541486 -250354 60975 444835 866511 1050940
30366A050940k78855n75254m48499j02694R3343O7506K4445O7952Q7667J7113
$$ 1050940 772085 196831 -251668 -354362 -261019 -193513 -169068 -101116 -13449 3664
30356C664m4360m0757o1284j17797n4363J52297K46213Q9230l6115J39313L39942
$$ 3664 -40696 -81453 -142737 -260534 -314897 -162600 83613 172843 136728 276041 615983
30345F15983J03296m30253o10504k09040K56629K96779P0009l8677l6731j37817
$$ 615983 719279 289026 -321478 -530518 -273889 22890 92899 54222 17491 -120326
30335a20326k55419j26206J88488L22725J23416j50123j91925p493J61594J46996
$$ -120326 -375745 -501951 -313463 9262 132678 -17445 -209370 -216863 -55269 91727
30325I1727J5558m5817L1984J27618J28170J04850J65252K22223J09993j22993
$$ 91727 107285 61468 93452 221070 349240 454090 619342 841565 951558 828565
30315H28565k68613k74730k54618k09630l7900J82906K46644J72494J58585J59273
$$ 828565 559952 285222 30604 -179026 -216926 -34020 212624 385118 543703 702976
30305G02976p2355m43089n01295j41059J55237M7980j42669l547K93363L02176
$$ 702976 630621 187532 -313763 -454822 -299585 -251605 -394274 -397821 -104458 197718
30295A97718j6768l44579m80298l90145m2885M07245N32518J56673k65745k34735
$$ 197718 180950 -163629 -643927 -1034072 -1076957 -669712 -137194 19479 -246266 -481001
30285d81001P1096J44601j3079M947K21578K40690r667j32154M2568J87961P9226
$$ -481001 -409905 -265304 -278383 -273436 -51858 188832 179165 47011 89579 277540 356766
30274C56766n7284j2100M7538n0244j40202m4143P8929J0944j41062j39049j4928
$$ 356766 299482 287382 334920 284676 144474 100331 179260 190204 49142 -89907 -104835
30263a04835J1914q6974j14668L2077K02452J82637m1980k48997k10978K5148
$$ -104835 -92921 -179895 -294563 -262486 -60034 122603 80623 -168374 -379352 -354204
30253c54204J67950O8264m4321J12717M14254M53840J10997k78280l66570j76697
$$ -354204 -186254 -117990 -162311 -49594 364660 818500 929497 651217 284647 107950
30243A07950L4174R4642K3269m1583K5112J59839J19355j71706l98204k54559
$$ 107950 142124 236766 260035 218452 243564 403403 522758 351052 -47152 -301711
30233c01711M2193K8926k58647l02763O0423L54360K31897Q888O3045J69168n1568
$$ -301711 -259518 -230592 -489239 -792002 -731579 -377219 -145322 -136434 -73389 95779 44211
30222D4211l69384k63623J67011K83125q1092l24232j0375M51619M32565K671
$$ 44211 -325173 -588796 -421785 -138660 -219752 -543984 -554359 -102740 329825 332496
30212C32496k34438l8314K08590J39359j03980j72428k8703Q2805O0887P3124
$$ 332496 98058 59744 268334 407693 303713 131285 102582 185387 246274 319398
30202C19398K27209L40712J93509j09932k42534j09091K0418q1146k56684k13718
$$ 319398 546607 887319 1080828 970896 728362 619271 639689 558543 301859 88141
30192H8141K0422J37784K767j86654k23327j40734n5788J7903P3149K5487j12216
$$ 88141 108563 246347 249114 62460 -160867 -301601 -357389 -339486 -266337 -240850 -353066
30181c53066j53521k6242M6549j01719k22085K0001M55023N51200J67765k24495
$$ -353066 -506587 -532829 -486280 -587999 -810084 -790083 -335060 216140 383905 159410
30171A59410j93613J24847L20991K40869K2207j62647k00315o7454P5407K6058
$$ 159410 -34203 90644 411635 652504 674711 512064 311749 244295 319702 345760
30161C45760j11816j0627L12346L82707k7368m70736m49331j09184J01834J27033
$$ 345760 233944 223317 535663 918370 891002 420266 -29065 -138249 -36415 90618
30151I0618J56941J08584j58531l47252j01007K83907K24308j65929k19164J55577
$$ 90618 247559 356143 197612 -149640 -250647 33260 257568 91639 -127525 28052
30141B8052L03468o0025l72633j75332J85002K14349K1766m2667L270k1475n5949
$$ 28052 331520 271495 -101138 -276470 -91468 122881 144647 101980 105250 83775 27826
30130B7826Q60L4334j9820j4948N5505k1513j88259p9042K73315L17608r7421
$$ 27826 28686 63020 43200 28252 83757 62244 -126015 -205057 68258 385866 288445
30119B88445l71909j49562P5269j04340k35176J14910M48980J95070j96468k4844
$$ 288445 -83464 -233026 -157757 -262097 -497273 -382363 66617 261687 65219 40375
30109D0375L58622J63355l62251l26331J91828K56521k49079m15387O3790L66060
$$ 40375 398997 562352 200101 -126230 65598 322119 73040 -342347 -278557 87503
30099H7503J2918l41510j27658K00455R4679j25232L5819L22500K37642p7661
$$ 87503 100421 -241089 -368747 -168292 -73613 -198845 -163026 159474 397116 319455
30089C19455j62930j2769P0804M8544N1288L3722n1101n1501N8272K3951k04350
$$ 319455 156525 143756 214560 263104 314392 348114 297013 245512 303784 327735 123385
30078A23385k74978m8000J00619l7397p5706K40443M54682J37517l12993k90806
$$ 123385 -151593 -199593 -98974 -136371 -212077 28366 483048 620565 307572 16766
30068A6766K8708N8607j83103k17822l5139n3194k42510j05576M01628O66893
$$ 16766 45474 104081 -79022 -296844 -331983 -385177 -627687 -733263 -331635 335258
30058C35258L38322j60567k93046j15457l0552j66110k89642j82408R3943K61482
$$ 335258 673580 513013 219967 104510 73958 -92152 -381794 -564202 -470259 -208777
30048b08777J28382j40382j70426J09672L10560J26588k01687k57453n7779P2148
$$ -208777 -80395 -220777 -391203 -281531 29029 155617 -46070 -303523 -361302 -289154
30038b89154O3140J20084K63850K75725R3481r8193j87999k38615k64790j99410
$$ -289154 -226014 -105930 157920 433645 527126 428933 240934 2319 -262471 -461881
30028d61881q1608k1966j233O4959J28935J17098J19168J98660J64831j24912
$$ -461881 -543489 -565455 -566688 -501729 -372794 -255696 -136528 62132 226963 102051
30018A02051l81754k22934J96527L41310O1355k50364k85591j55088k6061J30323
$$ 102051 -279703 -502637 -306110 35200 96555 -153809 -439400 -594488 -620549 -490226
30008d90226K94825K95962J13086m0809o8833j07506j88922j34986P1534J63968
$$ -490226 -195401 100561 213647 172838 104005 -3501 -192423 -327409 -255875 -91907
29998i1907K3001j00672j0752R6668j7414k02201j36482J72555L88028K80244
$$ -91907 -68906 -169578 -180330 -83662 -101076 -303277 -439759 -267204 120824 401068
29988D01068k9717k36474j53564J13228K57227J02107j73191k53430p9935J41872
$$ 401068 371351 134877 -18687 94541 351768 453875 280684 27254 -52681 89191
29978H9191K55120K43183Q6393j77031l06218j25480J04596j386k94083k58757
$$ 89191 344311 587494 673887 496856 190638 65158 169754 168368 -125715 -384472
29968c84472J04218J92948j94021m38878r1692L51909K49591j30892j00038K59630
$$ -384472 -280254 -87306 -281327 -720205 -811897 -459988 -210397 -341289 -441327 -181697
29958a81697K47214k28377m50795n3858M02400L20678r3474k84067j64523l3727
$$ -181697 65517 -162860 -613655 -667513 -265113 55565 -37909 -321976 -486499 -520226
29948e20226M745Q1655J94562K00613J03329L7905J5907o2856j80682k05941j04269
$$ -520226 -515481 -433826 -239264 -38651 64678 102583 118490 55634 -125048 -330989 -435258
29937d35258L9442J78266L04379L27120J44045j60014l52389l14698j37415M4226
$$ -435258 -395816 -217550 86829 413949 557994 397980 45591 -269107 -406522 -362296
29927c62296J68122K00021J27776L0054J1488M1581O29q9813o0554J16285K24986
$$ -362296 -194174 5847 133623 163677 175165 216746 217375 127562 67008 183293 408279
29916D08279J20252k9398N001J46115J23292j10438l10642k93968j43705k1796
$$ 408279 528531 499133 504134 650249 773541 663103 352461 58493 -85212 -107008
29906a07008K7460J3120q1354k04270k12091o5922O6823L6592o5898n2698Q1341
$$ -107008 -79548 -66428 -147782 -352052 -564143 -630065 -563242 -526650 -592548 -645246 -563905
29895e63905J77674J56684Q2957J7119m5835r4916r0532l4893M6662J57785K44667
$$ -563905 -386231 -229547 -146590 -129471 -175306 -270222 -360754 -395647 -348985 -191200 53467
29884E3467J36799k16860m95989k87392L12048O68121L70772k18090m35323j58028
$$ 53467 190266 -26594 -522583 -809975 -497927 170194 540966 322876 -112447 -270475
29874b70475J46112J21155q9474j95901j55923o5081O7567K12380J92958o7901
$$ -270475 -124363 -3208 -92682 -288583 -444506 -509587 -442020 -229640 -36682 -104583
29864a04583l04217j97108J41914K71258K7146k50415j99402R8040K86926J93744
$$ -104583 -408800 -605908 -463994 -192736 -165590 -416005 -615407 -517367 -230441 -36697
29854c6697o7995l11034m06884k98111o0013J06962J01627P7299K17393M26806
$$ -36697 -104692 -415726 -822610 -1120721 -1180734 -1073772 -972145 -894846 -677453 -250647
29844b50647M36503J81104j13528k09293o5443J95598L60717K16003k22507n97773
$$ -250647 185856 366960 253432 44139 -21304 174294 535011 751014 528507 -69266
29834f9266n59464k01777Q8460J78635K60925L76638K83618o4437l02438j64765
$$ -69266 -628730 -830507 -742047 -563412 -302487 74151 357769 293332 -9106 -173871
29824a73871J03350J25151p3386j98559j43138j5423J04382J67354R5544l5373
$$ -173871 -70521 54630 -18756 -217315 -360453 -375876 -271494 -104140 -8596 -43969
29814d3969J8865K36815J85596l14065o97905l64420L65987O35995K78845m1547
$$ -43969 -25104 211711 397307 83242 -614663 -979083 -613096 22899 301744 260197
29804B60197O6298K24950Q4825j03324p2609p4150l51267n76645l52456R7731
$$ 260197 326495 551445 636270 532946 460337 386187 34920 -541725 -894181 -796450
29794g96450K82846K02406J92559K36651L5634l32119m25094j44463J10167R2109
$$ -796450 -513604 -311198 -118639 118012 153646 -178473 -603567 -748030 -637863 -545754
29784e45754K9763J33611K21794Q7111j08383j00160N4366J10133M2074L7303
$$ -545754 -515991 -382380 -160586 -73475 -181858 -282018 -227652 -117519 -75445 -38142
29774c8142J43799J77268P834k28553k85038j05350J02236J10787m2290j01299
$$ -38142 105657 282925 290759 62206 -222832 -328182 -225946 -115159 -157449 -258748
29764b58748N1490K03852R6749j86198k94005o7779K45762K94788K3804k84832
$$ -258748 -207258 -3406 93343 -92855 -386860 -454639 -208877 85911 109715 -175117
29754a75117l13214k7375K78730K89438M1135j11572K9619K25098J52160j12838
$$ -175117 -488331 -515706 -236976 52462 93597 -17975 11644 236742 388902 276064
29744B76064k24995r7604Q660o8974j57699m9391J86878L10911J95016o2459k13114
$$ 276064 51069 -46535 -37875 -106849 -264548 -313939 -127061 183850 378866 316407 103293
29733A03293p1412K32718L16452L9477k31289j46994L4485j46955n02334l92128
$$ 103293 31881 264599 581051 620528 389239 242245 276730 129775 -372559 -764687
29723g64687J92315M80983J04435l07971j47718K25007J71095j41366j05856K35204
$$ -764687 -572372 -91389 13046 -294925 -442643 -217636 -46541 -187907 -293763 -58559
29713e8559K96976k9407k58586j68327m5835n1802k3141K3772j38918l72452k24688
$$ -58559 238417 209010 -49576 -217903 -263738 -315540 -338681 -314909 -453827 -826279 -1050967
$$ [...]
##END NTUPLES=NMR SPECTRUM
##END=
